##TITLE=1H_SL88-Dau(f7)
 CDcl3, 8 sc, 
 11.05.2021
##JCAMPDX= 6.0         $$ Bruker NMR JCAMP-DX V2.0
##DATA TYPE= NMR FID
##DATA CLASS= NTUPLES
##ORIGIN= UXNMR, Bruker Analytische Messtechnik GmbH
##OWNER= root
$$ XWIN-NMR		Version 3.5
$$ Tue May 11 10:26:11 2021 Russian Standard Time (UT+4h)  she@DPX200
##.OBSERVE FREQUENCY= 200.131506
##.OBSERVE NUCLEUS= ^1H
##.DELAY= (6, 6)
##.ACQUISITION MODE= SIMULTANEOUS
##.ACQUISITION SCHEME= undefined
##.AVERAGES= 8
##.DIGITISER RES= 18
##SPECTROMETER/DATA SYSTEM= spect
##.PULSE SEQUENCE= zg30
##.SOLVENT NAME= CDCl3
##.SHIFT REFERENCE= (INTERNAL, CDCl3, 0, 15.7039)
##AUDIT TRAIL= $$ (NUMBER, WHEN, WHO, WHERE, WHAT)
$$ ##TITLE= Audit trail, XWIN-NMR		Version 3.5
$$ ##JCAMPDX= 5.01
$$ ##ORIGIN= Bruker BioSpin GmbH
$$ ##OWNER= she
$$ F:/spectra/data/she/nmr/H-F/1/audita.txt
$$ ##AUDIT TRAIL=  $$ (NUMBER, WHEN, WHO, WHERE, WHAT)
(   1,<2021-05-11 10:24:59.75 +0400>,<she>,<DPX200>,
      <created by zg, POWCHK disabled, PULCHK disabled
       configuration hash MD5:
       00 E9 B6 7A A2 85 ED C7 34 08 36 98 17 FE 4E 26
       data hash MD5: 16K
       41 F5 64 4B E9 F3 F3 54 DB 00 3B 09 76 3C E4 8D>)
$$ ##END=
$$ 
$$ hash MD5
$$ A6 9B 01 82 F8 6F 8C 32 F9 31 33 B7 78 28 D3 BF
##$RELAX= 
##$RELAX= 
##$RELAX= 
##$RELAX= 
##$RELAX= 
##$RELAX= 
$$ Bruker specific parameters
$$ --------------------------
##$DU= <F:/spectra>
##$EXPNO= 1
##$NAME= <H-F>
##$PROCNO= 1
##$TYPE= <nmr>
##$USER= <she>
##$AMP= (0..31)
100 100 100 100 100 100 100 100 100 100 100 100 100 100 100 100 100 100 
100 100 100 100 100 100 100 100 100 100 100 100 100 100 
##$AQSEQ= 0
##$AQ_mod= 1
##$AUNM= <au_zg>
##$AUTOPOS= <>
##$BF1= 200.13
##$BF2= 200.13
##$BF3= 200.13
##$BF4= 200.13
##$BF5= 200.13
##$BF6= 200.13
##$BF7= 200.13
##$BF8= 200.13
##$BYTORDA= 1
##$CFDGTYP= 0
##$CFRGTYP= 5
##$CHEMSTR= <none>
##$CNST= (0..31)
1 1 145 1 1 1 1 1 1 1 1 1 1 1 1 1 1 1 1 1 1 1 1 1 1 1 1 1 1 1 1 1 
##$CPDPRG= <>
##$CPDPRG1= <>
##$CPDPRG2= <>
##$CPDPRG3= <>
##$CPDPRG4= <mlev>
##$CPDPRG5= <mlev>
##$CPDPRG6= <mlev>
##$CPDPRG7= <mlev>
##$CPDPRG8= <mlev>
##$CPDPRGB= <>
##$CPDPRGT= <>
##$D= (0..31)
0 1.2 0 0 0 0 0 0 0 0.06 0 0.03 0 0 0 0 0.0002 0 0 0 0 0 0 0 0 0 0 0 0 
0 0 0 
##$DATE= 1620714299
##$DBL= (0..7)
120 120 120 120 120 120 120 120 
##$DBP= (0..7)
150 150 150 150 150 150 150 150 
##$DBP07= 0
##$DBPNAM0= <>
##$DBPNAM1= <>
##$DBPNAM2= <>
##$DBPNAM3= <>
##$DBPNAM4= <>
##$DBPNAM5= <>
##$DBPNAM6= <>
##$DBPNAM7= <>
##$DBPOAL= (0..7)
0.5 0.5 0.5 0.5 0.5 0.5 0.5 0.5 
##$DBPOFFS= (0..7)
0 0 0 0 0 0 0 0 
##$DE= 6
##$DECBNUC= <off>
##$DECIM= 32
##$DECNUC= <off>
##$DECSTAT= 4
##$DIGMOD= 1
##$DIGTYP= 9
##$DL= (0..7)
0 120 120 120 120 120 120 120 
##$DP= (0..7)
150 150 150 150 150 150 150 150 
##$DP07= 0
##$DPNAME0= <>
##$DPNAME1= <>
##$DPNAME2= <>
##$DPNAME3= <>
##$DPNAME4= <>
##$DPNAME5= <>
##$DPNAME6= <>
##$DPNAME7= <>
##$DPOAL= (0..7)
0.5 0.5 0.5 0.5 0.5 0.5 0.5 0.5 
##$DPOFFS= (0..7)
0 0 0 0 0 0 0 0 
##$DQDMODE= 0
##$DR= 18
##$DS= 0
##$DSLIST= <SSSSSSSSSSSSSSS>
$$ [...]
##$SUBNAM2= <"">
##$SUBNAM3= <"">
##$SUBNAM4= <"">
##$SUBNAM5= <"">
##$SUBNAM6= <"">
##$SUBNAM7= <"">
##$SUBNAM8= <"">
##$SUBNAM9= <"">
##$SW= 16.9725357007746
##$SWIBOX= (0..15)
0 0 2 0 0 0 0 0 0 0 0 0 0 0 0 0 
##$SW_h= 3396.73913043478
##$TD= 16384
##$TD0= 1
##$TE= 0
##$TE2= 300
##$TE3= 300
##$TEG= 300
##$TL= (0..7)
0 120 120 120 120 120 120 120 
##$TP= (0..7)
150 150 150 150 150 150 150 150 
##$TP07= 0
##$TPNAME0= <>
##$TPNAME1= <>
##$TPNAME2= <>
##$TPNAME3= <>
##$TPNAME4= <>
##$TPNAME5= <>
##$TPNAME6= <>
##$TPNAME7= <>
##$TPOAL= (0..7)
0.5 0.5 0.5 0.5 0.5 0.5 0.5 0.5 
##$TPOFFS= (0..7)
0 0 0 0 0 0 0 0 
##$TUNHIN= 0
##$TUNHOUT= 0
##$TUNXOUT= 0
##$USERA1= <user>
##$USERA2= <user>
##$USERA3= <user>
##$USERA4= <user>
##$USERA5= <user>
##$V9= 5
##$VALIST= <valist>
##$VCLIST= <CCCCCCCCCCCCCCC>
##$VD= 0
##$VDLIST= <DDDDDDDDDDDDDDD>
##$VPLIST= <PPPPPPPPPPPPPPP>
##$VTLIST= <TTTTTTTTTTTTTTT>
##$WBST= 1024
##$WBSW= 4
##$XGAIN= (0..3)
0 0 0 0 
##$XL= 0
##$YL= 0
##$YMAX_a= 82106
##$YMIN_a= -82404
##$ZGOPTNS= <>
##$ZL1= 120
##$ZL2= 120
##$ZL3= 120
##$ZL4= 120
##$ABSF1= 10
##$ABSF2= 0
##$ABSG= 5
##$ABSL= 3
##$ALPHA= 0
##$AQORDER= 0
##$ASSFAC= 0
##$ASSFACI= 0
##$ASSFACX= 0
##$ASSWID= 0
##$AUNMP= <proc_1d>
##$AZFE= 0.1
##$AZFW= 0.1
##$BCFW= 1
##$BC_mod= 2
##$BYTORDP= 1
##$COROFFS= 0
##$CY= 11.3945322036743
##$DATMOD= 1
##$DC= 2
##$DFILT= <>
##$DTYPP= 0
##$F1P= 15.9154993809931
##$F2P= -4.1035820241983
##$FCOR= 0.5
##$FTSIZE= 0
##$FT_mod= 4
##$GAMMA= 1
##$GB= 0.15
##$INTBC= 1
##$INTSCL= 1
##$ISEN= 128
##$LB= 0.24
##$LEV0= 0
##$LPBIN= 0
##$MAXI= 10000
##$MC2= 0
##$MEAN= 0
##$ME_mod= 0
##$MI= 1.114404
##$NCOEF= 0
##$NC_proc= 0
##$NLEV= 6
##$NOISF1= 3.799351
##$NOISF2= 2.8
##$NSP= 1
##$NTH_PI= 0
##$NZP= 0
##$OFFSET= 15.70392
##$PC= 1
##$PHC0= -11126.21
##$PHC1= 16.001
##$PH_mod= 1
##$PKNL= yes
##$PPARMOD= 0
##$PSCAL= 0
##$PSIGN= 0
##$REVERSE= no
##$SF= 200.130013532006
##$SI= 16384
##$SIGF1= 3
##$SIGF2= 2
##$SINO= 400
##$SIOLD= 16384
##$SREGLST= <1H.CDCl3>
##$SSB= 0
##$STSI= 0
##$STSR= 0
##$SW_p= 3612.71676300578
##$SYMM= 0
##$S_DEV= 0
##$TDeff= 0
##$TDoff= 0
##$TI= <>
##$TILT= no
##$TM1= 0
##$TM2= 0
##$TOPLEV= 0
##$USERP1= <user>
##$USERP2= <user>
##$USERP3= <user>
##$USERP4= <user>
##$USERP5= <user>
##$WDW= 1
##$XDIM= 8192
##$YMAX_p= 0
##$YMIN_p= 0
$$ End of Bruker specific parameters
$$ ---------------------------------
##NTUPLES= NMR FID
##VAR_NAME=  TIME,          FID/REAL,        FID/IMAG
##SYMBOL=    X,             R,               I
##VAR_TYPE=  INDEPENDENT,   DEPENDENT,       DEPENDENT
##VAR_FORM=  AFFN,          ASDF,            ASDF
##VAR_DIM=   8192,          8192,            8192
##UNITS=     SECONDS,       ARBITRARY UNITS, ARBITRARY UNITS
##FACTOR=    0.0002944,     1,               1
##FIRST=     0,             0,               0
##LAST=      2.4114304,     0,               0
##MIN=       0,             -82404,          0
##MAX=       2.4114304,     82106,           0
$$ Real data points
##PAGE= N=1
##DATA TABLE= (X++(R..R)), XYDATA
$$ plain form
0 0 0 0 0 0 0 0 0 0 0 0 0 0 0 0 -8 8 -8 8 -8 16 -16 16 -24 24 -32 32 -40 48 -53 58 -69 80 -88 98 -112 128
36 128 -144 160 -177 197 -218 242 -269 298 -330 362 -402 442 -486 537 -589 651 -716 791 -875
55 -875 970 -1077 1204 -1350 1523 -1732 1993 -2324 2760 -3364 4257 -5710 8442 -15310 67596
70 67596 82106 -82404 32545 18912 -34828 35544 9338 -22847 19940 -1723 11600 14331
82 14331 -22169 -6468 16948 1220 2543 2796 -1137 7667 12042 -10736 -7560 15887 2257 1577
96 1577 22780 -12276 -17865 27764 9826 -15891 5219 227 -441 11260 -2764 -7070 -4511 -489
110 -489 16190 -7129 -27161 10245 14380 -11167 3547 -568 -19563 11025 14409 -19125 -1644
123 -1644 10901 -4803 9820 6068 -13970 -3042 3207 7173 4364 -6203 6873 1288 -11393
$$ packed form
0@%%%%%%%%%%%%%%qJ6j6J6j6K4l2L2m0M8n6O4p2Q8j01J11j27J49j68J86k10K40
36A28k72L04l37L74m15M60n11N67o28O92p64Q44r28J023j126J240j367J507j666
55h75J845k047K281k554K873l255L725m317N084o124P621r967J4152k3752Q2906
70F7596J4510j64510J14949j3633n3740P0372k6206l2185M2787k1663J3323K731
82A4331l6500J5701K3416j5728J323K53l933Q804M375k2778L176K3447j3630o80
96A577K1203l5056n589M5629j7938k5717K1110m992o68J1701j4024m306K559M022
110d89J6679k3319k0032L7406M135k5547J4714m115j8995L0588L384l3534J7481
123a644J2545j5704J4623l752k0038J0928O249L966k809j0567J3076n585j2681
$$ plain form
136 -11393 4970 -1299 -8912 6862 4969 -2086 -7587 -4847 2931 -5263 1290 861 -11125 12608
150 12608 10733 -14783 -2672 364 1746 13150 -986 -831 3203 -2485 12039 2939 -12463 8402
164 8402 11054 -1347 3484 532 -5837 3776 7863 -3154 -4155 1145 -2409 3243 2596 -8891 -3246
179 -3246 -404 2333 3823 -14109 -4239 10986 -7102 -1970 2410 -12032 -348 5406 -5166 -5855
193 -5855 -2730 5840 -532 -10689 -3135 -6361 224 7673 -9479 -7117 1335 -2822 -208 -7972 -6663
208 -6663 2756 -4248 6225 2696 -17707 1598 6640 -7589 4694 2073 -5969 6909 3890 -2801
222 -2801 -2427 -1106 9147 5762 -3262 3759 2845 -1189 5772 3216 -4784 2090 9805 1420 -2769
237 -2769 2255 -1472 2556 8465 -4304 -4646 7419 3388 -1786 -1243 158 2833 -679 1746 3135
$$ packed form
136a1393J6363o269p613J5774j893p055n501K740P778q194O553m29j1986K3733
150A2608j875k5516J2111L036J382J1404j4136J55M034n688J4524r100j5402K0865
164H402K652j2401M831k952o369R613M087j1017j001N300l554N652o47j1487N645
179c246K842K737J490j7932R870J5225j8088N132M380j4442J1684N754j0572o89
193e855L125Q570o372j0157P554l226O585P449j7152K362Q452m157K614p764J309
208f663R419p004J0473l529k0403J9305N042j4229J2283k621q042J2878l019o691
222b801L74J321J0253l385r024P021r14m034O961k556q000O874P715q385m189
237b769N024l727M028N909j2769l42J2065m031n174N43J401K675l512K425J389
$$ plain form
252 3135 -6644 -1138 8684 -143 -5760 -97 -127 -2283 2798 946 -7634 849 4958 -5682 -1786
267 -1786 -1079 -6853 2264 2243 -3952 -2544 -5327 2002 1368 -10114 804 2729 -4958 3818 -1366 -9643
283 -9643 1689 3183 -2750 -1562 689 191 -504 2700 -2035 -4910 3522 3534 797 1364 -2651 1759
299 1759 3340 -965 3153 -1019 -931 8882 694 -4000 3551 583 1040 5057 1578 -2696 -15 6615
315 6615 1868 -3851 1623 1671 1778 2897 -1822 -317 1393 1532 4249 -3853 -2481 5719 -2036 488
331 488 3148 -5788 2055 5037 -4087 -1867 -520 -739 1780 -693 -1111 -2477 -2521 1937 -319 -3552
347 -3552 -1912 359 1607 -1761 -2111 -1805 -4002 3877 2533 -6336 802 2803 -2375 1527 -455 -3144
363 -3144 1788 3048 2459 -2139 -2320 4436 1426 -1326 1406 182 554 2683 1440 -1652 -1184 3335
$$ packed form
252C135r779N506R822q827n617N663l0k156N081j852q580Q483M109j0640L896
267a786P07n774R117k1o195J408k783P329o34j1482J0918J925p687Q776n184q277
283i643J1332J494n933J188K251m98o95L204m735k875Q432J2k737N67m015M410
299A759J581m305M118m172Q8R813q188m694P551k968M57M017l479m274K681O630
315F615m747n719N474M8J07J119m719J505J710J39K717q102J372Q200p755K524
331D88K660q936P843K982r124K220J347k19K519k473m18j366m4M458k256l233
347c552J640K271J248l368l50L06k197P879j344q869P138K001n178L902j982k689
363c144M932J260n89m598j81O756l010k752K732j224L72K129j243l092M68M519
$$ plain form
379 3335 1090 -947 2815 -1183 -834 5762 -144 -2447 2175 1601 2893 1079 -632 2228 221 2575
395 2575 4852 -2616 -1236 5155 1995 -625 1580 97 -1013 2765 1871 -4499 -1144 3240 -376
410 -376 -1172 -1319 -2106 82 -598 -800 -2060 -3767 1657 238 -4506 -332 -1931 -3862 1954 493 -4723
427 -4723 -2384 1542 -57 -4081 -1094 -581 -2891 1273 -159 -4384 -1487 -952 -30 -532 -4558 -524
443 -524 -194 -1171 1900 -4576 -3472 5372 -1316 -2809 2911 -1478 312 3496 108 -481 149 2874
459 2874 3553 -731 1151 2558 883 2662 2121 -719 -250 2535 3411 -1424 -747 2495 -1006 959
475 959 2341 -3694 -1182 3039 -339 -1588 -1538 -937 224 -118 -166 -2365 -2056 1723 291 -2614 -1787
492 -1787 479 -53 -1488 621 -1887 -3588 2599 -253 -4370 542 -1436 -2180 2053 -2534 -2697 0
$$ packed form
379C335k245k037L762l998L49O596n906k303M622n74J292j814j711K860k007K354
395B575K277p468J380O391l160k620K205j483j110L778q94o370L355M384l616
410c76p96j47p87K188o80k02j260j707N424j419m744M174j599j931N816j461n216
427d723K339L926j599m024K987N13k310M164j432m225K897N35R22n02m026M034
443e24L30r77L071o476J104Q844o688j493N720m389J790L184l388n89O30K725
459B874O79m284J882J407j675J779n41k840M69K785Q76m835O77L242l501J965
475I59J382o035K512M221l378j249N0O01J161l42m8k199L09L779j432k905Q27
492a787K266n32j435K109k508j701O187k852m117M912j978p44M233m587j63K697
$$ plain form
508 0 -1253 1241 -1589 -2708 1745 -80 -544 1974 -1706 -929 3059 1962 -295 -396 2548 2328 565
525 565 2374 294 -556 4351 2208 -530 1313 1036 1771 1994 -38 758 351 1323 2443 -1377 -930
542 -930 2471 232 -172 2175 -704 -1278 2471 1719 -1461 -45 1116 422 1604 -43 -1075 240
558 240 555 1754 -390 -2775 1584 1012 -1839 723 -1308 -2371 1710 222 -2327 -1902 -234 698
574 698 -1459 -1113 -431 -2540 786 767 -2643 -776 -218 158 660 -1563 -115 16 -731 2591 -1051 -2639
592 -2639 2561 275 -974 1365 -1743 -556 2009 8 -825 -1215 539 1896 -865 -399 936 -777
608 -777 474 2189 -740 -1972 1600 2743 -438 106 1185 132 1788 1612 -890 208 1454 1049
624 1049 719 -542 419 287 629 1554 -1238 -1432 1495 674 -786 -756 -451 -43 -438 1071 -1015 -3025
$$ packed form
508@j253K494k830j119M453j825m64K518l680P77L988j097k257j01K944k20j763
525E65J809k080q50M907k143k738J843k77P35K23k032P96m07R72J120l820M47
542i30L401k239m04K347k879n74L749p52l180J416J161o94J182j647j032J315
558B40L15J199k144k385M359n72k851K562k031j063M081j488k549M25J668R32
574F98k157L46O82k109L326j9l410J867N58L76N02k223J448J31p47L322l642j588
592b639N200k286j249K339l108J187K565k001q33l90J754J357k761M66J335j713
608g77J251J715k929j232L572J143l181N44J079j053J656j76k502J098J246m05
624A049l30j261R61j32L42R25k792j94K927q21j460L0L05M08l95J509k086k010
$$ plain form
642 -3025 1527 983 -2319 -60 -880 -1428 1024 -859 -1066 -774 -1096 1569 -772 -2721 487 -837 -1047
659 -1047 1446 -1925 -1736 1308 17 -1286 -733 -492 -466 148 374 -1014 -1390 656 781 -124 -712 -146
677 -146 862 431 610 600 -934 1102 2163 -110 -22 1013 361 1002 1667 -18 -795 1442 1850 -245
695 -245 -19 773 -120 921 727 -326 -48 -359 1498 503 -2035 1043 861 -973 1412 -581 -1727
712 -1727 1198 310 -663 -291 -823 299 102 -359 -273 -1843 -175 1085 -1258 -1533 -842 -298 55 -1354
730 -1354 -399 -1049 -1459 1237 -848 -2336 247 -295 -756 668 -1476 -1016 410 113 -367 -858 -130 741
748 741 165 -80 275 -469 137 1612 198 -1198 673 1831 34 727 1168 -767 1014 1890 -63
765 -63 170 557 1163 1098 316 261 494 59 1495 382 -915 764 900 88 494 52 -347 277 1201 -40
$$ packed form
642c025M552n44l302K259q20n48K452j883k07K92l22K665k341j949L208j324k10
659a047K493l371J89L044j291j303N53K41K6O14K26j388l76K046J25r05n88N66
677a46J008m31J79j0j534K036J061k273Q8J035o52O41O65j685p77K237M08k095
695b45K26P92q93J041j94j053K78l11J857r95k538L078j82j834K385j993j146
712a727K925q88r73L72n32J122j97m61Q6j570J668J260k343k75O91N44L53j409
730a354R55o50m10K696k085j488K583n42m61J424k144M60J426k97m80m91P28Q71
748G41n76k45L55p44O06J475j414j396J871J158j797O93M41j935J781Q76j953
765f3K33L87O06o5p82n5K33m35J436j113j297J679J36q12M06m42l99O24R24j241
$$ plain form
785 -40 -1298 910 549 -549 354 -132 -758 631 34 -149 -613 -700 901 -27 -1383 203 -750 -450 920
804 920 -931 -1435 -199 43 -367 -315 -50 -766 -357 1023 -435 -1040 202 393 278 -429 -104 275 -86
823 -86 632 747 -1134 316 1417 -314 271 333 -377 567 886 115 -504 369 1190 321 -65 180 -205 519
843 519 737 -89 -248 -48 1181 303 -671 742 251 -135 1313 346 -670 629 756 123 13 -291 96
862 96 130 240 200 -841 -180 693 -262 -576 -600 -137 -319 -375 -258 -1353 -1051 807 -636 -1453 228 -601
882 -601 -584 39 -1013 -905 -526 23 184 -1297 -454 -19 -630 276 43 -1320 -498 585 -283 -763 -402
901 -402 279 -261 -4 137 -941 -16 1225 -70 -83 22 394 810 604 424 53 85 1517 906 -335
920 -335 405 1009 500 1082 834 -543 678 1382 427 -464 532 174 342 554 -17 -450 -99 292 503 -804
$$ packed form
785d0j258K208l61j098R03m86o26J389n97j83m64q7J601r28j356J586r53L00J370
804I20j851n04J236K42m10N2K65p16M09J380j458o05J242J91j15p07L25L79l61
823h6P18J15j881J450J101j731N85O2p10R44L19p71o19Q73Q21q69l86K45l85P24
843E19K18q26j59K00J229q78r74J413m91l86J448r67j016J299J27o33j10l04L87
862I6L4J10m0j041O61Q73r55l14k4M63j82n6J17j095L02J858j443q17J681q29
882f01J7O23j052J08L79N49J61j481Q43M35o11R06k33j363Q22J083q68m80L61
901d02O81n40K57J41j078R25J241j295j3J05L72M16k06j80l71L2J432o11j241
920c35P40O04n09N82k48j377J221P04r55q91R96l58J68K12n71m33L51L91K11j307
$$ plain form
940 -804 -973 679 -72 -105 27 -1063 -659 656 -335 -800 -421 -161 108 -372 -246 -838 -351 644 -294 -799
960 -799 -214 -263 51 -714 -708 -281 -895 293 383 -1556 -263 629 -142 -65 14 -280 210 818 336 76 140 577
982 577 766 498 535 547 353 987 756 -280 225 997 584 80 637 22 33 923 521 -443 136 612 742
1003 742 -132 54 85 -276 279 353 -488 -240 422 184 -8 -271 -50 -276 116 304 -927 -876 453 -367
1023 -367 -538 36 -800 -134 376 -656 -718 -771 73 173 -766 -358 -59 -661 169 -57 -906 -307 176 -4
1043 -4 -443 -321 -287 -98 4 291 -590 12 405 306 -84 -99 192 504 197 456 -58 19 703 555 -106 58
1065 58 441 310 555 303 -108 -37 881 581 -30 355 -76 -2 811 386 303 138 534 1004 -115 -289 793
1086 793 -229 -76 467 -504 -542 512 -251 -151 -317 -361 21 -559 -170 -491 -921 -26 28 -445 -586 -345
$$ packed form
940h04j69J652p51l3J32j090M04J315r91m65L79K60K69m80J26n92M87R95r38n05
960g99N85m9L14p65OM27o14J188R0j939J293Q92p71P7P9k94M90O08m82k60O4M37
982E77J89k68L7J2j94O34k31j036N05P72m13n04N57o15J1Q90m02r64N79M76J30
1003G42q74J86L1l61N55P4q41K48O62k38j92k63K21k26L92J88j231N1J329q20
1023c67j71N74q36O66N10j032o2n3Q44J00r39M08K99o02Q30k26q49N99M83j80
1043dm39J22L4J89J02K87q81O02L93r9l90j5K91L12l07K59n14P7O84j48o61J64
1065E8L83j31K45k52m11P1R18l00o11L85m31P4Q13m25q3j65L96M70j119j74J082
1086G93j022J53N43r71l8J054p63J00j66m4L82n80L89l21m30Q95N4m73j41K41
$$ plain form
1106 -345 -354 -256 -291 -222 -588 133 412 -641 -412 176 -487 23 36 -475 -21 34 57 -330 -756 -100 514 -67
1128 -67 200 -48 -301 317 292 -229 -240 566 249 220 501 -135 -22 758 514 112 -89 298 610 283 435
1149 435 151 -161 486 872 96 -179 197 205 -26 125 4 -129 216 513 -118 -451 312 -188 -194 5 -276
1170 -276 -374 276 -52 -461 -411 50 119 -669 -241 -129 -684 -48 20 -577 -622 -154 -252 -279 -227 -172 -240 -89 -138 -209
1194 -209 -215 -107 131 85 -246 -58 -52 -90 248 -108 -157 472 341 -35 194 -7 470 543 605 -10 -1 538 587 49
1218 49 329 370 -6 547 437 485 203 384 987 -65 -73 552 -62 257 374 -249 4 129 -32 -223 -202 -139
1240 -139 128 29 138 -329 -547 222 -40 -271 -175 -157 -304 -225 261 -301 -638 -94 260 -409 -266 -223 -424 -79
1262 -79 -38 -486 -326 -209 165 -151 -735 -95 -17 -85 92 -20 -109 -153 220 -123 -120 90 -55 -52 341 -41 -140 21
$$ packed form
1106c45rR8l5O9l66P21K79j053K29N88o63N10J3n11M54N5K3l87m26O56O14n81
1128f7K67k48k53O18k5n21j1Q06l17k9K81o36J13P80k44m02k01L87L12l27J52
1149D35k84l12O47L86p76k75L76Qk31J51j21j33L45K97o31l33P63n00oJ99k81
1170b76r8O50l28m09N0M61O9p88M28J12n55O36O8n97m5M68r8k7N2N5o8J51m9p1
1194b09oJ08K38m6l31J88Ol8L38l56m9O29j31l76K29k01M77P3O2o15RN39M9n38
1218D9K80M1l76N53j10M8k82J81O03j052qO25o14L19J17o23K53J25j61j91K1O3
1240a39K67r9J09m67k18P69k62k31R6J8j47P9M86n62l37N44L54o69J43M3k01L45
1262g9M1m48J60J17L74l16n84O40P8o8J77j12q9m4L73l43LK10j45LL93l82r9J61
$$ plain form
1286 21 375 127 -220 226 159 173 49 170 -38 328 541 -119 -140 382 272 -21 22 139 -49 218 321 125
1308 125 -165 238 -29 51 -184 -58 84 -97 324 -105 -320 113 -43 66 11 -66 -178 2 118 -245 -321
1329 -321 -66 -74 -317 -307 -257 -373 -98 53 -183 -207 -12 5 -34 -334 -62 -294 50 458 -110 -329 316 123
1351 123 -221 -14 -105 -235 226 118 -56 -168 156 410 85 118 124 -224 155 473 -29 -375 220 588 -224
1372 -224 425 236 52 294 460 227 2 79 555 283 -1 219 295 161 170 225 -287 180 300 105 149 1
1394 1 -235 50 281 90 -446 -188 18 -576 49 -258 -317 -101 175 -230 -508 -287 -60 75 -553 -68 -254
1415 -254 -198 -81 -86 -475 -197 -152 -49 -222 44 89 -365 65 128 -363 156 162 -3 112 -140 142 277 241 308
1438 308 -289 -20 518 132 -5 181 274 276 404 215 -146 180 436 176 66 205 464 236 379 387 -84 39
$$ packed form
1286B1L54k48l47M46o7J4j24J21k08L66K13o60k1N22j10k93M3J17j88K67J03j96
1308A25k90M03k67Q0k35J26J42j81M21m29k15M33j56J09n5p7j12J80J16l63p6
1329c21K55qk43J0N0j16K75J51k36k4J95J7l9l00K72k32L44M08n68k19O45j93
1351A23l44K07r1j30M61j08j74j12L24K54l25L3Ol48L79L18n02l46N95L68q12
1372b24O49j89j84K42J66k33k25P7M76k72k84K20P6j34RN5n12M67J20j95M4j48
1394Ak36K85K31j91n36K58K06n94O25l07n9K16K76m05k78K21K27J35o28M85j86
1415b54N6J17nl89K78M5J03j73K66M5m54M30O3m91N19Oj65J15k52K82J35l6O7
1438C08n97K69N38l86j37J86R3KJ28j89l61L26K56k60j10J39K59k28J43Qm71J23
$$ plain form
1460 39 249 234 -78 91 -9 -239 203 -38 -65 -122 150 91 -354 -73 70 -203 -330 -54 -408 -366 155 -311
1482 -311 -239 -472 -10 -63 -142 20 -431 -345 -88 -123 -109 -18 -22 -420 36 4 -294 -160 -114 -127 -193 141 238 -165 -55
1507 -55 -63 -184 388 228 196 -97 257 474 191 7 433 76 291 298 190 -188 236 196 178 214 66 100 284
1530 284 327 127 -11 -8 382 263 39 22 46 -120 243 142 -307 -142 210 -30 72 163 -145 -289 137 -161
1552 -161 -162 -357 -18 -347 -350 -176 -337 -267 -38 92 -255 -92 -190 -173 10 -225 -268 -204 119 17 98 -77 211
1575 211 123 -292 9 -121 -181 121 224 -130 4 183 149 191 -62 125 -86 301 306 -210 -72 245 255 278 118
1598 118 -96 241 157 263 61 -47 235 184 -33 447 11 13 192 426 -16 50 99 106 1 -28 -65 38 41 103
1622 103 -237 -100 262 111 -370 -136 -241 -217 -320 -175 -197 -278 42 1 -346 0 36 -299 164 -227 -349 -189
$$ packed form
1460C9K10j5l12J69j00k30M42k41k7n7K72n9m45K81J43k73j27K76l54M2N21m66
1482c11P2k33M62n3p9J62m51Q6K57l5J4R1ml98M56l2k98J34M6j3o6L34R7m03J10
1507e5qj21N72j60l2k93L54K17k83j84M26l57K15Pj08l78M24m0j8L6j48L4J84
1530B84M3k00j38LL90j19k24j7K4j66L63j01m49J65L52k40J02R1l08j44M26k98
1552a61jj95L39l29lJ74j61P0K29J30l47J63r8J7J83k35m3O4L23j02Q1j75K88
1575B11q8m15L01j30o0L02J03l54J34J79l4M2k53J87k11L87Nn16J38L17J0K3j60
1598A18k14L37q4J06k02j08K82n1k17M80m36KJ79K34m42O6M9Pj05k9l7J03LO2
1622A03l40J37L62j51m81K34j05K4j03J45k2q1L20m1l47L46L6l35M63l91j22J60
$$ plain form
1644 -189 -23 -244 -202 -173 166 -113 16 -302 -90 -111 -48 -6 13 114 233 -153 253 202 74 -170 282 51
1666 51 163 109 208 337 278 240 -191 -34 262 126 156 151 443 171 380 180 122 -13 177 86 -115 -15 415
1689 415 -29 156 94 -160 49 -22 131 -174 -92 -4 96 -319 52 -155 -131 110 -92 -349 -11 76 -181 -349
1711 -349 -372 -327 -187 184 -283 -180 -277 -183 -46 -289 -109 -292 -237 143 -3 -381 98 174 -169 178 -41 34
1733 34 -91 171 178 57 -59 423 176 234 78 1 187 262 114 156 70 82 195 117 383 90 -73 270 231 20
1757 20 -24 88 40 -60 -143 104 124 -61 312 -43 -47 158 -93 -132 -78 39 -100 42 -46 -448 -60 63 208
1780 208 -184 20 -293 -40 -245 -108 -254 -314 -129 88 -108 -229 -28 -269 -232 151 -104 -342 64 103 156
1801 156 -192 -13 -26 -86 135 -200 -157 145 -35 -21 201 -146 -162 7 121 101 -226 255 20 -81 -72 169 -29
$$ packed form
1644a89J66k21M2K9L39k79J29l18K12k1O3M2J9J01J19l86M06n1j28k44M52k31
1666E1J12n4R9J29n9l8m31J57K96j36L0nK92k72K09k00n8j35J90r1k01J00M30
1689D15m44J85o2k54K09p1J53l05Q2Q8J00m15L71k07K4K41k02k57L38Q7k57j68
1711c49k3M5J40L71m67J03r7R4J37k43J80j83N5L80j46l78M79P6l43L47k19P5
1733C4j25K62Pj21j16M82k47N8j56p7J86P5j48M2q6J2J13p8K66k93j63L43l9k11
1757B0m4J12m8j00q3K47K0j85L73l55mK05k51l9N4J17j39J42q8m02L88J23J45
1780B08l92K04l13K53k05J37j46o0J85K17j96j21K01k41L7L83k55k38M06L9N3
1801A56l48J79j3o0K21l35M3L02j80J4K22l47j6J69J14k0l27M81k35j01RK41j98
$$ plain form
1824 -29 299 190 109 -174 42 156 -24 89 240 90 76 95 104 44 209 162 -141 -62 122 219 95 45 -199 -243
1848 -243 67 58 164 -168 57 -366 -102 -219 -5 -223 -221 47 -143 -229 -133 85 -66 -68 -172 -138 169 137 -110
1871 -110 -166 -55 -291 -102 -23 -64 -65 -31 70 -35 -255 -113 -87 223 19 123 128 278 350 102 171 26 53 -67
1895 -67 178 124 -69 -5 264 -22 -1 136 133 65 23 244 -4 33 159 138 -95 179 -84 -32 162 43 -271 118
1919 118 244 -64 -125 -109 -84 16 -132 -43 -53 -343 -218 42 -145 -63 -67 -269 -184 -3 -220 -47 -231 -185 -7
1942 -7 -243 -138 -432 -98 -152 -490 -13 88 -133 -162 260 -18 -226 28 205 -162 19 142 -73 -90 343 114
1964 114 143 44 215 -136 115 0 76 -25 154 158 51 -90 32 34 218 273 129 80 122 114 122 319 -97 -300 74
1989 74 164 25 219 67 94 -125 176 -171 -85 88 109 112 -187 -399 -82 -5 -155 -131 34 -184 -9 39 -171
$$ packed form
1824b9L28j09q1k83K16J14j80J13J51j50j4J9Ro0J65m7l03P9J84R7j24n0k44m4
1848b43L10rJ06l32K25m23K64j17K14k18KK68j90q6R6K18j51kj04L4L07l2k47
1871a10n6J11k36J89P9m1jL4J01j05k20J42K6L10k04J04NJ50P2k48O9j45K7j20
1895f7K45n4j93O4K69k86K1J37lo8m2K21k48L7J26k1k33K74k63N2J94j19l14L89
1919A18J26l08o1J6K5J00j48Q9j0k90J25K60j87Q2mk02Q5J81k17J73j84M6J78
1942gk36J05k94L34n4l38M77J01k21k9M22k78k08K54J77l67J81J23k15j7M33k29
1964A14K9r9J71l51K51j15P6j01J79Mj07j41J22KJ84N5j44m9M2qQJ97m16k03L74
1989G4R0j39J94j52K7k19L01l47Q6J73K1Lk99k12L17P7j50K4J65k18J75M8k10
$$ plain form
2012 -171 28 252 89 -56 -247 -325 -21 -90 313 -53 -143 69 -159 -373 36 -63 -54 10 154 24 -24 205 -247
2035 -247 -102 -140 50 -84 97 32 110 111 11 285 -37 -192 -37 -2 102 13 -77 126 205 -38 -73 6 55 113
2059 113 -135 -54 -180 186 259 170 -218 88 -105 198 91 234 222 78 6 -110 24 -170 218 -54 -67 -131
2081 -131 144 -61 -160 -27 -112 -53 -96 -130 -8 90 -139 -103 125 -28 -98 112 -87 -19 -224 27 -262 -156 144
2104 144 225 -46 -243 135 -23 139 0 -166 -210 69 124 39 -112 131 -33 46 158 -70 -25 12 79 136 -90
2127 -90 65 -149 363 521 149 63 55 184 -109 134 -41 -144 -16 -170 52 137 -86 193 86 113 7 -212
2149 -212 -75 99 -159 -261 58 54 -34 -178 -178 -27 -46 -190 -125 29 -324 -59 38 -291 -227 125 -69 -115 -189 -105
2173 -105 57 -35 -192 -90 -112 106 -38 172 70 -67 -76 -156 0 -25 101 208 -152 14 195 4 -217 118
$$ packed form
2012a71J99K24j63j45j91p8L04o9M03l66r0K12k28k14M09r9RO4J44j30m8K29m52
2035b47J45l8J90j34J81o5P8Jj00K74l22j55J55L5J04q9r0K03P9k43l5P9M9N8
2059A13k48Q1j26L66P3q9l88L06j93L03j07J43j2j44p2j16J34j94L88k72j3o4
2081a31K75k05r9J33q5N9m3l4J22R8k29L6K28j53p0K10j99O8k05K51k89J06L00
2104A44Q1k71j97L78j58J62j39j66m4K79N5q5j51K43j64P9J12k28M5L7O7N7k26
2127i0J55k14N12J58l72q6qJ29k93K43j75j03J28j54K22Q5k23K79j07K7j06k19
2149b12J37J74k58j02L19mq8j44%J51j9j44O5J54l53K65R7l29O4L52j94m6p4Q4
2173a05J62r2j57J02k2K18j44K10j02j37rq0J56k5J26J07l60J66J81j91k21L35
$$ plain form
2195 118 -55 -14 297 -153 286 94 -25 103 89 204 -14 -67 519 -78 31 408 29 119 89 15 46 -65
2217 -65 123 110 -173 68 51 123 -287 -116 145 -454 16 45 27 88 -179 -181 177 66 -26 0 86 9 -47 11 -46
2242 -46 -274 -84 46 -112 -307 133 56 -160 -199 -168 -178 0 -52 -110 -2 -154 -68 -129 69 170 115 14 -98
2265 -98 -105 124 243 85 -75 -38 -45 35 -14 63 137 -103 352 109 -4 10 -56 -10 -88 138 36 -123 83 -42 55
2290 55 174 280 96 46 6 64 164 -137 112 -122 -133 -87 -97 -72 60 -80 -50 55 55 4 -33 173 3 42 24
2315 24 -249 -66 -101 -166 -6 -60 226 -123 174 30 -254 -59 3 -69 -124 59 101 11 -100 140 -155 83 205
2338 205 -70 -81 -76 24 6 30 52 308 -138 193 78 -26 42 -54 37 233 -67 212 -7 39 171 90 251 125
2362 125 31 16 121 180 215 28 218 67 -120 0 -59 -151 -84 111 -249 97 185 -265 63 -135 130 -339 29
$$ packed form
2195A18j73M1L11m50M39j92j19J28j4J15k18n3N86n97J09L77l79R0l0p4L1j11
2217f5J88j3k83K41j7P2m10J71K61n99M70K9j8O1k67kL58j11r2K6Q6p7n6N8n7
2242d6k28J90J30j58j95M40p7k16l9L1j0J78n2n8J08j52Q6o1J98J01n5j01j12
2265i8pK29J19j58j60L7pQ0m9P7P4k40M55k43j13J4o6M6p8K26j02j59K06j25R7
2290E5J19J06j84n0m0N8J00l01K49k34j1M6j0K5J32j40L0J05%n1l7K06j70L9j8
2315B4k73J83l5o5J60n4K86l49K97j44k84J95O2p2n5J83M2r0j11K40k95K38J22
2338B05k75j1NJ00j8K4K2K56m46L31j15j04O8r6R1J96l00K79k19M6J32q1J61j26
2362A25r4j5J05N9L5j87J90j51j87J20n9r2O7J95l60L46Q8m50L28j98K65m69L68
$$ plain form
2385 29 -128 -229 -33 -56 -184 -119 -49 -60 -167 66 136 -46 49 -5 -161 -99 40 -14 -45 -269 14 66 -11 -142
2409 -142 -29 -24 89 97 21 95 22 -120 20 198 32 -326 351 113 -173 191 60 312 60 -60 382 274
2431 274 308 116 46 160 -92 144 -43 -58 -24 -182 163 75 -224 156 211 13 69 291 -57 -84 -255 -67 -59
2454 -59 26 182 287 98 153 8 -161 -42 -56 136 -122 -103 -245 -32 189 62 -68 128 32 76 -115 -108 -34
2477 -34 150 -131 -196 -62 22 28 -354 -54 -7 -211 -19 103 -186 -22 212 369 -71 28 156 -134 -71 90 22
2500 22 -88 30 107 -69 98 228 93 -39 -60 125 -51 93 172 109 -117 -2 132 21 21 -97 -183 -68 170
2523 170 149 -59 -14 -94 123 -66 -326 -294 59 137 -103 -237 -44 76 -110 83 29 -6 -74 83 -214 -229 -41
2546 -41 -37 -151 -259 66 74 52 46 -107 -124 -59 -143 108 235 -120 -96 33 -31 151 -198 112 200 -30 201 -301 151
$$ packed form
2385B9j57j01J96k3j28O5P0j1j07K33P0j82R5n4j56O2J39n4l1k24K83N2p7j31
2409a42J13NJ13Qp6P4p3j42J40J78j66l58O77k38k86L64j31K52k52j20M42j08
2431B74L4j92p0J14k52K36j87j5L4j58L45q8k99L80N5j98N6K22l48k7j71J88Q
2454e9Q5J56J05j89N5j45j69J19j4J92k58J9j42K13K21j27j30J96r6M4j91PP4
2477c4J84k81o5J34Q4Ol82L00M7k04J92J22k89J64K34J57m40R9J28k90O3J61o8
2500B2j10J18P7j76J67J30j35j32k1J85j76J44P9o3k26J15J34j11%j18q6J15K38
2523A70k1k08M5q0K17j89k60L2L53P8k40j34J93J20j86J93n4l5o8J57k97j5J88
2546d1Mj14j08L25Qk2oj53j7O5q4K51J27l55K4J29o4J82l49L10Q8k30K31n02M52
$$ plain form
2571 151 -10 230 3 249 88 256 -211 78 38 72 77 19 112 -87 122 47 115 22 88 -33 39 127 102 48 -108
2596 -108 107 108 72 251 22 -16 -74 -310 50 59 113 -68 158 -145 -77 -53 5 98 -169 7 4 67 -106 -11 -216
2621 -216 188 -33 102 -78 -99 -68 89 55 -120 -193 -24 -130 -62 -91 44 186 -110 25 -68 22 -181 93 45
2644 45 -54 182 146 -76 -58 -107 123 118 257 234 -107 51 104 31 120 94 139 -59 77 -8 205 284 -34 -130 -144 -89
2670 -89 160 77 65 -90 -28 -278 69 253 186 -200 -33 -238 -24 -209 -238 1 -26 61 -69 -26 -7 -258 80
2693 80 -30 -111 -83 -142 18 43 -82 283 43 7 -45 -66 -87 7 -14 -153 -17 -136 76 -100 -210 -27 40 381
2717 381 167 40 -40 -96 -345 -1 3 195 -113 173 134 33 140 -8 160 -51 -65 50 173 146 129 -53 28
2740 28 13 -148 121 102 -116 -79 55 322 28 175 229 18 -36 -102 89 163 26 147 12 307 246 -81 -24
$$ packed form
2571A51j61K40k27K46j61J68m67K89m0L4Nn8R3j99K09p5O8r3O6j21P2Q8k5n4j56
2596a08K15Jl6J79k29l8n8k36L60RN4j81K26l03O8K4N8R3k67J76lO3j73R5k05
2621b16M04k21J35j80k1L1J57l4j75p3J69j06O8k9J35J42k96J35r3R0k03K74m8
2644D5r9K36l6k22J8m9K30nJ39k3l41J58N3p3Q9k6M5j98J36q5K13P9l18r6j4N5
2670h9K49q3j2j55O2k50L47J84o7l86J67k05K14j85k9K39k7Q7j30M3J9k51L38
2693H0j10q1K8n9J60K5j25L65k40l6n2k1k1R4k1j39J36j19K12j76j10J83O7L41
2717C81k14j27q0n6k49L44MJ92l08K86l9j01J07j48J68k11j4J15J23k7j7j82Q1
2740B8j5j61K69j9k18L7J34K67k94J47N4k11n4o6J91P4j37J21j35K95o1l27N7
$$ plain form
2763 -24 -73 -114 -130 76 -235 -25 196 -11 -113 -12 27 -60 -99 -144 -169 -116 -43 -88 -223 150 -75 149 114 -74
2787 -74 -235 141 119 -22 127 -45 -188 10 93 12 176 -83 28 148 20 -133 109 -43 -265 -108 -152 -81
2809 -81 87 -9 39 -18 144 59 244 -229 184 98 134 -211 161 153 187 59 -19 33 9 -88 -224 -7 166 -101 -106
2834 -106 -200 2 -130 19 -38 18 -5 84 72 -17 -141 -137 4 -7 -181 -160 -138 -7 130 23 41 -6 -184 -293 -1
2859 -1 -272 296 152 -48 27 187 183 143 111 -136 8 -18 -66 7 46 167 -83 105 184 -225 84 66 37 128 -30
2884 -30 233 -171 190 -57 103 62 396 198 67 120 141 50 -174 126 152 -58 -36 180 25 -140 257 -89
2906 -89 4 84 77 -130 148 -222 -284 68 274 -117 33 129 -69 -67 20 -150 209 -208 -86 -43 49 106 71 -360 -74
2931 -74 18 159 -167 -54 -38 -12 -137 -107 -90 231 24 59 213 -173 -56 -207 84 -154 -62 141 138 -98 177
$$ packed form
2763b4m9m1j6K06l11K10K21k07j02J01L9q7l9m5k5N3P3m5j35L73k25K24l5j88
2787g4j61L76k2j41J49j72j43J98Q3q1J64k59J11J20j28j53K42j52k22J57m4P1
2809h1J68r6M8n7J62q5J85m73M13q6L6l45L72qL4j28p8N2k4r7j36K17J73k67n
2834a06r4K02j32J49n7N6k3Q9j2q9j24MJ41j1j74K1K2J31J37j07J8m7j78j09K92
2859ak71N68j44k00P5J60mm0l2k47J44k6m8P3L9J21k50J88P9m09L09j8k9R1j58
2884c0K63m04L61k47J60m1L34j98j31N3K1r1k24L00K6k10K2K16j55j65L97l46
2906h9R3Q0pk07K78l70o2L52K06l91J50R6j98KQ7j70L59m17J22M3R2N7l5m31K86
2931g4R2J41l26J13J6K6j25L0J7L21k07L5J54l86J17j51K91k38R2K03lk36K75
$$ plain form
2954 177 109 208 -65 89 131 -67 267 101 -28 133 175 91 157 337 -155 60 -263 71 -125 11 119 86
2976 86 -158 7 -116 39 31 65 -114 -97 -48 -52 -308 -248 74 -17 -66 -213 -184 -19 153 -71 -92 -189 79 -166 -59
3001 -59 48 76 -135 -18 -4 -113 255 -134 -61 -53 -98 27 -46 -24 -234 6 -109 -78 -4 118 -41 -40 24 -246 -14
3026 -14 -95 -29 74 25 163 -33 -28 52 311 87 -132 138 12 -256 122 73 -220 221 106 191 35 68 45 -98
3050 -98 67 -32 24 190 -130 143 -131 -146 59 48 -114 -147 -67 -15 70 -98 -11 81 16 -49 147 -170 164 -135
3074 -135 -140 83 -269 -152 115 -84 4 -44 -67 18 -16 18 -248 2 -22 -187 -76 -185 -114 49 -254 -104 -1
3097 -1 -138 49 239 54 -36 145 146 124 91 187 167 103 -76 154 -80 135 130 4 38 -52 -53 287 325 117 24 83
3123 83 -38 146 -14 88 119 80 115 197 67 37 -200 -126 -44 -4 29 99 -70 67 199 -53 -69 -6 -144 49
$$ packed form
2954A77o8R9k73J54M2j98L34j66j29J61M2q4O6J80m92K15l23L34j96J36J08l3
2976H6k44J65j23J55qL4j79J7M9mk56O0L22r1m9j47K9J65J72k24k1r7K68k45J07
3001e9J07K8k11J17J4j09L68l89P3Qm5J25p3K2k10K40j15L1P4J22j59JO4k70K32
3026a4q1O6J03m9J38j96NQ0K59k24k19K70j26k68L78m9k93M41j15Q5j56L3k3j43
3050i8J65r9N6J66l20K73k74j5K05j1j62l3Q0N2Q5j68Q7R2o5o5J96l17L34k99
3074a35nK23l52J17K67j99Q8m8k3Q5l4L4k66K50k4j65J11j09P1J63l03J50J03
3097aj37J87J90j85r0J81Jk2l3R6k0o4j79K30k34K15nj26L4r0jL40L8k08r3N9
3123H3j21J84j60J02L1l9L5Q2j30l0k37P4Q2M0L3P0j69J37J32k52j6O3j38J93
$$ plain form
3147 49 279 80 144 -101 -11 82 7 -88 -260 20 -140 43 37 82 235 11 -9 -48 28 -77 39 185 -150 -4
3171 -4 -11 -218 -73 -200 305 221 -210 237 141 88 64 -49 197 -243 122 241 47 -38 -36 285 -263 107 226 24
3195 24 73 110 -63 -45 -195 136 190 69 4 158 -20 134 225 82 -127 123 270 61 -73 188 166 77 85 227
3219 227 -31 123 -65 -24 -28 -208 -98 -363 -130 -114 -62 157 -292 -83 176 80 17 36 -241 -86 99 39 -22
3242 -22 53 130 100 -109 2 167 7 -68 17 -45 178 177 -20 43 131 141 50 281 17 129 -14 -130 57 65 -69
3267 -69 -68 118 136 113 51 -94 22 91 18 99 5 56 105 33 180 -274 80 -198 56 -47 5 -65 15 -18 34 -37
3293 -37 -159 -19 -26 60 108 -82 10 115 24 -99 4 -196 -23 -259 -121 180 -50 22 -178 -10 161 310 -115
3316 -115 176 108 -66 -46 -16 143 -56 165 65 -239 -16 119 109 186 83 83 -201 -9 -65 -10 -152 -24 28
$$ packed form
3147D9K30j99O4k45R0R3p5r5j72K80j60J83oM5J53k24k0l9P6j05J16J46l35J46
3171dpk07J45j27N05q4m31M47r6n3k4j13K46m40L65J19j94q5KL21n48L70J19k02
3195B4M9L7j73J8j50L31N4j21o5J54j78J54R1j43k09K50J47k09j34K61k2q9QJ42
3219B27k58J54j88M1mj80J10k65K33J6N2K19m49K09K59r6o3J9k77J55J85o0o1
3242b2P5P7l0k09J11J65j60p5Q5o2K23jj97O3Q8J0r1K31k64J12j43j16J87Qj34
3267f9JJ86J8k3o2j45J16O9p3Q1r4N1M9p2J47m54L54k78K54j03N2p0Q0l3N2p1
3293c7j22J40pQ6M8j90R2J05r1j23J03k00J73k36J38L01k30P2k00J68J71J49m25
3316a15K91o8j74K0L0J59j99K21j00l04K23J35j0P7j03%k84J92n6N5j42J28N2
$$ plain form
3339 28 -89 -118 -109 181 30 -77 237 -55 -37 170 -12 45 -41 138 -37 -159 59 160 -309 -57 76 -74
3361 -74 -29 -66 -80 76 125 74 65 -35 -202 4 -162 91 -28 -80 103 74 -198 62 146 -88 -201 -96 -174 -193
3385 -193 -34 -15 -34 82 32 186 -150 39 191 -205 -69 121 90 -163 45 74 151 -95 -52 -101 -194 7 191
3408 191 -149 81 105 -101 -154 70 3 33 -234 44 2 -30 95 158 118 -152 50 -21 -64 431 -19 -38 -34 -99 182
3433 182 87 -171 -179 -173 50 -96 -160 -219 -189 -12 -199 -10 203 -59 -202 306 -238 -43 -130 -18 -2 63 24 47
3457 47 74 -17 -209 -107 220 -118 137 87 -1 -13 49 138 89 -118 -9 1 -27 122 68 -144 73 -21 -78 -190 -154
3482 -154 19 173 33 -121 -77 -92 131 91 83 67 -94 -183 -153 29 366 177 35 21 5 -198 139 -65 -78 -56
3506 -56 -90 33 159 28 -111 -12 20 -129 114 63 20 -4 -214 81 -204 -49 -51 -82 62 -169 254 191 70 -71
$$ packed form
3339B8j17k9RK90j51j07L14k92J8K07j82N7q6J79j75j22K18J01m69K52J33j50
3361g4M5l7j4J56M9n1rj00j67K06j66K53j19n2J83k9k72K60Q4k34j13J05p8j9
3385a93J59J9j9J16n0J54l36J89J52l96J36J90l1k53K08K9P7k46M3m9r3K01J84
3408A91l40K30K4k06n3K24o7L0k67K78m2l2J25O3m0k70K02p1m3M95m50j9Mo5K81
3433A82r5k58qOK23j46o4n9L0J77j87J89K13k62j43N08n44J95q7J12J6O5l9K3
3457D7K7r1j92J02L27l38K55n0q8j2O2Q9m9k07J09J0k8J49n4k12K17r4n7j12L6
3482a54J73J54j40j54M4j5K23m0qj6j61q9L0J82L37j89j42j4j6k03L37k04j3K2
3506e6l4J23J26j31j39R9L2j49K43n1m3k4k10K95k85J55kl1J44k31M23o3j21j41
$$ plain form
3530 -71 41 175 -25 31 -100 -81 18 -30 -6 11 -192 57 153 -92 -32 -236 -101 48 187 66 135 -24 68 -40
3554 -40 -198 130 90 209 203 220 34 -183 169 -22 13 -240 173 43 -25 -45 -195 -15 122 273 -27 -86 -199
3577 -199 216 49 59 197 275 -139 -119 157 -267 -221 5 126 -255 -239 -79 110 -9 -117 -166 -82 213 -15
3599 -15 -114 -114 -152 39 -109 -216 7 213 -76 123 -47 123 100 -6 146 -103 -9 -35 -111 108 -34 90 -63
3622 -63 -120 88 42 -43 232 -153 248 -249 -18 13 -35 126 194 -73 -153 89 103 152 -205 46 -49 -172 77 -32
3646 -32 203 235 -81 45 -151 83 -18 -279 0 -282 -13 -124 100 -44 -95 -177 56 -83 96 64 -49 1
3668 1 -2 -71 17 224 131 36 -100 -197 141 -21 -138 -218 -175 54 -203 173 -187 82 21 241 53 -9 -160 -81 163
3693 163 -127 3 33 92 -30 165 -51 41 93 158 84 1 117 -225 -204 -60 88 -80 -13 71 12 17 130 -96
$$ packed form
3530g1J12J34k00N6j31J9R9m8K4J7k03K49R6k45O0k04J35J49J39j21O9j59R2j08
3554d0j58L28m0J19oJ7j86k17L52j91L5k53M13j30o8k0j50J80J37J51l00n9j13
3577a99M15j67J0J38P8m14K0K76m24M6K26J21l81J6J60J89j19j08m9Q4K95k28
3599a5r9%l8J91j48j07K23K06k89J99j70J70k3j06J52k49R4k6p6K19j42J24j53
3622f3n7K08m6q5K75l85M01m97K31L1m8J61O8k67q0K42J4M9l57K51r5j23K49j09
3646c2K35L2l16J26j96K34j01k61K79k82K69j11K24j44n1q2K33j39J79l2j13N0
3668Alo9Q8K07r3r5j36r7L38j62j17q0M3K29k57L76l60K69o1K20j88o2j51P9K44
3693A63k90J30L0N9j22J95k16R2N2O5p4q3J16l42K1J44J48j68O7Q4n9NJ13k26
$$ plain form
3717 -96 -58 57 -25 -164 -123 -80 140 -138 -95 38 -16 -228 -193 -104 105 -34 135 52 -21 187 -98 -91 -140 175 172
3742 172 174 -186 -15 42 -166 135 73 49 -37 10 115 -91 -36 101 -173 -11 -9 -19 -23 -102 118 -150 -24 -55 73
3767 73 11 -55 -143 -56 -90 -90 -165 -107 245 -10 126 -144 -47 0 101 -36 45 57 -32 -22 -45 -215 -112 230 -183 60
3793 60 -23 -106 89 189 52 228 2 -131 -33 155 -63 16 -118 -68 -25 -72 -128 -68 140 80 -121 43 -171 -184
3817 -184 66 -255 13 92 147 -248 103 -12 -55 -40 178 27 -155 -69 -7 -119 230 -263 82 74 41 3 -86 -85
3841 -85 90 177 -61 136 55 -183 -156 -181 -200 -59 -75 -71 -19 -51 -77 163 78 101 -155 11 54 143 77 -1 230 84
3867 84 137 -15 92 113 -57 -75 -64 -92 -122 251 6 152 240 4 -10 20 101 -107 -136 22 -264 90 160 91 -84
3892 -84 110 -24 -23 37 157 63 27 132 -19 -150 99 -101 -75 82 39 -35 -44 15 -322 -29 56 115 -74 -67 187
$$ packed form
3717i6L8J15q2j39M1M3K20k78M3J33n4k12L5Q9K09j39J69q3p3K08k85Pm9L15l
3742A72Kl60J71N7k08L01o2k4q6M7J05k06N5J37k74J62Kj0mp9K20k68J26l1J28
3767G3o2o6q8Q7l4%p5N8L52k55J36k70R7M7J01j37Q1J2q9J0k3j70J03L42m13K43
3793F0q3q3J95J00j37J76k26j33R8J88k18P9j34N0M3m7n6O0K08o0k01J64k14j3
3817a84K50l21K68P9N5l95L51j15m3J5K18j51j82Q6O2j12L49m93L45ql3l8q9J
3841h5J75Q7k38J97q1k38K7k5j9J41j6MN2l2k6K40q5K3k56J66M3Q9o6p8K31j46
3867H4N3j52J07K1j70j8J1k8l0L73k45J46Q8k36j4L0Q1k08k9J58k86L54P0o9j75
3892h4J94j34JO0J20r4l6J05j51j31K49k00K6J57m3p4rN9l37K93Q5N9j89PK54
$$ plain form
3917 187 54 173 42 208 -204 51 -98 147 262 -37 13 -220 51 -206 12 151 -26 -64 -91 195 54
3938 54 83 -65 -9 -214 -147 211 179 -69 71 7 -72 -135 -222 -252 -6 125 -37 129 13 51 -47 7 7 13 -129 -279
3964 -279 -127 65 -38 175 123 18 -7 126 44 62 -53 157 -120 204 33 43 7 12 37 19 -37 67 -206 171
3988 171 -81 -141 -109 -181 90 -106 62 224 3 -10 248 29 -44 66 -1 -286 36 -93 -101 228 -140 47 190
4011 190 190 -91 -52 -76 2 -49 -259 -153 210 81 -64 -68 48 -173 4 -4 7 98 39 89 123 18 297 175 70
4036 70 142 -84 -32 -55 -222 -71 62 140 -207 97 -51 -14 65 -9 241 74 -108 -171 41 -84 -83 -271 164 -83
4060 -83 -118 32 31 25 -4 74 -47 -123 89 73 136 -97 39 74 -128 -56 76 11 96 -85 142 151 22 -287 256 -176
4086 -176 -38 43 -124 249 92 -25 -134 180 -245 122 285 -162 -197 -61 152 39 214 150 138 -53 17 191
$$ packed form
3917A87j33J19j31J66m12K55j49K45J15k99N0k33K71k57K18J39j77l8k7K86j41
3938E4K9j48N6k05O7L58l2k48J40o4p9o3q7l0K46J31j62J66j16L8r8N4%Oj42j50
3964b79J52J92j03K13n2j05k5J33q2J8j15K10k77L24j71J0l6NK5j8n6J04k73L77
3988A71k52o0L2p2K71j96J68J62k21j3K58k19p3J10o7k85L22j29qL29l68J87J43
4011A90%k81L9k4P8n1k10J06L63j29j45mJ16k21J77qJ1R1n9N0L4j05K79j22j05
4036G0P2k26N2k3j67J51J33P8l47L04j48L7P9p4K50j67j82o3K12j25Jj88M35k47
4060h3l5J50jok9P8j21p6K12j6O3k33J36L5k02P2J32o5Q5j81K27Rj29l09N43m32
4086a76J38Q1j67L73j57j17j09L14m25L67J63m47l5J36K13j13J75o4j2j91P0J74
$$ plain form
4108 191 -3 16 16 -75 -66 -51 -118 -23 10 49 194 252 91 -99 -158 -61 -112 -51 11 51 27 96 -44 22 -5 72 0 33
4136 33 -164 241 94 23 -260 -9 253 28 -168 -7 -127 102 -55 -209 96 140 25 -106 60 6 360
4157 360 65 135 87 138 -233 -258 -91 -13 -249 -60 -197 -76 -89 31 -78 -25 28 -129 -250 230 -31 110 191
4180 191 -20 19 -164 92 -191 134 -82 -150 -98 -29 104 96 -156 -130 64 -84 132 -195 -171 84 -39 -32 -37 67
4204 67 -223 50 34 118 -126 -15 4 -11 -233 -83 -77 -103 -96 46 -40 -45 -22 -153 293 17 60 222 49 -25 -13 86
4230 86 236 -167 -139 -96 -58 -106 -55 -189 138 176 12 -104 -89 -83 -52 15 45 280 54 138 24 124 87 250 -81
4255 -81 79 71 208 -52 60 33 -3 -63 0 -30 176 -7 64 -97 291 -18 322 39 -56 172 -26 -234 -96
4278 -96 -9 -168 64 -30 119 156 215 13 49 -141 80 31 114 -108 57 229 -3 -76 -130 -87 111 -51 -114 123
$$ packed form
4108A91j94J9%r1RJ5o7R5L3L9J45N8j61j90n9R7n1O1O2M0k4O9j40O6k7P7p2L3
4136C3j97M05j47p1k83K51K62k25j96J61j20K29j57j54L05M4j15j31J66n4L54
4157C60k95P0m8N1l71k5J67P8k36J89j37J21j3J20j09N3N3j57j21M80k61J41Q1
4180A91k11L9j83K56k83L25k16o8N2O9J33qk52K6J94j48K16l27K4K55j23PnJ04
4204F7k90K73j6Q4k44J11J9j5k22J50Ok6PJ42q6nK3j31M46k76M3J62j73p4J2R9
4230H6J50m03K8M3L8m8N1j34L27L8j64j16J5OL1O7L0K35k26Q4j14J00l7J63l31
4255h1J60qJ37k60J12k7l6o0O3l0K06j83P1j61L88l09L40k83r5K28j98k08J38
4278i6Q7j59K32r4J49L7N9k02L6j90K21m9Q3k22J65J72k32p3n4M3J98j62o3K37
$$ plain form
4302 123 14 150 -144 73 -110 164 -49 49 90 -27 84 -198 96 -71 62 144 -141 -76 186 78 -104
4323 -104 57 131 -138 -87 -142 50 -107 15 -110 88 59 77 190 125 31 111 18 -50 -13 -174 16 49 18 118
4347 118 93 -83 152 141 -290 -7 -15 36 -198 -83 151 -174 -89 -335 -12 -85 -130 -148 13 -8 -27 111 -201 -92
4371 -92 16 77 319 115 61 -93 63 -15 55 132 111 95 31 16 90 -40 -194 -142 -26 162 -102 -15 99 -8
4395 -8 -29 -138 184 16 -25 -63 103 155 -56 -247 32 -218 246 221 68 -21 50 48 -77 211 -23 161 355 -180
4419 -180 50 -89 -73 -112 175 195 -25 152 -55 -222 66 19 83 -126 -161 -203 -68 -240 -9 -33 -31 216 -118
4442 -118 204 108 -61 19 41 -26 45 75 -61 49 232 37 -150 -85 15 -117 -13 -156 199 154 52 75 -120
4465 -120 -23 -10 47 -88 135 103 -174 -115 18 28 242 132 23 136 164 106 8 -166 52 -32 -22 -76 32 117
$$ packed form
4302A23j09J36k94K17j83K74k13R8M1j17J11k82K94j67J33Q2k85O5K62j08j82
4323a04J61P4k69N1n5J92j57J22j25J98k9J8J13o5r4Q0r3o8L7j61J90L3l1J00
4347A18k5j76K35j1m31K83qN1k34J15K34l25Q5k46L23p3m5j8J61k1j9J38l12J09
4371i2J08O1K42k04n4j54J56p8P0P7k1j6o4j5P4j30j54N2J16J88k64Q7J14j07
4395hk1j09L22j68m1l8J66N2k11j91K79k50M64k5j53q9P1kj25K88k34J84J94n35
4419a80K30j39J6l9K87K0k20J77k07j67K88m7O4k09l5m2J35j72K31k4KK47l34
4442a18L22r6j69Q0K2o7P1L0j36J10J83j95j87O5J00j32J04j43L55m5j02K3j95
4465a20R7J3N7j35K23l2k77N9J33J0K14j10j09J13K8n8r8j74K18q4J0n4J08Q5
$$ plain form
4489 117 110 23 -223 134 -99 -153 24 4 -116 -88 -66 11 208 250 3 130 -156 58 -271 -230 -38 236 -58
4512 -58 -10 73 262 71 91 217 244 210 -179 67 99 140 -24 23 150 133 -36 61 -26 19 -84 -25 86 -13 -49
4537 -49 -242 182 46 -228 -58 131 -124 51 -137 31 34 91 80 -230 -121 297 182 4 10 -148 120 -31
4559 -31 29 -33 344 -14 160 81 179 -160 72 -223 56 49 20 31 -97 39 -138 26 10 29 -191 -133 75 -267
4583 -267 -3 70 -94 -5 -141 160 -95 98 63 58 -172 -49 -82 -93 222 165 -41 14 -27 -62 -59 -333 -88 24
4607 24 -59 -31 89 78 -94 95 23 -163 -35 53 -43 116 32 122 -108 52 -67 -183 44 82 -62 73 -194
4630 -194 265 -100 159 0 75 100 284 124 -46 84 -223 -76 -123 -167 -82 49 192 -112 -85 -165 -170 -47 -169
4653 -169 -187 -76 256 77 182 -35 31 38 -43 100 -73 -60 -139 -276 -55 59 158 -57 -222 242 -227 41 -62
$$ packed form
4489A17pq7k46L57k33n4J77k0j20K8K2P7J97M2k47J27k86K14l29M1J92K74k94
4512e8M8Q3J89j91K0J26K7l4l89K46L2M1j64M7J27j7j69R7q7M5j03N9J11r9l6
4537d9j93M24j36k74J70J89k55J75j88J68LN7j1l10J09M18j15j78Oj58K68j51
4559c1O0o2L77l58J74p9R8l39K32k95K79pk9J1j28J36j77J64j6J9k20N8K08l42
4583b67K64P3j64Q9j36L01k55J93l5nk30J23l3j1L15n7k06N5m1l5Lk74K45J12
4607B4q3K8J20j1j72J89p2j86J28Q8r6J59q4R0k30J60j19j16K27L8j44J35k67
4630a94M59l65K59j59P5K5J84j60j70J30l07J47m7m4Q5J31J43l04K7q0nJ23j22
4653a69j8J11L32j79J05k17O6Pq1J43j73J3p9j37K21J14R9k15j65M64m69K68j03
$$ plain form
4676 -62 -70 -94 -77 3 92 175 -140 -204 -54 103 149 -100 -112 288 -101 -74 38 -71 123 -84 0 32 193 146 155 -142
4702 -142 35 -7 85 -6 35 77 -158 88 88 -165 91 -68 120 107 -120 -160 -16 101 142 -52 -109 -59 82 -13
4726 -13 -130 111 -21 -242 38 120 209 97 -216 -186 17 125 -15 114 -157 88 -83 19 13 -64 -109 -42 -48 62
4750 62 111 70 95 -25 40 46 5 160 -44 -33 -62 86 -47 -226 -8 229 17 -187 101 -50 29 269 48 86
4774 86 -4 109 54 -112 31 -29 -103 171 -208 89 27 -2 82 -39 -122 237 -44 -162 51 28 31 18 176 26
4798 26 86 329 -57 -161 93 -104 292 1 37 -45 -158 -37 22 44 -47 130 -119 -126 -12 -122 -209 -3 -22 -216
4822 -216 -30 -179 18 341 99 -217 21 -14 164 157 57 -101 85 171 115 125 40 -94 -270 -24 -7 -60 179
4845 179 46 84 152 4 47 -185 218 31 190 140 34 90 -6 205 45 44 98 -136 119 -247 -36 32 218
$$ packed form
4676f2qk4J7Q0Q9Q3l15o4J50J57M6k49j2M00l89K7J12j09J94k07Q4L2J61m7Rk97
4702a42J77m2R2r1M1M2k35K46%k53K56j59J88j3k27m0J44J17M1j94n7N0J41r5
4726a3j17K41j32k21K80Q2Q9j12l13L0K03J08j40J29k71K45j71J02op7m5O7oJ10
4750F2M9m1K5j20O5Om1J55k04J1k9J48j33j79K18K37k12k04K88j51P9K40k21L8
4774H6r0J13n5j66J43o0p4K74l79K97o2k9Q4j21q3L59k81j18K13k3Lj3J58j50
4798B6O0K43l86j04K54j97L96k91L6q2j13J21N9K2r1J77k49pJ14j10q7K06j9j94
4822b16J86j49J97L23k42l16K38l5J78pj00j58J86Q6n6J0q5j34j76K46J7n3K39
4845A79j33L8O8j48M3k32M03j87J59n0j06N6r6K11j60jN4k34K55l66K11O8J86
$$ plain form
4868 218 34 92 24 -188 -93 -40 11 -37 -60 146 226 -38 -14 168 111 -36 -10 -55 -109 19 -79 -126 -129 -157 -26 -23 -84
4895 -84 191 -259 -164 30 22 52 -122 1 -234 -46 -229 -72 99 61 -53 119 87 -42 368 -108 -16 210 -106
4918 -106 11 -77 -175 -147 52 -161 283 112 171 -17 45 6 -8 200 4 31 -97 73 20 -42 -18 -148 4 16
4942 16 -11 -152 11 -115 -54 181 -15 166 -57 71 -17 41 -187 -54 179 -33 -146 -29 -82 8 -83 26 6
4965 6 -168 -147 -208 142 131 -179 115 -91 -117 -68 -9 50 -145 13 -104 5 -242 125 -120 43 -12 135 -85
4988 -85 145 25 -89 -258 120 -32 -3 46 106 60 13 56 54 -131 136 214 -62 79 -41 -95 57 -26 84 -107
5012 -107 173 -123 90 27 49 61 -129 134 59 -73 -13 79 -8 -170 -82 160 -79 -67 -31 3 -255 40 167 -52
5036 -52 -25 84 62 6 -238 -5 37 -9 159 273 -236 -144 75 93 -81 -70 87 -32 -144 110 7 -362 -115
$$ packed form
4868B18j84N8o8k12R5N3N1m8k3K06Q0k64K4J82n7j47K6m5n4J28r8m7lk8J31Lo1
4895h4K75m50R5J94qL0j74J23k35J88j83J57J71l8j14J72l2j29M10m76R2K26l16
4918a06J17q8r8K8J99k13M44j71N9j88O2l9j4K08j96K7j28J70n3o2K4j30J52J2
4942A6k7j41J63j26O1K35j96J81k23J28q8N8k28J33K33k12j13J17n3R0r1J09k0
4965Fj74K1o1L50j1l10K94k06k6M9N9N9j95J58j17J09k47L67k45J63n5J47k20
4988h5K30j20j14j69L78j52K9M9O0m6m7M3kj85K67P8k76J41j20n4J52q3J10j91
5012a07K80k96K13o3K2J2j90K63p5j32O0R2q7j62Q8K42k39J2L6L4k58K95J27k19
5036e2K7J09k2n6k44K33M2m6J68J14n09R2K19J8j74J1J57j19j12K54j03l69K47
$$ plain form
5059 -115 40 -75 50 -115 -74 -141 -49 35 129 -145 334 19 160 91 -56 -32 224 -98 141 29 152 -107
5081 -107 42 -57 23 -3 194 125 202 30 18 100 -17 127 -41 9 -382 -202 44 -96 96 -76 47 298 -71
5104 -71 -25 -6 279 168 -289 39 58 -139 -11 -49 58 -146 -130 -93 -52 19 119 -102 92 -76 3 167 -84
5127 -84 276 -55 -30 -114 -122 134 -33 24 -19 -64 -136 253 0 -89 -10 -98 24 -255 -71 -68 87 -90 -126 -42 -29 38
5153 38 -31 32 197 -123 126 -249 142 -68 138 -54 281 -5 10 30 188 37 -138 78 110 60 -67 -87 -50
5176 -50 -66 103 -52 -39 -21 -247 -107 147 138 17 55 89 -238 -52 -185 36 -94 162 -69 19 -138 -46 256
5199 256 55 73 -153 107 -102 -178 155 -19 152 107 -195 31 -186 29 66 60 191 81 36 -358 2 -158
5221 -158 52 291 -197 254 -96 -60 -69 -5 80 -37 12 127 134 -15 113 -95 7 -18 -12 30 1 134 179 11 -139
$$ packed form
5059a15J55j15J25j65M1o7R2Q4R4k74M79l15J41o9j47K4K56l22K39j12J23k59
5081a07J49r9Q0k6J97o9P7j72j2Q2j17J44j68N0l91J80K46j40J92j72J23K51l69
5104g1M6J9K85j11m57L28J9j97J28l8J07k04J6L7M1P1J00k21J94j68P9J64k51
5127h4L60l31K5q4qK56j67N7m3m5p2L89k53q9P9q8J22k79J84LJ55j77l6Q4J3O7
5153C8o9O3J65l20K49l75L91k10K06j92L35k86J5K0J58j51j75K16L2n0j27k0L7
5176e0j6J69j55J3J8k26J40K54rj21L8L4l27J86j33K21j30K56k31Q8j57R2L02
5199B56k01J8k26K60k09p6L33j74J71m5l02K26k17K15L7oJ31j10m5l94L60j60
5221a58K10K39m88M51l50L6rO4Q5j17M9J15Pj49J28k08J02k5OM2k9J33M5j68j50
$$ plain form
5246 -139 45 125 69 -62 26 -28 47 162 -149 121 -28 190 15 -48 211 -92 -138 53 -55 164 43 -152
5268 -152 -10 -143 1 108 -4 -19 149 -44 -76 14 -24 -283 77 74 -64 28 34 -202 -173 -262 -64 -143 -3 -166
5292 -166 -106 -6 86 143 117 27 -278 250 -88 56 124 87 46 -142 -11 81 143 -25 -102 -189 13 -81 24 -85
5316 -85 60 61 29 -155 118 14 -242 -100 -38 -12 -315 131 -176 -151 59 9 75 -41 61 -1 -39 1 -139 63
5340 63 -62 75 88 -284 125 13 -26 202 -276 26 10 -20 29 -58 -7 0 97 84 83 -125 7 -7 -4 92 168 130 158
5367 158 25 -76 111 -251 -29 -72 161 8 -127 -79 118 -22 107 -10 -161 11 85 -244 -55 -2 -97 -90
5389 -90 -112 54 -56 -43 255 -23 93 183 28 -202 -157 261 291 -33 -7 -125 -252 266 -10 -123 -15 -67 54
5412 54 -76 -183 -8 -194 -19 119 -21 -223 154 74 -12 -13 -256 226 -196 -30 202 -116 99 -108 -198 -202 237
$$ packed form
5246a39J84Q0n6j31Q8n4P5J15l11K70j49K18j75o3K59l03m6J91j08K19j21j95
5268a52J42j33J44J07j12j5J68j93l2R0l8k59L60lj38R2Ok36K9q9J98p9J40j63
5292a66O0J00R2N7k6r0l05N28l38J44O8l7m1j88J31R2O2j68p7q7K02r4J05j09
5316h5J45Jl2j84K73j04k56J42O2K6l03M46l07K5K10n0O6j16J02o2l8M0j40K02
5340F3j25J37J3l72M09j12l9K28m78L02j6l0M9q7N1PR7j3jk08J32j4LR6P6l8K8
5367A58j33j01J87l62K22m3K33j53j35M8J97j40J29j17j51J72P4l29J89N3r5P
5389i0k2J66j10J3K98k78J16R0j55k30M5M18L0l24K6j18j27N18k76j13J08n2J21
5412E4j30j07J75j86J75J38j40k02L77q0q6jk43M82m22J66K32l18K15k07r0mM39
$$ plain form
5435 237 -50 130 102 54 -131 19 228 95 4 -82 24 41 30 108 117 131 -54 -116 77 12 80 229 177 -196 237
5460 237 123 -47 16 -74 -118 -106 222 38 -45 180 177 31 -118 187 21 189 18 -113 -233 -145 -31 128 57
5483 57 -68 -74 -252 -153 -188 -53 144 110 -48 112 -3 -52 -31 31 109 -20 -181 107 15 20 -50 61 -162 103 -74
5508 -74 43 262 -116 125 -38 184 147 -31 172 111 116 -145 31 332 -186 -110 248 61 124 107 -46 -33 -8
5531 -8 88 51 -44 -75 24 -119 44 -69 -76 76 -120 -30 -48 -137 -207 74 261 -244 -66 162 85 -187 -133 28 -80
5556 -80 -95 35 76 -49 61 235 142 133 -121 -55 2 172 63 -385 -94 56 -300 129 -126 -17 -37 17 79 -35
5580 -35 73 -51 -31 119 -383 -5 133 249 -132 -54 -30 -165 77 11 10 -37 54 53 185 -94 -60 2 -43 113 118
5605 118 -80 150 -48 29 -35 100 4 -5 -31 -100 -215 147 58 237 233 -188 -50 56 -4 -40 308 -254 -190 -46
$$ packed form
5435B37k87J80k8m8j85J50K09j33r1q6J06J7j1P8RJ4j85o2J93o5O8J49n2l73M33
5460B37j14j70O3r0m4J2L28j84q3K25lj46j49L05j66J68j71j31j20Q8J14J59p1
5483E7j25oj78R9l5J35J97l4j58J60j15m9K1O2P8j29j61K88r2Np0J11k23K65j77
5508g4J17K19l78K41j63K22l7j78K03o1Nk61J76L01n18P6L58j87O3j7j53J3K5
5531hR6l7r5l1R9j43J63j13pJ52j96R0j8q9p0K81J87n05J78K28p7k72N4J61j08
5556h0j5J30M1j25J10J74r3rk54O6N7J70j09m48K91J50l56M29k55J09k0N4O2j14
5580c5J08j24K0J50n02L78J38J16l81P8K4j35K42o6jm7R1jJ32k79L4O2m5J56N
5605A18j98K30j98P7o4J35r6rk6o9j15L62q9J79mm21J38J06o0l6L48n62O4J44
$$ plain form
5629 -46 111 -94 80 -10 -6 62 -192 -59 75 -203 -97 55 -127 27 -123 -63 -103 64 72 -237 48 81 35 -63
5653 -63 1 141 32 -4 -12 185 204 92 -13 -51 223 65 -115 21 -291 59 211 -126 -56 -102 -135 86 85 -88
5677 -88 -99 -8 -38 265 -82 -17 -89 -388 -19 15 75 -258 86 -202 165 84 -59 -146 257 -127 75 145 186 75
5701 75 60 167 -87 -73 161 -113 -17 235 -3 183 18 -103 -296 -19 66 89 213 45 -86 84 174 -151
5723 -151 -179 45 -86 -130 -133 275 95 81 -226 39 -42 -91 107 191 -336 -84 153 -119 -52 -34 -42 23 -92 70
5747 70 113 56 72 -132 -195 -69 1 -45 -17 -44 172 -82 105 -222 -125 -102 -13 49 -269 -135 -143 -8 41 171 -66
5772 -66 -64 -63 244 41 -199 -3 -26 40 166 47 -99 -56 22 65 -29 93 408 -120 57 187 -28 -48 -57 0 40
5797 40 -106 -1 282 -65 -85 -116 261 -28 54 -31 82 -96 32 -136 -26 -74 17 -9 -120 49 207 182 -29
$$ packed form
5629d6J57k05J74r0MO8k54J33J34k78J06J52j82J54j50O0m0J67Ql09K85L3m6r8
5653f3O4J40j09l6qJ97J9j12j05l8K74j58j80J36l12L50J52l37P0m6l3K21jj73
5677h8j1R1l0L03l47O5p2k99L69L4O0l33L44k88L67q1j43q7M03l84K02P0M1j11
5701G5j5J07k54J4K34k74R6K52k38J86j65j21j93K77Q5K3J24j68j31J70R0l25
5723a51k8K24j31m4lM08j80j4l07K65q1m9J98Q4n27K52K37k72O7J8qO5j15J62
5747G0M3n7J6k04o3J26P0m6K8k7K16k54J87l27R7K3Q9O2l18J34qJ35M9J30k37
5772f6KJL07k03k40J96k3O6J26j19j46M3P8M3r4J22L15n28J77J30k15k0rN7M0
5797D0j46J05K83l47k0l1L77k89Q2q5J13j78J28j68J10m8R1k6j11J69J58k5k11
$$ plain form
5820 -29 51 -171 32 -98 -34 195 -140 -166 -25 -131 235 99 -79 6 155 -176 33 236 -23 13 34 251
5842 251 -21 -49 76 -100 -48 -31 -163 -175 65 -2 46 74 -84 64 -112 -134 91 -48 -115 -104 -11 -21 -151 -41
5866 -41 46 82 -3 -209 -5 -4 -20 124 41 -108 229 184 44 37 30 24 -58 -283 -92 46 296 -15 -163 318 -142
5891 -142 -32 33 67 -42 104 58 102 -23 -233 -82 -11 56 102 -87 236 101 16 -24 -289 0 -80 -20 -75 -233
5915 -233 79 25 46 104 -106 -22 223 35 -200 109 -72 6 -141 -354 -111 80 114 -120 -25 -65 -94 -7 -148
5938 -148 149 -218 -123 75 -215 17 86 -163 61 -45 -183 40 16 -14 88 -27 99 -46 74 -153 -45
5959 -45 52 97 -57 141 -232 -165 -25 162 185 -38 -74 -159 3 -257 50 6 -36 -66 62 46 47 -76 10 31 43
5984 43 133 -11 -69 -146 157 92 64 152 -40 -50 -126 -94 -100 204 241 -39 163 107 403 -10 158 -30 41 -166 -148
$$ packed form
5820b9Q0k22K03j30O4K29l35k6J41j06L66j36j78Q5J49l31K09K03k59L6K1K17
5842B51k72k8J25j76N2J7j32j2K40o7M8K8j58J48j76k2K25j39o7J1R3j0j30J10
5866d1Q7L6q5k06K04Jj6J44q3j49L37m5j40ppoq2k25J91J38K50l11j48M81m60
5891a42J10O5L4j09J46m6M4j25k10J51P1O7M6j89L23j35q5m0k65K89q0O0n5j58
5915b33L12n4K1N8k10Q4K45j88k35L09j81P8j47k13K43J91L4k34R5m0k9Q7j41
5938a48K97l67R5J98k90K32O9k49K24j06j38K23k4l0J02j15J26j45J20k27J08
5959d5R7M5j54J98l73O7J40J87K3k23l6q5J62k60L07m4m2l0J28j6Jj23Q6K1J2
5984D3R0j44n8p7L03o5k8Q8j92j0p6L2oL04L7k80K02n6K96m13J68j88P1k07J8
$$ plain form
6009 -148 -83 44 -137 -52 -92 -40 176 -20 -35 -175 -183 -101 -69 19 214 83 -48 -105 -126 -272 278 63 94 -42
6033 -42 118 -25 -39 -36 -20 -66 -148 114 121 58 144 -49 -5 38 -198 83 56 -132 216 -165 51 -153 46 3 3 359
6059 359 20 -58 66 13 247 9 15 -174 136 61 -147 109 98 37 -60 -47 51 -94 -34 96 -157 -24 120 24
6083 24 -209 -78 11 61 159 208 27 -114 206 -118 -160 -56 120 -124 48 59 284 -12 -113 -97 -69 35 -47
6106 -47 58 -33 -58 -325 15 106 28 126 67 17 94 20 -143 -155 -60 -20 74 -54 132 -158 14 62 26 120 -48 153
6132 153 77 -42 210 40 100 22 -259 -9 -108 79 -220 56 2 -200 99 197 -280 -77 -128 -132 -35 98 75 -136
6156 -136 -53 -71 175 -50 -82 -30 -82 7 37 95 114 44 32 -94 -70 9 -23 119 167 -58 243 -315 -239 169 -91
6181 -91 -113 -60 -6 -87 -96 -44 161 -65 206 -304 -99 28 -50 -111 87 -92 -195 99 146 202 -34 157 180 145 -92
$$ packed form
6009a48O5J27j81Q5m0N2K16j96j5j40qQ2L2Q8J95j31j31n7k1j46N50k15L1j36
6033d2J60j43j4LJ6m6q2K62Po3Q6j93M4M3k36K81k7j88L48l81K16k04J99m3%L56
6059C59l39p8J24n3K34k38Oj89L10p5k08K56j1o1r7J3R8j45O0J30k53J33J44r6
6083B4k33J31Q9N0R8M9j81j41L20l24m2J04J76k44J72J1K25k96j01J6K8J04q2
6106d7J05r1k5k67L40R1p8R8n9n0P7p4j63j2R5M0R4j28J86k90J72M8l6R4j68K01
6132A53p6j19K52j70O0p8k81K50r9J87k99K76n4k02K99R8m77K03n1mR7J33k3k11
6156a36Q3j8K46k25l2N2n2Q9L0N8J9p0j2j26K4P9l2J42M8k25L01n58P6M08k60
6181i1k2N3N4q1rN2K05k26K71n10K05J27p8o1J98j79j03K94M7N6k36J91K3l5k37
$$ plain form
6206 -92 -191 124 -182 75 -172 -95 -55 -320 43 -74 -26 -18 -130 23 39 85 94 -124 -132 13 -73 -42 68 -10 -45 90
6232 90 19 108 68 -16 110 89 -7 -104 292 -213 13 -156 -169 -228 -144 100 72 -54 -139 -93 176 -96 -46 153 234
6257 234 -61 -126 94 -43 -219 16 -190 38 -66 -25 57 158 -289 -9 -10 -61 -96 115 -20 -74 55 -239 -13
6280 -13 20 -42 -22 58 -43 19 273 -84 64 -123 -12 -15 27 60 -81 -30 -126 -102 -135 166 72 118 217 -70 58 89
6306 89 -62 -79 -81 64 -1 -28 165 76 25 95 45 43 54 -45 89 260 155 -40 194 185 -93 -144 27 -15 142 53
6332 53 68 71 93 -43 -150 -46 62 -35 190 -257 9 110 33 -206 -26 -97 -168 -57 -28 1 -49 228 -119 -72
6356 -72 105 223 130 -34 34 -63 -45 225 68 -35 268 -175 -209 -169 278 -12 -36 91 68 103 2 -10 -160 -22
6380 -22 322 223 72 -4 -114 -115 -58 -40 -51 131 254 114 -43 138 135 45 167 75 -36 56 -25 -80 91 47 52 -83
$$ packed form
6206i2r9L15l06K57k47P7M0k65L63j17M8Qj12J53J6M6Rk18qJ45q6L1J10p8l5J35
6232I0p1Q9m0q4J26k1r6r7L96n05K26j69j3n9Q4K44k8j26q5M6K69k72N0J99Q1
6257B34k95o5K20j37j76K35k06K28j04M1Q2J01m47K80jn1l5K11j35n4J29k94K26
6280a3L3o2K0Q0j01O2K54l57J48j87J11lM2L3j41N1r6K4l3L01r4M6R9k87J28L1
6306H9j51j7kJ45o5k7J93q9n1P0n0kJ1r9J34J71j05j95K34rk78n1J71m2J57q9
6332E3J5LK2j36j07J04J08r7K25m47K66J01p7k39J80p1p1J11K9K9n0K77l47M7
6356g2J77J18r3j64O8r7J8K70j57j03L03m43l4M0M47k90k4J27k3L5j01j2j50J38
6380b2L44r9j51p6j10jN7J8j1J82J23j40j57J81lr0J22r2j11R2q1n5J71m4Nj35
$$ plain form
6406 -83 34 217 163 55 -32 -32 64 10 46 113 151 -29 60 -154 -17 -135 101 -4 -113 -90 -3 73 101 92 -1 -181
6432 -181 -22 -40 -150 92 113 -61 108 79 61 148 175 80 56 96 54 264 72 201 55 240 5 -206 -51
6455 -51 177 -65 -150 333 23 111 220 -132 93 -64 154 22 77 145 36 172 -105 -125 127 235 -76 -9
6477 -9 122 275 134 -208 22 -32 -52 -102 -134 -45 20 -25 -25 -239 -66 -158 -93 -86 22 178 132 -129 -73 184 -155 246
6503 246 105 5 -26 8 102 215 -172 -199 84 137 247 -75 227 -245 62 111 -117 63 121 146 -162 -38 -64
6526 -64 139 89 -70 -15 227 -182 1 115 -16 50 72 -82 -23 20 -146 33 -182 166 80 274 -217 170 -260
6549 -260 -27 65 -112 176 98 6 -71 -138 -116 196 58 -2 69 -68 241 -137 42 18 29 103 -360 83 147 -23
6573 -23 243 -161 -129 123 45 -60 -174 -13 81 57 -68 59 -138 -57 29 221 103 -259 162 127 -127 64 -8
$$ packed form
6406h3J17J83n4j08q7%R6n4L6O7L8j80Q9k14J37j18K36j05j09K3Q7P6K8rr3j80
6432a81J59j8j10K42K1j74J69k9j8Q7K7r5k4M0m2K10j92J29j46J85k35k11J55
6455e1K28k42q5M83l10Q8J09l52K25j57K18j32N5O8j09J36k77k0K52J08l11O7
6477iJ31J53j41l42K30n4k0n0l2Q9O5m5%k14J73r2O5PJ08J56m6k61N6K57l39M01
6503B46j41j00l1L4R4J13l87k7K83N3J10l22L02m72L07M9k28J80N8K5l08J24k6
6526f4K03n0j59N5K42m09J83J14j31O6K2j54N9M3j66J79k15L48q6J94m91L87m30
6549b60K33R2j77K88p8r2p7o7K2L12j38o0P1j37L09l78J79k4J1P4m63M43O4j70
6573b3K66m04L2K52p8j05j14J61R4k4j25J27j97Q1Q6J92j18l62M21l5k54J91p2
$$ plain form
6596 -8 -149 199 130 72 -83 -154 109 -231 172 241 -54 -55 -253 28 -163 120 -93 98 130 79 -145 82 -128
6619 -128 5 -169 40 49 133 177 -113 69 189 150 -48 -4 -122 -209 18 23 -200 151 15 -36 -145 -150 -33 2
6643 2 -111 23 -139 265 80 182 -16 -100 6 -143 -146 -153 -6 -30 -17 -201 63 178 -273 -190 148 125 -40 -11
6667 -11 -94 41 -76 76 64 128 -124 -171 -27 123 -23 -76 111 -82 8 -80 198 -74 10 220 272 44 -149
6690 -149 91 22 1 17 139 226 132 33 -93 34 186 -95 135 -97 -32 34 40 30 236 -1 47 -117 2 -79
6714 -79 110 128 -18 -28 155 73 -92 55 81 -78 65 -39 -81 26 14 86 47 91 81 -91 -100 14 -27 -52 -155
6739 -155 -57 -125 171 -18 -19 27 -51 78 168 -51 -29 86 40 37 -210 110 -30 134 159 12 24 -29 10 51 -52
6764 -52 53 -30 102 86 129 -41 370 201 0 -52 120 182 -178 -93 51 -147 69 125 -150 -107 -31 4 -6 -66
$$ packed form
6596hj41L48o9n8j55p1K63l40M03O9k95jj98K81j91K83k13J91L2n1k24K27k10
6619a28J33j74K09RQ4M4k90J82J20l9j98M4j18q7K27Nk23L51j36n1j09nJ17L5
6643Bj13J34j62M04j85J02j98q4J06j49lpJ47k4J3j84K64J15m51Q3L38k3j65K9
6667a1q3J35j17J52j2O4k52m7J44J50j46n3J87j93R0q8K78k72Q4K10N2k28j93
6690a49K40o9k1J6J22Q7r4r9j26J27J52k81K30k32O5O6Oj0K06k37M8j64J19q1
6714g9J89J8j46j0J83q2j65J47K6j59J43j04m2J07j2P2l9M4j0j72rJ14m1k5j03
6739a55R8o8K96j89jM6p8J29R0k19K2J15m6lk47L20j40J64K5j47J2n3L9M1j03
6764e2J05q3J32j6M3j70M11j69k01n2J72O2l60Q5J44j98K16N6k75M3P6L5j0o0
$$ plain form
6788 -66 22 -28 -19 -158 307 -73 42 48 106 31 189 -98 -39 -60 -173 -153 111 144 55 66 -159 23 -50 139 148 -3
6814 -3 -114 230 25 229 170 -272 111 106 -128 -21 44 36 0 26 95 -304 -13 281 191 -153 -86 82 225 -41
6838 -41 30 -133 -1 338 98 177 112 203 206 -148 -285 -117 -86 97 -163 161 72 62 114 -81 -198 -90 -210 -165
6862 -165 70 95 -265 -243 -385 13 16 24 90 -197 53 71 -169 -81 -77 -6 -102 -121 191 -149 73 172 46 -25 55 1
6888 1 27 -10 -225 -40 26 61 -235 -398 -43 123 2 54 71 -232 12 58 50 23 135 -80 152 187 -336 169
6912 169 31 119 -126 66 27 -210 -215 137 -65 83 -93 -46 85 -212 239 -186 63 26 5 -229 110 150 -173
6935 -173 -37 130 79 -209 -267 118 90 63 -47 150 -45 63 -157 -189 -111 126 113 -26 243 114 34 109 74
6958 74 92 120 87 -59 160 213 -312 24 -165 -47 -238 46 -205 296 -17 126 -220 -77 19 -12 67 -78 -261
$$ packed form
6788f6Q8n0Rj39M65l80J15ON8p5J58k87N9k1j13K0K64L3q9J1k25J82p3J89Rj51
6814cj11L44k05K04n9m42L83nk34J07O5ql6K6O9l99K91K94r0l44O7J68J43k66
6838d1P1j63J32L39k40P9o5R1Ll54j37J68L1J83k60L24q9j0N2j95j17J08j20M5
6862a65K35K5l60K2j42L98LQO6k87K50J8k40Q8MP1r6j9L12l40K22R9j26p1Q0n4
6888AK6l7k15J85O6L5k96j63L55J66j21N2J7l03K44M6qk7J12k15K32L5n23N05
6912A69j38Q8k45J92l9k37nL52k02J48j76M7J31k97M51m25K49l7k1k34L39M0l23
6935a73J36J67n1k88n8L85k8k7j10J97j95J08k20l2P8K37j3j39K69j29q0P5l5
6958G4J8K8l3j46K19N3n25L36j89J18j91K84k51N01l13J43l46J43R6l1P9j45j83
$$ plain form
6981 -261 -63 11 -106 -116 120 -168 -175 1 -155 -32 125 -316 22 -27 53 -107 163 247 16 -253 44 -61
7003 -61 31 -47 168 111 114 135 21 7 -53 -16 94 -110 0 -249 -55 203 -52 27 228 -74 145 -125 -117 -62 -154
7028 -154 157 -124 135 56 -105 -99 32 -136 -159 -12 45 -1 27 16 56 -68 92 -123 -25 -81 211 178 -32 31
7052 31 338 1 -65 -73 -88 -99 -94 67 42 -132 138 -169 179 199 -147 135 -306 -105 24 -95 -39 49 129 69 -65
7077 -65 -145 -76 -44 -26 79 -81 49 -136 -179 -52 17 99 110 -3 56 123 64 183 -132 42 171 -31 97 -27
7101 -27 -98 -4 -97 1 -97 -91 56 -72 -235 -87 -5 -23 195 42 -48 -66 -2 -49 173 -115 69 -139 192 -4 23
7126 23 -177 104 -45 275 72 -94 121 -36 -86 -145 -34 132 -58 -22 41 -62 -237 59 -36 -40 139 -98 125
7149 125 68 -25 -12 172 -92 -10 62 109 95 266 -134 -49 -65 129 -35 53 -39 151 171 280 -114 178 -112 10
$$ packed form
6981b61J98P4j17j0K36k88pJ76j56J23J57m41L38m9Q0j60K70Q4k31k69K97j05
7003f1R2p8K15n7LK1j14j4o0L7J10k04J10k49J94K58k55P9K01l02K19k70QN5r2
7028a54L11k81K59p9j61OJ31j68k3J47N7m6K8j1M0j24J60k15R8n6K92l3k10O3
7052C1L07l37o6qj5j1NJ61k5j74K70l07L48K0l46K82m41K01J29j19N6Q8Q0o0j34
7077f5q0O9L2J8J05j60J30j85m3J27O9Q2J1j13N9O7n9J19l15J74J29k02J28j24
7101b7p1R4r3R8r8OJ47j28j63J48Q2j8K18j53r0j8O4m7K22k88J84k08L31j96K7
7126B3k00K81j49L20k03j66K15j57n0n9J11J66j90L6O3j03j75K96r5mJ79k37K23
7149A25n7r3J3J84k64Q2P2M7j4J71m00Q5j6J94j64Q8r2J90K0J09l94K92k90J22
$$ plain form
7173 10 -18 299 76 32 -4 63 220 -266 34 -28 192 -26 275 -42 -43 -46 110 25 -41 258 141 5 -11 -43 108
7198 108 -65 56 128 -5 -85 29 68 -122 -92 31 179 -13 164 79 71 -113 -40 -60 94 -101 36 -42 38 -239
7222 -239 -27 70 -184 -158 64 -15 -49 -51 118 -47 -243 41 -149 -41 -216 -21 145 132 115 150 161 -50 -263
7245 -263 375 -144 110 62 -36 31 -66 112 184 34 -93 -125 136 195 -281 -270 -61 -73 327 -53 -58 70 -138 134
7269 134 113 114 -98 -3 106 128 38 -343 128 -44 163 -221 -103 147 88 167 18 -23 43 -80 51 160 -92
7292 -92 26 -29 -216 -1 67 -101 153 -48 136 3 -70 -53 -3 -24 126 -62 83 184 -38 -40 -65 21 -270 -63
7316 -63 152 -99 124 132 81 40 -36 -133 -239 134 -234 28 73 -72 -136 -227 53 178 -391 163 -4 -133 50
7339 50 -216 51 -42 -80 -89 224 160 -10 12 203 -136 27 21 -243 -2 277 -61 56 214 -135 79 -110 -94
$$ packed form
7173A0k8L17k23m4l6O7J57m86L00o2K20k18L01l17jlJ56q5o6K99j17j36j6l2J51
7198A08j73J21P2j33q0J14L9j90L0J23J48j92J77q5qj84P3k0J54j95J37p8Q0k77
7222b39K12R7k54K6K22p9l4kJ69j65j96K84j90J08j75J95J66j3j7L5J1k11k13
7245b63O38n19K54m8r8O7r7J78P2j50j27l2K61N9m76J1K09j2M00l80nJ28k08K72
7269A34k1Jk12R5J09K2r0l81M71j72K07l84J18K50n9P9j49m1O6j23J31J09k52
7292i2J18n5j87K15O8j68K54k01J84j33p3J7N0k1J50j88J45J01k22kk5Q6k91K07
7316f3K15k51K23Qn1m1p6r7j06L73l68K62M5j45o4r1K80J25n69N54j67j29J83
7339E0k66K67r3l8rL13o4j70K2J91l39J63ok64K41K79l38J17J58l49K14j89J6
$$ plain form
7362 -94 135 -37 103 -189 -134 114 -107 -270 42 179 227 -97 -24 -76 116 -83 190 -221 134 -161 85 -62
7384 -62 134 -125 -95 -227 -58 -203 -86 146 43 175 -400 -41 78 5 -84 110 105 178 -150 -91 -288 -105 -6
7407 -6 -52 199 -90 -139 161 6 -43 8 108 -118 162 111 -171 58 83 176 112 -93 -177 -19 -229 -246 51 176
7431 176 -257 81 43 -77 177 47 162 120 99 1 -75 8 -76 37 -40 -2 -129 -45 -133 -96 164 -62 -9 -20 72
7456 72 -8 288 17 -23 8 -90 9 -64 -288 -26 -162 -32 28 203 49 -14 181 -219 127 -4 -21 -170 107
7479 107 -190 85 -110 95 -31 13 -53 -167 -93 143 -38 -76 -75 68 -3 -4 -13 -165 -4 -101 -97 -33 183 247 -9
7504 -9 77 159 48 32 6 29 -28 -4 73 78 -196 44 47 0 1 84 31 -191 110 101 -37 138 102 53 142 53 126 -32 250
7533 250 -51 -41 -89 47 103 -27 -28 -61 42 -273 -147 29 52 42 -18 195 188 -137 321 -62 42 -35 206 -14
$$ packed form
7362i4K29j72J40k92N5K48k21j63L12J37M8l24P3n2J92j99K73m11L55k95K46j47
7384f2J96k59L0j32J69j45J17K32j03J32n75L59J19p3q9J94nP3l28N9j97J83R9
7407fm6K51k89m9L00j55m9N1J00k26K80n1k82K29K5R3o4k05q4J58k10j7K97J25
7431A76m33L38l8j20K54j30J15m2k1r8p6Q3q4J13p7L8j27Q4q8L7K60k26N3j1R2
7456G2q0K96k71m0L1r8R9p3k24K62j36J30O0J75j54o3J95m00L46j31j7j49K77
7479A07k97K75j95K05j26M4o6j14P4K36j81l8JJ43p1jrj52J61r7MO4K16O4k56
7504iQ6Q2j11j6k6K3n7K4P7Nk74K40Lm7JQ3n3k22L01rj38J75l6m9Q9q9P3j58K82
7533B50l01J0m8J36N6j30jl3J03l15J26J76K3j0o0K13pl25M58l83J04p7K41k20
$$ plain form
7557 -14 -217 -27 -10 -255 -71 48 37 159 26 107 58 -138 167 -71 73 -235 168 -96 -62 108 -47 -28
7579 -28 73 64 -280 141 4 -106 52 -36 -129 -148 -91 139 -96 19 46 -201 -46 126 -3 111 -71 5 28
7602 28 -148 -119 -9 61 -146 -44 217 -154 -87 34 -82 181 -122 -380 -134 -238 -7 64 52 147 139 -118 -46
7625 -46 -136 -104 199 -137 47 139 -232 -101 -123 -91 129 -163 17 -85 -159 -58 -18 21 -400 127 166 -166 -138 -229
7649 -229 -57 -52 -14 -2 -129 64 193 61 76 119 48 -46 -74 -21 -214 55 119 19 157 54 64 69 10 80 113 81
7675 81 -156 -54 -138 76 48 91 -11 126 171 76 -21 -147 163 252 65 148 141 35 62 -65 -30 -113 45 -121 -137
7700 -137 -59 -19 86 -107 195 13 100 314 118 -88 35 99 -93 -77 -56 -35 3 60 -207 56 159 36 117
7723 117 76 -267 32 12 98 91 12 -114 172 -102 -59 136 -170 -143 -141 -340 -20 91 -28 83 94 -35 -114 -1
$$ packed form
7557a4k03J90J7k45J84J19j1J22j33Q1m9j96L05k38J44l08M03k64L4J70j55J9
7579b8J01rl44M21j37j10J58q8r3j9N7K30k35J15K7k47J55J72j29J14j82P6K3
7602B8j76K9J10P0k07J02K61l71O7J21j16K63l03k58K46j04K31P1j2R5qk57P2
7625d6r0L2L03l36J84R2l71J31k2L2K20k92J80j02p4J01M0L9m21N27L9l32K8r1
7649b29J72NL8J2j27J93J29j32J5M3p1r4k8N3j93K69O4j00J38j03J0Nn9P0L3l2
7675H1k37J02q4K14k8M3j02J37M5r5r7j26L10Q9j87Q3pj06K7j27L5q3J58j66j6
7700a37P8M0J05j93L02j82Q7K14j96k06J23O4j92J6K1K1L8N7k67K63J03j23Q1
7723A17m1l43K99k0Q6pp9j26K86k74M3J95l06K7Kj99L20J11j19J11J1j29p9J13
$$ plain form
7747 -1 224 7 -2 29 -104 -138 -48 60 161 219 -31 -132 -37 -83 52 -35 -11 -173 -148 -110 81 111 225 185 205 -87
7773 -87 218 -93 242 -150 26 115 186 124 102 -192 93 -260 -164 87 16 -67 178 23 -212 -2 -58 -11 -11 -191
7797 -191 69 -50 -236 57 154 63 9 -4 -88 -218 -138 5 -196 240 -22 44 -75 -48 -14 348 89 53 71 -170
7821 -170 -48 20 183 -92 -201 127 -67 74 -19 262 108 -49 -201 -128 282 -199 162 -185 179 142 -115
7842 -115 -138 -170 -25 -192 90 152 175 28 -116 29 -18 -94 122 96 -200 54 78 -20 -97 76 -198 13 -264
7865 -264 -70 -22 93 -310 -132 84 -232 -56 30 -99 52 -217 17 239 -224 195 6 99 -66 35 40 119
7887 119 9 31 74 115 -107 9 -302 -4 86 -9 113 -101 -87 164 127 104 -73 -203 -3 -71 -81 163 14
7910 14 43 213 -58 -173 -23 80 235 -28 104 -41 39 183 177 92 -182 -66 204 -58 -143 -50 121 17 163
$$ packed form
7747aK25k17rL1j33l4R0J08J01N8k50j01R5m6J35q7K4j62K5L8J91L0J14m0K0k92
7773h7L05l11L35l92J76Q9P1o2k2k94K85l53R6K51p1q3K45j55k35K10n6M7%j80
7797a91K60j19j86K93R7r1n4j3q4j30Q0J43k01M36k62O6j19K7L4L62k59l6J8k41
7821a70J22O8J63k75j09L28j94J41r3K81j54j57j52P3M10m81L61l47L64l7k57
7842a15k3l2J45j67K82O2K3j47j44J45m7p6K16k6k96K54K4r8p7J73k74K11k77
7865b64J94M8J15m03J78K16l16J76Q6j29J51k69K34K22m63M19j89R3j65J01NP9
7887A19j10K2M3M1k22J16l11K98R0r5J22k14J4K51l7k3j77j30K00o8j0K44j49
7910A4K9J70k71j15J50J03J55k63J32j45Q0J44oq5k74J16K70k62q5R3J71j04J46
$$ plain form
7933 163 -58 -64 31 -76 34 -70 -130 -6 42 -214 -162 72 104 111 -161 -159 31 85 57 -377 -24 135 -21 -10 -84
7958 -84 10 -336 12 -81 -64 -112 -32 -9 110 5 235 188 127 -91 -30 -121 -176 160 217 -71 32 -303 -78 186
7982 186 -63 7 -69 118 -8 85 177 -179 156 31 149 -65 75 -108 -82 111 20 -9 -6 87 -193 183 -149
8005 -149 -58 -76 -63 52 -6 -25 132 -137 -98 35 -45 -270 -2 151 11 -187 -99 -106 23 35 -133 -67 -92 70
8029 70 -236 -102 201 48 120 59 -115 48 38 128 -20 -133 -37 102 -53 163 -40 200 80 -157 -100 76
8051 76 -50 284 -124 -218 -73 161 427 80 121 123 -216 0 -259 -224 118 177 99 -192 309 41 154 -99 260
8074 260 -21 78 68 66 315 -22 -143 -7 -3 165 -120 67 -91 121 -34 93 -18 64 196 56 -3 111 1
8097 1 165 36 59 66 -107 265 -310 238 -64 99 -140 -262 151 121 -68 -140 18 35 38 -175 -198 -29 7 128
$$ packed form
7933A63k21oR5j07J10j04o0J24M8k56N2K34L2Pk72KJ90N4k8m34L53J59j56J1p4
7958h4R4l46L48r3J7m8Q0K3J19j05K30m7o1k18O1r1n5L36N7k88J03l35K25K64
7982A86k49P0p6J87j26R3R2l56L35j25J18k14J40j83K6J93r1k9LR3k80L76l32
8005a49R1j8J3J15n8j9J57k69L9J33q0k25K68J53j40j98Q8pJ29J2j68O6k5J62
8029G0l06J34L03j53P2o1j74J63j0R0j48j13R6J39j55K16k03K40j20k37N7J76
8051G6j26L34m08r4J45K34K66l47M1Kl39K16k59L5L42N9p8k91N01k68J13k53L59
8074B60k81R9j0kK49l37j21J36MJ68k85J87j58K12j55J27j11Q2J32j40n9J14j10
8097AJ64j29K3Pj73L72n75N48l02J63k39j22M13l0j89p2J58J7Lk13k3J69L6J21
$$ plain form
8121 128 -116 68 25 -178 -66 24 18 115 67 -105 -22 40 35 61 48 -267 -160 117 63 20 -43 -77 -57 105 177 15
8147 15 63 331 88 213 -35 -136 -66 58 30 24 -98 -227 24 -191 109 -9 -48 -20 43 -65 -47 3 114 12
8171 12 -9 74 42 53 -48 -129 -57 -210 -19 365 95 -87 -121 -106 120 -79 -66 37 99 -24
$$ packed form
8121A28k44J84m3k03J12R0oR7m8j72Q3O2nK6j3l15J07K77n4m3o3l4K0J62P2j62
8147A5M8K68k43J25k48j01P0J24k8oj22j29K51k15L00j18l9K8O3j08J8N0J11j02
8171A2k1Q3l2J1j01q1P2j53J91L84k70j82l4J5K26j99J3J03O2j23
8191b4
$$ Imaginary data points
##PAGE= N=2
##DATA TABLE= (X++(I..I)), XYDATA
$$ plain form
0 0 0 0 0 0 0 0 0 0 0 0 0 0 0 0 -8 8 -8 8 -8 16 -16 16 -24 24 -32 35 -40 48 -56 64 -72 83 -96 108 -122 137
36 137 -155 175 -195 217 -242 269 -298 331 -368 404 -449 493 -546 600 -662 727 -801 885 -975
55 -975 1079 -1195 1329 -1484 1661 -1875 2134 -2453 2860 -3402 4155 -5289 7200 -11307 42487
70 42487 -68278 -27475 77816 -42898 25558 35822 -29289 17898 19127 -6270 17959 -20851
82 -20851 -7345 21294 2332 -5071 -2767 -5092 412 -3082 -9652 -17991 7620 5712 -17176 6285
96 6285 -9336 -31722 20598 9216 -29540 -1862 1807 -6482 5076 -6985 -11038 -4451 -684
109 -684 8033 -8211 -24835 4622 18311 -13149 -12257 3669 -16450 240 18772 -20835 -11062
122 -11062 17333 -6476 376 5942 -15699 -769 9717 7539 6834 -5844 5574 7471 -7729
$$ packed form
0@%%%%%%%%%%%%%%qJ6j6J6j6K4l2L2m0M8n6O7p5Q8j04J20j36J55j79K04k30K59
36A37k92L30l70M12m59N11n67O29o99P72q53R42j039J146j262J389j528J686j860
55i75K054k274K524k813L145l536M009m587N313o262P557r444J2489j8507N3794
70D2487j10765M0803J05291j20714O8456J0264o5111M7187J229k5397K4229l8810
82b0851J3506K8639j8962p403K304k325N504l494o570q339K5611j908k2888K3461
96F285j5621k2386N2320j1382l8756K7678L669q289J1558j2061m053O587L767
109f84Q717j6244j6624K9457J3689l1460Q92J5926k0119J6690J8532l9607R773
122a1062K8395k3809O852N566k1641J4930J0486k178p05j2678J1418J897j5200
$$ plain form
135 -7729 8340 8407 -2499 10482 9377 -185 -4778 -1009 8424 -428 414 5285 -8054 6051 9368
150 9368 -18421 -8289 5029 -9 5231 -4664 -10259 -920 -4029 1487 338 -14637 350 11078
164 11078 -6992 -6348 136 -7533 -249 6658 -6248 -7243 1281 -2120 40 517 -9438 -4425 1727
179 1727 -206 394 -11029 -6777 11285 -3785 -9003 3488 -7339 -3205 8731 -3226 -5702 2193
193 2193 6087 1895 -7774 -286 4621 3576 9862 -2633 -6726 8224 4061 915 356 -1824 8429
208 8429 4198 2393 6185 -12031 -425 16070 -4686 470 8062 -6160 4492 6196 -5569
221 -5569 -557 1348 7234 6818 -6361 477 4884 -2268 3613 3130 -4399 1356 7926 909 -6457
236 -6457 575 1105 -1105 5449 -3688 -8345 5880 2544 -6073 -2789 -1718 703 -1752 -2990 722
$$ packed form
135g729J6069O7j0906J2981j105r562m593L769R433q852Q42M871j3339J4105L317
150I368k7789J0132J3318n038N240r895n595R339l109N516j149j4975J4987J0728
164A1078j8070O44O484p669P284O907j2906r95Q524l401K160M77r955N013O152
179A727j933O00j1423M252J8062j5070n218J2491j0827M134J1936j1957k476P895
193B193L894m192r669P488M907j045O286j2495m093J4950m163l146n59k180J0253
208H429m231j805L792j8216J1606J6495k0756N156P592j4222J0652J704j1765
221e569N012J905N886m16j3179O838M407p152N881m83p529N755O570p017p366
236f457P032N30k210O554r137m657J4225l336q617L284J071K421k455j238L712
$$ plain form
251 722 -6496 -4309 7132 -1598 -8937 -1464 1212 -1877 7 978 -6473 -1684 6857 -4709 -4510
266 -4510 2912 -3845 2362 5410 -4073 -1584 -1299 2000 4870 -6363 782 8648 -3232 1979 2691
281 2691 -6860 3118 7783 -1043 -964 2985 2339 580 2395 822 -2688 5093 5908 -254 739 -1129
297 -1129 1393 5298 -612 1492 1498 -1373 6709 1881 -5967 2259 2842 -631 3038 566 -3934 -573
313 -573 5037 933 -6039 -335 2273 -1058 236 -3168 -2593 1085 -704 641 -3961 -5327 4002 -1076
329 -1076 -4358 2137 -4491 -1941 4905 -4506 -4596 1575 -302 1110 -347 -2188 -984 -1196 2007 1262
345 1262 -3050 -251 2095 1981 -803 -2211 689 -653 2607 4112 -4889 -368 5874 -1548 145
360 145 2281 -1729 2623 4502 1035 -933 -1327 4779 3741 -1868 2013 2243 520 2958 1237 -1026
$$ packed form
251G22p218K187J1441q730p339P473K676l089J884R71p451M789Q541j1566J99
266d510P422o757O207L048r483K489K85L299K870j1233P145P866j1880N211P12
281B691r551R978M665q826P9L949o46j759J815j573l510P781Q15o162R93j868
297a129K522L905n910K104Ok871Q082m828p848Q226N83l473L669k472m500L361
313e73N610m104o972N704K608l331J294l404N75L678j789J345m602j366R329n078
329a076l282O495o628K550O846r411r0O171j877J412j457j841J204k12L203p45
345A262m312K799K346j14k784j408K900j342L260J505r001M521O242p422J693
360A45K136m010M352J879l467j968l94O106j038n609L881K30j723K438j721k263
$$ plain form
376 -1026 -200 2981 2450 -2069 886 -14 -2537 3592 -306 -5764 630 468 -1255 -1198 -3920 -1421 -1231
393 -1231 -1848 874 -4733 -5126 2821 -82 -4167 -1567 -1034 -2386 156 335 -5077 -2987 3191 -790
409 -790 -3270 -1221 -1951 73 -17 -1700 -1182 -2332 881 1536 -4306 -1073 893 -2761 1728 1859 -3736
426 -3736 -1017 3362 1583 -2320 16 2960 -171 2241 2853 -2295 833 3370 1456 1835 -1454 1034
442 1034 3575 -413 2027 -972 -3232 5973 1297 -4892 2478 588 -1551 2692 -712 -2248 -106
457 -106 1072 2078 -1877 -1508 2033 -111 301 1235 -1306 -399 2147 2497 -1451 -1889 2705 414 -538
474 -538 2303 -2279 -1717 3800 110 -2324 -877 -276 488 -179 -871 -1130 -1805 1723 792 -3051 -1401
491 -1401 1024 868 -768 620 -55 -1914 2781 2131 -3555 1075 2188 -975 2826 87 -2186 1934
$$ packed form
376a026Q26L181n31m519K955r00k523O129l898n458O394j62j723N7k722K499J90
393a231o17K722n607l93P947k903m085K600N33j352K542J79n412K090O178l981
409g90k480K049p30K024r0j683N18j150L213O55n842L233J966l654M489J31n595
426c736K719M379j779l903K336K944l131K412O12n148L128K537j914L79l289K488
442A034K541l988K440k999k260R205m676o189P370j890k139M243l404j536K142
457a06J178J006l955L69L541k144M12R34k541R07K546L50l948m38M594k291r52
474e38K841m582N62N517l690k434J447O01P64o67o92k59o75L528r31l843J650
491a401K425j56j636J388o75j859M695o50n686M630J113l163L801k739k273M120
$$ plain form
507 1934 1347 710 223 -2219 2149 1696 -1469 1916 -426 -1246 3077 1736 -1370 -698 1804 2341 -416
524 -416 728 1418 -660 3188 2710 -1501 1307 2129 1254 1974 -188 328 1118 995 1968 -950 -2003 2282
542 2282 517 -1916 242 -665 -2340 662 442 -3138 -2032 295 -1148 -958 -1474 -2468 -722 -434 -682
559 -682 -1395 -3227 3 1452 -2724 -584 -167 -2371 1107 628 -2570 -1338 177 942 -1096 -1650 360
576 360 -1311 79 1627 -2473 -1019 1349 155 862 -1154 -362 1502 -47 2223 636 -2206 2935
592 2935 2453 -967 1966 292 180 3586 977 -632 456 1195 2454 -136 -1030 1410 44 54 1691
609 1691 -541 -2209 1090 2234 -1430 -2067 412 -274 -54 532 -1830 -1155 1161 -95 -828 -1263 -604
626 -604 -126 -95 138 -1601 -2153 1149 536 -1730 -1265 -386 -205 -1122 115 -457 -3062 813 1894 -2572
$$ packed form
507A934n87o37m87k442M368m53l165L385k342q20M323j341l106O72K502N37k757
524d16J144O90k078L848m78m211K808Q22q75P20k162N16P90j23R73k918j053M285
542B282j765k433K158r07j675L002k20l580J106K327j443J90n16r94J746K88k48
559f82p13j832L230J449m176K140M17k204L478m79l198J232J515P65k038n54K010
576C60j671J390J548m100J454K368j194P07k016P92J864j549K270j587k842N141
592B935m82l420K933j674j12L406k609j609J088P39J259k590q94K440j366J0J637
609A691k232j668L299J144l664o37K479o86K20N86k362O75K316j256p33m35O59
626f04M78L1K33j739n52L302o13k266M65Q79J81r17J237n72k605L875J081m466
$$ plain form
644 -2572 -1089 397 -1299 955 -45 -1705 368 -375 1347 577 -2086 1156 1288 -742 1833 298
660 298 -1212 2302 1427 -553 233 688 1123 850 920 158 -571 1548 1730 -64 58 475 1195 787 46
679 46 514 -479 470 2033 -358 -783 1106 111 466 1039 -311 -1102 872 1621 -1048 -1017 555 -304 -72
698 -72 -30 -978 -770 -638 481 215 -2598 -336 1215 -1828 -237 -345 -2423 687 319 -1645 -680 -943
716 -943 -44 101 -902 -539 -1093 -379 1285 -1000 -1273 283 446 595 -180 -235 257 -126 1347 603 -1455
735 -1455 1054 1321 -4 1129 -16 -226 1717 1087 384 267 484 1562 563 152 873 224 578 1688
753 1688 462 -1062 581 2036 -76 99 914 -576 486 1813 -396 -700 899 546 427 -207 -282
770 -282 256 -299 585 76 -1470 217 502 -522 -654 -666 -672 -465 330 -726 -2151 -167 876 -1311 -562
$$ packed form
644b572J483J486j696K254j000j660K073p43J722p70k663L242J32k030K575j535
660B98j510L514q75j980P86M55M35k73P0p62p29K119J82j794J22M17P20m08p41
679D6M68r93R49J563k391m25J889r95L55N73j350p91J974P49k669L1J572q59K32
698g2M2r48K08J32J119k66k813K262J551l043J591j08k078L110l68j964R65k63
716i43Q99J45j003L63n54P14J664k285k73J556J63J49p75n5M92l83J473p44k058
735a455K509K67j325J133j145k10J943o30p03j17K17J078r99m11P21o49L54J110
753A688j226j524J643J455k112J75Q15j490J062J327k209l04J599l53j19o34p5
770b82N38n55Q84n09j546J687K85j024j32j2oK07P95j056j425J984J043k187P49
$$ plain form
789 -562 -326 -1072 264 -85 -754 -915 -851 603 224 -1204 37 220 -619 698 -327 -1103 472 887
807 887 -254 -330 263 133 189 1199 86 -886 495 988 340 -431 10 1033 325 688 1195 -778 366
826 366 1913 -40 -138 884 229 700 1053 -8 -119 419 1198 183 -588 147 68 -24 519 -560 -1039
845 -1039 -243 310 -104 -1729 -517 -90 -1312 -36 -470 -2026 -266 -37 -1023 -747 -785 -259 -290 -485 -567
864 -567 -876 -712 598 -310 -994 -341 72 -35 -99 31 -583 -304 1282 40 -1168 193 377 -232 639
883 639 -163 -202 547 714 607 -36 -119 1420 251 504 1143 -260 617 1339 699 -162 481 1017 332 364
903 364 998 -317 -4 1278 135 -381 132 289 433 79 -526 2 -298 186 86 -1192 -271 580 -137
922 -137 -269 -196 -340 -166 759 6 -657 236 226 -113 128 -485 -562 -78 -42 94 -713 -1125 498 -163 -902
$$ packed form
789e62K36p46J336l49o69j61O4J454l79j428J241J83q39J317j025p76J575M15
807H87j141p6N93j30N6J010j113r72J381M93o48p71M41J023p08L63N07j973J144
826C66J547j953r8J022o55M71L53j061j11N38P79j015p71P35p9r2N43j079m79
845a039P96N53m14j625J212M27j222J276m34j556J760K29r86K76l8N26l1j95q2
864e67l09J64J310r08o84O53M13j07o4J30o14K79J586j242j208J361J84o09Q71
883F39q02l9P49J67j07o43q3J539j169K53O39j403Q77P22o40q61O43N36o85L2
903C64O34j315L13J282j143n16N13J57J44l54o05N28l00M84j00j278R21Q51p17
922a37j32P3j44J74R25p53o63Q93j0l39K41o13p7M84L6J36q07m12J623o61p39
$$ plain form
943 -902 -93 -500 -576 376 -44 -882 -306 230 122 -203 -244 -196 -232 689 377 -684 335 600 392 5 -20
964 -20 387 -4 167 1063 -782 -279 1251 335 -24 373 -172 217 528 -160 -167 233 715 320 57 433 1
985 1 151 617 438 -389 -17 706 584 -61 286 189 11 712 226 -595 -243 146 58 -647 -574 141 -579 -160
1007 -160 -101 -887 -560 38 -368 -646 -534 -490 -230 -488 -6 -707 -1041 471 -162 -840 -12 -443 -198 244
1027 244 -347 -456 -13 32 462 -486 -265 414 -267 187 408 -566 -215 686 400 39 65 364 306 449 678
1048 678 -190 -70 855 475 284 329 457 523 304 392 312 -45 784 787 -80 -136 415 161 82 -102 -177 -284 608
1071 608 116 -274 -332 -148 -314 101 -324 -540 -144 -417 183 -343 -831 183 -324 -805 411 -772 -728 206
1091 206 -328 -665 -513 -311 91 -389 -417 -344 -700 164 345 -731 -76 146 -256 -4 -184 -116 -150 53 362
$$ packed form
943i02Q09m07p6R52m20q38N76N36j08l25m1M8l6R21l12j061J019K65k08l87k5
964b0M07l91J71Q96j845N03J530r16l59L97n45L89L11o88pM00M82l95k63L76m32
985AJ50M66j79q27L72P23j22o45L47r7j78P01m86q21L52L89q8p05P3P15p20M19
1007a60N9p86L27N98m06k78J12M4K60k58M82p01l34J512o33o78Q28m31K45M42
1027B44n91j09M43M5M30r48K21O79o81M54K21r74L51R01k86l61K6K99n8J43K29
1048F78q68J20R25l80j91M5J28O6k19Q8q0l57Q29Lq67n6N51k54p9j84p5j07Q92
1071F08m92l90n8J84j66M15m25k16L96k73O00n26m88J014n07m81J216j183M4R34
1091B06n34l37J52K02M02m80k8P3l56Q64J81j076O55K22m02K52j80O8l4K03L09
$$ plain form
1112 362 -203 -179 679 26 3 331 -105 302 598 389 20 -92 413 663 301 386 445 131 470 694 40
1133 40 -320 541 183 -206 252 228 -250 585 384 -322 78 408 33 -219 -112 15 -196 -106 222 -335 -641
1154 -641 36 -56 -279 -181 -325 -247 -176 118 -502 -756 183 -131 -384 -468 -489 -433 -39 -77 -262 -358 213 195 -262
1177 -262 -346 88 -83 212 315 -312 -339 551 387 145 118 120 161 318 463 8 37 507 338 268 18 225 213
1200 213 148 596 224 -69 469 845 63 197 135 161 516 131 -70 -88 172 251 -122 -69 327 -81 205 268
1222 268 -251 199 301 423 -396 -505 173 -194 -148 399 -419 -632 191 -103 -422 -565 -296 -184 -102 -230 -334
1243 -334 -570 -206 90 -538 -362 -152 -247 -2 -133 -369 -305 -16 394 -372 -378 176 -50 -33 54 -181 -323 157
1265 157 239 58 -256 347 518 247 155 283 -152 322 515 375 -136 48 418 -94 233 127 -148 372 516
$$ packed form
1112C62n65K4Q58o53k3L28m36M07K96k09l69j12N05K50l62Q5N9l14L39K24o54
1133D0l60Q61l58l89M58k4m78Q35k01p06M00L30l75k52J07J27k11R0L28n57l06
1154f41O77r2k23R8j44P8P1K94o20k54R39l14k53q4k1N6L94l8j85r6N71j8m57
1177b62q4M34j71K95J03o27k7Q90j64k42k7KM1J57J45m55K9M70j69p0k50K07j2
1200B13o5M48l72k93N38L76p82J34o2K6L55l85k01j8K60P9l73N3L96m08K86O3
1222B68n19M50J02J22q19j09O78l67M6N47q18k13Q23k94l19j43K69J12Q2j28j04
1243c34k36L64K96o28J76K10r5K45j31k36O4K89M10p66oN54k26J7Q7k35j42M80
1265A57Q2j81l14O03J71k71r2J28m35M74J93j40n11J84L70n12L27j06k75N20J44
$$ plain form
1286 516 -143 172 196 314 182 152 324 89 244 631 -74 -318 274 -118 -234 32 -95 -440 -42 -162 -299
1307 -299 -622 -80 -119 -360 -157 -161 -357 -144 -158 -476 -529 -421 -43 -381 -429 -240 -343 84 187 -237 -356 131
1329 131 147 -69 19 -128 -109 -62 198 131 -181 13 473 37 -82 95 158 45 568 57 -173 511 569 296
1351 296 504 199 491 421 259 342 109 178 299 49 -105 240 37 171 557 -72 -299 -262 376 164 -81
1372 -81 93 -37 -160 410 -394 -246 -74 -290 35 -243 -321 -244 -115 -58 -22 -459 -54 -17 -132 -261 -147 -247
1394 -247 -25 -87 51 -475 -137 72 17 -316 -58 -255 -113 44 -107 -304 -47 358 188 -255 -107 117 106
1415 106 197 205 -199 8 531 487 87 27 438 -16 161 245 -147 71 633 119 42 252 385 206 66 171
1437 171 -102 79 417 -1 -96 -6 177 -5 -220 -14 -201 -5 136 -104 -471 235 -72 -117 5 -143 -97
$$ packed form
1286E16o59L15K4J18j32l0J72k35J55L87p05k44N92l92j16K66j27l45L98j20j37
1307b99l23N42l9k41K03mj96K13j4l18n3J08L78l38m8J89j03M27J03m24j19M87
1329A31J6k16Q8j47J9M7K60o7l12J94M60m36j19J77O3j13N23n11k30O84N8k73
1351B96K08l05K92p0j62Q3k33O9J21k50j54L45k03J34L86o29k27L7O38k12k45
1372h1J74j30j23N70q04J48J72k16L25k78p8P7J29N7L6m37M05L7j15j29J14j00
1394b47K22o2J38n26L38K09n5l33K58j97J42J57j51j97K57M05j70m43J48K24j1
1415A06R1Qm04K07N23m4m00o0M11m54J77Q4l92K18N62n14p7K10J33j79j40J05
1437A71k73J81L38m18r5R0J83j82k15K06j87J96J41k40l67P06l07m5J22j48M6
$$ plain form
1458 -97 -450 -255 -82 -292 -94 -4 -260 10 -2 -631 -272 127 -346 -178 -134 -273 -75 -210 29 -298 -260 255
1480 255 79 -261 -2 78 -80 67 160 6 232 199 69 -91 85 82 -79 -18 113 -277 77 277 228 70
1502 70 60 290 203 -15 210 -90 108 327 201 -62 125 429 258 -90 251 -5 -57 510 -56 -218 252
1523 252 158 268 49 -149 71 -265 255 -170 -493 -99 257 111 -235 42 10 -111 126 -42 -291 -338 141
1544 141 -108 -344 -20 -219 -148 -98 -54 -267 -23 352 -46 -204 -119 -150 -446 42 -60 -91 184 159 25 -29 131
1567 131 359 259 120 269 -163 -126 481 125 -111 111 330 141 135 281 -37 147 149 139 -41 -176 58 -94
1589 -94 127 203 4 13 227 236 -135 40 -185 -133 268 67 -265 76 -83 126 -306 -189 -75 -100 31 -96 -215
1612 -215 -284 46 -117 -151 -274 -164 -149 -331 -236 -134 -401 14 -7 -261 -236 -21 -212 -33 -101 -217 -183 68 183
$$ packed form
1458i7l53J95J73k10J98R0k56K70j2o29L59L99m73J68M4j39J98j35K39l27L8N15
1480B55j76l40K59Q0j58J47R3j54K26l3j30j60J76lj61O1J31l90L54K00m9j58
1502G0j0K30q7k18K25l00J98K19j26k63J87L04j71l48L41k56n2N67n66j62M70
1523B52r4J10k19j98K20l36N20m25l23L94L56j46l46K77l2j21K37j68k49m7M79
1544A41k49k36L24j99P1N0M4k13K44L75l98j58Q5l1k96M88j02l1K75k5j34n4J60
1567A31K28j00j39J49m32L7O07l56k36K22K19j89oJ46l18J84Kj0j80j35K34j52
1589i4K21P6j99RK14Rl71J75k25N2M01k01l32L41j59K09m32J17J14k5J31j27j19
1612b15o9L30j63l4j23J10J5j82R5J02k67M15k1k54K5K15j91J79o8j16L4K51J15
$$ plain form
1635 183 4 100 15 -22 -34 23 -73 315 243 189 -20 204 464 176 164 64 78 266 169 175 78 34 348 269 173 276
1661 276 153 73 72 52 152 59 194 207 -104 -42 66 -139 288 102 -78 -284 45 -118 135 105 -298 -118 -142
1684 -142 61 -231 -62 -86 22 -289 -136 -296 -228 37 -206 -312 -289 -45 196 -215 -4 -252 -324 120 41 -250
1706 -250 -403 106 -24 -15 50 -113 -253 178 85 0 37 88 80 -174 -81 -171 -28 200 212 -42 88 166 -44 224
1730 224 221 123 105 25 187 -122 -129 295 102 -22 -107 -77 331 91 439 232 302 9 152 22 -90 45 -63
1753 -63 15 141 35 -303 128 -29 158 18 -80 -76 -208 -15 -419 -100 154 13 -101 -177 -57 -10 -74 189 -248
1776 -248 -461 -67 -148 -284 -134 -116 42 -71 228 -349 -301 82 11 -78 -64 75 46 65 227 -92 -73 -74 42 -27
1800 -27 133 17 -10 150 294 216 118 159 352 147 -181 68 237 -24 194 91 76 149 240 133 38 39 81 147
$$ packed form
1635A83j79R6q5l7j2N7r6L88p2n4k09K24K60k88j2j00J4J88r7Or7m4L14p9r6J03
1661B76j23q0jk0J00r3J35J3l11O2J08k05M27j86j80k06L29j63K53l0m03J80k4
1684a42K03k92J69k4J08l11J53j60O8K65k43j06K3K44K41m11K11k48p2M44p9k91
1706b50j53N09j30RO5j63j40M31r3q5L7N1qk54R3r0J43K28J2k54J30P8k10K68
1730B24lr8j8q0J62l09pM24j93j24q5L0M08k40L48k07P0k93J43j30j12J35j08
1753f3P8J26j06l38M31j57J87j40r8Mj32J93m04L19K54j41j14p6J20M7o4K63m37
1776b48k13L94q1j36J50J8J58j13K99n77M8L83p1q9J4J39k9J9J62l19J9jJ16o9
1800b7J60j16k7J60J44p8r8M1J93k05l28K49J69k61K18j03j5P3R1j07r5JM2O6
$$ plain form
1824 147 -38 90 -73 -142 84 -148 -175 51 95 -191 -160 -28 -4 48 -117 -112 -212 -106 -158 -263 74 -229 63
1847 63 -220 214 -258 -286 -135 -10 -81 -165 108 -136 165 -14 -181 23 -98 -1 181 -64 259 164 -90 120
1869 120 -137 -36 -15 26 127 -17 210 144 360 305 298 -161 246 215 -40 212 205 143 93 519 102 31 67 272
1893 272 -114 164 -5 -134 315 293 -81 -63 -102 66 68 9 -21 -112 -320 -12 -58 -296 -269 -184 -45 -150 -43 61
1917 61 -241 57 -97 -138 -100 102 6 -221 -63 -18 -139 228 63 -87 3 87 -77 -55 33 -89 -130 116 70 -200
1941 -200 7 57 26 105 187 -56 147 -56 -28 18 169 -124 29 59 -63 0 -57 208 -88 3 312 151 244 17
1965 17 114 -22 171 101 304 -78 -40 200 -102 -181 211 22 -186 -85 -141 78 -102 295 -214 -204 24 -68 -254
1988 -254 -116 -164 -271 -54 45 -82 -81 -131 117 -159 -62 -131 -263 -181 252 -73 -123 -204 -192 182 -196 -9 -83 -128
$$ packed form
1824A47j85J28j63o9K26k32k7K26M4k86L1J32K4N2j65Nj00J06n2j05L37l03K92
1847F3k83M34m72k8J51J25p1q4K73k44L01j79j67K04j21R7J82k45L23r5k54K10
1869A20k57J01K1M1J01j44K27o6K16n5pm59M07l1k55K52po2n0M26m17p1L6K05
1893B72l86K78j69j29M49k2l74J8l9J68Kn9l0r1k08L08m6k38K7Q5J39j05J07J04
1917F1l02K98j54m1L8K02r6k27J58M5j21L67j65j50R0Q4j64K2Q8j22m1K46m6k70
1941b00K07N0l1P9Q2k43K03k03K8M6J51k93J53L0j22O3n7K65k96R1L09j61R3k27
1965A7R7j36J93p0K03l82L8K40l02p9L92j89k08J01n6K19j80L97n09J0K28r2j86
1988b54J38m8j07K17R9j27Jn0K48k76R7o9j32Q2M33l25n0q1J2L74l78J87p4m5
$$ plain form
2012 -128 -13 202 -3 17 -3 -111 -126 -63 -95 44 327 -103 -234 7 110 78 145 13 -29 -157 -62 239 195
2035 195 -43 102 -45 -80 117 108 151 251 146 179 34 36 -145 -44 216 -102 71 -120 76 -159 -44 -278
2057 -278 -91 -21 -78 -161 -147 -148 9 -95 -438 -17 -106 -267 -71 -88 -61 -4 -197 -123 -64 104 -326 182 -43 -5
2081 -5 -142 -34 73 -240 108 27 31 -38 210 -186 -190 85 247 75 -190 11 -56 25 326 115 84 60 267 -18
2105 -18 89 143 59 85 37 -24 133 254 -22 69 159 213 40 42 189 196 -65 78 -17 -64 -48 17 29 -50 112 120 -45
2132 -45 77 199 13 -160 170 44 72 -187 -93 -116 -51 0 -122 -119 -99 -141 -214 -30 -181 -62 -274 220 -170 -228
2156 -228 -111 14 -135 -62 22 -9 96 13 -177 27 206 -182 -269 -76 131 -80 -134 36 -31 -49 5 230 -96
2179 -96 89 20 109 -132 249 -85 -168 10 10 -50 102 67 188 -166 200 16 60 189 239 40 77 154 248 13
$$ packed form
2012a28J15K15k05K0k0j08j5O3l2J39K83m30j31K41J03l2O7j32m2j28R5L01m4
2035A95k38J45j47l5J97rM3J00j05L3j45Kj81J01K60l18J73j91J96k35J15k34
2057b78J87P0n7q3J4jJ57j04l43M21q9j61J96j7K7N7j93P4N9J68m30N08k25L8
2081ej37J08J07l13L48q1Mo9K48l96mK75J62j72k65K01o7Q1L01k11l1k4K07k85
2105a8J07N4q4K6m8o1J57J21k76R1R0N4j73KJ47Pk61J43r5m7J6O5J2p9J62Qj65
2132d5J22J22j86j73L30j26K8k59R4k3O5N1j22LK0m2p3J84j51J19k12M94l90n8
2156b28J17J25j49P3Q4l1J05q3j90K04J79l88q7J93K07k11n4J70o7j8N4K25l26
2179i6J85o9Q9k41L81l34q3J78%o0J52l5J21l54L66j84M4J29N0j99L7P7R4k35
$$ plain form
2203 13 146 -77 57 -136 -185 -56 210 74 -129 168 -79 -137 103 -25 -38 -142 -181 -74 -136 -214 20 19 -201
2226 -201 -13 -13 60 -151 -14 8 5 -262 -245 -51 -17 -82 -97 -42 111 121 -73 -128 -38 11 -55 -108 170 -16 24 -17
2252 -17 -105 12 68 -199 -192 209 14 -139 286 97 152 192 51 18 61 276 105 175 -53 -89 -14 -36 -132 -255 218
2277 218 127 27 -121 -75 99 66 131 1 -241 67 44 -255 4 -48 -189 -328 48 49 69 -43 -139 -289 -64
2300 -64 160 -100 43 -141 -104 -195 92 -82 205 72 76 -110 -218 -73 -16 -8 5 -70 -133 3 -38 184 -306 -153
2324 -153 -240 30 -7 -235 -9 278 213 106 288 169 -53 137 269 146 112 -186 81 64 -207 -32 77 -83
2346 -83 27 136 18 358 318 67 -238 -121 139 35 246 38 21 -171 159 24 35 -120 -106 -192 -11 -12 -126
2369 -126 -204 -43 155 36 -239 -162 -157 -9 127 -231 -155 -164 41 -75 -89 108 -39 -156 119 40 -198 14 79
$$ packed form
2203A3J33k23J34j93m9J29K66j36k03K97k47n8K40j28j3j04l9J07o2p8K34jk20
2226b01J88%P3k11J37K2lk67J7J94L4o5j5N5J53J0j94n5R0M9o6n3K78j86M0m1
2252a7q8J17N6k67PM01j95j53M25j89N5M0j41l3M3K15j71P0k28l6P5k2r6j23M73
2277B18r1j00j48M6J74l3O5j30k42L08k3k99K59n2j41j39L76JK0j12r6j50K25
2300f4K24k60J43j84L7r1K87j74K87j33Mj86j08J45N7QJ3p5o3J36m1K22m90J53
2324a53q7K70l7k28K26K87o5j07J82j19k22J90J32j23l4k98K67j7k71J75J09j60
2346h3J10J09j18L40m0k51l05J17K60j04K11k08j7j92L30j35J1j55J4q6J81jj14
2369a26p8J61J98j19k75P7NJ48J36l58P6rK05j16j4J97j47j17K75p9k38K12O5
$$ plain form
2392 79 -81 23 265 127 -130 80 94 -226 60 254 84 -147 -31 155 -128 12 -53 53 212 117 9
2413 9 173 103 77 -4 122 71 -24 36 43 26 203 61 -12 -107 105 91 -141 67 80 -176 -225 -93 -54 -19 151 -92
2439 -92 -114 33 11 -8 -84 -88 14 -161 -175 40 -281 -91 99 6 54 -122 49 -49 -37 6 -198 -25 -141 -189 -68
2464 -68 -85 24 -136 -53 -27 36 319 128 -119 -191 251 269 94 134 129 -224 135 72 -6 199 353 64 82 47 -42
2489 -42 -85 -52 29 106 -6 -83 47 96 158 115 -65 258 179 162 125 95 -62 63 160 203 105 -161 81 31 -29 22
2515 22 130 -100 -155 -242 -190 -173 60 -244 -145 -120 172 -238 191 -146 102 12 -94 76 152 75 -130 134 -13
2538 -13 147 -195 4 -99 173 121 -192 -174 28 167 56 260 -124 33 147 -129 190 86 57 104 181 -131
2560 -131 205 78 144 -165 45 0 35 -66 -189 86 -15 146 104 60 -156 72 -8 -97 35 -30 5 -45 -49 63
$$ packed form
2392G9j60J04K42j38k57K10J4l20K86J94j70k31J16J86k83J40o5J06J59r5j08
2413IJ64p0k6q1J26n1r5O0Pj7J77j42p3r5K12j4k32K08J3k56m9J32L9L5J70k43
2439i2k2J47k2j9p6mJ02j75j4K15l21J90J90r3M8j76J71r8J2M3k04J73j16m8J21
2464f8j7J09j60Q3K6O3K83j91k47p2M42J8j75M0nl53L59o3p8K05J54k89J8l5q9
2489d2m3L3Q1P7j12p7J30M9O2m3j80L23p9j7l7l0j57J25R7M3r8k66K42n0o0N1
2515B2J08k30n5q7N2J7K33l04R9K5K92m10M29l37K48r0j06J70P6p7k05K64j47
2538a3J60l42J99j03K72n2l13J8K02J39j11K04l84J57J14k76L19j04k9M7P7l12
2560a31L36j27O6l09K10m5L5j01j23K75j01J61m2m4k16K28q0q9J32o5L5n0mJ12
$$ plain form
2584 63 205 127 79 29 21 -66 -86 -140 -110 100 -141 -87 -132 -56 30 -107 46 -42 -100 -187 -29 -17 -125 0 167 232
2610 232 -65 -69 47 -38 -27 99 -401 -143 191 3 116 155 95 -29 134 -129 142 40 27 -1 -131 -1 66
2633 66 -162 36 -20 54 214 66 -130 136 5 -50 152 15 241 -31 374 66 -101 67 222 23 43 80
2655 80 -145 -172 75 108 201 237 158 -136 -3 111 -55 -27 -125 50 149 -106 80 145 -186 -116 123 6 -119 -330
2679 -330 201 36 3 131 -177 -236 4 123 -104 -118 104 -39 -45 199 137 146 227 -38 50 14 -257 -143 -10 80
2703 80 -5 -80 -55 -75 3 144 251 5 -54 -31 220 -198 7 411 -237 317 -72 -101 195 15 211 153 136 -35
2727 -35 88 -38 180 291 27 63 -45 -36 82 129 -215 -189 -82 94 -161 -67 -376 0 -79 -122 -101 174 -31
2750 -31 5 66 -64 -62 -43 -118 -201 -323 110 -14 -11 -78 -161 162 -104 346 -46 94 -65 -72 71 -166 -111 -34 142
$$ packed form
2584F3J42p8m8n0qq7k0n4L0K10k41N4m5P6Q6j37J53q8n8q7J58J2j08J25J67O5
2610B32k97mJ16q5J1J26n00K58L34j88J13L9o0j24J63k63K71j02j3k8j30J30O7
2633F6k28J98n6P4J60j48j96K66j31n5K02j37K26k72M05l08j67J68J55j99K0L7
2655H0k25k7K47L3R3L6p9k94J33J14j66K8r8J75R9k55J86O5l31P0K39j17j25k11
2679c30N31j65l3J28l08n9K40J19k27j4K22j43oK44o2RQ1k65Q8l6k71J14J33R0
2703H0q5p5K5k0P8J41J07k46n9K3K51m18K05M04o48N54l89k9K96j80J96n8j7j71
2727c5J23j26K18J11k64L6j08RJ18M7l44K6J07J76k55R4l09L76p9m3K1K75k05
2750c1L6O1j30KJ9p5q3j22M33j24Lo7q3L23k66M50l92J40j59pJ43k37N5P7J76
$$ plain form
2775 142 94 -57 81 89 -70 -138 274 -7 135 -46 79 -7 -54 -187 -119 24 -33 58 -195 113 34 263 -40
2798 -40 -145 35 60 -59 95 36 -35 129 -71 141 -227 108 -7 32 -79 13 84 -33 0 18 76 -176 -136 -105
2822 -105 89 104 -89 98 30 -83 54 -123 99 174 -26 -61 -212 -142 -239 152 -11 287 -21 233 111 44
2844 44 47 -90 211 -55 41 100 93 -3 -44 10 -290 -223 0 187 -22 58 75 -144 -123 -12 -36 189 180 -25 48 108
2870 108 -68 -66 -165 181 76 13 -42 -87 -101 75 -24 1 110 344 -78 -96 -81 118 -258 -47 -42 44 -210 -65 246
2895 246 53 103 61 -230 144 -94 -108 23 -31 -166 -45 -53 -80 -201 27 92 13 124 33 -98 -53 59 198 -35
2919 -35 -359 -126 56 -88 -68 -18 32 16 -43 10 100 219 48 -67 -91 180 -209 94 -62 -133 131 53 149 83
2943 83 27 145 122 309 90 27 -91 53 263 21 -12 -1 92 148 -79 59 83 54 48 140 -8 194 -124 -49 -294
$$ packed form
2775A42m8j51J38Qj59o8M12k81J42j81J25q6m7j33O8J43n7R1k53L08p9K29l03
2798d0j05J80K5j19J54n9p1J64k00K12l68L35j15L9j11R2P1j17L3J8N8k52M0L1
2822a05J94J5j93J87o8j13J37j77K22P5k00l5j51P0r7L91j63K98l08K54j22o7
2844D4Lj37L01k66R6N9pr6m1N4l00O7K23J87k09Q0J7k19K1J11k4K25rk05P3O0
2870A08j76Kr9L46j05o3n5m5j4J76r9K5J09K34m22j8J5J99l76K11NQ6k54J45L11
2895B46j93N0m2k91L74k38j4J31n4j35J21qk7j21K28O5p9J11r1j31M5J12J39k33
2919c5l24K33J82j44K0N0N0j6n9N3R0J19j71j15k4K71l89L03j56p1K64p8R6o6
2943H3n6J18k3J87k19o3j18J44K10k42l3J1R3N6k27J38K4k9oR2j48K02l18P5k45
$$ plain form
2968 -294 -60 34 -208 71 -65 -34 67 -22 -9 0 -133 -135 -119 11 -103 -42 87 -93 280 19 -359 45 64 119
2992 119 235 66 26 -186 15 -10 -224 -41 147 -99 -150 108 -104 -118 -51 -42 62 160 -35 -71 65 31 159
3015 159 -174 154 68 -147 71 51 -68 -51 127 41 193 49 -173 65 -67 8 -132 -10 158 -50 -159 -202
3037 -202 -81 53 -157 47 -46 134 129 -77 -168 -2 1 -59 195 -67 -108 -133 149 -139 -250 157 -348 98 43
3060 43 -269 -87 129 -88 -98 207 -105 119 -84 -86 31 25 158 96 -67 -59 -19 74 -78 -153 0 126 -138 172
3084 172 -153 -38 -132 -166 124 223 138 134 36 5 192 148 104 -144 108 -137 55 76 9 -37 -181 -15 201 119 178
3109 178 -73 57 132 -69 117 -64 0 -218 -27 -71 -196 -236 62 27 -118 -157 244 30 -190 81 -200 -189
3131 -189 -49 270 -72 -144 38 -173 -41 -33 -242 275 -59 110 38 77 -340 -20 216 107 68 57 26 -43 -244
$$ packed form
2968b94K34R4k42K79j36L1J01q9J3Rj33kJ6J30j14O1J29j80L73k61l78M04J9N5
2992A19J16j69m0k12K01k5k14J83J88k46n1K58k12j4O7RJ04R8j95l6J36l4J28
3015A59l33L28q6k15K18k0j19J7J78q6J52j44k22K38j32P5j40J22J68k08j09m3
3037b02J21J34k10K04r3J80nk06r1J66Lo0K54k62m1k5K82k88j11M07n05M46n5
3060D3l12J82K16k17j0L05l12K24k03kJ17oJ33o2j63QM0R3j52p5J53J26k64L10
3084A72l25J15r4l4K90R9q5mr8l1J87m4m4k48K52k45J92K1o7m6j44J66K16q2N9
3109A78k51J30P5k01J86j81O4k18J91m4j25m0K98l5j45l9M01k14k20K71k81J1
3131a89J40L19l42p2J82k11J32Qk09N17l34J69p2L9m17L20K36j09l9j1l1o9k01
$$ plain form
3154 -244 128 57 -68 -38 -76 167 27 -6 -3 247 41 141 57 -116 128 161 -24 284 173 -21 156 78 67
3177 67 131 83 12 26 11 44 -3 28 146 66 -178 27 -38 -39 -21 113 -150 88 68 194 198 -45 133 121 -66 -4
3203 -4 121 -218 -163 -111 -325 17 185 -26 -191 -111 -16 -272 138 -117 -69 210 56 -10 78 -38 -12 98 -92
3226 -92 -169 -40 0 -192 -59 37 -20 -160 73 -20 196 2 -81 154 28 0 151 -253 286 -49 16 49 -54
3249 -54 32 -5 4 175 -180 166 61 -82 87 -109 295 -91 79 -177 36 -37 -56 -126 -6 11 -149 184 -55
3272 -55 -20 -79 -92 64 -11 -32 319 64 -114 33 234 -262 -61 -169 -7 108 -86 -119 -54 -159 -17 -152 0
3295 0 -4 -70 33 -68 181 -58 1 -77 100 -108 -15 62 -23 136 65 90 -47 8 158 26 347 -198 -4 187
3319 187 44 48 -7 20 -44 118 31 -53 109 94 1 25 26 -209 -44 -120 126 107 -43 -104 -33 -38 167 104 -33 -11 -77
$$ packed form
3154b44L72p1j25L0l8K43j40l3LK50k06J00q4j73K44L3j85L08j11j94J77p8j1
3177F7O4m8p1J4j5L3m7L1J18q0k44K05o5jJ8J34k63K38k0J26Mk43J78j2j87O2
3203dJ25l39N5N2k14L42J68k11j65Q0R5k56M10k55M8K79j54o6Q8j16K6J10j90
3226i2p7J29M0j92J33R6n7j40K33r3K16j94q3K35j26k8J51m04N39l35O5L3j03
3249e4Q6l7RJ71l55L46j05j43J69j96M04l86J70k56K13p3j9p0J20J7j60L33k39
3272e5L5n9j3J56p5k1L51k55j78J47K01m96K01j08J62J15j94l3O5j05J42j35J52
3295@mo6J03j01K49k39N9p8J77k08R3P7q5J59p1K5j37N5J50j32L21n45J94J91
3319A87j43Mn5K7o4J62q7q4J62j5r3K4Jk35J65p6K46j9j50o1P1nK05o3j37K2o6
$$ plain form
3346 -77 -200 -27 -3 -201 -105 -149 -306 -158 218 42 18 0 185 -48 -50 -335 -259 -114 79 -143 -140 -201 -112 75
3370 75 -16 -64 -237 -20 -26 184 -86 178 -134 -147 -184 39 -119 -118 -16 -43 -289 -1 -175 252 39 -295 30
3393 30 -106 -29 -9 75 -11 288 148 211 4 -228 -100 -28 -7 -71 -56 27 124 -132 7 -161 190 240 -72 118
3417 118 -102 121 -70 -22 5 308 -102 -94 364 166 34 -61 303 -179 8 -43 -23 156 -119 -35 10 129 -143
3440 -143 -25 -268 116 -49 -42 72 24 227 -362 121 169 -39 -278 10 -136 -171 -92 311 -70 266 -134 41
3462 41 -149 26 -115 68 23 -124 -99 92 -117 -2 58 -1 -142 -98 193 62 -41 59 144 -56 -23 44 47 145
3486 145 -164 4 -22 -195 84 -44 -117 -24 -68 -24 119 -73 142 -108 134 -182 8 -108 161 -61 243 60
3508 60 -90 11 -127 -212 123 134 -20 140 28 109 -48 133 -132 51 5 -140 58 113 -211 -137 113 61 41
$$ packed form
3346g7j23J73K4j98R6m4j57J48L76j76k4j8J85k33kk85P6J45J93k22Lo1Q9J87
3370G5r1m8j73K17oK10k70K64l12j3l7K23j58JJ02k7k46K88j74M27k13l34L25
3393C0j36P7K0Q4q6K99j40O3k07k32J28P2K1o4J5Q3R7k56J39j68L51N0l12J90
3417A18k20K23j91M8K7L03m10QM58j98j32r5L64m82J87n1K0J79k75Q4M5J19k72
3440a43J18k43L84j65PJ14m8K03n89M83M8k08k39K88j46l5P9M03l81L36m00J75
3462D1j90J75j41J83m5j47K5J91k09J15O0n9j41M4K91j31j03J00Q5k00L3O7LR8
3486A45l09J68k6j73K79j28p3R3m4M4J43j92K15k50K42l16J90j16K69k22L04j83
3508F0j50J01j38q5L35J1j54J60j12Q1j57J81k65J83m6j45J98N5l24P4K50n2k0
$$ plain form
3531 41 155 -1 -16 48 -21 -53 206 -156 -76 155 -35 -47 8 -6 41 67 113 110 102 17 -61 -107 -169 -16 -151 33 0
3558 0 -102 -23 -3 140 -16 -33 -158 26 124 5 23 209 -34 -1 -54 -129 -87 -72 158 -109 92 -43 -93 -86 41
3583 41 -197 85 -3 62 -109 -254 70 -52 -60 -24 155 -54 -17 -148 -138 245 17 -209 -86 32 220 -222 -236
3606 -236 83 -22 130 -98 -120 -111 358 -28 177 -193 -117 64 -76 142 -158 185 -41 13 67 -214 85 -135
3628 -135 207 236 -62 50 354 37 45 14 -35 -118 43 107 -106 110 -135 112 -43 -187 -20 67 -23 -138 114
3651 114 118 142 -55 158 -162 37 57 118 -112 -25 -56 94 -121 159 -34 7 89 3 -130 101 7 35 209 52
3675 52 -30 -39 6 86 67 -120 28 84 -33 -53 -86 129 106 8 68 -5 -265 117 57 173 7 88 28 170 -5 238
3701 238 103 -117 40 40 -164 -129 107 -253 -86 313 179 112 -135 -201 94 -71 88 -36 -220 148 -122 -37
$$ packed form
3531D1J14j56j5O4o9l2K59l62Q0K31j90j2N5j4M7K6M6lqq5p8m6o2J53j35J84l3
3558@j02P9K0J43j56j7j25J84R8j19J8J86k43L3n3p5M2J5K30k67K01j35n0PJ27
3583D1k38K82q8O5j71j45L24j22qL6J79k09L7j31J0L83k28k26J23J18J88m42j4
3606b36L19j05J52k28k2RM69l86K05l70P6J81j40K18l00L43k26N4N4k81K99k20
3628a35L42K9k98J12L04l17Ql1m9q3J61O4k13K16k45K47j55j44J67Q7r0j15K52
3651A14MK4j97K13l20J99K0O1k30Q7l1J50k15K80j93M1Q2q6j33K31r4K8J74j57
3675E2q2rM5Q0j9j87J48N6j17k0l3K15k3r8O0p3k60L82o0J16j66Q1o0J42j75K43
3701B38j35k20J57%k04L5K36l60J67L99j34o7k47o6K95j65J59j24j84L68k70Q5
$$ plain form
3723 -37 -1 362 -62 117 -200 -12 -96 86 -144 -2 -8 29 -167 -64 -229 -37 -24 -112 37 -35 185 -53 27
3746 27 42 46 -313 -170 17 38 -56 141 -145 -76 99 -27 169 -7 71 -103 59 -51 -39 43 144 32 -121
3769 -121 -6 98 170 188 -57 -82 175 213 316 -103 -154 70 197 -26 111 6 5 -47 8 132 -165 146 103
3792 103 -155 88 -29 -105 34 121 71 131 172 101 250 181 52 -315 31 22 -129 -59 142 -57 -31 -97 -66 55
3816 55 -13 1 20 -39 -156 121 -37 -130 -107 8 -1 182 115 -116 -160 135 -6 75 175 161 27 68 -17 9 38 76
3842 76 -47 -14 -3 121 83 226 -201 -171 -164 86 57 128 35 14 91 -77 173 -1 -197 -15 24 -17 -17 74 62 -171
3868 -171 -106 59 171 45 107 -36 126 9 -195 -87 57 -163 -63 -7 98 -92 -28 -142 59 -9 -76 -112
3890 -112 -73 -13 60 -20 -54 76 -95 -129 69 -93 -352 -68 8 -100 231 48 -83 135 183 -142 60 -158 -99
$$ packed form
3723c7L6L63m24J79l17J88q4J82k30J42oL7j96J03j65J92J3q8J49p2K20k38Q0
3746B7J5Ml59J43J87K1r4J97k86O9J75j26J96j76P8j74J62j10J2Q2J01j12j53
3769a21J15J04P2J8k45k5K57L8J03m19n1K24J27k23J37j05jn2N5J24k97L11m3
3792A03k58K43j17p6J39Q7n0O0M1p1J49o9j29l67L46rj51P0K01j99K6o6L1J21
3816E5o8J4J9n9j17K77j58r3K3J15rJ83o7k31m4K95j41Q1J00j4j34M1q5K6K9L8
3842G6j23L3J1J24l8J43m27L0PK50k9P1r3k1P7j68K50j74j96J82L9m1%R1j2k33
3868a71O5J65J12j26O2j43J62j17k04J08J44k20J00N6J05j90O4j14K01o8o7l6
3890a12L9O0P3q0l4J30j71l4J98j62k59K84P6j08L31j83j31K18M8l25K02k18N9
$$ plain form
3913 -99 17 25 -35 -6 38 160 -24 -211 -44 49 183 135 -117 44 80 269 -164 -29 -20 -36 56 -136 117 -101
3937 -101 -157 -44 184 -49 44 47 48 -124 -218 -60 5 107 63 10 -110 -24 -206 139 226 -166 -97 -27 -230 -30 -64
3962 -64 -229 -119 -203 -57 186 3 130 -112 28 -106 142 125 -172 8 40 92 174 181 119 167 107 65 54 -11 36
3987 36 53 -19 -153 -131 29 -64 176 68 42 60 -103 -70 -178 -112 -199 -304 137 190 63 59 -76 48 56 110 -121
4012 -121 9 -34 117 -57 -146 -10 70 -208 40 64 -134 9 102 12 -96 -59 -40 114 5 -28 -58 -45 120 10
4036 10 -45 -43 -57 -180 -35 -150 -60 -63 -246 52 -147 -182 100 -73 73 126 240 -7 -162 -151 -69 -59 9 -71 -37
4061 -37 168 281 151 117 -10 -58 196 -79 70 -188 18 83 85 67 203 81 121 -6 -153 -111 78 -139 -103
4084 -103 103 90 -9 71 -13 -58 70 25 -226 -87 -55 -120 49 8 286 -256 67 -153 -13 -92 -245 124 -58
$$ packed form
3913i9J16Qo0K9M4J22j84j87J67R3J34m8k52J61L6J89m33J35Rj6R2j92K53k18
3937a01n6J13K28k33R3LJj72r4J58O5J02m4n3j20Q6j82L45Q7l92O9P0k03K00l4
3962f4j65J10q4J46K43j83J27k42J40j34K48j7k97J80L2N2Q2Po2M8o0m2j1o5M7
3987C6J7p2j34K2J60r3K40j08k6J8j63L3j08O6q7j05M41N3j27mj35J24QN4k31
4012a21J30m3J51j74q9J36Q0k78K48K4j98J43R3r0j08L7J9J54j09l3l0J3J65j10
4036A0n5Kj4j23J45j15R0lj83K98j99l5K82j73J46N3J14k47j55J1Q2J0O8q0L4
4061c7K05J13j30l4j27m8K54k75J49k58K06O5Kj8J36j22M0j27j47M2J89k17L6
4084a03K06j3r9Q0q4m5J28m5k51J39L2o5J69m1K78n42L23k20J40p9j53L69j82
$$ plain form
4107 -58 -243 7 60 -105 6 -62 168 165 -196 95 161 -24 -85 -93 -42 112 176 -106 26 91 191 -188 19 51
4131 51 1 51 38 -112 -14 -206 -142 -68 -43 -79 -72 -177 -63 -119 268 22 97 105 -191 104 -64 137 -296 -98 -9
4156 -9 105 8 15 -140 29 104 27 -8 -94 323 118 -163 153 110 71 48 16 133 -2 -61 -40 221 11 87 -157
4181 -157 38 -78 84 -3 -22 73 -2 -40 87 -107 86 60 -98 -22 -31 -44 -117 145 3 -183 94 137 -74 118
4205 118 23 54 -82 111 97 -2 18 101 62 33 161 -187 -24 147 -12 -86 129 -57 103 87 47 -37 -5 -15 -65
4230 -65 154 1 246 -51 236 69 -103 76 50 40 41 -101 -105 112 87 237 46 -44 -1 -31 -290 177 102 26
$$ packed form
4107e8j85K50N3j65J11o8K30ll61K91O6j85o1qN1J54O4k82J32O5J00l79K07L2
4131E1n0N0j3j50R8j92O4P4K5l6Pj05J14n6L87k46P5Qk96K95j68K01m33J98Q9
4156iJ14r7Pj55J69P5p7l5q6M17k05k81L16m3l9k3l2J17j35n9K1K61k10P6k44
4181a57J95j16J62q7j9R5p5l8J27j94J93k6j58P6rj3p3K62j42j86K77M3k11J92
4205A18r5L1j36J93j4r9K0Q3l9k9J28l48J63J71j59p4K15j86J60j6m0q4L2j0n0
4230f5K19j53K45k97K87j67j72J79k6j0Jj42mK17k5J50j91r0M3l0k59M67p5p6
$$ [...]
8191a72
##END NTUPLES=NMR FID
##END=
