##TITLE=1H_SL84-f7-f3
 CDCl3,8 sc, 
 2.04.2021
##JCAMPDX= 6.0         $$ Bruker NMR JCAMP-DX V2.0
##DATA TYPE= NMR FID
##DATA CLASS= NTUPLES
##ORIGIN= UXNMR, Bruker Analytische Messtechnik GmbH
##OWNER= root
$$ XWIN-NMR		Version 3.5
$$ Fri Apr  2 10:05:24 2021 Russian Standard Time (UT+4h)  she@DPX200
##.OBSERVE FREQUENCY= 200.131506
##.OBSERVE NUCLEUS= ^1H
##.DELAY= (6, 6)
##.ACQUISITION MODE= SIMULTANEOUS
##.ACQUISITION SCHEME= undefined
##.AVERAGES= 8
##.DIGITISER RES= 18
##SPECTROMETER/DATA SYSTEM= spect
##.PULSE SEQUENCE= zg30
##.SOLVENT NAME= CDCl3
##.SHIFT REFERENCE= (INTERNAL, CDCl3, 0, 15.7039)
##AUDIT TRAIL= $$ (NUMBER, WHEN, WHO, WHERE, WHAT)
$$ ##TITLE= Audit trail, XWIN-NMR		Version 3.5
$$ ##JCAMPDX= 5.01
$$ ##ORIGIN= Bruker BioSpin GmbH
$$ ##OWNER= she
$$ F:/spectra/data/she/nmr/H-F/1/audita.txt
$$ ##AUDIT TRAIL=  $$ (NUMBER, WHEN, WHO, WHERE, WHAT)
(   1,<2021-04-02 10:04:08.18 +0400>,<she>,<DPX200>,
      <created by zg, POWCHK disabled, PULCHK disabled
       configuration hash MD5:
       00 E9 B6 7A A2 85 ED C7 34 08 36 98 17 FE 4E 26
       data hash MD5: 16K
       08 A6 D8 AE 45 66 F2 A5 DF 1F 82 D3 35 B1 DE C7>)
$$ ##END=
$$ 
$$ hash MD5
$$ D6 73 9A 8A FC 9E 96 C4 3D 40 2C CF DE 8E 3E 44
##$RELAX= 
##$RELAX= 
##$RELAX= 
##$RELAX= 
##$RELAX= 
##$RELAX= 
$$ Bruker specific parameters
$$ --------------------------
##$DU= <F:/spectra>
##$EXPNO= 1
##$NAME= <H-F>
##$PROCNO= 1
##$TYPE= <nmr>
##$USER= <she>
##$AMP= (0..31)
100 100 100 100 100 100 100 100 100 100 100 100 100 100 100 100 100 100 
100 100 100 100 100 100 100 100 100 100 100 100 100 100 
##$AQSEQ= 0
##$AQ_mod= 1
##$AUNM= <au_zg>
##$AUTOPOS= <>
##$BF1= 200.13
##$BF2= 200.13
##$BF3= 200.13
##$BF4= 200.13
##$BF5= 200.13
##$BF6= 200.13
##$BF7= 200.13
##$BF8= 200.13
##$BYTORDA= 1
##$CFDGTYP= 0
##$CFRGTYP= 5
##$CHEMSTR= <none>
##$CNST= (0..31)
1 1 145 1 1 1 1 1 1 1 1 1 1 1 1 1 1 1 1 1 1 1 1 1 1 1 1 1 1 1 1 1 
##$CPDPRG= <>
##$CPDPRG1= <>
##$CPDPRG2= <>
##$CPDPRG3= <>
##$CPDPRG4= <mlev>
##$CPDPRG5= <mlev>
##$CPDPRG6= <mlev>
##$CPDPRG7= <mlev>
##$CPDPRG8= <mlev>
##$CPDPRGB= <>
##$CPDPRGT= <>
##$D= (0..31)
0 1.2 0 0 0 0 0 0 0 0.06 0 0.03 0 0 0 0 0.0002 0 0 0 0 0 0 0 0 0 0 0 0 
0 0 0 
##$DATE= 1617343447
##$DBL= (0..7)
120 120 120 120 120 120 120 120 
##$DBP= (0..7)
150 150 150 150 150 150 150 150 
##$DBP07= 0
##$DBPNAM0= <>
##$DBPNAM1= <>
##$DBPNAM2= <>
##$DBPNAM3= <>
##$DBPNAM4= <>
##$DBPNAM5= <>
##$DBPNAM6= <>
##$DBPNAM7= <>
##$DBPOAL= (0..7)
0.5 0.5 0.5 0.5 0.5 0.5 0.5 0.5 
##$DBPOFFS= (0..7)
0 0 0 0 0 0 0 0 
##$DE= 6
##$DECBNUC= <off>
##$DECIM= 32
##$DECNUC= <off>
##$DECSTAT= 4
##$DIGMOD= 1
##$DIGTYP= 9
##$DL= (0..7)
0 120 120 120 120 120 120 120 
##$DP= (0..7)
150 150 150 150 150 150 150 150 
##$DP07= 0
##$DPNAME0= <>
##$DPNAME1= <>
##$DPNAME2= <>
##$DPNAME3= <>
##$DPNAME4= <>
##$DPNAME5= <>
##$DPNAME6= <>
##$DPNAME7= <>
##$DPOAL= (0..7)
0.5 0.5 0.5 0.5 0.5 0.5 0.5 0.5 
##$DPOFFS= (0..7)
0 0 0 0 0 0 0 0 
##$DQDMODE= 0
##$DR= 18
##$DS= 0
##$DSLIST= <SSSSSSSSSSSSSSS>
$$ [...]
##$SUBNAM2= <"">
##$SUBNAM3= <"">
##$SUBNAM4= <"">
##$SUBNAM5= <"">
##$SUBNAM6= <"">
##$SUBNAM7= <"">
##$SUBNAM8= <"">
##$SUBNAM9= <"">
##$SW= 16.9725357007746
##$SWIBOX= (0..15)
0 0 2 0 0 0 0 0 0 0 0 0 0 0 0 0 
##$SW_h= 3396.73913043478
##$TD= 16384
##$TD0= 1
##$TE= 0
##$TE2= 300
##$TE3= 300
##$TEG= 300
##$TL= (0..7)
0 120 120 120 120 120 120 120 
##$TP= (0..7)
150 150 150 150 150 150 150 150 
##$TP07= 0
##$TPNAME0= <>
##$TPNAME1= <>
##$TPNAME2= <>
##$TPNAME3= <>
##$TPNAME4= <>
##$TPNAME5= <>
##$TPNAME6= <>
##$TPNAME7= <>
##$TPOAL= (0..7)
0.5 0.5 0.5 0.5 0.5 0.5 0.5 0.5 
##$TPOFFS= (0..7)
0 0 0 0 0 0 0 0 
##$TUNHIN= 0
##$TUNHOUT= 0
##$TUNXOUT= 0
##$USERA1= <user>
##$USERA2= <user>
##$USERA3= <user>
##$USERA4= <user>
##$USERA5= <user>
##$V9= 5
##$VALIST= <valist>
##$VCLIST= <CCCCCCCCCCCCCCC>
##$VD= 0
##$VDLIST= <DDDDDDDDDDDDDDD>
##$VPLIST= <PPPPPPPPPPPPPPP>
##$VTLIST= <TTTTTTTTTTTTTTT>
##$WBST= 1024
##$WBSW= 4
##$XGAIN= (0..3)
0 0 0 0 
##$XL= 0
##$YL= 0
##$YMAX_a= 325733
##$YMIN_a= -442987
##$ZGOPTNS= <>
##$ZL1= 120
##$ZL2= 120
##$ZL3= 120
##$ZL4= 120
##$ABSF1= 10
##$ABSF2= 0
##$ABSG= 5
##$ABSL= 3
##$ALPHA= 0
##$AQORDER= 0
##$ASSFAC= 0
##$ASSFACI= 0
##$ASSFACX= 0
##$ASSWID= 0
##$AUNMP= <proc_1d>
##$AZFE= 0.1
##$AZFW= 0.1
##$BCFW= 1
##$BC_mod= 2
##$BYTORDP= 1
##$COROFFS= 0
##$CY= 11.3945322036743
##$DATMOD= 1
##$DC= 2
##$DFILT= <>
##$DTYPP= 0
##$F1P= 15.9154993809931
##$F2P= -4.1035820241983
##$FCOR= 0.5
##$FTSIZE= 0
##$FT_mod= 4
##$GAMMA= 1
##$GB= 0.15
##$INTBC= 1
##$INTSCL= 1
##$ISEN= 128
##$LB= 0.24
##$LEV0= 0
##$LPBIN= 0
##$MAXI= 10000
##$MC2= 0
##$MEAN= 0
##$ME_mod= 0
##$MI= 1.114404
##$NCOEF= 0
##$NC_proc= 0
##$NLEV= 6
##$NOISF1= 3.799351
##$NOISF2= 2.8
##$NSP= 1
##$NTH_PI= 0
##$NZP= 0
##$OFFSET= 15.70392
##$PC= 1
##$PHC0= -11131.63
##$PHC1= 27.00093
##$PH_mod= 1
##$PKNL= yes
##$PPARMOD= 0
##$PSCAL= 0
##$PSIGN= 0
##$REVERSE= no
##$SF= 200.130013532006
##$SI= 16384
##$SIGF1= 3
##$SIGF2= 2
##$SINO= 400
##$SIOLD= 16384
##$SREGLST= <1H.CDCl3>
##$SSB= 0
##$STSI= 0
##$STSR= 0
##$SW_p= 3612.71676300578
##$SYMM= 0
##$S_DEV= 0
##$TDeff= 0
##$TDoff= 0
##$TI= <>
##$TILT= no
##$TM1= 0
##$TM2= 0
##$TOPLEV= 0
##$USERP1= <user>
##$USERP2= <user>
##$USERP3= <user>
##$USERP4= <user>
##$USERP5= <user>
##$WDW= 1
##$XDIM= 8192
##$YMAX_p= 0
##$YMIN_p= 0
$$ End of Bruker specific parameters
$$ ---------------------------------
##NTUPLES= NMR FID
##VAR_NAME=  TIME,          FID/REAL,        FID/IMAG
##SYMBOL=    X,             R,               I
##VAR_TYPE=  INDEPENDENT,   DEPENDENT,       DEPENDENT
##VAR_FORM=  AFFN,          ASDF,            ASDF
##VAR_DIM=   8192,          8192,            8192
##UNITS=     SECONDS,       ARBITRARY UNITS, ARBITRARY UNITS
##FACTOR=    0.0002944,     1,               1
##FIRST=     0,             0,               0
##LAST=      2.4114304,     0,               0
##MIN=       0,             -442987,         0
##MAX=       2.4114304,     325733,          0
$$ Real data points
##PAGE= N=1
##DATA TABLE= (X++(R..R)), XYDATA
$$ [...]
$$ plain form
2100 -1419 -1301 856 -2382 336 370 -144 1386 444 1265 -647 -955 972 -2169 515 1820 -1542 2449
2117 2449 1168 -1478 2014 -841 -757 1631 -483 1223 1019 357 945 -1343 541 -97 -625 2520 -126
2134 -126 661 2530 -1779 513 -297 -1947 1443 -595 450 1812 -947 1249 -269 -1601 903 -1417
2150 -1417 303 1122 -1303 600 -809 -1430 72 -1783 752 105 -512 1578 -1632 -307 247 -3425
2166 -3425 170 -182 -2148 2023 -427 -570 1074 -1260 -771 -660 -346 -10 -706 1452 -665 -928 1653
2183 1653 -2078 -14 2096 -1826 1929 1685 -1573 1294 -297 -1317 975 151 390 655 1264 1332 -698
2200 -698 1787 -506 -1545 2319 -736 -48 2540 -1020 674 1153 -1376 1036 90 -214 939 -268
2216 -268 944 -659 -825 909 -2079 470 1157 -1549 1636 344 -1098 856 -1590 -729 -201 -1591
$$ packed form
2100a419J18K157l238K718L4n14J530r42Q21j912l08J927l141K684J305l362L991
2117B449j281k646L492k855Q4K388k114J706k04o62N88k288J884o38n28L145k646
2134a26P87J869m309K292q10j650L390k038J045J362k759K196j518j332K504k320
2150a417J720Q19k425J903j409o21J502j855K535o47o17K090l210J325N54l672
2166c425L595l52j966M171k450j43J644k334M89J11L14L36o96K158k117k63K581
2183A653l731K064K110l922L755k44l258K867j591j020K292q24K39K65O09O8k030
2200f98K485k293j039L864l055O88K588l560J694M79k529K412r46l04J153j207
2216b68J212j603j66J734k988K549O87k706L185j292j442J954k446Q61N28j390
$$ plain form
2232 -1591 848 -692 37 885 -1970 311 -317 -1824 1253 -983 -542 633 -1310 -208 -318 -1054
2248 -1054 97 -691 1065 143 -631 1287 -1738 -917 999 -2010 744 1078 -920 1667 365 -582
2264 -582 773 -407 117 -69 469 1381 -411 1279 397 -1546 1903 -422 -431 2646 -643 448 1503
2281 1503 -859 315 96 36 379 92 1846 -163 468 1483 -2123 572 685 -1957 1918 363 -1255
2298 -1255 1674 -606 -650 198 -1297 178 -279 217 291 -1226 650 -977 -1504 925 -1486 -228 1317
2315 1317 -1581 279 74 -1778 182 -914 -504 76 -380 862 -825 -137 76 -1805 802 -104 -1096
2332 -1096 1649 -369 -86 1215 -1018 395 138 -594 1471 -388 397 1037 -732 993 -78 -416
2348 -416 1398 -441 747 1038 -30 968 -553 326 374 -543 1490 145 -3 1981 -1310 384 1153
$$ packed form
2232a591K439j540P29Q48k855K281o28j507L077k236M41J175j943J102j10p36
2248a054J151p88J756r22p74J918l025Q21J916l009K754L34j998K587j302r47
2264e82J355j180N24j86N38R12j792J690q82j943L449k325rL077l289J091J055
2281A503k362J174k19o0L43k87J754k009O31J015l606K695J13k642L875j555j618
2298a255K929k280m4Q48j495J475m57M96P4j517J876j627n27K429k411J258J545
2315A317k898J860k05j852J960j096M10N80m56J242j687O88K13j881K607r06r92
2332a096K745k018K83J301k233J413k57p32K065j859P85O40j769J725j071l38
2348d16J814j839J188K91j068R98j521Q79M8r17K033j345j48J984l291J694P69
$$ plain form
2365 1153 -1825 725 406 -1136 1681 -256 -473 315 -915 565 -598 -107 400 -1373 856 -438
2381 -438 -1044 1263 -1735 -691 1067 -1387 661 301 -1413 52 -1073 -781 -137 -717 388 -592 -212
2398 -212 540 -1351 602 -344 -1630 1346 -579 -489 890 -1104 85 323 -727 869 -134 224 722
2415 722 -343 835 -241 -93 541 -723 770 960 41 1554 36 159 1446 -755 866 393 -456
2432 -456 1333 -602 182 1143 -1009 937 445 -256 1334 -314 146 486 -844 584 -598 -455 977
2449 977 -941 610 45 -939 692 -824 -700 414 -1229 368 -79 -1093 430 -898 13 157 -1194
2466 -1194 284 -446 -754 749 -1237 -421 213 -1278 508 -312 -473 332 -778 320 -58 -489 408
2483 408 -945 62 529 -785 1108 -93 -315 1229 -637 573 780 -980 1282 140 -146 990
$$ packed form
2365A153k978K550l19j542K817j937k17P88j230J480j163M91N07j773K229j294
2381d38o06K307k998J044J758k454K048l60j714J465j125K92O44n80J105r80L80
2398b12P52j891J953r46j286K976j925R0J379j994J189K38j050J596j003L58M98
2415G22j065J178j076J48O34j264J493J90r19J513j518J23J287k201J621m73q49
2432d56J789j935P84R61k152J946m92p01J590j648M60L40j330J428j182J43J432
2449I77j918J551n65r84J631j516J24J114j643J597m47j014J523j328R11J44j351
2466a194J478p30l08J503j986Q16O34j491J786q20j61Q05j110J098l78m31Q97
2483D08j353J007M67j314J893j201k22J544j866J210K07j760K262j142k86J136
$$ plain form
2499 990 -521 696 459 -513 1264 126 534 938 -405 491 24 -555 635 -547 357 480 -513 1133
2517 1133 -370 -368 1239 -910 250 203 -1032 779 -388 -584 405 -967 107 -310 -567 631 -966
2534 -966 -325 212 -1404 218 -505 -1375 560 -701 -171 418 -500 230 -501 -340 9 -966 246 -652
2552 -652 -648 726 -1192 155 709 -1048 1123 140 -938 843 -444 -223 711 -610 870 44 258
2569 258 1050 -569 1179 415 -313 1312 -361 -286 964 -624 333 574 88 1124 13 961 281 -622
2587 -622 1284 -589 -296 1148 -1203 375 776 -1052 826 261 -338 629 -489 83 -48 -671 -106
2604 -106 -1024 82 235 -865 1107 -198 -624 764 -1132 -359 159 -1405 131 -485 -664 250 -798
2621 -798 180 36 -153 815 -838 -443 236 -1200 161 -511 -720 582 -410 452 698 -333 614 -410
$$ packed form
2499I90j511J217k37r72J777j138M08M04j343Q96m67n79J190j182R04J23r93J646
2517A133j503KJ607k149J160m7j235J811j167j96R89j372J074m17k57J198j597
2534i66O41N37j616J622p23q70J935j261N30N89r18P30p31J61L49r75J212q98
2552f52MJ374j918J347N54j757K171r83j078J781j287K21R34j321J480q26K14
2569B58P92j619J748p64p28J625j673P5J250j588R57K41m86J036j111R48o80r03
2587f22J906j873K93J444k351J578M01j828J878n65n99R67j118N72j31o23N65
2604a06r18J106J53j100J972j305m26J388j896P73N18j564J536o16j79R14j048
2621g98R78j44j89R68j653L95O79j436J361o72k09J302r92Q62K46j031R47j024
$$ plain form
2639 -410 -247 772 -1053 274 568 -641 1078 66 -82 1126 90 479 515 -130 480 -677 412
2656 412 10 -408 1201 96 -134 1822 -655 459 1170 -1281 268 93 -677 246 -203 -85 -129 360
2674 360 289 -619 581 -92 -1239 691 -711 -1060 937 -1396 -595 1106 -963 369 38 -560 -576 -197
2692 -197 -34 -638 -291 53 -1296 -170 422 -1437 947 -85 -1394 649 -604 -780 291 -860 -29
2709 -29 -124 -319 301 -434 699 168 136 929 -622 287 337 -827 607 373 -496 1127 125 601 1043
2728 1043 -244 923 106 -364 777 -594 31 819 -250 807 198 -86 651 -213 294 -120 30 808
2746 808 -1092 -119 485 -1378 586 -48 -1039 1035 -209 -528 567 -1108 -857 -240 -273 -203 -355 752
2764 752 -528 -295 760 -1093 -174 702 -1489 -124 -242 -1319 323 -388 -773 193 -64 -510 142 492
$$ packed form
2639d10J63J019j825J327K94j209J719j012j48J208j036L89L6o45O10j157J089
2656D12m02m18J609j105k30J956k477J114P11k451J549j75p70R23m49J18m4M89
2674C60p1r08J200o73j147J930j402l49J997k333Q01J701k069J332l31n98j6L79
2692a97J63o04L47L44j349J126N92j859K384j032j309K043j253j76J071j151Q31
2709b9r5j95O20p35J133n31l2P93j551R09N0j164J434k34q69J623j002M76M42
2728A043j287J167q17m70J141j371O25P88j069J057o09k84P37q64N07m14J50P78
2746H08j900R73O04j863J964o34r91K074j244l19J095j675K51O17l3P0j52J107
2764G52j280K33J055j853R19Q76k191J365j18j077J642p11l85R66k57m46O52L50
$$ plain form
2782 492 232 -506 510 -639 -768 1108 -483 75 1238 -674 718 1231 -1043 680 401 -416 453
2799 453 -248 205 242 425 57 -95 1069 69 18 1067 -320 22 416 -1139 483 142 -924 1259
2817 1259 -96 -780 1130 -339 -455 -425 -467 -222 -552 -272 -108 -642 898 -325 -996 -544 -728 514
2835 514 -157 -581 395 -913 -1368 -613 -1000 -554 908 -878 288 218 -688 -142 -1594 -743 -1878 -214
2853 -214 82 -1052 1639 416 -735 856 -554 -415 637 -1115 -221 794 -939 -76 321 -210 543
2870 543 848 557 263 558 204 -646 400 -208 -1064 1366 -149 -131 1582 -265 534 769 -627 291
2888 291 125 -647 231 55 28 147 82 531 -331 410 267 -480 838 -338 -981 323 -1303 -343 482
2907 482 -954 556 332 -443 390 -626 -662 -385 -812 -304 -574 177 -216 -757 535 -773 -351 548 -1030
$$ packed form
2782D92k60p38J016j149j29J876j591N58J163j912J392N13k274J723k79q17Q69
2799D53p01M53L7J83l68j52J164j000n1J049j387L42L94j555J622l41j066K183
2817A259j355o84J910j469j16L0m2K45l30K80J64n34J540j223o71M52j84J242
2835E14o71m24R76j308m55P55l87M46J462j786J166p0r06N46j452Q51j135J664
2853b14K96j134K691j223j151J591j410J39J052j752Q94J015j733Q63L97n31P53
2870E43L05k91k94K95l54q50J046o08q56K430j515J8J713j847P99K35j396R18
2888B91j66p72Q78j76k7J19o5M49q62P41j43p47J318j176o43J304j626R60Q25
2907D82j436J510k24p75Q33j016l6K77m27N08k70P51l93n41J292j308M22Q99j578
$$ plain form
2926 -1030 63 246 -842 275 -188 -1099 246 -473 65 763 245 397 -108 -25 -537 -761 661 -446
2944 -446 64 1441 -662 629 899 -864 732 582 -434 1032 197 -86 636 -399 14 410 313 418
2962 418 298 975 215 -111 453 -811 -408 378 -764 954 266 -173 862 -410 -318 405 -889 50
2980 50 245 -678 97 -290 -421 -608 -473 144 -534 506 350 -847 508 -911 -1502 315 -856 -661
2998 -661 781 -535 143 436 -417 -49 -31 -302 -418 230 388 -823 625 32 -1146 934 206 -687
3016 -687 1624 -206 -444 1077 -795 -378 329 -493 143 541 586 519 609 636 -610 367 402 -966 769
3035 769 253 -282 1122 -170 -53 1000 -423 489 977 -121 383 -135 -221 -176 -511 -211 -83 379 619
3054 619 -146 352 -80 -851 -74 -992 -134 120 -672 465 -28 -658 170 -375 -746 269 -261 -99 -159 -246
$$ packed form
2926a030J093J83j088J117m63r11J345p19N38O98n18J52n05Q3n12k24J422j107
2944d46N10J377k103J291K70j763J596j50j016J466q35k83P22j035M13L96r7J05
2962D18j20O77p60l26N64j264M03P86j142J718o88m39J035j272R2P23j294R39
2980E0J95r23P75l87j31j87J35O17o78J040j56j197J355j419n91J817j171J95
2998f61J442j316O78K93q53L68J8k71j16O48J58j211J448n93j178K080p28q93
3016f87K311j830k38J521j872M17P07q22O36L98M5o7R0K7j246R77L5j368J735
3035G69n16n35J404j292J17J053j423R12M88j098N04n18q6M5l35L00J28M62K40
3054F19p65M98m32p71P77r18Q58K54p92J137m93o30Q28n45l71J015n30J62o0q7
$$ plain form
3074 -246 -471 -583 -48 -365 -13 1065 -155 362 594 -1233 358 -156 -1329 637 39 -340 875 356
3092 356 -50 692 150 -253 -85 482 3 92 988 -1035 355 781 -782 823 824 -342 1193 404 -653
3111 -653 227 -389 -563 193 192 601 550 903 200 -280 633 -727 -427 710 -726 315 648 -857 438
3130 438 -526 -717 578 17 209 127 -62 -421 -554 -568 -657 -708 193 46 40 465 -403 -79 -467 -1157 136
3151 136 -505 -248 625 -503 13 -169 -651 247 90 -105 651 84 85 -242 -327 -34 -778 397 14 133
3171 133 1244 254 215 819 -806 -249 631 -407 484 523 117 428 234 65 131 236 322 -222 631 3
3191 3 -617 525 -558 -323 1026 -203 137 1207 -370 152 211 -616 -257 -439 -320 -282 -126 235 -368
3210 -368 347 -368 -965 250 -478 -382 425 -511 -318 5 -853 -311 -198 -232 76 67 97 -23 -496 -512 -575 -452
$$ packed form
3074b46k25j12N35l17L52J078j220N17K32j827J591n14j173J966n98l79J215n19
3092C56m06P42n42m03J68N67m79Q9Q96k023J390M26j563J605Jj166J535p89j057
3111f53Q80o16j74P56jM09n1L53p03m80R13j360L00J137j436J041L33j505J295
3130D38r64j91J295n61J92q2j89l59j33j4q9n1R01j47oM25q68L24l88o90J293
3151A36o41K57Q73j128N16j82m82Q98j57j95P56n67Jl27q5K93p44J175l83J19
3171A33J111r90l9O04j625N57Q80j038Q91L9m06L11j94j69O6J05Q6n44Q53o28
3191Co20J142j083K35J349j229L40J070j577N22N9q27L59j82J19L8J56L61o03
3210c68P15p15n97J215p28R6Q07r36J93L23q58N42J13l4L08rL0j20m73j6o3J23
$$ plain form
3232 -452 -49 -127 435 188 16 659 -584 -292 192 -533 262 -102 -166 606 -363 26 23 -78 440 656 423
3253 423 618 142 82 -89 -75 241 -401 623 1023 217 1036 203 -401 518 -357 -519 555 -284 226 437
3273 437 -25 -227 80 3 -243 52 665 -544 -82 55 -1032 209 -354 -594 518 189 -11 236 -333
3292 -333 -433 -176 -613 -381 -216 182 -188 -255 368 -551 -130 -198 -574 80 195 -284 464 -221 -573 239 -784
3313 -784 -53 159 306 951 19 10 -125 -407 -76 -187 243 384 166 825 429 -7 645 -364 -101 558
3333 558 127 290 656 -9 402 -95 -136 511 72 483 300 69 436 -506 -50 -394 -727 383 3 51
3353 51 744 -366 120 -61 -713 191 -492 -225 45 8 311 -494 -515 -91 -556 165 140 -381 129 -447 -575
3374 -575 -251 -809 -476 51 -231 440 331 -161 247 -479 -125 -156 -304 80 -52 395 206 -128 242 -217
$$ packed form
3232d52M03p8N62k47j72O43j243K92M84p25P95l64o4P72r69L89lj01N18K16k33
3253D23J95m76o0j71J4L16o42J024M00q06Q19q33o04R19q75j62J074q39N10K11
3273D37m62k02L07p7k46K95O13j209M62J37j087J241n63k40J112l29k00K47n69
3292c33j00K57m37K32J65L98l70o7O23r19M21o8l76O54J15m79P48o85l52Q12j023
3313g84P31K12J47O45r32rj35k82L31j11M30J41k18O59l96m36O52j009K63O59
3333E58m31J63L66o65M11m97m1O47m39M11j83k31L67r42M56l44l33J110l80M8
3353E1O93j110M86j81o52R04o83K67K70l7L03q05k1M24m65P21k5n21N10n76j28
3374e75L24n58L33N27k82O71j09m92M08p26L54l1j48L84j32M47j89l34L70m59
$$ plain form
3394 -217 -155 609 -144 454 424 -329 633 -229 -261 781 -146 367 633 373 543 67 117 -189 -416 110 -84
3415 -84 357 611 -319 286 -87 -202 602 -70 -275 419 -255 368 255 -230 -92 -96 -188 28 5 626 215 -159
3437 -159 -613 -1334 -337 -153 -452 44 347 260 319 -647 -254 -5 135 -315 -715 -356 -438 -629 -158 -169 414
3458 414 -1014 -211 -704 -238 -1080 16 -14 492 193 648 -487 -385 -4 625 137 -347 740 -973 -90
3477 -90 -163 60 435 -338 408 377 -42 657 -289 301 539 -91 844 338 -321 290 -306 -688 439 153 506
3498 506 654 311 232 -36 -521 -393 -578 -434 93 -597 154 -223 87 -247 -447 74 -22 -170 133 -303 -17
3519 -17 -499 -563 -132 -121 115 80 -178 182 -453 -484 -157 -634 -329 208 -195 139 103 -235 41 -622 -139 -8
3541 -8 -244 266 102 42 354 -293 39 68 -54 399 194 436 542 172 79 -14 -71 292 106 438 565 105
$$ packed form
3394b17O2P64p53N98l0p53R62q62l2J042r27N13K66k60J70m76N0l06k27N26j94
3415h4M41K54r30O05l73j15Q04o72k05O94o74O23j13m85J38mr2K16k3O21m11l74
3437a59m54p21R97J84k99M96L03q7N9r66L93K49J40m50m00L59q2j91M71j1N83
3458D14j428Q03m93M66q42J096l0N06k99M55j135J02L81O29m88m84J087j713Q83
3477i0p3K23L75p73P46l1m19O99r46N90K38o30R35n06o59O11n96l82J127k86L53
3498E06J48l43p9k68m85J28j85J44N27o90P51l77L10l34k00N21r6j48L03m36K86
3519a7m82o4M31J1K36l5k58L60o35l1L27m77L05N37m03L34l6l38K76o63M83J31
3541hk36N10j64o0L12o47L32K9j22M53k05K42J06l70r3r3n7L63j86L32J27m60
$$ plain form
3563 105 386 46 -222 410 64 287 312 129 268 137 84 92 -145 151 63 108 183 -301 -150 49 -692 -56
3585 -56 -274 -526 553 -48 -32 201 -155 -399 -561 -388 -127 -283 -67 -64 -326 191 -422 -681 138 -484 90
3606 90 -76 -136 97 -258 -102 -256 -438 335 -85 333 301 -324 -149 -62 -332 84 -66 220 549 84 389
3627 389 184 76 70 -53 439 619 186 537 248 -36 353 -71 201 625 130 588 450 267 100 -96 170
3648 170 45 71 277 -299 169 431 -261 -172 -10 -481 -19 -31 6 53 -215 -180 -371 -320 -375 -303 -7 295 -318
3671 -318 84 -311 -717 152 -587 -37 -102 -121 73 -76 -352 -40 -515 113 155 -197 387 5 306 48 -483
3692 -483 150 -302 -356 309 125 -97 -27 113 444 -234 -8 111 -115 453 81 78 547 -59 190 269 -138 261
3714 261 214 369 569 -192 199 123 -66 427 177 184 356 107 92 -123 -340 189 -282 -78 61 14 250 -344
$$ packed form
3563A05K81l40k68O32l46K23K5j83J39j31n3Qk37K96q8M5P5m84J51J99p41O36
3585e6k18k52J079o01J6K33l56k44j62J73K61j56K16Lk62N17o13k59Q19o22N74
3606I0j66o0K33l55J56j54j82P73m20M18l2o25J75Q7k70M16j50K86L29m65L05
3627C89k05j08oj23M92J80m33L51k89k84L89m24K72M24m95M58j38j83j67j96K66
3648A70j25K6K06n76M68K62o92Q9J62m71M62j2L7M7k68L5j91N1n5P2K96L02o13
3671c18M02l95m06Q69p39N50o5j9J94j49k76L12m75O28M2l52N84l82L01k58n31
3692d83O33m52n4O65j84k22P0J40L31o78K26J19k26N68l72lM69o06K49P9m07L99
3714B61m7J55K00p61L91p6j89M93k50PJ72k49j5k15k17N29m71K04J39m7K36n94
$$ plain form
3736 -344 -39 -53 -273 67 -273 -378 248 -330 -117 -126 -282 -354 -268 -303 -1 -64 -158 -103 -270 110 -351 -431 140
3759 140 -4 174 293 -18 211 -94 -401 76 -341 242 161 18 428 -147 -225 -33 -452 181 345 21 320
3780 320 107 -51 -262 -15 364 -99 -51 759 81 239 207 -190 124 343 -123 362 66 408 298 -22 232
3801 232 -236 -77 -19 -214 159 -86 -122 177 -430 -239 -10 -236 87 -170 -217 -194 -132 105 -270 -302 98 -47
3823 -47 -155 -51 -798 -449 373 -726 -487 -364 -504 -154 -169 -52 -392 -225 2 -165 82 100 -60 119 201
3844 201 62 114 -183 -44 -6 3 461 5 55 193 -107 285 42 133 275 -39 53 512 -212 311 20 -191
3866 -191 261 -166 329 -9 202 445 -171 160 -34 -220 488 -8 192 297 -110 2 225 -304 -149 113
3886 113 -241 -118 -50 -136 -58 -127 -156 -277 -134 -170 -251 231 -143 -84 141 -342 -59 -120 -82 -50 -194 192 -196 -436
$$ packed form
3736c44L05j4k20L40l40j05O26n78K13rj56p2Q6l5L02o3r4N5j67L80m61q0N71
3759A40j44J78J19l11K29l05l07M77m17N83q1j43M10n75p8J92m19O33J64l24K99
3780C20k13j58k11K47L79m63M8Q10o78J58l2l97L14K19m66M85k96L42j10l20K54
3801B32m68J59N8j95L73k45l6K99o07J91K29k26L23k57m7K3O2K37l75l2M00j45
3823d7j08J04p47L49Q22j099K39J23j40L50j5J17l40J67K27j67K47J8j60J79Q2
3844B01j39N2k97J39L8RM58m56N0J38l00L92k43R1J42l14R2M59p24N23k91k11
3866a91M52m27M95l38K11K43o16L31j94j86P08m96K00J05m07J12K23n29J55K62
3886A13l54J23O8q6P8o9k9j21J43l6q1M82l74N9K25m83K83o1L8L2j44L86l88k40
$$ plain form
3910 -436 135 145 -106 123 -90 -113 -39 -249 -2 44 -97 213 83 -49 153 268 218 -68 -113 198 177 274 262
3933 262 58 417 27 31 229 -35 300 17 238 194 135 93 -25 254 338 248 -74 601 253 142 107 -99 -68
3956 -68 86 33 25 -164 3 -241 -164 232 -218 -138 31 -200 -115 191 -178 167 -399 -520 -179 -403 76 -237
3978 -237 -26 170 -118 -49 -60 -265 143 -130 164 175 -252 60 68 -99 -176 166 85 -58 165 151 57 54 27 -65
4002 -65 225 107 386 164 169 47 74 -344 370 48 142 74 349 335 381 -124 55 -148 -6 338 74 -38 161
4025 161 169 -37 -70 -76 113 270 174 -82 -348 -261 -87 367 64 -321 -5 36 -107 10 24 -189 -16 -277 -214
4048 -214 -205 -16 -130 -119 142 -62 24 -22 -292 -95 46 -422 -136 -61 -224 -68 -256 -66 112 134 113 307 135
4071 135 -154 59 -26 115 6 243 -154 52 81 -8 72 9 -145 152 135 201 231 263 120 192 98 127 267 185
$$ packed form
3910d36N71J0k51K29k13k3P4k10K47M6j41L10j30j32K02J15n0k86m5L11k1R7j2
3933B62k04L59l90MJ98k64L35k83K21m4n9m2j18K79Q4r0l22O75l48j11l5k06L1
3956f8J54n3qj89J67k44P7L96m50Q0J69k31Q5L06l69L45n66j21L41k24M79l13
3978b37K11J96k88O9j1k05M08k73K94J1m27L12Qj67p7L42q1j43K23j4r4lk7r2
4002f5K90j18K79k22Nj22K7m18P14l22R4o8K75j4M6n05J79k03J42L44k64j12J99
4025A61Qk06l3oJ89J57r6k56k66Q7J74M54l03l85L16M1j43J17J4k13J73k61O3
4048b14RJ89j14J1K61k04Q6m6k70J97J41m68K86P5j63J56j88J90J78K2k1J94j72
4071A35k89K13q5J41j09K37l97K06K9q9Q0o3j54K97j7O6L0L2j43P2r4K9J40q2
$$ plain form
4095 185 266 250 116 -195 109 207 -238 60 326 1 426 -40 -165 79 13 -133 -145 -180 -85 -187 -137 -177 -136
4118 -136 -91 -57 -265 7 -94 -195 -118 -132 130 -162 -239 -160 -279 117 55 -47 137 28 -20 47 -27 -29 47 40 -33
4143 -33 -82 -58 276 -448 115 125 -352 172 -73 -133 135 28 91 146 233 97 392 325 -82 80 -21 181 148
4166 148 199 64 158 171 71 409 60 154 216 -210 -69 87 -117 28 -66 33 -51 -5 -80 -371 -16 -21 35 -22 -152
4191 -152 164 150 -95 181 28 -157 -72 -111 -164 -77 -241 -192 -145 -294 -24 -78 -201 -9 -221 156 -239 -109 50
4214 50 -230 -223 9 -388 62 -155 -93 73 95 134 223 -57 190 439 67 108 -280 120 33 97 2 28 161 530
4238 530 -238 281 129 -153 230 25 18 199 123 112 272 64 -31 -256 117 79 132 17 -298 -42 41 -103 -49
4261 -49 -207 -134 -58 -132 -61 -15 -4 -248 22 -61 120 66 -136 137 99 163 -21 -142 149 -522 18 -279 -79 82
$$ packed form
4095A85Q1j6j34l11L04R8m45K98K66l25M25m66j25K44o6j46j2l5R5j02N0m0M1
4118a36M5L4k08K72j01j01P7j4K62k92p7P9j19L96o2j02J84j09m8O7p4kP6pp3
4143c3m9K4L34p24N63J0m77N24k45o0K68j07O3N5Q7j36K95o7m07J62j01K02l3
4166A48N1j35R4J3j00L38l49R4O2m26J41J56k04J45r4R9q4M6p5k91L55nN6n7j30
4191a52L16j4k45K76j53j85Q5l9n3Q7j64M9M7j49K70n4j23J92k12L77l95J30J59
4214E0k80PK32l97M50k17O2J66K2L9Q9k80K47K49l72M1l88M00q7O4r5K6J33L69
4238E30p68N19j52k82L83k05pJ81p6j1J60k08r5k25L73l8N3j15l15K56Q3j44N4
4261d9j58P3P6p4P1M6J1k44K70q3J81n4k02K73l8O4j84j21K91o71N40k97K00J61
$$ plain form
4285 82 -382 62 -68 16 -211 -155 -188 -17 90 82 -264 71 -119 -65 249 305 22 198 219 12 399 -10 -94
4308 -94 184 -124 182 248 -239 300 184 79 212 284 153 25 33 60 -169 195 -81 -52 201 -67 65 81 50
4331 50 183 -7 11 117 -127 -22 -310 -30 91 168 -163 -322 -115 157 4 -180 -137 -410 -175 39 -268
4352 -268 -51 -17 -297 -61 144 -68 -123 -449 -268 -225 -46 -134 -92 -79 -75 -5 36 -133 151 73 -6 102 184 15
4376 15 -89 200 265 325 360 164 221 -19 299 -107 408 -125 -108 442 -518 307 438 -79 267 639 376 905
4398 905 -342 -438 -52 353 -41 -242 -51 148 91 163 -307 -258 570 -284 56 -42 -111 -56 60 -198 235 36
4420 36 -320 -253 84 -251 14 -377 -357 23 -30 -61 108 6 -38 150 235 86 11 -23 -246 202 -233 -61 -90
4443 -90 -110 52 186 -8 22 11 -26 64 287 -137 66 139 -34 96 132 -30 -27 372 10 -12 276 9 13 43 40
$$ packed form
4285H2m64M44j30Q4k27N6l3J71J07ql46L35j90N4L14N6k83J76K1k07L87m09q4
4308i4K78l08L06O6m87N39j16j05J33P2j31j28QK7k29L64k76K9K53k68J32J6l1
4331E0J33j90J8J06k44J05k88K80J21P7l31j59K07K72j53j84M3k73K35K14l07
4352b68K17L4k80K36K05k12n5l26J81M3J79q8M2J3MP0M1j69K84p8p9J08Q2j69
4376A5j04K89O5O0L5j96N7k40L18m06N15n33J7N50r60Q25J31n17L46L72k63N29
4398I05j247r6L86M05l94k01J91J99n7P2m70M9Q28q54L40r8o9N5J16k58M33j99
4420C6l56O7L37l35K65l91K0L80n3l1J69j02m4J88Q5j49p5l4k23M48m35J72k9
4443i0k0J62J34j94L0j1l7R0K23m24K03P3j73J30L6j62LL99l62k2K88k67ML0l
$$ plain form
4468 40 12 235 -194 135 48 111 51 106 -193 -131 72 -116 -132 222 -109 -277 208 -145 -11 197 33 -136 106
4491 106 -15 -177 25 -299 -204 82 -483 143 -80 -57 -240 102 -462 -282 -1 -190 -81 177 -246 163 -33
4512 -33 -188 173 8 -71 129 -44 -336 188 -226 -13 -318 136 -103 406 55 -162 149 323 -156 143 132
4533 132 -190 248 -152 -88 210 66 -97 -176 278 108 65 137 32 33 -103 -63 110 101 -54 345 -149 30 4
4556 4 -29 -63 74 -44 -170 39 207 -125 -108 -18 -185 -279 83 -334 -267 -122 -289 -16 185 -29 63 -109 -365
4579 -365 309 -11 91 52 108 -279 -177 165 -132 13 -48 79 217 7 -307 48 63 -305 40 68 37 201
4601 201 18 -1 177 -89 196 4 -15 -134 105 154 -249 11 -75 161 347 166 -92 270 -168 -258 215 0
4623 0 63 481 254 128 76 -21 -68 114 79 -41 9 83 13 53 -151 -341 127 -189 24 118 -157 -21 -15 -80 -182
$$ packed form
4468D0k8K23m29L29q7O3o0N5k99O2K03j88j6L54l31j68M85l53J34K08j64j69K42
4491A06j21j62K02l24R5K86n65O26k23K3j83L42n64J80K81j89J09K58m23M09j96
4512c3j55L61j65p9K00j73k92N24m14K13l05M54k39N09l51k17L11J74m79K99j1
4533A32l22M38m00O4K98j44j63p9M54j70m3P2j05Jj36M0J73rj55L99m94J79k6
4556Dl3l4J37j18j26K09J68l32J7R0j67r4L62m17O7J45j67K73K01k14R2j72k56
4579c65O74l20J02l9N6l87J02L42k97J45o1J27J38k10l14L55J5l68L45K8l1J64
4601B01j83j9J78k66K85j92j9j19K39M9m03K60q6K36J86j81k58L62m38r0M73k15
4623@O3M18k27j26n2r7m7J82l5j20N0P4p0M0k04j90M68l16K13R4k75J36Oo5j02
$$ plain form
4648 -182 -68 -202 -115 -162 -23 -42 -170 -279 -253 216 -205 -335 131 -199 -165 100 -139 -43 70 -424 73 83
4670 83 -162 98 16 -123 30 -43 -47 28 -204 -4 93 62 136 275 -66 -71 87 134 -196 18 194 50 124 116 159
4695 159 -49 5 15 152 115 -121 -123 -109 -159 138 47 -39 229 230 -300 344 -44 -148 -330 -280 -383 15 399 -79
4719 -79 -12 -352 -700 -23 -245 -738 411 -14 -235 106 37 581 -32 46 -521 181 -438 -115 -406 -625 -754
4740 -754 -161 110 -253 207 -600 -210 216 110 -347 257 -233 -159 -598 -41 -126 -108 -292 48 -295 37 584
4761 584 84 -258 679 272 295 -296 -514 867 -66 297 114 130 -395 853 171 541 -83 119 460 557
4781 557 -10 239 -347 43 -214 -219 347 -157 497 -199 -73 -398 -378 -192 -289 -58 -284 -153 -314 84 -223
4802 -223 -240 -125 -627 -170 327 -410 176 -365 -357 -134 44 -41 63 198 16 -25 147 -75 146 261 -83 -35
$$ packed form
4648a82J14j34Q7m7J39j9j28j09K6M69m21j30M66l30L4K65k39R6J13m94M97J0
4670H3k45K60q2j39J53p3mP5k32K00R7l1P4J39l41nJ58M7l30K14J76j44P4qM3
4695A59k08N4J0J37l7k36kJ4n0K97r1q6K68Jn30O44l88j04j82N0j03L98L84m78
4719g9O7l40l48O77k22m93J149m25k21L41o9N44o13P8n67P02o19L23k91k19j29
4740g54N93K71l63M60q07L90M26j06m57O04m90P4m39N57q5J8j84L40l43L32N47
4761E84n00l42R37m07K3n91k18J381r33L63j83J6n25J248o82L70o24K02L41R7
4781E57n67K49n86L90k57nN66n04O54o96J26l25K0J86r7K31k26J31j61L98l07
4802b23j7J15n02M57M97p37N86n41QK23J78q5J04J35j82m1J72k22K21J15l44M8
$$ plain form
4824 -35 92 -95 -147 95 131 -67 -215 -262 138 474 305 268 -123 -148 37 323 -202 180 226 -96 85 167 -128
4847 -128 79 -144 -178 203 -29 -158 195 -6 -135 66 -36 -62 31 -112 -161 127 157 -20 44 30 -63 -96 42
4870 42 -118 -23 52 -102 -50 110 -21 78 -33 -257 146 -59 -153 161 -351 -98 27 -324 -15 348 -151 -309
4892 -309 104 -99 105 295 13 0 325 119 -30 276 234 382 227 362 -194 356 325 -516 14 -250 -458
4913 -458 229 -216 -50 598 204 -184 279 -242 -306 643 -398 -571 327 464 271 -23 -325 139 -116 -83
4933 -83 -78 483 180 -367 326 -268 -662 307 -187 189 418 -19 -326 -137 -379 133 566 -274 -55 10 4 -35
4955 -35 -184 -278 -94 -19 -284 33 138 -394 -65 -44 -214 -77 110 -152 7 124 78 -96 -115 16 -478 268
4977 268 -82 47 42 -181 46 84 74 -308 36 -140 55 -52 251 89 110 -17 8 219 14 126 323 110
$$ packed form
4824c5J27j87n2K42L6j98j48m7M00L36j69l7l91k5J85K86n25L82M6l22J81Q2k95
4847a28K07k23l4L81k32j29L53k01j29K01j02k6R3j43m9K88L0j77O4j4r3l3J38
4870D2j60R5P5j54N2J60j31R9j11k24M03k05r4L14n12K53J25l51L09L63m99j58
4892c09M13k03K04J90k82j3L25k06j49L06m2J48j55J35n56N50l1q41N30k64k08
4913d58O87m45J66O48l94l88M63n21o4R49j041j73Q98J37j93k94l02M64k55L3
4933h3NN61l03n47O93n94l94R69m94L76K29m37l07J89k42N12M33q40K19O5ol9
4955c5j49r4J84P5k65L17J05n32L29K1j70J37J87k62J59J17m6j74j9J31m94P46
4977B68l50J29nk23K27L8j0l82L44j76J95j07L03j62K1j27K5K11k05J12J97k13
$$ plain form
4999 110 123 296 -210 -95 59 -70 43 203 42 146 56 1 48 -26 -17 -104 173 -231 87 24 -142 25 217
5022 217 -100 -272 144 -308 56 -93 -21 -238 -359 -253 2 69 -130 48 -103 -181 -106 -98 -391 412 0 -36
5044 -36 -194 59 -178 -342 -108 -81 189 -58 84 210 103 -289 29 43 -209 298 283 157 194 -30 3 31
5066 31 -66 82 231 183 120 116 45 42 23 120 -29 36 -102 59 74 227 14 -11 -240 78 75 -40 -6 -99 -140 -48 -103
5093 -103 -279 -21 193 25 196 194 -169 -54 -173 -239 -243 157 -114 50 71 -165 200 -303 -48 -3 37 168 247
5116 247 239 -79 36 183 147 -87 129 3 133 191 -139 -17 -134 -181 -66 74 -243 59 -12 -85 424 95
5138 95 151 328 -43 60 194 -76 102 126 108 144 59 -157 19 210 97 17 11 102 -111 244 -148 69 42 -7
5162 -7 -87 -123 -21 -337 125 13 233 54 27 -253 -183 37 67 44 110 -36 74 -8 30 -291 -34 -242 -37 139
$$ packed form
4999A10J3J73n06J15J54j29J13J60j61J04r0n5M7p4Rq7K77m04L18o3j66J67J92
5022B17l17j72M16m52L64j49P2k17j21J06K55O7j99J78j51p8P5Qk93Q03m12l6
5044c6j58K53k37j64K34K7K70k47J42J26j07l92L18J4k52N07j5j26L7k24L3K8
5066C1r7J48J49m8o3mp1lj9R7j49O5j38J61J5J53k13k5k29L18lj15L4r3m1R2n5
5093a03j76K58K14j68J71kl63J15j19o6mM00k71J64K1k36L65n03K55M5M0J31P9
5116B47ql18J15J47l6k34K16j26J30N8l30J22j17m7J15J40l17L02p1p3N09l29
5138I5N6J77l71J03J34k70J78K4j8L6q5k16J76J91j13q0oR1k13L55l92K17k7m9
5162gq0l6J02l16M62j12K20j79k7k80P0K20L0k3O6j46J10q2L8l21K57k08K05J76
$$ plain form
5186 139 -139 66 -202 -60 -64 5 -124 131 -126 -172 -49 -20 -95 145 34 87 37 -70 -174 12 42 111 394
5209 394 63 119 -43 26 116 4 125 -73 91 -86 -80 5 85 222 53 -137 22 64 25 -117 -67 289 -84
5232 -84 259 36 -120 -52 17 -109 -22 218 -158 328 -337 83 -95 -208 -26 -88 -106 -97 226 -144 -123 40 -387
5255 -387 -298 133 -323 -27 -118 97 -20 255 131 -121 190 -88 -269 96 112 -126 180 -129 16 -3 -181
5276 -181 -20 93 204 130 102 -69 120 114 120 50 215 -50 133 35 62 -35 -145 -73 101 241 124 103 155 -162
5300 -162 -44 -6 159 15 -49 286 -149 20 -69 38 -7 -95 -95 34 142 195 180 115 161 -60 -186 -74 -143 -235
5324 -235 -278 56 -139 -37 -173 -72 -145 -17 -129 194 -169 -13 -129 -46 -23 176 -82 58 -53 -170 -213 -261
5346 -261 -12 177 19 -204 125 158 -89 -121 -122 13 -139 318 407 56 40 80 24 156 243 -363 11 -21 142
$$ packed form
5186A39k78K05k68J42mO9j29K55k57m6J23K9p5K40j11N3n0j07j04J86L0O9K83
5209C94l31N6j62O9R0j12J21j98J64j77OQ5Q0J37j69j90J59M2l9j42N0L56l73
5232h4L43k23j56O8O9j26Q7K40l76M86o65M20j78j13J82o2j8RL23l70K1J63m27
5255c87Q9M31m56K96r1K15j17K75j24k52L11k78j81L65J6k38L06l09J45j9j78
5276a81J61J13J11p4k8j71J89oOp0J65k65J83r8K7r7j10P2J74J40j17k1N2l17
5300a62J18L8J65j44o4L35m35J69q9J07m5q8%J29J08N3j5o5M6k21j26J12o9r2
5324b35m3L34j95J02j36J01p3J28j12L23l63J56j16Q3K3J99k58J40j11j17m3m8
5346b61K49J89j58k23L29L3k47l2jJ35j52M57Q9l51j6M0n6J32Q7o06L74l2J63
$$ plain form
5369 142 138 -99 8 -4 -41 -5 -85 -7 -13 -49 168 43 -45 -95 -113 -22 84 -38 109 128 -38 120 28 112 58 48
5395 48 -151 93 -164 10 -156 -251 -242 -54 -263 -20 -197 -89 76 -55 94 -138 47 81 -85 -188 173 -24
5417 -24 175 -64 -112 -69 -10 80 47 -245 -24 295 -251 -95 167 -302 189 33 293 94 258 -47 7 70 157
5440 157 71 -91 24 49 70 87 236 -23 89 43 -87 38 -135 112 104 -151 -188 -97 66 -59 -1 -38 -58 -175
5464 -175 159 -145 -86 -4 111 -227 83 187 -208 -153 25 13 -8 63 -132 184 73 -52 -95 -14 -110 32 84
5487 84 179 -90 -231 -287 -139 241 57 65 395 -163 162 143 -137 -234 -61 119 -30 -269 -174 84 87 17 -32 98
5511 98 1 -25 207 64 74 -10 192 -17 76 -24 37 359 -42 259 165 78 204 65 221 482 18 -12 303
5534 303 -38 -40 -35 112 355 421 -255 22 -32 -99 -98 -182 -177 -155 39 -127 -134 -38 -125 39 -157 -301 166 -240 -150 2
$$ packed form
5369A42mk37J07j2l7L6q0P8ol6K17j25q8n0j8R1J06j22J47J9j66J58r2Q4n4j0
5395D8j99K44k57J74j66r5RJ88k09K43j77J08J65j31J49k32J85L4j66j03L61j97
5417b4J99k39m8M3N9R0l3k92K21L19n46J56K62m69M91j56K60j99J64l05N4O3Q7
5440A57q6j62J15K5K1J7J49k59J12m6j30J25j73K47qk55l7R1J63j25N8l7k0j17
5464a75L34l04N9Q2J15l38L10J04l95N5J78j2k1P1j95L16j11j25m3Q1r6J42N2
5487H4R5k69j41n6J48L80j84QL30n58L25j9k80r7J73J80j49k39R5K58Lp0m9J30
5511I8r7k6K32j43J0q4K02k09R3j00O1L22m01L01r4q7J26j39J56K61m64l0L15
5534C03l41kNJ47K43O6o76K77n4o7Jq4NK2J94j66pR6q7J64j96j44M67m06R0J52
$$ plain form
5560 2 17 -28 -32 16 -107 31 -155 -13 216 15 168 58 29 -49 -203 -140 141 242 -34 9 -126 -136 -58 173
5584 173 202 0 78 200 -21 111 -4 146 63 -51 7 -159 41 329 194 75 90 -56 -62 48 156 -46
5606 -46 -84 -59 -102 -185 -120 -140 11 103 -176 -234 100 18 -61 -26 -238 -36 -267 -339 -406 -202 -88 -193 77 -115 -165
5631 -165 17 -9 172 -198 -295 73 -332 113 133 -59 -121 150 -73 -118 -3 292 336 -189 -55 -100 -114 242 127
5654 127 -44 -300 -241 94 -74 39 -69 -118 114 140 15 127 -55 207 342 47 46 73 -95 202 91 -195
5676 -195 32 3 -63 64 126 -10 242 284 115 101 190 71 -224 -97 -226 -7 125 -25 -42 -78 -53 -133 -70 180
5700 180 -144 -4 113 -74 -19 -8 -144 -259 139 -309 87 104 -54 241 -193 -189 -319 -356 66 -283 -99 -175
5722 -175 22 -16 -138 -48 -25 89 39 172 -45 148 120 96 176 -132 18 -25 60 305 -111 -28 -27 139 -71 80
$$ packed form
5560BJ5m5mM8j23J38j86J42K29k01J53j10k9p8j54O3K81J01k76M3j35j0P8K31
5584A73K9k02P8J22k21J32j15J50q3j14N8j66K00K88j35j19J5j46oJ10J08k02
5606d6l8K5m3q3O5k0J51R2k79n8L34q2p9L5k12K02k31p2o7K04J14j05K70j92n0
5631a65J82k6J81l70r7L68m05M45K0j92o2K71k23m5J15K95M4n25J34m5j4L56j15
5654A27j71k56N9L35j68J13j08m9K32K6j25J12j82K62J35k95jK7j68K97j11k86
5676a95K27k9o6J27O2j36K52M2j69j4Q9j19k95J27j29K19J32j50j7l6K5q0O3K50
5700A80l24J40J17j87N5J1j36j15L98m48L96J7j58K95m34Mj30l7M22l49J84p6
5722a75J97l8j22R0K3J14n0J33k17J93k8k4Q0l08J50m3Q5K45m16Q3JJ66k10J51
$$ plain form
5746 80 250 94 -45 64 -48 60 248 116 119 196 21 -44 56 6 70 74 -144 -196 110 -53 77 25 184 -108
5770 -108 10 -68 81 -95 -139 -30 -123 61 13 -6 -60 85 -162 66 -212 -90 81 -210 -50 157 21 198
5792 198 -109 -55 -78 -44 -42 63 47 -118 25 -127 95 -167 95 117 107 46 -39 -51 -74 91 -161 -70 154 -158
5816 -158 -303 108 196 163 190 18 15 -164 226 125 -52 -229 -7 26 256 -48 120 66 45 151 -181 55 -35
5839 -35 95 -46 -73 180 147 23 -33 6 20 -64 183 3 -99 -62 -236 -27 79 -42 -72 -68 -207 93 11 -324
5863 -324 -190 -1 -241 46 -162 -47 -208 -15 -87 43 84 59 140 110 57 148 56 26 129 -415 -168 193 -60
5886 -60 -276 -100 213 177 71 178 94 -92 100 -139 71 95 216 -25 -91 4 -11 39 25 185 -74 214 -74
5909 -74 -66 21 -90 0 185 -67 231 18 70 77 64 -149 -175 9 -433 46 25 91 -71 -40 -384 -238 -103 -310
$$ packed form
5746H0J70j56j39J09j12J08J88j32LP7j75o5J00n0O4Mk18n2L06j63J30n2J59k92
5770a08J18p8J49j76m4J09r3J84m8j9n4J45k47K28k78J22J71k91J60K07j36J77
5792A98l07N4k3L4KJ05j6j65J43j52K22k62K62K2j0o1q5j2k3J65k52R1K24l12
5816a58j45M11Q8l3K7j72lj79L90j01j77j77K22L3K30l04J68n4k1J06l32K36r0
5839c5J30j41k7K53l3j24n6L9J4q4K47j80j02L7j74K09J06j21l0Mj39L00q2l35
5863c24J34J89k40K87k08J15j61J93p2J30M1k5Q1l0n3R1r2l0J03n44K47L61k53
5886f0k16J76L13l6j06J07q4j86J92k39K10K4J21k41o6R5j5N0j4J60k59K88k88
5909g4QQ7j11R0J85k52K98k13N2Pj3k13k6J84m42M79k1O6j62L1l44J46J35k07
$$ plain form
5933 -310 -66 -108 -225 -195 190 -198 -164 129 84 102 -15 -211 -24 -243 15 117 -3 -46 50 147 -219 -3 -182
5956 -182 332 -34 91 101 -226 13 92 324 58 -92 -210 -201 -107 -83 302 -109 91 180 6 -37 291 95 88
5979 88 -8 181 109 -84 22 -91 285 44 37 71 -172 82 -251 -242 -136 9 88 -12 -190 50 -195 -221 -12
6002 -12 -178 -113 3 -134 74 23 -68 -61 -64 -50 34 17 -186 -264 -73 -165 -105 103 -126 91 -29 153 -114 101 -96
6027 -96 -152 -174 4 254 45 159 193 16 -122 34 126 231 139 208 8 -200 14 -136 -74 17 69 3 326 127
6051 127 -66 194 298 176 6 4 -95 129 18 231 186 109 -2 103 21 -117 221 -149 208 28 -172 -175 -27
6074 -27 65 -158 -77 -63 119 -88 -39 -127 -36 -489 -122 -210 52 257 96 -57 -127 -25 167 117 117 -130 330 -78
6098 -78 78 99 -141 101 -127 57 46 -240 -182 -31 -69 291 61 15 -26 -70 310 233 -226 167 -14 12 -90
$$ packed form
5933c10K44m2j17L0L85l88L4K93m5J8j17j96J87k19K58J02j20m3R6R7l66K16j79
5956a82N14l66J25J0l27K39P9K32k66j50j18RR4K4L85m11K00Q9j74m3L28j96p
5979H8r6J89p2j93J06j13L76k41pL4k43K54l33RJ06J45P9j00j78K40k45k6K09
6002a2j66O5J16j37K08n1r1PlJ4Q4j7k03p8J91r2O0K08k29K17j20J82k67K15j97
6027i6n6k2J78K50k09J14L4j77j38J56R2J05r2O9k00k08K14j50O2R1N2o6L23j99
6051A27j93K60J04j22j70kr9K24j11K13m5p7j11J05q2j38L38l70L57j80k00lJ48
6074b7R2k23Q1J4J82k07M9q8R1m53L67q8K62K05j61j53p0J02J92n0%k47M60m08
6098g8J56K1k40K42k28J84j1k86N8J51l8L60k30m6m1m4L80p7m59L93j81K6j02
$$ plain form
6121 -90 -17 -81 -150 177 117 179 -135 294 -134 -117 -96 -287 -51 224 455 39 -24 270 1 168 396 -146 186
6144 186 -300 388 -685 -700 -453 352 -272 -99 72 -269 109 166 -247 62 248 -244 -526 -89 96 -530
6164 -530 20 295 -497 70 -66 -427 -258 -238 -233 164 226 128 117 53 -259 -64 -57 62 193 113 -200 89 78 -3
6188 -3 -66 107 -5 23 47 325 293 5 -134 142 87 283 29 -172 81 185 -133 111 4 -3 25 222 36
6211 36 1 151 51 5 -2 200 -165 85 -25 51 -88 44 32 40 -45 -48 -204 44 -156 -315 -76 112 -43 -170
6235 -170 143 -151 4 -12 9 83 -11 -296 -134 -85 -71 98 242 -14 -16 208 63 -133 -317 48 -72 -104 148
6258 148 -56 -17 -19 92 -34 -171 -127 -185 -45 -21 151 138 -41 137 299 84 164 54 116 -56 63 175 96
6281 96 -69 22 132 49 141 -120 70 68 94 -182 4 -39 29 -67 -129 23 -202 52 -6 -107 1 -169 -463 194
$$ packed form
6121i0P3o4o9L27o0O2l14M29m28J7K1j91K36K75K31m16o3K94k69J67K28n42L32
6144A86m86O88j073j5K47Q05o24J73J71l41L78N7m13L09J86m92k82M37J85o26
6164e30N50K75p92N67j36l61J69K0NL97O2r8j1o4l12J95PJ19J31q0l13K89j1q1
6188co3J73j12K8K4K78l2k88j39K76n5J96k54k01K53J04l18K44j07pK8J97j86
6211C6l5J50j00m6pK02l65K50j10P6j39J32j2Qq5lj56K48k00j59K39J88j55j27
6235a70L13k94J55j6K1P4r4k85J62M9J4J69J44k56kK24j45j96j84L65j20l2K52
6258A48k04L9kJ11j26j37M4n8J40K4J72j3j79J78J62k15Q0j10O2j72J19J12p9
6281I6j65R1J10q3R2k61J90kK6k76J86m3O8r6o2J52k25K54n8j01J08j70k94O57
$$ plain form
6305 194 -172 -20 -154 -91 -167 -74 -406 -156 -1 -238 135 -124 -49 333 43 -273 69 21 -234 -155 -6 -132
6327 -132 -20 -20 -304 46 -79 -80 -45 72 -7 16 -56 -151 -15 18 15 209 165 103 -5 -246 128 -199 181 0 102
6352 102 -15 -138 118 11 28 28 166 167 -142 90 43 173 179 -86 156 -35 -203 -30 -2 -69 1 2 -153 100
6376 100 76 -182 181 -200 -139 148 -106 53 -28 -189 -167 -67 -172 18 40 -284 -59 8 -2 30 163 5 -130
6399 -130 -55 -66 -107 185 382 -143 -248 -60 62 103 41 -107 32 -96 89 339 -179 -113 -44 -261 69 40 -129
6422 -129 183 378 -72 13 17 121 87 -19 -45 82 108 -243 119 -97 98 -64 118 -90 11 12 91 208 -31
6445 -31 -138 -55 -92 -69 -82 33 -127 137 176 -77 105 -41 -230 -130 -135 -85 13 86 -99 -94 -21 -237 -77 -58 242
6470 242 -90 130 4 16 204 -65 -131 189 125 -76 81 -139 74 -100 100 -32 89 -93 -88 -93 26 86 42
$$ packed form
6305A94l66J52j34O3p6R3l32K50J55k37L73k59P5L82k90l16L42m8k55P9J49j26
6327a32J12%k84L50j25jL5J17p9K3p2r5J36L3lJ94m4o2j08k41L74l27L80j81J02
6352A02j17j23K56j07J7%J38Jl09K32m7J30Ok65K42j91j68J73K8o7P0Jj55K53
6376A00k4k58L63l81O1K87k54J59q1j61K2J00j05J90K2l24K25O7j0L2J33j58j35
6399a30P5j1m1K92J97n25j05J88J22M1o2j48J39j28J85K50n18O6O9k17L30k9j69
6422a29L12J95m50Q5MJ04l4j06k6J27K6l51L62k16J95j62J82k08J01JP9J17k39
6445c1j07Q3l7K3j3J15j60K64L9k53J82j46j89J00nN0R8P3j85NP3k16J60J9L00
6470B42l32K20j26J2J88k69o6L20o4k01J57k20K13j74K00j32J21j82NnJ19O0m4
$$ plain form
6493 42 111 156 204 -89 49 -132 -57 290 237 120 124 -5 240 280 250 217 31 -149 -179 182 -103 -54 135 -113
6517 -113 -102 308 -37 52 -84 54 205 11 245 -132 -166 -138 -51 -49 -83 96 -148 185 250 80 273 -148 -16
6540 -16 27 41 -20 51 -36 -230 19 164 143 -44 -115 -220 -239 57 9 4 -65 167 157 -15 94 -69 -108 136 167
6565 167 7 126 -169 152 222 28 -17 107 261 208 -172 260 -61 128 181 -47 -173 -211 -119 207 112 201 19
6588 19 8 -318 -256 -61 -28 11 31 -7 -101 88 4 -42 -115 -131 -25 -72 9 -2 -139 -180 -37 -154 -258 -167 -252 -129
6614 -129 106 -115 132 63 -104 28 -175 -128 -119 -135 79 -46 29 64 -66 57 60 34 -62 146 192 128 238 -12
6638 -12 18 310 -76 79 -73 -237 91 -205 32 25 93 130 -156 36 111 139 -161 108 -28 30 11 -127 220
6661 220 26 99 -136 88 -91 -30 213 67 -196 111 155 -180 -163 -129 65 51 -333 -12 42 43 -160 -21 58
$$ packed form
6493D2O9M5M8k93J38j81P5L47n3j17Mj29K45M0l0l3j86j80l0L61k85M9J89k48
6517a13J1M10l45Q9j36J38J51j94K34l77l4K8Q7Kl4J79k44L33O5j70J93m21J32
6540a6M3J4o1P1q7j94K49J45k1j87p1j05j9K96m8no9K32j0j72J09j63l9K44L1
6565A67j60J19k95L21P0j94m5J24J54n3l80M32l21J89N3k28j26l8R2L26r5Q9j82
6588A9j1l26O2J95L3L9K0l8r4J89q4m6p3j6J06m7Q1j1j37m1J43j17j04R1q5J23
6614a29K35k21K47o9j67J32k03M7Rj6K14j25P5L5j30J23Lk6r6K08M6o4J10k50
6638a2L0K92l86J55j52j64L28k96K37pO8L7k86J92P5K8l00K69j36N8j9j38L47
6661B20j94P3k35K24j79O1K43j46k63L07M4l35J7L4J94j4l84L21N4Jk03J39P9
$$ plain form
6684 58 -175 -119 -33 -359 -92 221 225 -89 -285 -222 -139 40 17 238 -75 14 -201 -52 -104 198 73 106 38 68
6708 68 -27 185 -30 57 47 144 -75 246 -28 -29 166 -63 -92 150 -39 52 133 -67 38 160 -59 11 168 140
6732 140 61 113 100 -175 119 -220 22 -107 -11 -72 85 193 -208 24 117 113 60 -25 148 316 49 64 -82 82
6756 82 108 48 22 238 45 27 -3 166 38 51 162 -159 -50 -67 148 -41 -310 -142 -120 -136 -51 -4 -23 7 -55
6781 -55 29 -153 -11 -68 225 7 110 191 5 52 -107 -17 116 -82 -186 103 102 220 -40 -291 -127 21 93
6804 93 91 27 242 -6 -240 43 4 138 -89 293 -38 411 100 -81 -16 81 124 129 -169 8 124 -122 -94 -148
6828 -148 -190 -225 72 50 -117 -176 -76 -31 92 -24 59 122 99 -84 38 -36 -84 76 -38 121 -40 -353 151
6851 151 -232 0 37 20 61 -110 -2 -50 -179 130 15 174 9 14 121 100 39 -81 182 163 77 -15 32 73
$$ packed form
6684E8k33N6Q6l26K67L13Ml14j96O3Q3J79k3K21l13Q9k15J49n2L02j25L3o8L0
6708F8r5K12k15Q7j0R7k19L21k74jJ95k29k9K42j89R1Q1k00J05J22k19P0J57k8
6732A40p9N2j3k75K94l39K42j29R6o1J57J08m01K32R3mn3q5J73J68k67J5j46J64
6756H2K6o0k6K16j93j8l0J69j28J3J11l21J09j7K15j89k69J68K2j6Q5M7j9L0o2
6781e5Q4j82J42n7K93k18J03Q1j86M7j59R0J33j98j04K89jJ18k60k51J64J48P2
6804I3ko4K15k48k34K83l9J34k27L82l31M49l11j81O5R7M3Nk98J77J16k46K8n4
6828a48m2l5K97k2j67n9J00M5J23j16Q3O3k3j83J22p4m8J60j14J59j61l13N04
6851A51l83K32L7j7M1j71J08m8j29L09j15J59j65NJ07k1o1j20K63j9q6r2M7M1
$$ plain form
6875 73 -41 220 85 97 -187 17 171 -90 -28 -9 68 -21 -45 -54 67 -45 266 38 150 60 28 -100 78 -356
6899 -356 -112 -330 -174 191 86 27 -113 192 -157 98 -216 231 -87 64 -127 -102 -50 206 24 -39 -233
6920 -233 -17 -241 -109 58 95 -237 -35 -336 -53 -132 -16 22 -253 161 -56 -3 -163 35 63 139 14 -14
6942 -14 16 -29 -310 193 -86 -14 -212 75 333 53 -39 21 183 -177 -80 -36 -11 127 131 170 -61 125 -73 -191
6966 -191 -204 -202 -131 -150 180 48 -195 170 -2 -23 134 123 77 35 57 -148 -257 -131 -46 -38 79 6 -149 -23 -93
6991 -93 -146 -182 122 -92 -176 -84 -146 -173 -55 33 -11 207 134 -156 64 -196 -188 53 -243 -62 -119 148 125 9 154
7016 154 -93 92 -65 -158 20 128 -87 223 -165 -51 -56 -128 -34 118 168 40 21 213 166 2 3 80 -4 170
7040 170 -56 125 -79 -70 -98 -187 44 -49 146 33 -91 -65 80 11 -12 8 -13 -191 211 133 -144 -120 148 -57
$$ packed form
6875G3j14K61j35J2k84K04J54k61O2J9P7q9k4rJ21j12L11k28J12r0l2j28J78m34
6899c56K44k18J56L65j05n9j40L05l49K55l14M47l18J51j91K5N2K56j82o3j94
6920b33K16k24J32J67L7l32K02l01K83p9J16L8k75M14k17N3j60J98K8P6j25k8
6942a4L0m5k81N03k79P2j98K87K58k80r2O0J62l60R7M4K5J38ML9k31J86j98j18
6966a91j3KP1j9L30j32k43L65j72k1J57j1m6m2K2k05j09J26Q5QJ17p3j55J26p0
6991i3n3l6L04k14q4R2o2k7J18Q8m4K18p3k90K20k60QK41k96J81n7K67k3j16J45
7016A54k47J85j57r3J78J08k15L10l88J14np2R4J52N0j28j9J92m7j64JP7q4J74
7040A70k26J81k04Rk8q9K31r3J95j13j24K6J45o9k3K0k1j78M02p8k77K4K68k05
$$ plain form
7064 -57 -48 48 93 -295 26 -143 91 -137 -192 -82 -42 -105 -30 104 211 -6 121 -55 -34 380 -275 -41 162
7087 162 238 -136 64 -43 109 -286 -31 414 450 177 -89 -473 227 -370 231 -193 92 -426 -142 -25 -23
7108 -23 143 -44 154 -130 38 86 103 -30 210 -127 277 235 141 225 144 -289 -30 -150 57 15 195 -247 -38
7131 -38 276 -13 -218 44 13 -48 -12 -244 117 -26 118 538 -311 -403 89 -348 -36 -273 51 -328 -292 15
7153 15 -205 138 256 -557 -140 -337 -447 -453 -311 484 282 89 -59 97 -191 480 -5 -5 41 -585 -46 103
7175 103 734 701 -102 406 176 472 394 280 -250 -522 10 723 514 42 -704 33 -149 353 212 -693 -124
7196 -124 174 128 -208 498 -146 22 590 -76 433 -336 -368 151 -33 -814 436 -534 200 162 -909 -136
7216 -136 66 -130 484 345 -92 68 -30 386 87 308 -128 50 172 -53 -59 -87 -217 11 173 -24 -6 144
$$ packed form
7064e7RR6M5l88L21j69K34k28n5J10M0o3P5J34J07k17J27j76K1M14o55K34K03
7087A62P6l74K00j07J52l95K55M45L6k73k66l84P00n97O01m24K85n18K84J17K
7108b3J66j87J98k84J68M8J7j33K40l37M04m2r4Q4q1m33K59j20K07m2J80m42K09
7131c8L14k89k05K62l1o1L6k32L61j43J44M20q49r2M92m37L12k37L24l79L6L07
7153A5k20L43J18q13M17j97j10oJ42P95k02j93j48J56k88O71m85%M6o26N39J49
7175A03O31l3q03N08k30K96p8j14n30k72N32P13k09m72p46P37j82N02j41r05N69
7196a24K98m6l36P06o44J68N68o66N09p69l2N19j84p81J250r70P34l8j071P73
7216a36K02j96O14j39m37J60r8M16k99K21m36J78J22k25ok8j30K28J62j97J8J50
$$ plain form
7238 144 -120 196 -106 7 20 164 10 -35 -60 -174 -40 4 -122 289 -154 -273 -245 74 -95 60 -41 -120
7260 -120 -36 -35 173 306 106 -88 3 159 -161 81 160 -48 195 -221 109 -53 210 -52 -89 -50 189 -170
7282 -170 -53 197 -5 94 132 83 -10 -56 32 -206 139 -97 -154 39 -75 59 238 -124 87 -78 16 218 4
7305 4 -139 2 -91 155 -94 -202 -132 -78 64 -217 -141 39 -149 77 82 -34 109 186 -129 -68 45 18 120 51
7329 51 259 -11 36 -160 -116 -164 109 -10 14 122 -157 -130 -181 146 4 12 423 117 -125 -92 67 -128 131
7352 131 -55 -211 0 -12 90 24 117 33 98 -142 -48 -14 -184 -106 -155 -12 -197 -295 -21 -154 -219 -135 -67 -61 87
7377 87 217 16 331 164 -87 57 -104 30 151 -82 -18 3 -21 -196 86 160 -133 69 67 -172 96 46 -181
7400 -181 120 281 32 -65 -19 -155 29 34 -41 -30 -120 -120 -176 101 52 103 89 233 -19 -161 -45 273 119 -177
$$ packed form
7238A44k64L16l02J13J3J44j54m5k5j14J34M4j26M11m43j19K8L19j69J55j01p9
7260a20Q4JK08J33k00j94R1J56l20K42P9k08K43m16L30j62K63k62l7L9K39l59
7282a70J17K50k02R9L8m9r3m6Q8k38L45k36n7J93j14J34J79l62K11j65R4K02k14
7305Dj43J41r3K46k49j08P0N4J42k81P6J80j88K26Nj16J43P7l15O1J13k7J02o9
7329E1K08k70M7j96M4m8K73j19K4J08k79K7n1L27j42QM11l06k42L3J59j95K59
7352A31j86j56K11j2J02o6R3q4O5k40R4L4j70P8m9J43j85r8K74j33o5Q4O8OJ48
7377H7J30k01L15j67k51J44j61J34J21k33O4K1k4j75K82P4k93K02kk39K68n0k27
7400a81L01J61k49r7M6j36J84Np5J1r0%n6K77m9N1j4J44k52j42J16L18j54k96
$$ plain form
7424 -177 104 147 198 174 -72 -126 81 -174 -153 110 -301 216 224 -36 215 -287 -149 100 -122 119 226 -38
7446 -38 -165 18 18 -267 51 -116 -69 -115 -62 -273 -197 -150 94 105 -147 -66 51 105 -72 107 -144 97 -20 -248
7470 -248 204 14 -119 130 -50 -111 189 -110 141 21 125 13 -26 92 -60 204 -243 -71 -91 -77 -4 -132
7492 -132 2 -131 266 -50 76 73 230 55 20 -319 -24 202 -70 79 -156 -7 -297 52 -91 -68 95
7513 95 -133 72 61 66 -120 57 -17 -140 -156 149 25 -180 51 -127 -310 372 -255 -4 -81 -244 -27 -193
7535 -193 -197 -167 -215 117 53 16 -67 -41 -66 133 -18 74 -27 68 -159 195 -153 137 -192 79 88 194 -241 29
7559 29 261 5 -3 65 58 44 169 -29 213 -134 0 116 352 -51 6 -4 -21 -203 243 -199 451 60 -36 -375
7583 -375 206 74 170 -136 35 -24 -172 140 -127 -125 135 -97 -29 87 -112 -159 -263 -174 -291 -148 14 11 -10
$$ packed form
7424a77K81M3N1k4k46n4K07k55K1K63m11N17Qk60K51n02J38K49k22K41J07k64
7446c8j27J83%k85L18j67M7m6N3k11P6M7K44J1k52Q1J17N4j77J79k51K41j17k28
7470b48M52j90j33K49j80o1L00k99K51j20J04j12l9J18j52K64m47J72k0J4P3j28
7492a32J34j33L97l16J26lJ57j75l5l39K95K26k72J49k35J49k90L49j43K3J63
7513I5k28K05j1Nj86J77p4j23j6L05j24k05K31j78j83O82o27K51p7j63K17j66
7535a93mL0m8L32o4l7q3K6k5J99j51R2j01R5k27L54l48K90l29K71RJ06m35K70
7559B9K32k56qO8pj4J25j98K42l47J34J16K36m03N7j0j7j82M46m42O50l91r6l39
7583c75N81j32R6l06J71n9j48L12k67KK60k32O8J16j99m7j04Q9j17J43J62lk1
$$ plain form
7606 -10 -256 -33 -103 -12 -315 -166 -225 30 -93 -19 125 -149 -75 -234 24 -209 243 -142 90 22 -31 -238 -147
7629 -147 -25 -14 -25 140 -83 170 74 96 -4 216 90 -54 -171 110 -105 -157 -190 8 275 -32 -147 105
7651 105 -36 -300 -139 85 6 -105 379 -77 151 198 -88 20 -93 40 -83 -62 -24 56 89 127 -157 -71 14
7674 14 -47 27 -144 89 -298 -113 -189 -259 -60 -70 -32 -145 -57 -235 -95 53 18 -104 33 101 94 31 116 126 10
7699 10 -73 34 202 -131 55 -273 84 -57 -56 -81 65 -145 -80 -254 122 -42 37 125 -209 47 -76 53 17
7722 17 157 143 187 -208 29 121 -151 -55 -147 -108 225 -44 -6 36 -5 -26 159 -187 118 -24 127 305 -162 -66
7746 -66 -91 61 -53 99 27 -156 -94 -7 -144 101 74 197 -93 -169 -122 -209 -101 -196 68 -146 -28 -57 -106 -118
7770 -118 34 -77 -156 -35 -257 30 9 61 -261 49 24 -5 18 57 10 7 170 -104 93 191 247 143 103 -188
$$ packed form
7606a0k46K23p0R1l03J49n9K55j23P4J44k74P4j59K58k33M52l85K32o8n3k07R1
7629a47J22J1j1J65k23K53r6K2j00K20j26j44j17K81k15n2l3J98K67l07j15K52
7651A05j41k64J61K24p9j11M84m56K28M7k86J08j13J33j23K1L8Q0L3L8k84Q6Q5
7674A4o1P4j71K33l87J85p6p0J99j0L8j13Q8j78J40J48l5j22J37O8po3Q5J0j16
7699A0q3J07J68l33J86l28L57j41Jk5J46k10O5j74L76j64P9Q8l34K56j23J29l6
7722A7J40j4M4l95K37R2k72R6r2L9L33k69L8M2m1k1J85l46L05j42J51J78m67R6
7746f6k5J52j14J52p2j83O2Q7j37K45k7J23k90p6M7q7J08r5K64k14J18k9m9j2
7770a18J52j11p9J21k22K87k1N2l22L10k5k9K3L9m7lJ63k74J97R8N6j04m0k91
$$ plain form
7794 -188 -151 -57 51 -53 -96 275 198 -195 30 -9 301 -140 61 -59 42 93 21 103 159 -28 126 1 97
7817 97 -211 -46 27 8 181 25 36 11 -108 -74 -15 -128 -30 -198 63 169 -160 13 -98 -48 232 -90 62
7840 62 -99 -105 162 7 -4 -47 127 -94 -35 185 14 272 26 133 -158 -291 -12 188 40 -109 211 60
7862 60 34 226 -54 -143 -42 -253 149 -63 -32 73 180 29 -4 -157 -23 -114 -117 -35 93 5 32 -5 -236 15
7886 15 -29 -48 52 97 -55 181 -88 36 74 -98 56 128 -204 0 -78 -24 -43 -154 8 156 62 -145 -163 -82
7910 -82 -160 -89 -90 7 23 -113 -60 40 86 9 107 26 213 254 231 66 48 142 -1 5 -136 -145 13 123 -133 144 184
7937 184 -19 10 -137 145 -6 -111 -226 -55 -177 -78 -184 -47 45 -61 34 -208 60 47 211 206 -36 102
7959 102 186 70 36 110 15 -36 -132 -65 53 19 122 -80 118 -200 66 -15 146 -146 -182 -62 -168 267 -72
$$ packed form
7794a88L7R4J08j04m3L71p7l93K25l9L10m41K01j20J01N1p2Q2N6j87J54j25R6
7817I7l08J65P3j9J73j56J1k5j19L4N9j13R8j68K61J06l29J73j11N0K80l22J52
7840F2j61oK67j55j1m3J74k21N9K20j71K58k46J07k91j33K79K00j48j49L20j51
7862F0k6J92k80q9J01k11M02k12L1J05J07j51l3j53J34r1lQ2J28q8K7l7k31K51
7886A5m4j9J00M5j52K36k69J24L8j72J54P2l32K04p8N4j9j11J62J48r4k07j8Q1
7910h2p8P1jR7J6j36N3J00M6p7R8q1J87M1k3j65j8R4j43Oj41rJ58J10k56K77M0
7937A84k03K9j47K82j51j05j15J71j22R9j06J37R2j06R5k42K68j3J64nk42J38
7959A02Q4j16l4P4r5n1r6O7J18l4J03k02J98l18K66q1J61k92l6J20j06M35l39
$$ plain form
7982 -72 -304 -12 -235 11 -84 97 103 69 201 -319 74 14 83 -247 78 75 -88 -89 58 41 170 206 -98 29
8006 29 13 -35 205 -142 159 81 -31 -21 -96 -77 -23 -3 -100 106 276 58 23 -14 -97 233 6 55 178 9 107
8031 107 4 181 78 3 49 -60 -101 138 -82 -212 71 -57 -33 -179 113 -153 -181 73 20 -87 36 -136
8053 -136 -33 47 127 119 -259 1 192 371 -71 58 47 108 4 175 -229 118 202 -114 39 -117 212 151 -10
8076 -10 96 -11 -206 -227 -273 50 67 55 -323 98 -133 312 92 -135 3 2 324 -19 144 31 -250 335
8098 335 38 -182 105 353 -25 -208 -111 27 26 272 -205 -213 171 -225 -8 160 -150 -333 -166 -249 -131 -150
8120 -150 -237 452 37 369 85 307 -41 -381 47 -336 -39 -203 232 583 156 -282 -553 85 221 -243
8140 -243 211 302 -532 -19 15 -163 -35 319 255 -43 9 116 -77 194 230 162 91 148 -308 51 101 229 -160
$$ packed form
7982g2k32K92k23K46r5J81Ol4J32n20L93o0O9l30L25lj63jJ47j7J29L6l04J27
8006B9j6m8K40l47L01p8j12J0p5J9N4K0r7K06J70k18l5l7q3L30k27M9J23j69R8
8031A07j03J77j03p5M6j09m1K39k20j30K83j28K4j46K92k66k8K54n3j07J23j72
8053a36J03Q0Q0ql78K60J91J79m42J29j1O1j04J71m04L47Q4l16J53j56L29o1j61
8076a0J06j07j95k1m6L23J7j2l78M21k31M45k20k27J38jL22l43J63j13k81N85
8098C35k97k20K87K48l78j83R7J38jK46m77qL84l96K17J68l10j83J67q3J18j9
8120a50q7O89m15L32k84K22l48l40M28l83K97j64M35L51m27m38k71O38J36m64
8140b43M54R1q34N13L4j78J28L54o4k98N2J07j93K71L6o8p1N7m56L59N0J28l89
$$ plain form
8163 -160 93 62 293 13 168 120 -347 342 90 -32 41 -395 158 301 154 38 -72 -189 156 76 -636
8184 -636 -134 186 -218 29 -256 -56 31
$$ packed form
8163a60K53l1K31k80J55m8m67O89k52j22P3m36N53J43j47j16j10j17L45q0p12
8184f36N02L20m04K47k85K00Q7
8191C1
$$ Imaginary data points
##PAGE= N=2
##DATA TABLE= (X++(I..I)), XYDATA
$$ plain form
0 0 0 0 0 0 0 0 0 0 0 8 -8 8 -8 16 -16 24 -32 36 -46 56 -64 80 -96 112 -131 154 -179 209 -241 276 -318
31 -318 363 -414 469 -530 599 -674 756 -846 945 -1053 1172 -1303 1444 -1597 1766 -1949 2150
48 2150 -2371 2611 -2877 3169 -3490 3847 -4246 4693 -5198 5771 -6433 7204 -8113 9210
62 9210 -10559 12266 -14503 17576 -22093 29460 -44246 141178 -363838 -13162 256276 -442987
74 -442987 139378 141610 -221656 142962 96826 -138415 89756 70161 -128609 -62536 150262
85 150262 -62265 -31726 171989 -147537 -118942 92659 -126144 37971 106045 -58497 67669
96 67669 28061 -40288 -2556 -65309 -39966 -77053 12873 90748 -50299 41139 26916 -88520
108 -88520 45742 -7649 -3136 42181 -87811 25974 19686 -73939 48784 -39409 -33884 74444
$$ packed form
0@%%%%%%%%%Qj6J6j6K4l2M0n6O8q2J02j20J44j76K08k43K85l33L88m50N17n94
31c18O81p77Q83r99J129j273J430j602J791j998K225k475K747l041L363l715M099
48B150m521M982n488O046o659P337q093Q939r891J0969j2204J3637j5317J7323
62I210j9769K2825k6769L2079l9669N1553p3706J85424n05016L50676K69438o99263
74d42987N82365K232l63266L64618m6136k35241K28171j9595j98770O6073K12798
85A50262k12527L0539K03715l19526K8595K11601k18803J64115O8074j64542J26166
96F7669l9608o8349L7732o2753K5343l7087Q9926P7875j41047R1438j4223j15436
108h8520J34262n3391M513M5317j29992J13785o288r3625J22723q8193N525J08328
$$ plain form
120 74444 -20184 49355 68984 -60130 -27245 19926 -12191 -47603 36984 20660 -90163 92423
132 92423 56516 -80547 130914 -24582 -106036 144191 -68622 -66770 130404 -96131 -32646
143 -32646 112710 -28538 -59 41807 -11645 -27011 28697 45309 -53612 27467 15722 -115505
155 -115505 68803 20722 -104625 104797 11410 -57491 106077 -17339 -55050 12060 -59856
166 -59856 -26314 23007 16500 -5648 6825 27634 -54669 6645 39157 -80068 29941 34652
178 34652 -62389 55081 -18177 -75773 26546 -43139 -4100 69204 -2246 16913 13183 -23242
190 -23242 -24283 -25774 -2547 -28267 9041 42043 -12091 43937 1659 -58991 42106 -21183
202 -21183 -18522 78561 -25504 -4429 31573 -53858 4852 8563 -22816 32594 26747 23766 16322
$$ packed form
120G4444r4628O9539J9629j29114L2885M7171l2117l5412Q4587j6324j10823J82586
132I2423l5907j37063K11461j55496q1454K50227k12813J852J97174k26535O3485
143c2646J45356j41248K8479M1866n3452j5366N5708J6612r8921Q1079j1745j31227
155a15505J84308m8081j25347K09422r3387o8901J63568j23416l7711O7110p1916
166e9856L3542M9321o507k2148J2473K0809q2303O1314L2512j19225J10009M711
178C4652r7041J17470p3258n7596J02319o9685L9039P3304p1450J9159l730l6425
190b3242j041j491K3227k5720L7308L3002n4134N6028m2278o0650J01097o3289
202b1183K661R7083j04065K1075L6002q5431N8710L711l1379N5410n847k981p444
$$ plain form
215 16322 10256 -6296 -52850 12258 23 -30854 66924 -6614 -19491 65694 -44075 -6392
227 -6392 47924 -54384 18901 34751 -36050 17804 -1419 -35627 -6716 6603 3611 -1431
239 -1431 38272 -688 -26973 38699 -39410 -37018 38209 -58975 -4851 50135 -46582 24918
251 24918 26312 -46183 22265 4222 -28213 7592 -4622 -17042 -12297 12169 -10574 -19740 34891
264 34891 -20666 -9788 54204 -34863 3951 36539 -58346 12674 11870 -51099 27338 5138
276 5138 -13137 38163 9470 4966 8149 -1034 -10601 -18398 15323 -13208 -5303 40456 -22959
289 -22959 12800 35520 -39931 28616 18755 -32893 43122 -3030 -26971 24260 -25672 -13945
301 -13945 14740 -2091 15795 17585 19691 -608 -6499 7416 -40743 -7794 13517 -36241 30184
$$ packed form
215A6322o066j6552m6554O5108j2235l0877R7778p3538j2877Q5185j09769L7683
227f392N4316j02308P3285J5850p0801N3854j9223l4208K8911J3319k992n042
239a431L9703l8960k6285O5672p8109K392P5227r7184N4124N4986r6717P1500
251B4918J394p2495O8448j8043l2435L5805j2214j2420M745K4466k2743r166N4631
264C4891n5557J0878O3992q9067L8814L2588r4885P1020q04o2969P8437k2200
276E138j8275N1300k8693m504L183r183r567p797L3721k8531P905M5759o3415
289b2959L5759K2720p5451O8547r861n1648P6015m6152k3941N1231m9932J1727
301a3945K8685j6831J7886J790K106k0299n891J3915m8159L2949K1311m9758O6425
$$ plain form
314 30184 17292 -29756 37052 -11639 -27097 29507 -21041 -6277 16975 -19053 -4554 -11450
326 -11450 -13159 -8573 -8655 19862 -2492 11939 24208 -28842 4803 -8285 -44640 13790 -13564
339 -13564 -10718 33965 -11680 11201 15190 -21234 11634 -8397 -7818 12271 -14338 7972 -2757
352 -2757 -11126 12200 -13326 14407 15870 -6100 34255 -6000 -8833 20696 -36795 984 12751
365 12751 -27798 31787 13133 -6864 33889 -3564 -4294 7071 -10685 -77 -7743 8385 -374
378 -374 -10528 26780 -16626 -3773 34919 -30141 12901 26704 -36706 17663 -408 -34864
390 -34864 12660 -11332 -9082 12063 3404 11356 -4514 11354 -4438 -31506 17320 -23227 -25064
403 -25064 34430 -25760 -922 30702 -30139 9632 8935 -23369 10992 -2639 -4663 -2685 -5993
$$ packed form
314C0184j2892m7048O6808m8691j5458N6604n0548J4764K3252l6028J4499o896
326a1450j709M586q2K8517k2354J4431J2269n3050L3645j3088l6355N8430k7354
339a3564K846M4683m5645K2881L989l6424L2868k0031N79K0089k6609K2310j0729
352b757q369K3326k5526K7733J463k1970M0355m0255k833K9529n7491L7779J1767
365A2751m0549N9585j8654j9997M0753l7453p30J1365j7756J0608p666J6128q759
378c74j0154L7308m3406J2853L8692o5060M3042J3803o3410N4369j8071l4456
390c4864M7524k3992K250K1145q659P952j5870J5868j5792k7068M8826m0547j837
403b5064N9494o0190K4838L1624o0841L9771o97l2304L4361j3631k024J978l308
$$ plain form
416 -5993 4991 -24752 6014 10829 -23230 32959 6139 -14931 33101 -24214 -10915 16266
428 16266 -32464 10664 9051 -7150 26567 -5398 10416 9482 -20979 19464 -6293 -6579 22993
441 22993 -14440 9720 3996 -15274 18331 -10592 7706 19348 -10947 29045 -7283 -16935
453 -16935 25026 -35230 -3608 24657 -26322 21888 14429 -13885 18700 -7633 -7574 -1794 -8017
466 -8017 6069 -13806 13247 3510 -30828 25346 -11028 -26000 36705 -17519 -6773 27363
478 27363 -25252 -46 2174 -24583 -3374 -3486 5497 -3210 7057 20529 -28701 7736 12051
491 12051 -40777 20935 1169 -28502 32306 -9509 -10710 22477 -18785 -446 8841 1425 9051
504 9051 -5215 14853 -8587 -17067 21864 -20088 -634 24396 -18405 25492 14797 -16297
$$ packed form
416e993J0984k9743L0766M815l4059N6189k6820k1070M8032n7315J3299K7181
428A6266m8730M3128j613j6201L3717l1965J5814r34l0461M0443k5757k86K9572
441B2993l7433K4160n724j9270L3605k8923J8298J1642l0295L9992l6328r652
453a6935M1961o0256L1622K8265n0979M8210p459k8314L2585k6333N9N780o223
466h017J4086j9875K7053r737l4338N6174l6374j4972O2705n4224J0746L4136
478B7363n2615K5206K220k6757K1209j12Q983q707J0267J3472m9230L6437M315
491A2051n2828O1712j9766k9671O0808m1815j201L3187m1262J8339R287p416P626
504I051j4266K0068k3440q480L8931m1952J9454K5030m2801M3897j0695l1094
$$ plain form
516 -16297 21311 -14427 -9485 12020 -12473 18856 -2405 -6417 27536 -18971 4876 19956
528 19956 -24838 14766 7568 -11651 19169 -8242 -11692 212 -5949 2238 -1339 15914 897
541 897 -11791 23986 -15165 -15677 16352 -32104 -243 16168 -19083 20461 -944 -17997 12161
554 12161 -12904 2700 2031 -14101 13242 -15146 -4229 15338 -26864 1579 5759 -15990 21355
567 21355 5870 -6310 6775 -10311 -8239 -4950 3208 -3734 -10837 22332 -2036 -3245 28348
580 28348 -22117 -4547 17492 -24617 19023 11864 -22401 18613 -6046 -6272 17900 -8807 9653
593 9653 4208 -2606 22971 -8242 -1098 5156 -24632 9696 8291 -4954 18874 -946 -1803 8376
607 8376 -1758 580 -8583 97 -2950 -7611 21077 -6403 -10389 13656 -20324 4111 17964
$$ packed form
516a6297L7608l5738M942K1505k4493L1329k1261m012L3953m6507K3847J5080
528A9956m4794L9604p198j9219L0820k7411l450J1904o161Q187l577J7253j5017
541H97j2688L5777l9151n12L2029m8456L1861J6411l5251L9544k1405j7053L0158
554A2161k5065J5604o69j6132K7343k8388J0917J9567m2202K8443M180k1749L7345
567B1355j5485j2180J3085j7086K072L289Q158o942p103L3169k4368j209L1593
580B8348n0465J7570K2039m2109M3640p159l4265M1014k4659k26K4172k6707J8460
593I653n445o814K5577l1213P144O254k9788L4328j405j3245K3828j9820q57J0179
607H376j0134K338r163Q680l047m661K8688k7480l986K4045l3980K4435J3853
$$ plain form
620 17964 -17199 9582 150 -16755 8968 -7331 -7100 -4172 -9631 10326 -1866 6705 9655
633 9655 -21196 2863 -3490 -16865 15394 -9492 -10130 12246 -8907 5582 5490 -10165 469
646 469 -6723 6480 4855 -5970 9673 -14073 -6052 13886 -11625 10795 6911 -12834 17952
659 17952 2216 -2177 10038 -15165 -111 2197 -2319 17396 -2834 1793 7853 -8186 12583
672 12583 1266 -8014 9282 -8220 5194 10153 -6137 6778 -7876 -4228 11874 -4271 10173
685 10173 3067 -11152 9270 -5487 -3693 5732 -13144 2234 1310 -327 11264 -7564 -1041
698 -1041 -3613 -12570 11534 -6117 -5957 10576 -16298 3522 8230 -15457 5937 -4576 -10399
711 -10399 10934 -1656 503 -1700 -8977 -847 -7598 4813 2534 -9170 11091 -5219 -2798
$$ packed form
620A7964l5163K6781r432j6905K5723j6299K31K928n459J9957j2192Q571K950
633I655l0851K4059o353j3375L2259k4886o38K2376k1153J4489r2j5655J0634
646D69p192J3203j625j0825J5643k3746Q021J9938k5511K2420l884j9745L0786
659A7952j5736m393J2215k5203J5054K308m516J9715k0230M627O060j6039K0769
672A2583j1317r280J7296j7502J3414M959j6290J2915j4654L648J6102j6145J4444
685A0173p106j4219K0422j4757J794R425j8876J5378r24j637J1591j8828O523
698a041k572q957K4104j7651J60J6533k6874J9820M708k3687K1394j0513n823
711a0399K1333j2590K159k203p277Q130o751J2411k279j1704K0261j6310K421
$$ plain form
724 -2798 14816 -14707 5 5870 -13340 13926 4687 -5839 8288 -9076 851 6168 -3119
737 -3119 9106 -3601 936 8861 -6132 9812 -1928 -8183 12513 -5338 6337 12708 -10990
750 -10990 8235 1171 -7905 12906 -4059 -1938 7132 -4722 5802 739 -1664 -10 -6620 7764
764 7764 -3208 179 11363 -14353 2437 6561 -17295 11795 -1412 -16061 15268 -6397 -5928
777 -5928 10810 -11117 -1797 84 -4688 2083 -4256 3856 -5213 -6269 10039 -11469 111 8605
791 8605 -17188 7552 4075 -13576 10257 -4494 -6298 6359 -5855 3403 598 -1282 5044
804 5044 -7145 8933 681 -9576 13670 -7899 -2588 16128 -12197 6397 7826 -10899 11851
817 11851 -962 -2802 8724 -6462 6871 1592 -3930 10685 -7187 2489 7707 -8218 9878
$$ packed form
724b798J7614k9523J4712N865j9210K7266r239j0526J4127j7364R927N317r287
737c119J2225j2707M537P925j4993J5944j1740o255K0696j7851J1675O371k3698
750a0990J9225p064r076K0811j6965K121R070j1854J0524n063k403J654o610J4384
764G764j0972L387J1184k5716J6790M124k3856K9090j3207j4649L1329k1665M69
777e928J6738k1927R320J881m772O771o339Q112r069j056J6308k1508J1580Q494
791H605k5793K4740l477j7651K3833j4751j804J2657j2214R258k805j880O326
804E044j2189J6078q252j0257K3246k1569N311J8716k8325J8594J429j8725K2750
817A1851j2813j840J1526j5186J3333n279n522J4615j7872R676N218j5925J8096
$$ plain form
830 9878 770 -3683 8414 -7149 3969 1565 -6575 9777 -7472 952 9540 -12791 7879
843 7879 651 -12316 11944 -5990 -3692 8320 -9038 1472 -1564 -4212 3337 -7794 4628
856 4628 -1666 -9251 11114 -10475 -4603 10442 -15463 3380 5858 -12028 7388 -2599 -4953
869 -4953 2515 -5700 2989 -5071 990 6862 -12074 9668 1523 -14583 17005 -5266 -7920 16776
883 16776 -10733 115 10502 -9631 5189 2800 650 3708 -2813 8202 -4700 -1179 11715
896 11715 -11079 7615 9163 -13033 13742 2181 -8749 12869 -4818 -470 5386 -3301 5599
909 5599 -3573 1438 4849 -9093 10211 -855 -7796 12497 -8794 -2764 9466 -11253 2608
922 2608 2208 -5745 4290 -3174 3072 -1380 -4997 6968 -9516 -1086 5579 -13237 6254 636
$$ packed form
830I878r108m453J2097j5563J1118k404q140J6352j7249Q424Q588k2331K0670
843G879p228j2967K4260j7934K298J2012j7358J0510l036k648P549j1131J2422
856D628o294p585K0365k1589N872J5045k5905J8843K478j7886J9416r987k354
869d953P468q215Q689q060O061N872j8936K1742q145j6106L1588k2271k654K4696
883A6776k7509J0848J0387k0133J4820k389k150L058o521J1015j2902L521J2894
896A1715k2794J8694J548k2196K6775j1561j0930K1618j7687M348N856q687Q900
909E599r172N011L411j3942J9304j1066o941K0293k1291O030J2230k0719J3861
922B608m00p953J0035p464O246m452l617J1965j6484Q430O665j8816J9491n618
$$ plain form
936 636 -10821 7995 -4636 -4137 4744 -5757 3356 -2960 -2563 4752 -10813 4674 1271 -10409
950 -10409 11523 -3458 -5007 12608 -8789 -295 6453 -7819 3368 163 313 2776 -2498 8711
964 8711 -3135 -397 11242 -9224 5261 7870 -10778 9554 1660 -6725 10030 -3517 1081
977 1081 6460 -1425 6367 -1580 2006 4938 -9448 6747 -374 -8431 10836 -4096 -1819 9085
991 9085 -5771 1202 3430 -3791 783 -3057 1429 -3616 -3168 6678 -9212 1443 7079 -12096
1005 -12096 7986 3053 -11922 8277 -4838 -8026 4600 -7329 -833 1012 -1753 3375 -4030
1018 -4030 3763 -526 -7094 6907 -6546 -4272 7739 -8003 1870 4787 -6751 5601 -733
1031 -733 245 4705 -3691 5201 -2147 -3115 7835 -8658 2778 7425 -8877 10886 3920 -6380
$$ packed form
936F36j1457J8816j2631M99Q881j0501R113o316L97P315j5565J5487l403j1680
950a0409K1932j4981j549J7615k1397Q494O748j4272J1187l205J50K463n274J1209
964H711j1846K738J1639k0466J4485K609j8648K0332p894q385J6755j3547M598
977A081N379p885P792p947L586K932j4386J6195p121q057J9267j4932K277J0904
991I085j4856O973K228p221M574l840M486n045M48R846j5890J0655N636j9175
1005a2096K0082m933j4975K0199j3115l188J2626j1929O496J845k765N128p405
1018d030P793m289o568J4001j3453K274J2011j5742R873K917j1538J2352o334
1031g33R78M460q396Q892p348r68J0950j6493J1436M647j6302J9763o966j0300
$$ plain form
1045 -6380 10996 -2102 -3366 5643 -4827 1538 1923 1047 3737 -495 5116 479 -1187 7460 -4084
1060 -4084 1210 3862 -6977 4461 -1337 -4222 5496 -4763 2989 3938 -5013 8429 -4218 -5266
1074 -5266 5284 -9717 -369 3580 -8839 5537 1273 -2947 4302 -3734 -959 -2512 -2759 1705
1088 1705 -4496 924 -1391 -7004 4976 -4618 -2598 7323 -6402 2551 3425 -6025 3858 -4784 -4331
1103 -4331 2544 -6294 5208 2274 -3283 8485 -4087 149 6883 -8211 3381 1433 -6436 7528
1117 7528 -418 -1066 4903 -2861 3570 2754 1511 4676 -3146 3333 -235 -3522 6349 -5416 -178
1132 -178 5954 -4022 7873 4445 -4260 5259 -4072 -1814 4092 -5557 2618 -1131 -2563 5113 -2985
1147 -2985 2110 978 -5645 5362 -2268 -1353 4306 -9179 -789 -168 -7169 6112 -2319 -2402 5301
$$ packed form
1045f380J7376j3098j264R009j0470O365L85q76K690m232N611m637j666Q647j1544
1060d084N294K652j0839J1438n798k885R718j0259P752R49q951J3442j2647j048
1074e266J0550j5001R348L949j2419J4376m264m220P249q036K775j553k47M464
1088A705o201N420k315n613J1980r594K020R921j3725Q953Q74r450R883q642M53
1103d331O875q838J1502k934n557J1768j2572M236O734j5094J1592j948p869J3964
1117G528p946o48N969p764O431q16j243L165p822O479l568l287R871j1765N238
1132a78O132r976J1895l428q705R519r331K258N906r649Q175l749j432P676q098
1147b985N095j132o623J1007p630R15N659j3485Q390O21p001J3281q431q3P703
$$ plain form
1162 5301 -3830 3073 888 -6620 -426 -6469 -796 1142 -3453 5215 -3087 -2308 6519 -5407 3113
1177 3113 1422 -7546 6065 -1532 -2701 5313 -5715 -45 2883 -1790 8463 927 258 2206
1191 2206 -4568 4079 -766 -4377 4898 -4331 4373 7978 -2098 5453 -582 -3100 5495 -2247 2878
1206 2878 1963 -4414 3496 -1740 1408 4666 -6067 4060 2222 -816 9106 -3588 -1920 412
1220 412 -8924 2282 -116 -2388 5494 -3916 3531 4401 -6003 3249 -4993 -6189 4658 -4922 1323
1235 1323 1045 -6429 1788 -1920 436 2384 -3602 1997 -3332 -385 3979 -9748 -478 -928 -8109
1250 -8109 8507 858 -1430 7515 -5539 514 2324 -5402 1850 -4358 -416 3875 -2836 7673
1264 7673 -371 -4792 7840 -3671 2322 7611 -6236 3234 567 -5258 4232 -1311 90 2222
$$ packed form
1162E301r131O903k185p508O194o043N673J938m595Q668q302P79Q827j1926Q520
1177C113j691q968J3611p597j169Q014j1028N670K928m673J0253p536o69J948
1191B206o774Q647m845l611R275r229Q704L605j0076P551o035k518Q595p742N125
1206B878r15o377P910n236L148L258j0733J0127j838l038R922j2694J668K332
1220D12r336J1206k398k272P882r410P447Q70j0404R252q242j196J0847r580O245
1235A323k78p474Q217l708K356J948n986N599n329K947M364j3727R270m50p181
1250h109J6616p649k288Q945j3054O053J810p726P252o208L942M291o711J0509
1264G673q044m421J2632j1511N993N289j3847R470k667n825R490n543J401K132
$$ plain form
1278 2222 1962 7831 -67 2903 2103 -8629 2306 -1379 -4315 7372 -3381 1307 7215 -3797
1292 -3797 4510 30 -3644 2434 -3779 3192 1712 -6199 2955 -4758 -3824 7040 -4485 2436 4509
1307 4509 -4676 3224 -742 -4777 -2038 -5463 43 -2377 1546 5345 -5810 2817 1540 -7515 5240
1322 5240 -3650 -4957 4806 -4877 -376 2314 -3682 1362 -1544 3325 3776 -1848 7644 -2630 -5685
1337 -5685 6412 -7628 -1886 6053 -5664 5822 6377 -1938 6015 382 -2468 -194 -830 2342
1351 2342 -3073 2770 2695 -5271 6468 691 -3877 8567 -2881 29 7976 -5414 -191 -120 -4971
1366 -4971 1080 -1320 3579 2980 -2 6331 -2207 -1841 3137 -8527 143 729 -5695 4568 -96
1381 -96 -2048 2006 -1822 1346 -1411 -895 3396 -5471 824 164 -8323 2475 -3744 -3562 6356 -1531
$$ packed form
1278B222k60N869p898K970q00j0732J0935l685k936J1687j0753M688N908j1012
1292c797Q307m480l674O078o213O971j480p911R154p713R34J0864j1525O921K073
1307D509r185P900l966m035K739l425N506k420L923L799j1155Q627j277r055J2755
1322E240q890j307R763r683M501K690n996N044k906M869M51n624R492j0274l055
1337e685J2097j4040N742P939j1717J1486N55q315P953n633k850K274o36L172
1351B342n415N843p5p966J1739n777m568J2444j1448K910P947j3390N223P1m851
1366d971O051k400M899n99k982O333q538L66M978j1664Q670N86o424J0263m664
1381i6j952M054l828L168k757N16M291q867O295o60q487J0798o219J82R918p887
$$ plain form
1397 -1531 1951 3754 -3634 597 -4221 -2653 -421 -5023 4274 34 -1707 7853 -3239 -301 5137
1412 5137 -5904 2600 2601 -3491 3062 -1300 -1325 -1020 -1326 4270 -723 4869 6317 -4332 5727 213
1428 213 -8461 5376 -3919 -3824 8150 -1058 2596 5534 -1405 260 -426 -203 -1883 -969 4009 -4005
1444 -4005 879 3731 -6097 2596 2673 -4822 6827 1424 -2862 2302 -4116 -3361 -2503 -2622 615 -1480
1460 -1480 4897 498 -2883 5254 -4919 -4679 2794 -7353 -597 2315 -6046 3374 -432 -2690 2451
1475 2451 -1911 421 1733 -307 3026 -3427 -1262 -545 -6186 1567 -386 685 6531 -786 3566
1490 3566 2178 -5542 2163 -3507 -3370 4417 -3658 3894 4832 -3743 5340 779 -2540 4625 46
1505 46 465 1860 -1438 515 -2508 780 -795 -1502 6531 1026 1646 6732 -4867 -197 904 -7056
$$ packed form
1397a531L482J803p388M231m818J568K232m602R297m240j741R560j1092K938N438
1412E137j1041Q504Jo092O553m362k5L05l06N596m993N592J448j0649J0059n514
1428B13q674J3837r295R5J1974r208L654K938o939J665o86K23j680R14M978q014
1444d005M884K852r828Q693P7p495J1649n403m286N164o418P55Q58j19L237k095
1460a480O377m399l381Q137j0173K40P473j0147O756K912q361R420l806k258N141
1475B451m362K332J312k040L333o453K165P17n641P753j953J071N846p317M352
1490C566j388p720P705n670J37P787q075P552R38q575R083m561l319P165m579
1505D6M19J395l298J953l023L288j575p07Q033n505O20N086j1599M670J101p960
$$ plain form
1521 -7056 1469 68 -1873 4237 -593 1340 532 -1843 484 -3321 1191 349 -3914 3074 -2972
1536 -2972 -4322 2653 -5330 -509 4283 -2585 3685 698 -3373 -482 -4459 -2698 -2529 -1638 3631
1551 3631 -1090 3326 3334 -4572 2937 -1742 -4568 4577 -3384 -578 4815 -4590 1513 1677 -3937 3659
1567 3659 1388 1704 2868 -592 1022 -2095 -1818 -854 -2650 3513 1257 1626 6648 -1349 2016 2317
1583 2317 -5525 2426 -298 -3051 5155 -1333 412 3431 -2902 1685 479 -300 3300 -848 1702
1598 1702 -423 -3354 930 -4446 -1697 2737 -2547 4340 2749 -2115 2645 -3329 -3529 -319 -4485
1613 -4485 562 -761 -501 2203 -2701 803 -655 -3652 3302 -2198 -864 3604 -4877 293 -825
1628 -825 -5649 2208 -1329 164 5266 -618 2685 337 -3449 -134 -4034 -817 947 -697 4243
$$ packed form
1521g056Q525j401j941O110m830J933q08k375K327l805M512q42m263O988o046
1536b972j350O975p983M821M792o868O270k987m071K891l977J761J69Q91N269
1551C631m721M416Qp906P509m679k826R145p961K806N393r405O103J64n614P596
1567C659k271L16J164l460J614l117K77R64j796O163k256L69N022p997L365L01
1583B317p842P951k724k753Q206o488J745L019o333M587j206p79L600m148K550
1598A702k125k931M284n376K749M434n284O887j591m864M760n974k00L210m166
1613d485N047j323K60K704m904L504j458k997O954n500J334M468q481N170j118
1628h25m824P857l537J493N102n884L303k348l786L315l900L217J764j644M940
$$ plain form
1643 4243 791 859 2919 -2951 2323 360 -2952 4712 -1515 -351 3019 -3512 1219 1846 -1819 4674
1659 4674 2050 1732 3017 -983 -152 -3044 -1003 929 -2931 4154 2424 -1313 6169 -2337 -2102 3286
1675 3286 -5208 414 2372 -3619 1372 106 -1888 -168 -743 1895 -660 481 1797 -3948 1583
1690 1583 -1349 -6179 2734 -3743 -3103 5118 -1226 1480 2475 -3241 544 -2960 -2539 370 -2889 1446
1706 1446 -209 -888 2741 -2635 1120 1969 -2599 3425 793 -1057 1800 -3263 -122 201 -3016 3823
1722 3823 764 1406 5209 -559 1754 38 -4113 1161 -497 120 2406 984 2857 -867 1141
1737 1141 2941 -3503 2535 1458 -2860 4678 -1578 -2898 3230 -4698 -1061 4560 -861 1944 2777
1752 2777 -180 -1298 -1822 -587 -4209 -916 1918 -2730 4370 1765 -4519 3563 -2074 -4714 3950
$$ packed form
1643D243l452O8K060n870N274j963l312P664o227J164L370o531M731O27l665O493
1659D674k624l18J285m000Q31k892K041J932l860P085j730l737P482q506K35N388
1675C286q494N622J958n991M991j266j994J720n75K638k555J141J316n745N531
1690A583k932m830Q913o477O40Q221o344K706R95n716L785l504M21K909l259M335
1706A446j655o79L629n376L755Q49m568O024k632j850K857n063L141L23l217O839
1722C823l059O42L803n768K313j716m151N274j658O17K286j422J873l724K008
1737A141J800o444O038j077m318P538o256j320O128p928L637N621n421K805Q33
1752B777k957j118n24J235l622L293K834m648P100k605o284Q082n637k640Q664
$$ plain form
1767 3950 -1939 -1852 1493 -1868 -752 -1692 -751 -880 -1499 3248 -708 875 3689 -6040 -952 1460
1783 1460 -6671 2174 1955 -2439 4390 551 207 2136 -2445 -510 -491 -27 1394 -534 2157 -870
1799 -870 -2163 3413 -644 749 3158 -454 2843 393 -570 1789 -3684 -259 1630 -982 4555
1814 4555 875 349 3907 -2231 -225 1537 -2888 -178 -19 881 1074 -695 1907 -1883 -1377 2517
1830 2517 -2682 1715 2267 -4479 1856 -517 -4908 1012 -1404 -1564 1309 1623 1030 -1185 711 -2249
1846 -2249 -4240 1941 -3110 -2049 4804 -4340 423 4699 -5560 576 2022 -4142 2203 1206 -1484
1861 -1484 380 -1203 -1338 -1400 1493 794 -1223 4914 447 -1288 4409 -3327 -2574 2009 -3466 1813
1877 1813 3917 -750 2899 682 -681 902 -419 829 -498 1098 2117 -1880 1583 -559 -2427
$$ packed form
1767C950n889Q7L345l361J116r40R41j29o19M747l956J583K814r729N088K412
1783A460q131Q845k19m394O829l839l44J929m581J935J9M64J421j928K691l027
1799h70j293N576m057J393K409l612L297k450r63K359n473L425J889k612N537
1814D555l680n26L558o138K006J762m425K710J59R00J93j769K602l790N06L894
1830B517n199M397N52o746O335k373m391N920k416j60K873L14n93k215J896k960
1846b249j991O181n051J061O853r144M763M276j0259O136J446o164O345r97k690
1861a484J864j583j35o2K893o99k017O137m467j735N697p736P53M583n475N279
1877A813K104m667L649k217j363J583j321J248j327J596J019l997L463k142j868
$$ plain form
1892 -2427 2615 -328 1106 3720 -1363 1564 217 -3248 672 -2166 -1050 1776 -644 2150 1045
1907 1045 -912 355 -1965 -370 -682 -1285 1633 -2546 -100 1089 -3724 1854 -179 -2797 4022
1922 4022 -1211 -1581 2476 -3502 -1871 -13 -2536 147 684 693 364 629 1833 -2577 113 562 -4138
1939 -4138 2442 662 -2995 4188 -836 -1877 3715 -1275 86 2815 -839 882 918 -23 -585 -827
1955 -827 1255 -1153 1731 3471 -1204 3159 1555 -2824 2351 -1400 -2537 2376 -931 638 2210
1970 2210 260 1197 -320 261 -234 -1422 1694 -1279 -255 1922 -3295 677 386 -3431 2711 62
1986 62 -893 3158 -2164 -1248 -190 -3511 -483 -772 -635 1172 -11 1001 -919 -1119 -300 -3046 888
2003 888 -319 -2041 2590 -1422 -1526 2522 -3191 88 2343 -1712 2639 1034 -1299 971 -1525
$$ packed form
1892b427N042k943J434K614n083K927j347l465L920k838J116K826k420K794j105
1907A045j957J267k320J595l12o03K918m179K446J189m813N578k033k618O819
1922D022n233l70M057n978J631J858k523K683N37Rl29K65J204m410K690M49m700
1939d138O580j780l657P183n024j041N592m990J361K729l654J721L6r41n62k42
1955h27K082k408K884J740m675M363j604m379N175l751j137M913l307J569J572
1970B210j950R37j517N81m95j188L116k973J024K177n217L972k91l817O142k649
1986F2r55M051n322R16J058l321L028k89J37J807j183J012j920k00Q19k746L934
2003H88j207j722M631m012j04M048n713L279K255m055M351j605k333K270k496
$$ plain form
2018 -1525 -1293 150 73 1614 209 1837 1251 -895 2038 -1614 -1134 2105 -1602 1463 2341 -1634
2034 -1634 1793 72 -976 1702 -99 746 962 102 1395 -1408 207 32 -2360 2323 337 -100
2050 -100 3326 -1324 -150 1071 -2798 321 -371 -1640 1251 -514 79 138 -1149 83 -1355 248
2066 248 177 -1491 1629 -1426 -1684 1691 -3112 -369 1333 -3148 2192 601 -1804 2070 -1432 -1570
2082 -1570 590 -1733 -80 394 150 810 -186 1190 -1198 -744 1591 -1914 1384 2074 -2063 2112
2098 2112 566 -2012 1867 -740 58 2324 276 1363 741 382 63 -1444 1019 -367 -158 3209
2114 3209 -756 741 1941 -2275 804 382 -1336 1637 25 221 972 -904 -99 -1041 -160 1038
2130 1038 -850 1580 570 -1608 1004 -2089 -1648 561 -2201 914 595 -1039 1609 -1361 -944 29
$$ packed form
2018a525K32J443p7J541j405J628n86k146K933l652M80L239l707L065Q78l975
2034a634L427j721j048K678j801Q45K16q60J293k803J615j75k392M683j986m37
2050a00L426m650J174J221l869L119o92j269K891j765N93N9j287J232j438J603
2066B48p1j668L120l055k58L375m803K743J702m481N340j591k405L874l502j38
2082a570K160k323J653M74k44O60r96J376k388M54K335l505L298O90m137M175
2098B112j546k578L879k607P98K266k048J087o22l59l19j507K463j386K09L367
2114C209l965J497J200m216L079m22j718K973j612J96P51j876Q05r42Q81J198
2130A038j888K430j010k178K612l093M41K209k762L115l19j634K648k970M17R73
$$ plain form
2146 29 -2462 613 -98 -1075 1740 -1006 -521 -258 -1625 232 -511 92 1230 -1006 1168 -675 -1744
2163 -1744 991 -2018 101 2286 -1046 1937 1061 -1446 935 -574 -653 870 47 895 226 940 517
2180 517 -1007 1920 -300 -1041 3270 -519 -45 2449 -1805 106 1138 -1570 1204 881 473 730
2196 730 494 838 -1429 -156 77 -2217 1555 648 -1506 2238 -755 -1155 1412 -1610 -273 684 -1425
2213 -1425 165 -441 -444 -362 -1578 255 -1206 -595 1789 -1377 336 554 -2317 268 -996 -1523 798
2230 798 -579 783 681 -689 732 -1371 -660 641 -1465 1115 627 -900 1318 -566 -419 816
2246 816 -532 844 406 551 1157 -809 821 -225 -1466 2151 -429 239 2718 -731 902 1183
2262 1183 -1149 689 -25 -133 887 413 1371 -211 414 779 -1976 1000 774 -1379 1958 37 -1036
$$ packed form
2146B9k491L075p11r77K815k746M85K63j367J857p43O03J138k236K174j843j069
2163a744K735l009K119K185l332K983q76k507K381j509p9J523q23Q48o69P14m23
2180E17j524K927k220p41M311l789M74K494m254J911J032k708K774l23m08K57
2196G30k36L44k267J273K33k294L772r07k154L744k993m00K567l022J337R57k109
2213a425J590o06lQ2j216J833j461O11K384l166J713K18k871K585j264n27K321
2230G98j377J362j02j370J421k103P11J301k106K580m88j527K218j884J47J235
2246H16j348J376m38J45O06j966J630j046j241L617k580O68K479l449J633K81
2262A183k332J838p14j08J020m74R58j582O25L65k755K976k26k153L337j921j073
$$ plain form
2279 -1036 1150 -1078 -612 315 -362 371 -102 510 -296 -1259 671 -1816 -1212 1640 -1967 488 1174
2296 1174 -2461 739 -413 -1862 592 -1004 -222 585 -357 620 -1150 -125 585 -1576 1260 98
2312 98 -1104 1917 -977 -606 941 -1392 246 838 -445 1126 29 359 136 -649 883 -648 548
2329 548 1500 -673 1437 844 -453 1405 -381 -95 1382 -107 1216 362 -363 889 -539 241 564
2346 564 -836 913 338 -323 877 -676 -16 -298 -728 438 -728 709 504 -1175 888 -932 -1356
2363 -1356 1179 -1665 -389 908 -1331 487 84 -1414 290 -804 -273 72 -570 490 -1154 -167
2379 -167 474 -1681 870 -196 -1291 1518 -920 -428 1031 -1360 -86 192 -541 582 39 472 625
2396 625 95 946 -647 175 925 -1065 1162 766 -555 1370 -187 -332 1424 -382 1032 563 -118
$$ packed form
2279a036K186k228M66R27o77P33m73O12q06r63J930k487O04K852l607K455O86
2296A174l635L200j152j449K454j596P82Q07r42R77j770J025P10k161K836j162
2312I8j202L021k894L71J547k333J638N92j283J571j097L30k23p85J532j531J196
2329E48R52k173K110n93j297J858j786K86J477j489J323q54p25J252j428P80L23
2346E64j400J749n75o61J200j553O60k82m30J166j166J437k05j679K063j820m24
2363a356K535k844J276J297k239J818m03j498J704j094N31L45o42J060j644R87
2379a67O41k155K551j066j095K809k438M92J459k391J274K78p33J123n43M33J53
2396F25n30Q51j593Q22P50j990K227l96j321J925j557j45J756j806J414m69o81
$$ plain form
2413 -118 1301 -572 271 504 -786 957 -291 110 1429 -579 672 324 -1088 1081 -922 -320
2429 -320 667 -1238 749 -3 -1157 703 -1001 -23 844 -1186 246 -206 -1025 313 -872 -383 5
2446 5 -1095 598 -686 -285 647 -1481 40 -275 -1406 457 -662 -492 635 -1120 494 -25 -501
2463 -501 830 -794 323 605 -850 998 -37 -446 1045 -556 372 839 -280 1105 180 249 891
2480 891 -508 599 191 23 1201 -337 784 763 -545 1385 -148 -326 1097 -750 628 455 -831
2497 -831 872 -291 -316 1018 -946 421 350 -657 707 -737 -603 132 -908 498 -253 -188 949
2514 949 -744 214 65 -1265 391 -794 -767 765 -1411 35 -138 -972 565 -884 -359 377 -976
2531 -976 349 -472 -732 636 -1362 33 634 -1226 806 231 -526 767 -358 -39 525 -84 449
$$ packed form
2413a18J419j873Q43K33j290J743j248M01J319k008J251l48j412K169k003O02
2429c20R87j905J987p52j154J860j704R78Q67k030J432m52q19J338j185M89L88
2446Ej100J693j284M01R32k128J521l15j131J863j119J70J127j755J614n19m76
2463e01J331j624J117K82j455J848j035m09J491j601R28M67j119J385r25O9O42
2480H91j399J107m08j68J178j538J121k1j308J930j533j78J423j847J378j73j286
2497h31J703j163k5J334j964J367p1j007J364j444J34P35j040J406p51O5J137
2514I49j693R58j49j330J656j185K7J532k176J446j73q34J537j449N25P36j353
2531i76J325q21k60J368j998J395O01j860K032n75p57J293j125L19N64o09N33
$$ plain form
2548 449 -473 432 578 -473 1315 -76 -87 2060 -364 344 1225 -1102 682 421 -348 1021 -184
2565 -184 633 715 -283 1027 -452 291 772 -1100 544 330 -969 522 -394 -71 813 -355 585 -201
2583 -201 -232 168 -1271 71 -197 -1327 1047 -941 -886 1245 -1054 -192 563 -1279 259 -359 -879 -203
2601 -203 -849 -206 -318 51 477 -924 347 286 -1442 438 -761 -838 687 -784 35 719 -637 607
2619 607 186 72 697 -363 782 -164 -397 872 -535 218 903 -377 1270 717 127 922 -315 195
2637 195 437 -759 861 -188 118 1557 -620 710 664 -443 1070 18 -203 467 -658 74 -186
2654 -186 -244 585 -356 664 505 -1121 1004 -550 -1088 644 -1196 -565 587 -1079 -79 262 -365
2671 -365 -115 -184 46 -607 -223 372 -1639 -264 -31 -1341 717 92 -1096 1115 -418 -382 660 -513
$$ packed form
2548D49r22R05J46j051J788j391j1K147k424P08Q81k327J784k61p69J369j205
2565a84Q17Q2r98J310j479P43M81j872J644k14j299J491r16L23Q84j168R40p86
2583b01l1M00j439J342k68j130K374j988N5K131k299Q62P55j842J538o18n20O76
2601b03o46O43j12L69M26j401J271o1j728J880j199p7J525j471Q19O84j356J244
2619F07m21j14O25j060J145r46k33J269j407P53O85j280J647n53n90P95j237N10
2637A95K42j196J620j049L06J439k177J330m6j107J513j052k21O70j125P32k60
2654a86n8Q29r41J020j59j626K125j554n38J732j840O31J152j666J000L41o27
2671c65K50o9K30o53L84N95k011J375K33j310K058o25j188K211j533L6J042j173
$$ plain form
2689 -513 60 -103 -25 -498 -451 797 -171 -19 1581 -676 165 1033 -846 640 27 -840 1079 -20
2707 -20 36 662 -160 804 58 0 195 -474 1019 -436 -339 851 -668 1 938 -229 678 358 -52 682
2727 682 -704 -84 -166 -1219 531 -101 -578 866 -495 191 338 -693 256 -469 -227 -136 -945 111
2745 111 -903 -628 709 -1067 36 584 -1152 507 201 -1469 213 -697 -958 158 -426 66 -356
2762 -356 -10 349 -553 501 -336 -720 860 -597 53 1595 -861 426 788 -629 942 556 31
2779 31 451 -51 -328 29 629 220 -399 828 189 -661 1865 -250 48 1228 -1683 349 759 -999
2797 -999 519 457 239 872 303 340 -383 315 429 -302 39 -544 -889 575 -1138 -791 583 -924 427
2816 427 292 -656 810 -798 -952 -814 -1562 -592 -377 -162 398 -1232 -2 102 -552 36 -1735 -302
$$ packed form
2689e13N73j63P8m73M7J248r68J52J600k257Q41Q68j879J486o13q67J919j099
2707b0N6O26q22R64p46n8J95o69J493j455R7J190j519O69R37j167R07l20m10P34
2727F82j386O20q2j053J750o32m77J444j361O86J47j031R49p25K42R1q09J056
2745A11j014K75J337j776J103N48j736J659l06j670J682r10k61J116n84M92m22
2762c56L46L59r02J054q37l84J580j457O50J542k456J287L62j417J571l86n25
2779C1M20n02k77L57O00m09o19J227o39q50K526k115K98J180k911K032M10j758
2797i99J518o2k18O33n69L7p23O98J14p31L41n83l45J464j713L47J374j507J351
2816D27j35r48J466j608j54J38p48R70K15K15N60j630J230J04o54N88j771J433
$$ plain form
2834 -302 349 -996 665 -79 -1183 624 -334 8 905 -622 1148 162 -987 170 -503 -368 241
2851 241 597 -6 -48 687 1422 274 774 -296 -346 1191 87 -503 925 -228 -12 876 -46 286 792
2870 792 302 -22 -72 106 -803 -44 600 -898 706 830 -891 1358 -211 -1092 754 -948 -480 389
2888 389 -712 -29 28 -466 -135 -228 399 -303 7 102 -1090 -50 -351 -1599 382 -734 -539 910 -518
2907 -518 -1 708 -952 -6 -247 -869 -234 -276 24 -68 246 227 -106 473 321 -517 1070 -532 -346 905
2927 905 -956 -282 722 -701 658 721 8 1086 569 110 29 -214 -141 -359 698 592 -228 1399 64
2946 64 -302 1012 -755 -45 810 -1136 276 466 -994 138 -300 -452 414 241 476 18 20 -86 -768
2965 -768 -2 -697 -604 752 -740 77 745 -1174 195 -438 -1100 388 -642 -655 184 -747 -118 -200 -270
$$ packed form
2834c02O51j345J661p44j104J807r58L42Q97j527J770r86j149J157o73J35O09
2851B41L56o03m2P35P35j148N00j070n0J537j104n90J428j153K16Q88r22L32N06
2870G92m90l24n0J78r09P59O44j498J604J24j721K249j569q81J846j702M68Q69
2888C89j101O83N7m94L31r3O27p02L10R5j192J040l01j248J981j116J95J449j428
2907e18N17P09j660R46k41o22O35m2L00r2L14j9l33N79j52q38J587j602J86J251
2927I05j861O74J004j423J359O3p13J078n17m59q1k43P3k18J057j06q20J627j335
2946F4l66J314j767P10Q55j946J412J90j460J132m38j52Q66j73K35m58Kj06o82
2965g68P66o95R3J356j492Q17O68j919J369o33o62J488j030j3Q39r31O29q2p0
$$ plain form
2984 -270 171 -56 545 104 248 355 -989 -155 -200 -1295 724 171 -297 1095 184 -36 533 -284 -370
3003 -370 191 -52 121 192 587 -407 227 894 -800 819 828 -959 1020 523 -1142 892 -483 -887 982
3022 982 -28 314 1060 280 -196 -44 -63 -871 -384 799 -586 342 926 -947 405 170 -829 601
3040 601 -70 -512 426 -743 -415 41 -927 21 -244 67 -169 290 467 -731 -349 -456 -972 -441 -247
3059 -247 -562 585 -161 209 468 -717 317 6 -718 355 -283 -398 381 -415 -119 -92 351 342 177 1222
3079 1222 218 -24 830 -1150 -283 781 -817 846 1347 -223 1173 544 -610 492 509 -72 88
3096 88 527 182 -226 523 -254 -484 1096 -557 176 1219 -951 160 494 -1459 -429 22 -722 0
3114 0 267 23 2 -10 -397 -1001 19 -884 -842 847 -684 -305 265 -1015 27 112 -592 398 -34 -337
$$ packed form
2984b70M41k27O01m41J44J07j344Q34m5j095K019n53m68J392r11k20N69q17q6
3003c70N61k43J73P1L95r94O34O67j694J619Rj787J979m97j665K034j375m04J869
3022I82j010L42P46p80m76J52j9q08M87J183j385R28N84j873J352k35r99J430
3040F01o71m42R38j169L28M56r68R48k65L11k36M59J77j198L82j07n16N31J94
3059b47l15J147p46L70K59j185J034l11p24J073o38j15P79p96K96K7M43rj65J045
3079A222j004k42Q54j980Q67J064j598J663N01j570J396o29j154J102J7n81J60
3096H8M39l45m08P49p77k30J580j653P33J043k170J111L34j953J030M51p44P22
3114@K67k44k1j2l87o04J020r03M2J689j531L79N70j280J042Q5p04R90m32l03
$$ plain form
3134 -337 -112 -660 -600 -390 -471 87 20 538 350 21 414 -697 -305 141 -563 275 439 -347 776 303
3154 303 -17 635 -185 132 718 -52 355 556 -93 -219 -362 420 -162 881 948 164 818 14 -936 284
3174 284 -630 -687 877 -168 337 1064 -161 -65 32 -170 -327 -144 91 -452 122 59 -834 -41 -142 -908
3194 -908 693 151 -470 583 -714 -1081 -72 -1055 -356 43 -198 -14 326 344 -260 -102 -129 -765 -88
3213 -88 289 -579 773 107 -529 496 -288 -58 553 73 513 257 29 -77 -281 -19 -192 71 794 475
3233 475 573 550 -126 339 -300 -129 432 -67 509 954 -426 318 196 -225 399 0 97 549 -148 19 -308
3254 -308 -215 -214 -402 637 384 207 790 -174 -170 172 -935 -50 -107 -614 373 -139 -190 159 -123 -156 -352 -321
3276 -321 -159 -300 236 -658 -500 -58 -919 -307 356 -456 541 431 -586 15 -364 -543 -160 -255 -143 47
$$ packed form
3134c37K25n48O0K10q1N58o7N18j88l29L93j111L92M46p04Q38J64p86J123m73
3154C03l20O52q20L17N86p70M07K01o49j26j43P82n82J043O7p84O54q04r50J220
3174B84r14n7J564j045N05P27j225R6R7k02j57J83K35n43N74o3q93P93j01p66
3194i08J601n42o21J053j297l67J009r83O99L99k41J84L40J8o04J58k7o36O77
3213h8L77q68J352o66o36J025p84K30O11m80M40k56k28j06k04K62j73K63P23l19
3233D75R8k3o76M65o39J71N61m99N76M45j380P44j22m21O24l99R7M52o97J67l27
3254c08R3Jj88J039k53j77N83r64ML42j107Q85n7n07R87n12n1L49k82l3j96L1
3276c21J62j41N36q94J58M42q61O12O63q12R97j10j017O01l79j79L83r5J12J90
$$ plain form
3296 47 92 369 82 348 -467 -226 400 37 283 564 -224 367 74 -239 493 -89 279 771 438 393 116
3317 116 -150 139 -277 18 43 227 689 24 248 521 -303 126 -12 -263 699 -73 39 519 -491 98
3337 98 235 -471 107 107 32 251 -336 -324 -621 -712 -256 -664 294 242 -346 239 -301 -677 -48 -770 -80 -129 -474
3360 -474 136 147 -162 89 -314 -79 -175 -108 566 -336 127 128 -660 74 -101 46 760 394 686 418 -312 360
3382 360 -309 -6 375 13 480 441 202 336 -23 273 206 -103 581 44 389 563 -458 160 266 -749
3402 -749 704 -162 177 693 -185 -77 152 -469 -496 -483 64 236 -27 505 -101 -320 -17 -512 -181 46
3422 46 -405 247 -471 -415 149 -581 -174 -307 89 212 -269 202 -165 -313 -392 -677 -508 593 -137 176 -49
3443 -49 -409 360 -447 -529 123 154 840 -88 -356 457 276 156 713 123 1210 255 715 644 -166 -365 -1193
$$ packed form
3296D7M5K77k87K66q15K41O26l63K46K81p88N91k93l13P32n82L68M92l33m5k77
3317A16k66K89m16K95K5J84M62o65K24K73q24M29j38k51R62p72J12M80j010N89
3337I8J37p06N78%p5K19n87J2k97r1M56m08R58n2n88N85n40l76O29p22O90m9l45
3360d74O10J1l09K51m03K35r6O7O74r02M63Jp88P34j75J47P14l66K92k68p30O72
3382C60o69L03L81l62M67l9k39J34l59K96o7l09O84n37L45J74j021O18J06j015
3402g49J453q66L39N16q78J08K29o21k7J3N47J72k63N32o06k19L03m95L31K27
3422D6m51O52p18N6N64p30M07j33L96J23m81M71l67j48p9k85J69J101p30L13k25
3443d9l60P69q07q2O52L1O86r28k68Q13j81j20N57n90J087r55M60p1q10j99q28
$$ plain form
3464 -1193 368 -338 559 -64 984 128 918 69 -22 636 271 -57 707 -408 -3 -159 -753 -101 -258
3483 -258 437 -145 -83 384 -58 -127 -111 -494 -582 391 -874 475 745 386 620 -372 -544 427 4 -295 2
3504 2 785 193 -547 -39 -686 -173 495 -554 519 -95 -86 -238 -17 -455 -191 -180 193 232 302 319 -105 201
3526 201 -181 -336 -10 -66 -34 694 63 545 340 -146 109 -219 116 428 367 274 277 -113 360 -154 -63 233
3548 233 172 516 242 180 212 -250 -147 134 49 443 -66 117 574 -50 42 194 -601 101 -6 -134 189 -91
3570 -91 -437 -285 -656 -232 -343 -103 157 -266 265 -268 -495 47 -667 -477 203 -120 269 96 -208 50
3590 50 -359 -166 -106 -232 104 -154 90 -74 -546 116 227 -108 616 101 -27 269 -450 86 26 -266 177
3611 177 -127 431 331 257 348 -89 -14 312 -353 257 556 -78 336 433 -59 99 -253 180 -131 96 417
$$ packed form
3464a193J561p06Q97o23J048q56P90q49r1O58l65l28P64j115M05j56n94O52j57
3483b58O95n82O2M67m42o9J6l83q8R73j265J349K70l59K34r92j72R71m23k99K97
3504BP83n92p40N08o47N13O68j049J073o14Rj52K21m38K64J1L73L9P0J7m24L06
3526B01l82j55L26n6L2P28o31M82k05m86K55l28L35L12o1r3Ll90M73n14R1K96
3548B33o1L44k74o2L2m62J03K81q5L94n09J83M57o24R2J52p95P02j07j28L23k80
3570i1l46J52l71M24j11K40K60m23N31n33k27N42p14J90O80l23L89j73l04K58
3590E0m09J93O0j26L36k58K44j64m72O62J11l35P24n15j28K96p19N36o0k92M43
3611A77l04N58j00p4R1m37P5L26o65O10K99o34M14R7m92J58l52M33l11K27L21
$$ plain form
3632 417 -52 94 -187 -379 -73 -346 -218 225 169 -70 101 -261 -251 -484 -253 -131 -283 -46 -98 -249 125
3653 125 -238 -683 -151 -458 17 -53 -138 -7 -215 -349 -351 -454 -82 -53 -136 -59 -365 11 -293 -370 41 -80 141
3676 141 339 279 110 318 -14 77 13 13 4 207 580 92 177 371 -183 401 271 61 289 131 98 503 279
3699 279 189 308 -86 371 294 189 324 -55 86 -180 -131 -50 -163 46 205 -286 107 -72 -310 -148 -498
3720 -498 119 -137 -79 132 -439 -462 -63 -688 -199 -359 -303 121 -49 -225 -139 -509 89 -262 -83 -48 -260 281
3742 281 -116 -420 117 -211 -167 343 -161 129 122 -154 237 -205 -3 105 -45 368 344 193 544 -60 281
3763 281 -99 -128 309 124 261 369 -119 187 68 -181 299 10 433 356 47 126 -73 -150 -78 -260 288 336
3785 336 -70 456 -6 -232 -35 -556 119 -195 -184 215 64 -219 199 -197 -324 -154 -229 28 -76 194 -226
$$ packed form
3632D17m69J46k81j92L06k73J28M43n6k39J71l62J0k33K31J22j52K37n2j51L74
3653A25l63m45N32l07M75p0q5J31k08j34kj03L72K9q3P7l06L76l04p7M11j21K21
3676A41J98o0j69K08l32R1o4%rK03L73m88Q5J94n54N84j30k10K28j58l3M05k24
3699B79r0J19l94M57p7j05J35l79J41k66M9Q1j13K09J59m91L93j79k38J62l50
3720d98O17k56N8K11n71k3L99o25M89j60N6M24j70j76Q6l70N98l51J79L5k12N41
3742B81l97l04N37l28M4N10n04K90pk76L91m42K02J08j50M13k4j51L51o04L41
3763B81l80k9M37j85J37J08m88L06j19k49M80k89M23p7l09P9j99p7P2j82N48M8
3785C36m06N26m62k26J97n21O75l14J1L99j51k83M18l96j27J70p5K57j04K70m20
$$ plain form
3806 -226 -432 82 -420 -218 137 -168 164 223 -123 285 -72 140 -407 -145 342 -251 -515 -24 -334 -1123
3826 -1123 203 -455 -268 -112 596 348 563 -242 555 -305 180 -85 445 446 31 434 115 108 348 15 187
3847 187 354 180 357 37 -32 224 -76 -63 -294 -190 376 9 -28 257 -272 70 39 -202 48 80 -160 -269
3869 -269 -73 -419 -415 -254 -347 -435 384 -33 -349 242 -336 -484 214 -180 89 8 -171 -91 -206 -416 101 -381
3891 -381 12 25 -206 332 31 183 194 -660 158 -186 -275 368 128 149 249 -21 68 94 21 137 47 31 98
3914 98 35 163 -250 148 270 -206 277 366 197 209 -63 -91 -7 -264 183 197 19 415 8 72 -105 -97 3
3937 3 181 -158 179 -241 10 -163 25 -22 -303 23 -289 -86 65 -148 -414 12 -229 -411 -143 -278 176
3958 176 -49 6 139 -258 -216 -228 -98 401 -84 -183 147 -336 -164 242 -332 165 -116 58 307 187 203 -269
$$ packed form
3806b26k06N14n02K02L55l05L32N9l46M08l57K12n47K62M87n93k64M91l10p89
3826a123J326o58J87J56P08k48K15q05P97q60M85k65N30Jm15M03l19pK40l33J72
3847A87J67j74J77l20o9K56l00J3k31J04N66l67l7K85n29L42l1k41K50L2k40j09
3869b69J96l46MJ61r3q8Q19m17l16N91n78j48O98l94K69q1j79Q0j15k10N17m82
3891c81L93J3k31N38l01J52J1q54Q18l44q9O43k40K1J00k70Q9K6p3J16r0j6O7
3914I8o3J28m13L98J22m76M83Q9j69J2k72k8Q4k57M47J4j78L96m07O4j77QJ00
3937CJ78l39L37m20K51j73J88m7k81L26l12K03J51k13k66M26k41j82K68j35M54
3958A76k25N5J33l97M2j2J30M99m85r9L30m83J72M06n74M97k81J74K49j20J6m72
$$ plain form
3980 -269 103 -88 -122 449 71 60 408 76 103 132 -103 16 168 -129 215 154 35 233 206 168 135 166 -53
4003 -53 270 277 -152 -120 283 -56 -40 475 -182 145 186 -225 25 -251 -155 -185 -197 -14 194 -268 -127 -275 -87
4026 -87 -162 -160 70 -478 -107 -365 -178 -428 93 -355 -172 584 -295 389 -212 66 -69 -395 -7 76 -260 -55
4048 -55 -229 22 -27 37 111 -170 157 -31 -251 353 0 106 224 -226 -110 437 -207 216 178 165 168 195 15
4071 15 200 231 313 -132 247 227 248 468 0 -69 299 -180 223 194 89 42 180 -166 128 -17 -62 -114 -246
4094 -246 -141 -251 -235 -133 -382 -205 -66 -126 143 117 51 -316 -194 93 -98 -320 57 -365 -190 51 -201
4115 -201 -262 -235 -65 166 -194 197 26 -51 -35 -248 -167 154 -90 109 146 -1 -24 -61 16 271 -14 -135 341
4138 341 149 250 163 155 -130 115 341 141 84 268 -1 123 -11 -246 454 -15 115 67 207 179 74 107
$$ packed form
3980b69L72j91l4N71l78j1L48l32K7K9k35J19J52k97L44o1j19J98k7l8l3L1k19
4003e3L23Pm29L2M03l39J6N15o57L27M1m11K50k76R6l0j2J83K08m62J41j48J88
4026h7p5KK30n48L71k58J87k50N21m48J83P56q79O84o01K78j35l26L88Q3l36K05
4048e5j74K51m9O4P4k81L27j88k20O04l53J06J18m50J16N47o44M23l8j3LK7j80
4071A5J85L1Q2m45L79k0K1K20m68o9L68m79M03k9j05m7J38l46K94j45m5n2j32
4094b46J05j10J6J02k49J77J39o0K69k6o6l67J22K87j91k22L77m22J75K41k52
4115b01o1K7J70K31l60L91j71p7J6k13Q1L21k44J99L7j47k3l7P7K55k85j21M76
4138C41j92J01q7qk85K45K26k00n7J84k69J24j34k35P00m69J30m8J40k8j05L3
$$ plain form
4160 107 -1 -316 -57 42 -88 288 -167 -97 98 -247 -7 112 -59 -165 -133 186 55 -104 -36 -85 -313 35
4182 35 -66 121 31 -165 -60 -423 -311 -211 -292 -33 306 -171 48 -275 -287 40 -239 261 -97 81 178 45
4204 45 37 98 134 323 69 213 260 199 350 28 -155 280 115 49 353 -119 136 288 96 227 -12 258 230
4227 230 -199 -141 364 178 237 49 317 -134 -90 92 -120 -112 -27 -155 -89 27 -225 109 -243 -38 7 -99 88
4250 88 -195 -65 -275 -352 210 -223 -44 322 -320 -50 -169 -277 -26 -116 -191 118 -208 -260 276 -192 -59 -98
4272 -98 179 -49 -96 166 -42 -118 -26 -82 51 -48 -43 246 -83 57 231 116 -164 254 116 157 -217 4 219
4295 219 95 199 14 326 314 -93 430 162 -104 154 -31 -393 31 212 -161 403 5 -122 -133 136 -198
4316 -198 -25 -115 94 132 -97 141 -25 -61 2 13 19 -164 -236 -208 -127 43 -260 -149 23 104 -140 23 -122 -125
$$ packed form
4160A07j08l15K59R9j30L76m55P0J95l45K40J19j71j06L2L19j31j59O8m9k28L48
4182C5j01J87r0j96J05l63J12J00q1K59L39m77K19l23j2L27k79N00l58J78R7j33
4204D5qO1L6J89k54J44M7o1J51l22j83M35j65o6L04m72K55J52j92J31k39K70k8
4227B30m29N8N05j86N9j88K68m51M4J82k12QQ5j28O6J16k52L34l52K05M5j06J87
4250H8k83J30k10p7N62m33J79L66o42K70j19j08K51r0p5L09l26n2N36m68J33l9
4272i8K77k28m7K62k08p6R2n6J33r9NK89l29J40J74j15k80M18j38M1l74K21K15
4295B19j24J04j85L12j2m07N23k68k66K58j85l62M24J81l73N64l98j27j1K69l34
4316a98J73r0K09L8k29K38j66l6O3J1Oj83p2K8Q1J70l03J11J72Q1k44J63j45l
$$ plain form
4340 -125 -9 -6 -178 5 74 48 -236 -118 195 -123 -182 55 202 -319 260 29 -371 18 32 82 37 -75 -127
4363 -127 56 361 -118 -52 236 105 -142 60 -121 -302 39 -193 212 105 -70 -395 978 321 161 642
4383 642 -293 -76 -167 671 27 -122 133 101 56 201 69 -22 73 -174 550 444 -1057 13 228 -123 -75
4404 -75 -193 -536 81 -619 -185 -33 -120 -225 -180 -337 -39 70 -10 6 32 -402 48 -144 -31 -178 -67 95
4426 95 -170 -313 283 -22 -6 -139 2 129 -7 167 186 27 175 -184 -247 264 281 174 1 27 -102 123
4448 123 73 -42 209 181 104 -46 15 -212 55 90 -89 108 157 102 307 -32 -283 -12 -73 -274 258 -37 -11
4471 -11 145 -324 -40 31 -217 -244 48 51 -196 -29 207 148 -125 55 -151 -48 -150 -109 149 -288 -162 178
4493 178 -242 -47 159 -7 -207 -6 86 -101 168 80 -12 100 172 -29 381 16 73 97 240 -112 -53 35 216
$$ packed form
4340a25J16Lj72J83O9k6k84J18L13l18n9K37J47n21N79k31m00L89J4N0m5j12n2
4363a27J83L05m79O6K88j31k47K02j81j81L41k32M05j07j75l25J373o57j60M81
4383F42r35K17r1Q38o44j49K55l2m5J45j32r1R5k47P24j06j501J070K15l51M8
4404g5j18l43O17p00M34J52q7j05M5j57K98J09q0J6K6m34M50j92J13j47J11J62
4426I5k65j43N96l05J6j33J41J27j36J74J9j59J48l59o3N11J7j07j73K6j29K25
4448A23n0j15K51k8p7j50O1k27K67L5j79J97M9n5K05l39k51K71o1k01N32k95K6
4471a1J56m69K84P1k48k7K92Lk47J67K36n9k73J80k06J03j02M1K58m37J26L40
4493A78m20J95K06j66k00K01R2j87K69q8r2J12P2k01M10l65N7K4J43l52N9Q8J81
$$ plain form
4516 216 188 22 47 98 143 45 260 147 101 265 -59 -105 113 -10 -25 27 -67 -22 190 -39 210 -41 -335 103
4540 103 76 109 101 254 187 -3 -8 -314 98 59 -134 -210 185 -334 -411 52 -517 -66 150 -98 -17 -92 -111 117
4564 117 27 -102 22 7 -127 -100 46 -241 -24 247 -148 -63 -2 -185 76 -98 39 148 -20 -80 -171 -32
4586 -32 -132 149 485 12 249 153 -178 169 76 -64 8 87 -204 262 125 118 170 8 6 146 29 -12 0 -85
4610 -85 -100 49 240 2 -172 -5 109 188 -205 -57 -166 59 193 308 101 -70 136 -344 76 -167 -210
4631 -210 -2 140 -49 -104 63 -80 -228 -56 -7 -234 66 65 89 -116 -92 -288 -175 206 -155 -18 -158 -136
4653 -136 181 -51 -95 -98 -32 -44 146 -51 -11 358 -244 -106 26 39 197 15 53 -83 198 133 -2 30 151
4676 151 37 333 -215 148 123 -287 -40 123 36 14 216 -209 -32 269 -36 -21 -34 21 10 7 -231 68 96
$$ packed form
4516B16k8j66K5N1M5r8K15j13m6J64l24m6K18j23j5N2r4M5K12k29K49k51k94M38
4540A03k7L3qJ53o7j90nl06M12l9j93p6L95n19p7M63n69M51K16k48Q1p5j9K28
4564A17r0j29J24j5j34K7J46k87K17K71l95Q5O1j83K61j74J37J09j68o0r1J39
4586c2j00K81L36m73K37r6l31L47r3j40P2P9k91M66j37pN2j62kJ40j17m1J2q5
4610h5j5J49J91k38j74J67J14P9l93J48j09K25J34J15k07j71K06m80M20k43m3
4631b10K08J42j89n5J67j43j48J72M9k27L00jK4k05K4j96J13L81l61J37j40K2
4653a36L17k32m4lO6j2J90j97M0L69o02J38J32J3J58j82L8j36K81o5j35L2J21
4676A51j14K96n48L63k5m10K47J63q7k2K02m25J77L01l05J5j3N5j1lk38K99K8
$$ plain form
4699 96 -36 98 36 -223 -7 130 -99 -155 224 -246 -5 -216 -279 -109 -62 219 67 -11 -186 119 234 149
4721 149 431 -177 -82 -42 371 -188 176 165 -347 183 -103 514 150 466 -256 88 928 391 879 -258 -383
4742 -383 1112 -356 960 1002 -363 261 -106 -50 -57 148 338 396 -143 -295 712 -240 -216 326 375 -429 162
4763 162 -848 -99 -145 -313 73 -56 702 -66 616 440 553 452 148 13 342 329 133 -175 169 -647
4783 -647 1213 93 3 -96 262 850 -94 -10 -68 -670 -294 46 -220 -99 55 142 -429 -400 27 105 -123 -399
4805 -399 -2 -354 -145 370 -96 8 505 -572 -52 105 9 2 83 -50 -44 175 106 176 192 -37 -200 208 -222
4828 -222 -53 17 -82 82 -31 -178 -55 346 -50 214 -28 90 -29 299 56 -115 184 -246 119 -61 15
4849 15 -40 132 -24 16 -168 43 -295 53 -258 -102 80 -275 -85 2 -99 -163 -179 -403 162 14 -156 179
$$ packed form
4699I6j32J34o2k59K16J37k29n6L79m70K41k11o3J70M7K81j52p8j75L05J15q5
4721A49K82o08R5M0M13n59L64j1n12N30k86O17l64L16p22L44Q40n37M88j137j25
4742c83J495j468J316M2j365O24l67N6pK05J90N8n39j52J007r52K4N42M9q04N91
4763A62j010P49m6j68L86j29P58p68O82j76J13j01l04j35L29j3j96l08L44q16
4783f47J860j120r0r9L58N88r44Q4n8o02L76L40k66J21J54Q7n71K9M27P8k28k76
4805c99L97l52K09N15m66J04M97j077N20J57r6pQ1j33OK19o9P0J6k29j63M08m30
4828b22J69P0r9J64j13j47J23M01l96K64k42J18j19L28k43j71K99m30L65j80P6
4849A5n5J72j56M0j84K11l38L48l11J56J82l55J90Q7j01o4j6k24N65j48j70L35
$$ plain form
4871 179 53 -59 -107 62 -86 271 267 89 257 108 72 -144 -74 147 -61 216 -227 310 248 46 -306 258
4893 258 4 190 132 97 -21 -184 -247 -354 97 -131 270 99 -100 490 5 591 93 -449 349 -186 207
4914 207 -82 2 447 -357 -426 525 -751 -45 86 94 227 -9 16 -243 -60 -189 -87 -601 -242 275 17
4935 17 473 -152 213 -284 160 175 -473 -64 -459 224 361 52 262 -305 -226 -113 -8 147 -471 196 55
4956 55 -128 220 -30 347 132 58 160 -113 48 -177 82 7 172 -24 157 -154 120 39 227 385 77
4977 77 177 382 -110 -176 -94 -399 -12 246 -119 295 183 -33 -132 -137 -55 -86 222 -204 -83 111 -145 -18 -68
5000 -68 -231 98 90 -176 6 -73 -113 11 -60 -241 -61 131 -8 -26 34 -70 -30 -219 -294 -106 272 -131 63
$$ packed form
4871A79j26j12m8J69j48L57mj78J68j49l6k16P0K21k08K77m43N37o2k02l52N64
4893B58k54J86n8l5j18j63o3j07M51k28M01j71j99N90m85N86m98n42P98n35L93
4914B07k89Q4M45q04o9R51j276P06J31QJ33k36K5k59J83j29J02n14L59N17k58
4935A7M56o25L65m97M44J5o48M09l95O83J37l09K10n67P9J13J05J55o18O67j41
4956E5j83L48k50L77k15p4J02k73J61k25K59p5J65j96J81l11K74q1J88J58l08
4977G7J00K05m92o6Q2l05L87K58l65M14j12k16r9nQ2l1L08m26J21J94k56J27n0
5000f8j63L29qk66J82p9m0J24p1j81J80J92j39j8O0j04M0j89p5J88L78m03J94
$$ [...]
8191a15
##END NTUPLES=NMR FID
##END=
