##TITLE=1H_SL84-Dau(f9-f2)
 CDCl3, 8 sc, 
 3.06.2021
##JCAMPDX= 6.0         $$ Bruker NMR JCAMP-DX V2.0
##DATA TYPE= NMR FID
##DATA CLASS= NTUPLES
##ORIGIN= UXNMR, Bruker Analytische Messtechnik GmbH
##OWNER= root
$$ XWIN-NMR		Version 3.5
$$ Thu Jun  3 12:46:34 2021 Russian Standard Time (UT+4h)  she@DPX200
##.OBSERVE FREQUENCY= 200.131506
##.OBSERVE NUCLEUS= ^1H
##.DELAY= (6, 6)
##.ACQUISITION MODE= SIMULTANEOUS
##.ACQUISITION SCHEME= undefined
##.AVERAGES= 8
##.DIGITISER RES= 18
##SPECTROMETER/DATA SYSTEM= spect
##.PULSE SEQUENCE= zg30
##.SOLVENT NAME= CDCl3
##.SHIFT REFERENCE= (INTERNAL, CDCl3, 0, 15.7039)
##AUDIT TRAIL= $$ (NUMBER, WHEN, WHO, WHERE, WHAT)
$$ ##TITLE= Audit trail, XWIN-NMR		Version 3.5
$$ ##JCAMPDX= 5.01
$$ ##ORIGIN= Bruker BioSpin GmbH
$$ ##OWNER= she
$$ F:/spectra/data/she/nmr/H-F/1/audita.txt
$$ ##AUDIT TRAIL=  $$ (NUMBER, WHEN, WHO, WHERE, WHAT)
(   1,<2021-06-03 12:44:51.82 +0400>,<she>,<DPX200>,
      <created by zg, POWCHK disabled, PULCHK disabled
       configuration hash MD5:
       00 E9 B6 7A A2 85 ED C7 34 08 36 98 17 FE 4E 26
       data hash MD5: 16K
       70 0F 9E BE 66 A4 61 A2 A8 84 DF 02 21 D4 2E 2D>)
$$ ##END=
$$ 
$$ hash MD5
$$ 4B 04 71 9A 19 9F E5 F0 2E 8B AB 8D A3 E7 5B D8
##$RELAX= 
##$RELAX= 
##$RELAX= 
##$RELAX= 
##$RELAX= 
##$RELAX= 
$$ Bruker specific parameters
$$ --------------------------
##$DU= <F:/spectra>
##$EXPNO= 1
##$NAME= <H-F>
##$PROCNO= 1
##$TYPE= <nmr>
##$USER= <she>
##$AMP= (0..31)
100 100 100 100 100 100 100 100 100 100 100 100 100 100 100 100 100 100 
100 100 100 100 100 100 100 100 100 100 100 100 100 100 
##$AQSEQ= 0
##$AQ_mod= 1
##$AUNM= <au_zg>
##$AUTOPOS= <>
##$BF1= 200.13
##$BF2= 200.13
##$BF3= 200.13
##$BF4= 200.13
##$BF5= 200.13
##$BF6= 200.13
##$BF7= 200.13
##$BF8= 200.13
##$BYTORDA= 1
##$CFDGTYP= 0
##$CFRGTYP= 5
##$CHEMSTR= <none>
##$CNST= (0..31)
1 1 145 1 1 1 1 1 1 1 1 1 1 1 1 1 1 1 1 1 1 1 1 1 1 1 1 1 1 1 1 1 
##$CPDPRG= <>
##$CPDPRG1= <>
##$CPDPRG2= <>
##$CPDPRG3= <>
##$CPDPRG4= <mlev>
##$CPDPRG5= <mlev>
##$CPDPRG6= <mlev>
##$CPDPRG7= <mlev>
##$CPDPRG8= <mlev>
##$CPDPRGB= <>
##$CPDPRGT= <>
##$D= (0..31)
0 1.2 0 0 0 0 0 0 0 0.06 0 0.03 0 0 0 0 0.0002 0 0 0 0 0 0 0 0 0 0 0 0 
0 0 0 
##$DATE= 1622709891
##$DBL= (0..7)
120 120 120 120 120 120 120 120 
##$DBP= (0..7)
150 150 150 150 150 150 150 150 
##$DBP07= 0
##$DBPNAM0= <>
##$DBPNAM1= <>
##$DBPNAM2= <>
##$DBPNAM3= <>
##$DBPNAM4= <>
##$DBPNAM5= <>
##$DBPNAM6= <>
##$DBPNAM7= <>
##$DBPOAL= (0..7)
0.5 0.5 0.5 0.5 0.5 0.5 0.5 0.5 
##$DBPOFFS= (0..7)
0 0 0 0 0 0 0 0 
##$DE= 6
##$DECBNUC= <off>
##$DECIM= 32
##$DECNUC= <off>
##$DECSTAT= 4
##$DIGMOD= 1
##$DIGTYP= 9
##$DL= (0..7)
0 120 120 120 120 120 120 120 
##$DP= (0..7)
150 150 150 150 150 150 150 150 
##$DP07= 0
##$DPNAME0= <>
##$DPNAME1= <>
##$DPNAME2= <>
##$DPNAME3= <>
##$DPNAME4= <>
##$DPNAME5= <>
##$DPNAME6= <>
##$DPNAME7= <>
##$DPOAL= (0..7)
0.5 0.5 0.5 0.5 0.5 0.5 0.5 0.5 
##$DPOFFS= (0..7)
0 0 0 0 0 0 0 0 
##$DQDMODE= 0
##$DR= 18
##$DS= 0
##$DSLIST= <SSSSSSSSSSSSSSS>
$$ [...]
##$SUBNAM2= <"">
##$SUBNAM3= <"">
##$SUBNAM4= <"">
##$SUBNAM5= <"">
##$SUBNAM6= <"">
##$SUBNAM7= <"">
##$SUBNAM8= <"">
##$SUBNAM9= <"">
##$SW= 20.0188882624521
##$SWIBOX= (0..15)
0 0 2 0 0 0 0 0 0 0 0 0 0 0 0 0 
##$SW_h= 4006.41025641026
##$TD= 16384
##$TD0= 1
##$TE= 0
##$TE2= 300
##$TE3= 300
##$TEG= 300
##$TL= (0..7)
0 120 120 120 120 120 120 120 
##$TP= (0..7)
150 150 150 150 150 150 150 150 
##$TP07= 0
##$TPNAME0= <>
##$TPNAME1= <>
##$TPNAME2= <>
##$TPNAME3= <>
##$TPNAME4= <>
##$TPNAME5= <>
##$TPNAME6= <>
##$TPNAME7= <>
##$TPOAL= (0..7)
0.5 0.5 0.5 0.5 0.5 0.5 0.5 0.5 
##$TPOFFS= (0..7)
0 0 0 0 0 0 0 0 
##$TUNHIN= 0
##$TUNHOUT= 0
##$TUNXOUT= 0
##$USERA1= <user>
##$USERA2= <user>
##$USERA3= <user>
##$USERA4= <user>
##$USERA5= <user>
##$V9= 5
##$VALIST= <valist>
##$VCLIST= <CCCCCCCCCCCCCCC>
##$VD= 0
##$VDLIST= <DDDDDDDDDDDDDDD>
##$VPLIST= <PPPPPPPPPPPPPPP>
##$VTLIST= <TTTTTTTTTTTTTTT>
##$WBST= 1024
##$WBSW= 4
##$XGAIN= (0..3)
0 0 0 0 
##$XL= 0
##$YL= 0
##$YMAX_a= 214015
##$YMIN_a= -157290
##$ZGOPTNS= <>
##$ZL1= 120
##$ZL2= 120
##$ZL3= 120
##$ZL4= 120
##$ABSF1= 10
##$ABSF2= 0
##$ABSG= 5
##$ABSL= 3
##$ALPHA= 0
##$AQORDER= 0
##$ASSFAC= 0
##$ASSFACI= 0
##$ASSFACX= 0
##$ASSWID= 0
##$AUNMP= <proc_1d>
##$AZFE= 0.1
##$AZFW= 0.1
##$BCFW= 1
##$BC_mod= 2
##$BYTORDP= 1
##$COROFFS= 0
##$CY= 11.3945322036743
##$DATMOD= 1
##$DC= 2
##$DFILT= <>
##$DTYPP= 0
##$F1P= 15.9154993809931
##$F2P= -4.1035820241983
##$FCOR= 0.5
##$FTSIZE= 0
##$FT_mod= 4
##$GAMMA= 1
##$GB= 0.15
##$INTBC= 1
##$INTSCL= 1
##$ISEN= 128
##$LB= 0.24
##$LEV0= 0
##$LPBIN= 0
##$MAXI= 10000
##$MC2= 0
##$MEAN= 0
##$ME_mod= 0
##$MI= 1.114404
##$NCOEF= 0
##$NC_proc= 0
##$NLEV= 6
##$NOISF1= 3.799351
##$NOISF2= 2.8
##$NSP= 1
##$NTH_PI= 0
##$NZP= 0
##$OFFSET= 15.70392
##$PC= 1
##$PHC0= -11476.75
##$PHC1= 6.800989
##$PH_mod= 1
##$PKNL= yes
##$PPARMOD= 0
##$PSCAL= 0
##$PSIGN= 0
##$REVERSE= no
##$SF= 200.130013532006
##$SI= 16384
##$SIGF1= 3
##$SIGF2= 2
##$SINO= 400
##$SIOLD= 16384
##$SREGLST= <1H.CDCl3>
##$SSB= 0
##$STSI= 0
##$STSR= 0
##$SW_p= 3612.71676300578
##$SYMM= 0
##$S_DEV= 0
##$TDeff= 0
##$TDoff= 0
##$TI= <>
##$TILT= no
##$TM1= 0
##$TM2= 0
##$TOPLEV= 0
##$USERP1= <user>
##$USERP2= <user>
##$USERP3= <user>
##$USERP4= <user>
##$USERP5= <user>
##$WDW= 1
##$XDIM= 8192
##$YMAX_p= 0
##$YMIN_p= 0
$$ End of Bruker specific parameters
$$ ---------------------------------
##NTUPLES= NMR FID
##VAR_NAME=  TIME,          FID/REAL,        FID/IMAG
##SYMBOL=    X,             R,               I
##VAR_TYPE=  INDEPENDENT,   DEPENDENT,       DEPENDENT
##VAR_FORM=  AFFN,          ASDF,            ASDF
##VAR_DIM=   8192,          8192,            8192
##UNITS=     SECONDS,       ARBITRARY UNITS, ARBITRARY UNITS
##FACTOR=    0.0002496,     1,               1
##FIRST=     0,             0,               0
##LAST=      2.0444736,     0,               0
##MIN=       0,             -157290,         0
##MAX=       2.0444736,     214015,          0
$$ Real data points
##PAGE= N=1
##DATA TABLE= (X++(R..R)), XYDATA
0 0 0 0 0 0 0 0 0 0 0 0 0 0 -8 8 -8 8 -8 16 -16 18 -24 30 -32 40 -48 56 -64 72 -81 96 -109 124 -141 158
34 158 -178 201 -225 253 -280 312 -349 387 -430 475 -524 580 -637 704 -776 855 -940 1037
52 1037 -1144 1264 -1396 1548 -1720 1921 -2154 2431 -2764 3177 -3706 4406 -5376 6820 -9184
67 -9184 13727 -25508 117297 214015 -134088 -60885 111343 -7355 -74722 56590 32215
78 32215 -29615 2735 14809 6279 35509 -2254 -33527 -4482 555 -7181 25953 12793 -20989
91 -20989 -449 22681 4480 -3719 -9544 -11190 5650 12921 3291 17253 19423 -18483 -27226 22941
105 22941 34086 -11768 -16598 13171 -3432 -12104 28605 18990 -29419 -7338 16483 -15397 2836
118 2836 30036 -30992 -45910 32090 33414 -20763 -2362 9202 -28338 -14166 21931 5671
130 5671 -12008 -4836 -1569 10112 17660 1208 -5194 -6069 -20037 -4024 30638 19611 -9014
143 -9014 -3818 7754 4247 -3371 -9267 -1340 9731 -5995 -12098 23386 25397 -24635 -30503 8695
157 8695 4460 -18891 -4 14243 -9752 -17045 6939 14225 -8456 -26672 -15584 9632 11337
170 11337 -2663 672 755 -14864 -6307 16744 7034 -13124 -7800 -509 6166 16750 5336 -11264
184 -11264 -2744 1740 -2057 10802 8157 -13114 -4175 7171 -7625 4006 20269 -12229 -25317
197 -25317 9180 6641 -15724 4318 7295 -23320 -10207 19746 3589 -15519 -6734 -5239 -10084
210 -10084 -2930 5076 6394 -3315 -15390 -3604 15106 1156 -19678 -8719 4933 -368 632
223 632 11189 3627 -14158 -11884 5700 8252 -7216 -11993 1996 8671 -768 -3239 7699 724
237 724 -24077 -12090 23772 10215 -22787 -99 19147 -12609 -13148 21408 5121 -23278 -1819
250 -1819 12448 3798 8889 2250 -12004 6346 10689 -10321 6365 22016 -10672 -14474 19147
263 19147 14116 -2946 5802 -909 -8688 11442 12540 -5311 1594 4351 -5710 5594 12715 -3517
277 -3517 -3745 2834 -5443 793 11277 -3168 -7392 6476 -1289 -6129 11485 4036 -19055 -5806
291 -5806 13350 904 -6708 3489 1830 -7311 -4458 2806 3906 -2649 -10209 -4816 8576 4997
305 4997 -5530 -1897 -21 -10312 -6321 11077 5714 -12814 -7209 7251 1119 -5087 1569 206
319 206 -9310 -6398 5035 9542 24 -11675 -3985 9808 -289 -9401 6228 8439 -11921 -6332
333 -6332 15107 8030 -7642 -4513 2078 3759 4083 -323 1750 5961 -3846 -3314 13258 8138 -9509
348 -9509 -63 8996 -1711 2402 12175 -1519 -6933 6681 6627 1144 5855 926 -6808 3231 8679
363 8679 3004 1841 -1251 -4250 5102 5751 -5002 2186 6162 -11344 -6005 17041 4311 -14695
377 -14695 -153 6509 -7050 -2321 7357 -2364 -6014 -1049 -1831 3277 4869 -8217 -7327 5956
391 5956 -1965 -7252 8528 4770 -15017 -5543 11499 1793 -9179 -2201 2759 -3142 -4912 3548
405 3548 6850 -6301 -13263 2502 10447 -4888 -8280 3744 -287 -8547 2187 8261 -3972 -9112
419 -9112 -136 4243 1458 -210 -1220 -1776 -322 741 1620 4627 2264 -5897 -2411 9282 5272
434 5272 -4585 1366 4129 -3786 1010 8695 -87 -2977 2813 -2807 -1452 10007 2421 -10875 -1640
449 -1640 5587 -521 -968 -32 -2864 -1728 -3805 -2609 7709 693 -15235 -2186 11097 -5062
463 -5062 -8431 6446 -1530 -11457 1563 6712 -2344 -4805 -4410 -494 6937 -978 -8430 4668 4217
478 4217 -11822 -1837 13135 -1824 -10654 1894 3139 -3834 181 2349 -2901 -4046 -2246 1459
492 1459 4759 -2768 -8210 1308 3329 -5903 -9 7146 -4918 -9663 5234 8076 -3584 -3190 2047
507 2047 -811 98 4351 2660 517 428 -1731 1897 8434 2433 -4759 1063 4136 18 4082 5359
523 5359 -3288 -2259 5700 417 -1796 6018 1124 -7718 1564 8200 -492 -3404 1312 64 -589
538 -589 1956 1647 2941 569 -6082 1008 11805 -104 -8189 6563 6276 -7639 2206 13541 -499
553 -499 -7912 3483 6835 3469 2075 -2743 -1111 6125 -10 -2566 7633 1094 -11635 2037
567 2037 10899 -5163 -6609 5088 -1660 -6848 3358 3169 -5281 -3653 -1999 -2026 1680 -1139 -4338
582 -4338 258 -1620 -6266 2508 5161 -6261 -6256 2861 466 -2018 2589 -301 -4953 -767 1968 662
598 662 746 -1921 -3762 1121 2325 -1092 149 -303 -4231 -1547 3231 -182 -3149 379 -922 -3083
614 -3083 1743 3973 -1916 -4379 420 2917 265 -135 2557 943 -3238 -730 6414 4879 -4126
629 -4126 -3278 6000 5378 -2602 -251 6500 1351 -5200 1658 8136 1074 -4688 -46 3444 237 -1661
645 -1661 161 1971 -2277 -5881 1553 5301 -3658 -7122 1316 410 -5345 732 2711 -6117 -6152 1541
661 1541 1008 -1367 -1862 -4194 -1871 1710 -1788 -2173 1282 -3526 -4450 3742 1207 -4356 904 1170
677 1170 -5702 -597 4955 -1418 -3330 219 -1417 -458 2917 -256 -2687 -554 -1487 162 4415 -330
693 -330 -4865 1365 2913 -1905 1687 4065 -2837 -3577 4670 4600 -691 -130 2742 1108 -300 2665
709 2665 5097 1531 -2243 337 5443 4267 -828 167 3951 732 -3050 4180 7213 -2788 -5599
724 -5599 4479 4922 -2225 -810 1931 -1498 -1560 458 1407 1942 -2854 -5259 2001 4862 -4233 -3367
740 -3367 3826 -2150 -5160 3938 2500 -4799 -1268 1028 -2735 424 3276 -2447 -3685 160 113 648
756 648 1073 -3132 -2851 1769 -1067 -2197 2590 -108 -6535 -36 4320 -2238 -3045 1467 -1496 -3218
772 -3218 1650 1665 -1890 -1187 -1276 -1025 2560 743 -2335 1098 449 -3137 2687 5667 -2857 -3428 4473
789 4473 1755 -2353 3489 3853 -2682 -1318 3523 3300 1368 -1295 -838 3788 2145 -1952 2669 4563
805 4563 -3366 -2748 6109 3829 -3393 -801 3151 233 -926 1485 2625 -601 -2965 -351 3690
820 3690 1394 -2802 -1386 1745 -212 -1479 1931 1584 -3469 -2416 2305 973 -1884 -370 -438 -2853
836 -2853 320 2217 -1239 -2315 -706 -1568 -560 1138 -1038 -1419 -670 -2788 -387 3248 -2255 -4875
852 -4875 1501 801 -3718 1344 2677 -4093 -3100 1635 381 -160 -198 -2637 -235 1931 -1676 -128
868 -128 3354 -2594 -3754 4214 2241 -3576 1087 2620 -2734 -544 4151 1422 -2231 -484 907
883 907 2593 1558 -1435 791 2219 -1428 -822 4697 2129 -3661 -632 4083 892 -951 1436 688
899 688 -1717 -481 1306 1797 76 -2332 -1289 1758 1193 -1084 -95 537 -2029 -810 2771 205
915 205 -2746 252 441 -1821 1006 2093 -2145 -2419 1231 119 -959 838 -555 -2111 -681 410
931 410 419 357 -2172 -3056 1675 1700 -2975 -1338 1991 -2300 -3498 2409 1888 -3280 -2652 375 -46 60
949 60 -214 -1262 -401 -653 -1960 1460 2628 -3100 -2501 3061 306 -2294 2692 1639 -3528 -331 4004
966 4004 745 -560 908 232 502 1814 556 1440 1736 -1694 -560 4682 1341 -2634 1716 2501
982 2501 -1900 881 4049 -249 -1513 777 1075 900 1524 -662 -138 1683 44 117 3132 160 -2569
999 -2569 1307 2439 -784 743 1557 -1729 -1118 2661 1331 -1480 -159 183 -534 -215 938 -14 -1266
1016 -1266 -2384 -1100 1672 166 -3452 -1849 982 -1508 -2832 923 518 -4304 -3207 1548 248
1031 248 -2837 -1416 -372 -1934 -1165 54 281 -231 -2464 -1977 2164 1321 -2512 -120 2216 -1943
1047 -1943 -923 3634 477 -3054 700 1711 -411 1122 1077 -982 202 815 203 2013 936 -2591
1063 -2591 556 3250 -808 -679 3081 -319 -2416 2316 2587 -737 234 887 -479 1145 2068 -9
1079 -9 512 521 -953 1845 2603 -1029 -811 1944 -485 -1122 2188 1148 -2386 -549 1254 -411 -983 390
1097 390 -263 -1572 -1167 217 348 -1145 -2459 -1133 689 -831 -1918 -154 -385 -2751 -1704 1806
1113 1806 -248 -3818 -1073 1356 -643 -1297 213 -36 -1352 -1026 472 1066 79 -1786 -311 1673
1129 1673 -290 -884 1803 309 -1971 242 2008 126 -296 642 -519 -449 1370 1233 -187 -719 106
1146 106 820 1356 543 -488 727 196 -461 1699 2193 -955 -690 2018 992 -771 1451 1719 -788
1163 -788 -135 1763 994 764 334 -79 504 856 -92 744 928 -2050 -710 2624 245 -2493 216 554
1181 554 -1795 354 1589 -1065 -1550 -84 -25 173 -413 -1819 -285 657 -1973 -760 2164 -914 -3049
1198 -3049 546 1408 -1591 -586 859 -272 -1534 -227 1010 470 -922 -1859 10 1105 -504 -997
1214 -997 -358 -383 -1055 181 1208 -1046 -1466 563 453 -935 465 927 -1475 -518 1097 121 -327 1166
1232 1166 -125 -599 1063 741 298 1367 -436 -1460 2228 1776 -1569 628 2182 -1207 36 3034
1248 3034 412 -1623 1034 1024 126 1193 429 -737 1128 -24 -728 1781 928 -2203 210 1996
1264 1996 -1242 -529 2346 -555 -2489 897 1430 -927 -598 217 -531 89 72 -265 409 -314 -2121 87
1282 87 2003 -1280 -2590 882 576 -2151 -325 1103 -1339 -1535 29 -27 -193 -584 -1468 -389 402
1299 402 -1074 -1091 1106 -614 -2059 365 874 -598 -146 -18 -1256 -60 1581 -88 -1020 401 -12
1316 -12 -789 735 897 -201 -339 88 566 1145 680 -881 -62 1434 2 -143 1904 523 -1543 789
1334 789 2053 108 -315 1025 474 -196 835 861 525 12 -628 392 1762 -144 -1304 1349 914
1351 914 -1756 240 2125 -938 -1211 1144 439 -510 319 -234 -439 198 -237 -232 1031 -862 -1884 1075
1369 1075 673 -1862 -114 1022 -1623 -1299 921 211 -1057 -397 -717 -537 331 -361 -1135 -28 -80 -1469
1387 -1469 272 832 -1298 -764 368 -649 -232 872 -698 -1268 719 413 -1268 279 810 -970
1403 -970 -846 817 684 -337 -236 -341 263 1084 -182 -56 1395 -12 -1114 1337 2096 -639 -800
1420 -800 1633 1058 -623 843 946 -151 -210 666 1005 1006 88 -485 826 1184 -630 217 1595 -464
1438 -464 -1092 1602 1305 -950 -104 824 -581 -123 821 -132 -358 -345 -491 65 1183 -893 -1313 820
1456 820 -115 -1527 773 698 -2018 -363 929 -896 -635 449 -905 -1089 595 -533 -982 180 -730
1473 -730 -1376 225 -39 -985 -73 29 -1671 183 713 -1172 -1111 705 -460 -1403 1173 659 -1363 -722
1491 -722 607 390 206 -313 129 939 108 -647 844 1909 -1223 -1055 1999 1240 -1108 386 1658
1508 1658 -157 -430 959 1080 183 -141 328 957 790 -256 -15 1090 115 -705 1317 1326 -977 -378
1526 -378 1597 12 -242 493 120 -540 327 533 -104 421 -171 -699 288 604 -556 -20 210 -946 -418
1545 -418 1094 -302 -984 310 -311 -1111 231 436 -1231 -699 377 -557 -390 241 -598 -777 56 -406
1563 -406 -215 384 -965 -979 642 63 -1519 341 626 -1675 -662 1446 233 -889 11 601 15
1580 15 167 -212 273 689 -592 -548 1533 809 -1301 102 1522 -362 -574 1082 669 -653 229 808
1598 808 338 207 -260 -85 561 562 -339 524 438 -725 -35 1102 489 -522 63 553 -160 549 706 32
1618 32 -185 360 -268 50 739 216 -464 -79 411 43 404 252 -818 -627 241 -491 -48 284 -1243 -799
1638 -799 544 95 -1081 -335 343 -1226 -519 784 -436 -593 -307 -335 175 92 -734 -473 447 -986 -897
1657 -897 1151 185 -1826 -192 1114 -781 -591 499 33 -650 -21 375 376 31 -1028 -275 1464 -194
1675 -194 -1191 861 1071 -1174 -37 1464 392 -723 349 411 -13 488 356 172 470 11 -140 1276
1693 1276 711 -568 -238 1103 240 228 822 -229 -871 667 564 -415 395 500 -242 134 705 67 -200
1712 -200 166 -277 -146 379 -216 -299 38 -219 -673 686 446 -1402 -557 718 -615 -785 734 30 -1438
1731 -1438 -37 714 -711 -355 -498 -610 310 56 -881 184 390 -1346 -540 1405 -706 -1864 680
1748 680 636 -1088 -227 560 -428 -624 -44 71 242 210 -917 -47 671 -478 -484 1335 13 -1454 483
1767 483 1414 -324 -61 716 124 114 662 237 282 972 -194 -151 944 356 -385 681 457 -401 288 949
1787 949 -315 81 397 -310 28 1100 -60 -955 624 709 -50 205 216 -264 5 150 29 310 -35
1806 -35 -843 293 879 -305 -482 753 186 -844 -119 759 -392 -722 -77 -161 -139 -362 -249 19 -214
1825 -214 -669 110 774 -588 -1268 232 520 -1019 -93 459 -579 -1104 248 336 -413 -195 -605 -39 448
1844 448 -330 -828 687 39 -902 620 914 -590 -559 702 -108 -185 754 26 -320 301 86 -187 828
1863 828 418 -721 156 755 -293 271 527 -380 56 1008 -411 -43 920 -108 -644 757 783 -692
1881 -692 -216 781 69 81 386 203 217 30 -289 299 940 -381 -795 621 484 -1010 7 912 -448
1900 -448 -914 675 491 -620 -427 22 -226 137 -475 -353 107 -605 -1110 332 748 -1187 -1021 581
1918 581 -422 -1049 464 270 -953 -630 138 38 -70 -170 -396 284 130 -379 -21 486 -396 -759 472
1937 472 423 -600 73 495 -28 -313 416 -133 -349 473 123 -212 471 328 -298 42 307 85 486 378
1957 378 -172 297 563 -190 608 1222 -532 -702 1094 869 -721 336 408 -321 -47 391 9 141 -159
1976 -159 -305 448 746 -550 -72 806 -155 -816 670 671 -1206 -507 457 -162 -204 -284 18 -210 -319 -470
1996 -470 399 221 -666 -593 335 -174 -845 129 388 -638 -463 411 -171 -496 -249 -244 -29 -190 -23 96 -105
2017 -105 -299 -541 78 306 -607 -250 395 -158 -395 248 -312 -420 178 208 -346 -2 369 -239 -12 354
2037 354 199 68 496 -44 -25 681 50 38 679 -38 -267 935 526 -398 -57 946 20 -111 612 423
2057 423 -332 216 524 264 82 -200 260 409 -290 -482 563 508 -743 -392 967 155 -544 172 426
2076 426 -192 -250 56 89 -47 -181 -286 155 -8 -464 13 334 -534 -447 463 6 -1013 -230 189 -603 -170
2097 -170 53 -309 -380 -1 -350 -205 18 -349 -253 -37 -111 -406 7 -94 -593 198 172 -434 -95 327 -163
2118 -163 -420 502 169 -390 -62 297 -33 -310 319 227 -163 -271 161 520 236 -288 -29 737 269 -254
2138 -254 736 499 -453 -198 962 166 -294 205 454 89 190 45 190 459 -305 -164 802 403 -753
2157 -753 135 838 -461 -176 497 320 -466 145 532 158 149 -35 -218 192 -125 -353 269 190 -737 -380 439
2178 439 -205 -410 391 -174 -696 -100 229 -635 -109 -106 -318 -41 214 -190 -256 0 -295 -194 99 -417 -662
2199 -662 375 35 -471 60 250 -561 -360 596 6 -190 189 203 -367 -81 395 141 74 -132 21 566
2219 566 -99 -780 234 563 -261 -190 884 304 -524 398 807 -241 -196 331 107 205 48 -253 627 395
2239 395 -801 60 792 -60 -415 626 313 -646 314 608 -168 -185 38 -184 122 110 -250 -414 303 -131
2259 -131 -321 458 -457 -381 215 224 -665 -221 109 -704 -236 140 -169 -197 102 -104 -488 115 87 -244 -240 -213 -433
2282 -433 83 82 -588 3 -50 -492 -42 435 -298 -844 388 536 -528 -186 244 178 -348 188 40 415 -5
2303 -5 -542 409 490 -331 -300 935 195 -686 403 772 -40 -192 481 452 5 244 332 99 14 -299 240 760
2325 760 -148 -180 255 174 -431 77 580 -91 -394 158 220 -123 404 208 -4 -11 154 44 254 -60 -376 282
2347 282 -99 -366 15 110 -520 -260 633 -231 -404 173 371 -464 -232 107 -245 -195 44 8 -131 -99 81
2368 81 111 48 -427 -545 257 -217 -857 291 182 -429 -343 276 -293 -649 21 87 23 -342 31 281 421 -439
2390 -439 -176 546 305 -312 370 361 -318 -275 545 393 -220 -42 588 104 -37 32 453 439 230 -62 148 220
2412 220 -301 66 336 -35 -7 385 253 -336 -46 428 153 -72 429 86 -77 28 249 -216 -233 -15 40
2433 40 -101 -99 104 27 -37 -455 -7 -96 -303 -465 148 -203 -526 180 309 -241 -402 -3 -184 -194 -430 -443 78
2456 78 -187 -468 109 322 -69 -693 410 -4 -519 -229 400 -61 -163 235 315 -168 -554 -93 290 77
2476 77 -184 -231 634 -205 -473 389 206 -311 -24 192 -32 -277 158 365 101 55 114 27 55 56 130 413 188
2499 188 22 237 226 -147 -217 385 329 -284 189 175 -156 103 273 103 37 293 -79 -191 -80 -63 52 -92
2521 -92 -264 -132 -16 20 -350 56 53 -337 59 294 -420 -744 413 285 -427 -65 84 -140 -64 -477 -149
2542 -149 143 -433 -286 104 28 -382 -161 449 -69 -407 134 225 -483 -294 278 4 -160 271 -31 112 -182
2563 -182 -123 427 18 -445 -167 462 -151 -252 354 486 -198 31 389 145 -239 252 361 -105 116 1
2583 1 141 80 -104 277 454 -11 15 273 303 -168 174 630 125 -324 353 216 -293 331 359 -235 -89 -127
2605 -127 269 -29 -221 -250 440 373 -404 -387 114 -97 -295 86 171 -545 -422 124 -53 -460 156 -272 -229 -200
2627 -200 -253 26 -32 -292 -318 323 -226 -551 72 137 -387 -158 296 -51 -239 -56 70 -575 -158 -225 -109 13
2649 13 12 -191 456 152 -334 253 454 -225 -92 431 -17 -307 232 306 -192 242 7 -293 140 182 -49 229
2671 229 222 -92 211 358 -106 -17 362 -161 -330 51 417 -33 172 221 138 -73 66 135 -26 -115 60 70 235
2694 235 2 56 33 -3 -354 -66 165 -419 96 447 -92 -460 234 48 -130 -102 294 -5 -162 -87 -207 123
2716 123 -204 -448 45 400 -393 -332 64 -103 -522 -20 237 -84 -30 336 97 -462 -18 203 -201 -357 -202
2737 -202 87 293 -38 -108 331 -32 -160 183 279 -189 -249 111 29 14 97 89 -17 62 57 171 134 -68 30 462
2761 462 149 -105 259 154 -207 6 410 108 -133 177 65 -463 143 29 120 -133 145 240 41 161 -88
2782 -88 217 191 -108 63 216 -64 -516 25 273 -164 -219 109 50 -376 -270 47 7 -357 -21 31 157 -88
2804 -88 167 107 -349 -551 89 79 -108 -276 -176 224 -437 137 94 -43 -245 37 10 -116 -146 -78 56 -95
2826 -95 -318 128 -43 -438 -91 339 198 -127 236 -16 96 -320 68 -14 -210 -42 -7 116 133 -71 -45 179
2848 179 72 -164 462 96 -226 77 -30 -47 -59 136 164 -35 129 347 11 42 130 109 100 -101 -145 166 -9
2871 -9 -400 6 200 -15 154 88 -83 -237 -94 407 -192 -168 170 -286 49 -30 182 -23 -327 -246 -227 311
2893 311 -416 -217 238 46 -406 -7 239 -103 -233 -41 -9 -46 -175 99 -220 -340 -175 55 93 -287 -122
2914 -122 -42 -364 -303 64 268 -101 -68 82 102 -48 155 270 -10 -59 -96 278 -38 -332 254 383 -69 55
2936 55 325 390 33 -90 247 86 7 41 422 -29 -131 116 67 97 247 290 83 198 -33 199 185 -64 39
2959 39 250 51 -211 -278 424 -6 -121 -50 229 16 -146 92 33 4 -90 -25 44 -228 -235 74 136 -122 81 157
2983 157 -15 -173 141 203 -47 70 213 -75 -229 104 -391 -198 -19 -253 241 8 -460 -212 -137 200 -221
3004 -221 256 62 -319 16 350 129 -314 239 100 -85 -20 81 -142 -117 66 15 78 -97 -28 496 183 -197
3026 -197 33 239 66 -37 414 151 -323 160 234 -106 160 251 4 -144 -110 185 279 262 -115 320 209 -54
3048 -54 -363 365 230 -25 231 248 -95 -90 12 -153 -93 -86 -20 -139 -16 -76 104 73 -315 -163 237 37 -372
3071 -372 9 477 -139 -41 137 -60 -297 -68 188 -69 -51 -136 180 210 -241 -148 -9 149 -439 -100 275 -241
3093 -241 -275 -17 -93 15 -185 241 55 -300 -68 167 -44 -216 -189 320 32 -39 66 83 190 -121 350 183
3115 183 -208 -134 430 226 -92 303 281 19 -273 42 -33 56 -1 93 9 -44 211 -144 173 -469 62 145 24
3138 24 -118 -21 5 -170 25 342 167 -83 73 -51 -219 72 -69 138 -54 56 14 261 -141 -298 -45
3159 -45 -50 -166 -232 89 -229 -15 282 8 -93 -36 -71 -98 -28 -54 -91 40 -316 -27 246 -8 -263 -96 193
3182 193 -200 -110 -11 82 -224 -265 236 72 -31 -177 -115 133 -139 108 427 152 103 -67 126 8 -73 257
3204 257 398 -60 174 -43 69 95 -119 353 182 -189 13 26 119 -42 80 108 -287 -63 138 241 -320
3225 -320 153 166 -114 -212 -83 -4 -154 87 83 67 76 26 63 -66 251 -100 -50 -287 -200 253 193 -215 -190 112 -152
3250 -152 -40 -114 -158 109 -226 -193 -58 -79 -367 -17 -173 -359 -17 -9 119 -163 -58 -53 159 -108 -134 -86 -154 -180
3274 -180 203 68 143 107 -133 -182 12 22 2 -5 -59 48 114 124 -241 25 15 -124 14 147 148 14 -64 70 251
3299 251 -171 93 -14 162 -28 -76 201 42 126 242 197 -379 -68 338 254 -262 48 86 -328 -111 180 178
3321 178 -177 -43 -157 96 -74 -250 73 278 -160 -97 74 72 -310 -63 -91 -214 -139 -278 -33 -147 -125 -22
3343 -22 -130 -211 -114 33 95 -111 -161 -24 -137 -348 80 239 -134 -269 188 114 -150 -141 110 -19 53 47 -27 103
3367 103 -99 -127 203 -99 -5 240 -6 -76 -314 186 -149 -357 52 401 90 -80 503 -123 -178 -67 -476
3388 -476 -12 -20 -95 124 -147 -643 77 250 -142 166 -110 -79 -69 -525 222 -103 -27 -205 -450 -232 210 415
3410 415 384 -90 -178 398 236 76 -479 468 229 89 -13 4 327 -231 -234 281 243 -113 175 59 246 -462
3432 -462 -141 2 -48 -195 -300 432 -57 -236 64 160 -98 103 -381 190 -410 -383 -53 -521 -11 373 616
3453 616 24 -50 -81 -94 -364 -356 123 231 348 -126 346 -119 205 131 324 -19 -43 -70 368 111 349 -203 166
3476 166 -403 242 1126 -439 -38 -692 398 1 279 -89 413 418 13 189 -268 -370 30 255 -575 -630
3496 -630 269 121 25 149 -526 396 303 9 -192 -63 -519 -124 136 358 -583 388 471 -62 303 461 257
3517 257 -403 -285 -143 -66 -74 -650 -70 -93 -80 58 -64 14 -291 112 25 -76 -191 -29 -22 133 48 0 -130 -17
3541 -17 -202 67 -83 -239 -31 231 -65 23 162 31 -68 134 -77 1 -79 120 -2 -10 -69 193 -52 92 -125
3564 -125 11 -108 136 -41 40 -26 -116 -98 -3 3 -63 165 33 -141 -89 98 -190 18 -159 -70 44 -130 82
3587 82 142 13 -135 -47 291 -87 -231 -82 74 -231 -29 73 -278 113 109 94 40 -372 -123 -219 188 -64 -39
3610 -39 159 -158 -36 263 24 63 -247 -47 261 -373 356 18 -162 -178 49 160 -252 198 131 -692 -36
3631 -36 111 115 467 5 -640 -409 104 -171 123 94 -116 -67 72 1 80 222 193 -358 73 77 -498 393 -476
3654 -476 -331 -227 502 182 -269 19 202 28 -771 -326 -261 -55 110 -413 -166 515 -243 -236 -483 368 -507
3675 -507 403 9 76 622 -208 -678 82 426 -330 -169 -525 -86 -628 -470 499 69 319 -193 35 -172
3695 -172 -88 450 347 148 11 -790 -372 9 817 -351 48 -253 -361 -281 197 -110 -244 -186 103 -634 490
3716 490 113 -779 116 -493 -176 195 154 187 164 -154 291 -304 140 -231 -522 160 -581 87 246 -702 -505
3737 -505 -489 711 -785 784 -90 -376 657 1495 -266 -643 -330 -372 -45 27 -118 39 -44 -756 292
3756 292 266 -139 398 -207 696 376 -250 166 -313 177 -96 -360 421 258 -595 -700 618 -42 -962 338
3776 338 79 -5 -347 -89 186 157 179 -61 -532 -453 -371 -537 -446 367 3 -134 -221 69 762 18 71 -7 -56
3799 -56 166 31 -204 -421 3 -676 347 97 171 160 -215 -176 17 189 279 148 -391 27 380 -45 187
3820 187 77 151 -611 -807 -24 -388 -31 -7 149 179 -228 160 146 -95 23 61 500 -124 212 81 76 -307
3842 -307 -26 89 131 -92 -112 -95 101 -256 75 -101 18 -22 24 90 135 207 111 101 -115 149 -116 41 -161
3865 -161 2 33 46 111 139 40 14 83 63 -156 61 -174 -362 -438 -42 191 -87 151 101 -49 -130 50 -193 -121
3889 -121 -432 -170 385 -425 465 -247 -23 -87 0 -120 158 62 -691 300 105 165 236 75 -80 -159 -118 70
3911 70 -86 -72 -422 502 115 -47 27 154 -205 249 -100 137 -78 -211 140 -23 113 -121 278 86 130
3932 130 242 213 -249 -247 -478 211 -38 12 225 196 167 533 -374 74 -67 274 -97 -43 226 112 -193 502
3954 502 -269 20 15 -171 -365 -354 -197 -354 -285 -419 10 -351 -86 -276 -13 -127 -38 -293 -258 -19 211 -297
3976 -297 -396 125 -215 -21 -93 52 -1 116 -16 284 -138 66 166 2 77 -275 -47 113 93 -282 -235 121
3998 121 -225 108 87 -1 94 -89 23 180 -8 -69 130 -70 75 -15 -10 167 -5 -333 -194 -8 -78 20 186
4021 186 -71 -19 199 256 25 -52 36 58 14 -19 116 55 -5 237 -123 -182 408 -133 -115 209 -68 119 357 -54
4045 -54 -68 161 -251 -174 18 16 44 -267 102 318 -35 -507 306 -40 442 168 -588 -531 -146 176 -453 -434 -49
4068 -49 -14 85 -109 756 -330 298 -195 21 490 -354 -37 467 -222 -100 279 -152 -368 -265 655 -157 -61
4089 -61 -148 -273 -453 484 404 -144 -342 302 -186 -575 708 181 560 -133 -127 -130 115 253 81 165 234 247 641
4112 641 277 -28 762 130 -353 20 -3 347 360 509 -163 -360 164 147 -54 203 -252 -222 80 11 -113 -138
4134 -138 275 -39 209 -274 -232 162 96 310 233 108 -276 -59 104 242 -128 1 -95 -315 218 -39 -175
4155 -175 120 95 -169 16 332 -208 -177 -33 -301 -18 -194 188 146 -84 -18 -142 47 -272 38 9 17 -148
4177 -148 24 190 -169 -48 113 -215 540 24 94 -291 -20 40 -26 86 90 77 158 150 74 119 183 9 38 159
4201 159 353 -142 -110 192 -316 111 245 -36 28 10 -139 -58 -65 65 72 98 -52 -131 17 166 -107 89 17 6
4225 6 -91 116 127 -88 -49 -70 22 -412 26 75 20 -163 -250 37 104 -48 6 -84 157 -186 -26 -179 -197 -388 -189
4250 -189 -312 -84 349 116 147 -143 -153 -144 -29 -149 -9 122 166 -157 69 175 -20 -114 59 8 104 -228 40
4273 40 22 29 105 48 -44 -207 224 -8 9 -30 -51 122 117 -107 -34 5 340 383 152 -261 -269 -17 -99 -112 71 -44
4299 -44 -58 11 -27 67 42 -36 148 66 -85 -112 90 -37 -158 -105 63 26 -87 -79 160 -124 -258 -25 117 84 -45
4324 -45 -26 24 10 34 -108 17 -199 109 191 -117 -170 -10 12 -111 -101 -8 38 -106 84 2 -123 -133 -3 -32 7
4349 7 -32 -98 266 -87 284 25 154 143 343 6 59 -144 -46 -76 127 34 66 -215 -95 -14 95 -30 -173 -18
4373 -18 -151 182 -98 12 -114 106 -83 -148 114 -5 148 283 -23 129 16 96 -37 -282 97 -15 -117
4394 -117 13 36 168 -424 -335 -400 162 111 -215 -70 -30 -54 64 78 156 -14 2 20 -179 210 -89 200 204 112
4418 112 -26 -99 -177 149 114 -38 -32 63 146 -268 -333 283 -232 -43 161 -89 195 -146 -308 -17 -14 -53 119 -138
4442 -138 -7 61 74 52 -70 22 -15 154 27 -38 -122 21 -131 -32 168 -3 -155 240 -44 54 -124 -36 80
4465 80 78 -215 -105 94 -99 -11 -108 110 157 273 320 -132 248 90 188 -274 -296 204 21 139 -12 134 10
4488 10 -279 128 -49 -169 -52 234 197 -135 -236 -168 -68 -70 138 289 -28 -54 25 -231 -61 65 -12 31 207
4511 207 -186 -226 130 -121 -87 -16 -1 -93 -43 206 -66 -157 182 -3 19 9 171 -281 -6 4 -62 249 -85 32
4535 32 80 130 -74 11 -5 -255 5 -84 -43 -143 -21 304 -100 -80 32 51 -165 48 304 -80 -49 87 276
4558 276 -101 290 -188 -59 -46 -262 119 34 154 37 -177 97 114 34 -83 -36 -61 -203 75 -46 -337 -5
4580 -5 247 223 -257 -161 -191 -15 -123 6 164 196 276 150 247 29 -145 3 -133 -236 283 -7 41 -24 -139
4603 -139 78 30 256 64 103 -343 -115 50 164 61 -33 100 -337 13 -102 23 -20 -243 43 32 110 -188
4625 -188 -1 19 89 -16 107 103 97 86 45 17 149 -74 97 29 22 122 -25 50 -173 110 157 28 60 -257 -196
4650 -196 -89 82 -152 56 -83 66 -202 9 -116 -82 23 -88 9 90 -18 -62 16 108 -145 29 96 -53
4672 -53 -80 -31 -95 121 -126 268 100 150 -86 68 69 -24 61 -91 60 -23 -160 -113 231 -309 49 150 -119 -75
4696 -75 -45 -200 -242 -54 45 75 41 139 235 358 -40 -130 128 -132 -45 -16 64 -181 105 -137 327 112 -72 236
4720 236 -124 36 32 -63 71 163 105 160 162 -276 115 160 -17 -34 117 -231 -51 397 56 44 -70 -80 69 -60
4744 -60 -87 183 13 -152 87 -301 -203 -176 -135 232 101 14 58 -92 -142 -109 -40 -29 -120 210 -106 -126 -37 -103 109
4769 109 1 84 -1 -206 149 -161 -58 -232 111 -45 112 209 43 64 -402 29 145 -267 41 26 -119 -182
4791 -182 -221 256 99 259 -6 -25 61 94 164 -195 -107 -110 39 14 230 215 75 -280 -109 401 196 -46 -1 138
4815 138 -65 19 79 -149 -22 170 -65 180 35 166 87 39 217 -175 122 58 31 -20 -29 140 46 333 260 -71
4839 -71 39 93 -66 -54 -23 159 223 79 -44 54 21 280 -163 65 -57 -30 27 -93 175 -83 181 -267 67
4862 67 244 73 153 132 54 73 -116 -96 0 17 -160 -168 -239 330 6 170 129 -122 -100 -39 39 -38 -76 28 9 34
4888 34 -41 53 -67 141 -168 -244 68 43 166 37 -76 -254 143 134 -228 -209 271 -45 198 174 33 30 245 245
4912 245 -144 -77 -186 202 88 -143 -39 75 81 298 -73 22 118 63 25 90 6 -62 -98 -233 -323 -136 -200 78
4936 78 -274 85 11 -113 -292 -141 125 67 77 -178 355 -314 86 55 -154 118 -42 -127 -92 -76 -130 162 -132
4959 -132 -20 -136 135 -89 70 62 41 151 -18 -207 -88 -247 123 112 -310 -47 14 86 111 -247 -98 26
4981 26 -242 224 238 -3 -193 5 -139 181 -254 13 79 108 -49 -28 -137 -8 94 -43 -218 -331 34 -71
5003 -71 141 -14 39 115 -280 -85 -37 -149 204 -133 10 -37 -16 -146 66 -81 -212 184 -65 -49 101 -44
5025 -44 183 116 -328 33 133 -200 153 -34 -11 -67 91 46 37 -352 -188 50 -256 98 98 -104 250 -68 55
5048 55 -23 121 -69 -106 -92 64 -154 -108 -94 261 71 69 -83 -177 350 -225 -108 -3 57 -36 242 -97 133 -3
5072 -3 -200 142 39 136 304 160 -85 -190 219 -60 88 -168 24 -116 29 34 244 -15 -320 -95 57 160
5094 160 52 -102 -124 224 -71 186 168 342 -25 295 151 -15 -100 -10 24 -80 310 125 63 -107 67 -10
5116 -10 36 -3 172 12 215 -7 63 -57 89 -2 109 -93 181 92 133 -204 46 -36 85 106 195 13 -145
5139 -145 28 143 78 -40 31 33 197 69 130 166 -43 -155 92 -16 -125 -262 -95 42 48 -115 72 56 16
5162 16 -178 120 8 -93 -99 189 125 26 0 196 188 -57 -121 140 343 -84 -57 -257 -25 -110 105 -98 -173 -86
5186 -86 -32 159 94 -7 -7 56 -267 -154 12 -16 -107 13 67 17 -141 -80 -132 -100 -41 84 316 -361 46 -151 -259
5211 -259 99 -89 32 -112 -166 -261 -118 -152 -87 68 130 -50 144 -118 -246 87 456 36 -86 38 151 -48
5233 -48 -138 65 -31 165 -155 -219 116 -54 51 166 64 -218 -105 -85 39 -1 39 -36 -20 49 -95 -57 -118 -36
5257 -36 2 274 -129 -120 -170 175 52 -22 218 77 -49 115 -49 69 57 -18 74 152 65 3 22 -229 10 40 -34
5282 -34 -155 -237 -298 -131 27 -189 188 141 -143 90 88 -113 -141 47 -39 10 31 -169 -163 -113 -67 -187 253 -81 -14
5307 -14 359 -116 -56 147 168 -100 -32 -32 -38 -163 -173 19 -221 -90 36 18 105 -228 236 -89 -13 -116 -143 -17
5331 -17 -184 8 158 -145 129 9 -9 -5 20 186 -22 -226 49 220 -41 -73 -164 29 62 -20 -43 -206 111
5354 111 -30 -190 241 -52 128 81 56 27 50 50 74 -86 59 128 37 64 -179 61 78 -143 -177 132 -58 88
5378 88 122 -21 -20 9 -75 -42 -83 -82 -5 -122 129 -121 8 183 -79 -21 112 95 -13 -25 -189 83 106 195 -81
5403 -81 -30 70 152 31 120 106 39 -111 -77 105 -8 -236 -30 150 -273 -166 105 63 -33 -122 84 47 89 41
5427 41 196 -180 -236 6 -27 -105 -185 -40 157 365 -10 121 105 -18 -89 242 -6 278 -49 298 -156 -124 129
5450 129 8 350 -176 99 89 -2 82 225 18 -145 13 213 -89 -60 -142 -190 196 192 107 248 -164 -34 276
5473 276 -19 -54 31 34 -256 96 -21 -6 67 16 -68 -50 -201 3 420 -23 -18 -2 113 8 363 44 -124 -131 -330
5498 -330 -111 101 46 -227 320 -43 10 -135 53 352 47 136 -60 83 -319 -94 -32 -82 -62 -31 -18 -27 -227
5521 -227 -75 159 -393 130 -27 -117 -42 203 -26 -242 35 165 -22 -32 121 -177 102 -255 -39 140 181
5542 181 -217 -132 -54 -58 147 -26 -52 -175 -58 -141 118 -122 150 86 -55 11 155 116 -104 -56 106 77 -123 6
5566 6 -147 -4 -316 -61 136 -134 -75 -8 -15 20 -250 126 -59 -150 -73 19 -76 -151 -115 150 -5 116 57 228 244
5591 244 -145 98 51 -12 3 -186 -131 -17 39 141 -26 -151 -32 -114 211 -203 66 13 -100 68 -280 -25
5613 -25 105 -171 -22 109 106 66 47 -157 -142 160 70 -18 -78 -33 58 -183 -45 -51 -192 -43 -151 36 59 -158 129
5638 129 209 -170 81 134 -23 -29 -203 -136 -36 29 -13 -166 195 -92 -66 175 -43 53 20 -128 -82 -1 -109 32
5662 32 -339 -120 87 40 -23 9 -426 -92 -63 19 -224 -31 111 68 86 199 76 140 127 -61 -37 110 218 46
5686 46 -18 35 103 25 -92 -69 -23 -44 -113 -141 -45 334 144 30 -126 -5 10 -30 10 33 -82 91 152 57 -14 65
5712 65 237 187 -3 123 97 -25 102 17 137 108 168 97 210 13 -326 -308 68 -3 11 87 15 -53 -115 -117 -42 104
5738 104 9 30 102 -55 -51 -139 295 -59 282 147 12 -55 137 5 136 76 -260 -70 163 -11 -104 -72 -205
5761 -205 -112 -190 6 -464 -138 28 180 -151 -38 -48 -95 -111 227 83 -45 -51 -44 123 -108 231 99 37 -148
5784 -148 110 -36 213 105 -69 107 83 32 61 -70 273 208 54 -76 -4 6 8 -145 -95 -178 -114 -125 225 101
5808 101 -139 -118 60 -92 -139 -189 172 237 65 45 -38 135 90 -168 78 -48 -187 263 221 -190 -469 -19 104
5831 104 244 -162 42 63 -62 322 30 79 -109 -234 -89 90 -254 1 -34 -128 -263 -172 -94 -134 -130 134 250
5854 250 -3 -163 34 -55 -182 18 -134 -37 -119 209 154 -167 -84 11 278 -267 62 -422 -66 60 129 -184
5876 -184 -264 217 193 100 54 88 229 87 -153 152 158 -61 44 -155 -95 2 65 326 59 -194 -5 227 -15
5899 -15 14 -108 -25 -18 -153 48 54 186 -170 -96 68 149 -274 68 241 -356 -105 35 -127 26 10 -72 179 30
5923 30 -18 161 -131 -228 -101 -63 11 -50 89 -96 -81 -155 250 -64 -272 -12 127 -290 -276 -93 -76 10 -132 -42
5947 -42 51 -245 -192 166 61 -19 -138 77 81 148 134 -20 -266 -46 75 201 -72 -98 150 -13 -76 150 -31
5970 -31 -134 79 27 35 -134 129 13 105 -71 45 354 -40 215 76 15 280 70 -30 12 -47 30 299 -1
5993 -1 -64 17 -1 16 114 83 117 -160 -76 56 -29 -111 -199 73 -76 -42 5 120 11 -38 101 42 136 -238 -77 -94
6019 -94 -142 202 -245 42 64 -121 21 152 -2 -111 280 -142 -98 -177 17 96 -179 -38 10 189 185 160 -104
6042 -104 -56 92 152 -51 -13 83 281 -28 80 -34 137 -102 -83 -97 104 185 32 116 -132 174 43 87 22
6065 22 -263 -212 53 168 0 176 57 251 -74 -93 -10 -89 213 -53 17 104 231 -219 -111 241 127 20
6087 20 -195 -191 -69 3 -132 -138 -167 -259 -137 60 -32 -126 -245 -16 185 -102 -48 63 182 -147 -4 -338 0 -193
6111 -193 -36 70 157 166 203 65 101 -146 55 -57 -215 -21 71 48 34 -73 -19 -43 -39 146 154 46 3 175 -24
6136 -24 -227 -136 104 195 -2 14 212 -146 29 1 -287 -332 -25 37 -190 52 -147 73 137 -11 -221 164 89
6159 89 -16 55 -113 45 49 99 -109 140 47 286 177 -237 -107 73 -20 7 1 13 218 47 230 -10 -145 142
6183 142 156 76 -274 2 250 -244 -76 86 161 -82 25 150 -274 -122 -140 -64 61 -135 -260 215 -129 -164
6205 -164 77 224 99 -80 -82 45 -59 -1 110 78 163 -57 26 73 14 197 -113 -140 151 268 56 -147 -88
6228 -88 375 -191 -16 101 32 -14 -55 72 -20 123 -266 -5 101 -91 47 -217 215 -164 34 182 85 103
6250 103 146 1 321 161 -37 121 -70 -162 -100 38 -40 2 -164 223 84 9 457 -58 -6 92 108 -57 17
6273 17 167 -6 -127 -1 -98 58 -146 -5 -161 -40 -75 12 57 123 -202 -5 279 11 166 -234 79 -404
6295 -404 -95 -230 100 -104 4 108 -147 -81 143 44 -90 24 216 45 -247 46 110 61 29 -51 -32 43 -47
6318 -47 225 18 -41 -259 -301 138 50 -106 -10 -105 -12 15 -46 27 -84 -158 256 -6 -151 1 93 74 -62 -8 -20
6343 -20 37 122 -39 64 -112 -38 126 -58 -79 135 -115 -198 66 -109 48 -141 230 -52 -38 41 50 -141 -139 9
6367 9 150 323 -16 -49 -90 139 -68 9 84 37 -73 -132 -44 -76 -143 280 76 -363 147 -143 30 -357 -230 -203
6391 -203 -84 64 -103 64 79 62 -67 -258 -49 -157 -232 167 -24 -101 123 -3 134 282 -249 195 17
6412 17 87 292 -278 -88 294 -172 -55 29 -116 150 -167 38 -39 52 -243 80 24 -171 64 151 124 40 76
6435 76 -104 -248 -378 -39 48 -1 -45 128 107 -285 -45 -107 -10 144 -48 76 190 -62 -213 189 79 -294
6457 -294 -30 162 5 -198 -109 58 123 39 100 -117 -13 -170 112 214 -192 28 -59 46 -5 84 -64 52
6479 52 52 -251 -71 12 317 177 78 -152 2 -102 -81 331 101 41 -149 -88 33 15 -278 -121 21 123 -101
6502 -101 -25 -105 151 -40 50 78 18 133 -126 256 -198 246 -223 -32 23 112 -191 -167 -186 -26 9 -110 64
6525 64 20 -185 -8 -50 -10 -41 -176 -4 32 -44 80 -113 32 64 -167 38 368 -168 -84 -8 -152 -13 88
6548 88 44 -72 -149 -10 74 -55 -139 7 -224 -237 58 7 57 21 -104 307 -42 -99 123 222 -269 -20 -4 -49
6572 -49 39 -191 -54 -42 -81 -51 -9 -47 29 343 197 290 -81 363 -142 186 5 -105 179 -72 -187 351 161
6595 161 -67 69 267 -28 73 200 -22 -19 92 74 29 148 -112 17 204 -40 -104 195 -322 -311 84 -146
6617 -146 58 -196 9 172 -205 -31 206 -18 222 -53 -315 200 -120 -12 -23 110 -3 148 203 35 -208
6638 -208 272 155 4 -9 72 -89 144 -147 100 -117 -82 141 150 -258 -205 18 119 202 0 -62 14 -87 -268
6661 -268 -61 -175 -124 -65 66 40 67 137 95 -128 -194 480 21 87 -3 78 89 178 54 -94 -98 -103 168 72 164 -46
6687 -46 -76 -13 201 -25 132 90 242 37 171 161 -109 88 -160 56 -228 184 -23 32 31 165 -116 205 114
6710 114 -62 -34 -319 12 17 97 29 44 27 2 32 32 -155 92 -18 94 83 48 -145 -108 28 -91 89 138 -177
6735 -177 -96 13 125 -73 -57 -38 -34 -138 129 0 61 148 172 136 -178 -209 98 147 35 -216 -11 53 -231 102
6759 102 -225 -216 -118 -55 30 -257 -231 -99 211 25 43 -59 -135 -138 167 -15 56 -58 121 228 -54 -51 46 -51 -57 34
6785 34 123 -1 -204 -140 134 148 -65 44 220 148 -315 -89 93 -320 -101 -53 -55 -39 315 -298 10 106 -306
6808 -306 -117 90 -179 -24 62 85 -101 3 64 -206 -73 -15 210 122 -101 254 84 -152 -291 -157 -37 -186
6830 -186 56 338 -50 -156 -153 39 4 174 -102 101 166 -134 49 -57 -127 -113 -90 28 101 -105 151 -7 -104
6853 -104 263 50 48 40 76 -247 -15 303 313 116 -157 122 6 -90 112 -100 -103 -84 -69 -45 25 -131 -269 46
6877 46 -102 53 186 105 95 152 -285 305 -314 28 299 88 -144 47 131 -203 159 267 -21 70 17 17 -120
6900 -120 -91 -14 13 -188 -197 -172 -120 -43 -339 98 -56 -234 -19 87 -50 -28 -102 35 -60 -2 98 -135 -108 -93 286
6925 286 -170 -156 48 20 187 -305 16 -45 -8 -210 -63 -62 -132 58 14 94 15 33 304 -93 -298 81 246 -77
6949 -77 45 64 55 -137 -57 130 147 -191 95 35 -9 48 -288 182 -108 -71 -192 190 236 272 -2 180 -79 134
6973 134 22 29 121 117 11 -43 -127 136 153 19 -143 130 298 -158 -233 -45 -14 107 41 130 -117 -88 -70 108 -276
6998 -276 -9 30 -122 128 -70 -41 -8 -33 -98 -71 -80 -18 37 101 140 -189 196 63 20 -120 33 -35 -275 -166 -182
7023 -182 -86 64 -163 106 313 -300 -169 -68 -172 -166 41 203 -143 -37 205 -126 37 -186 -107 59 -116
7044 -116 -22 -73 -37 136 71 -29 -56 71 145 167 -178 -73 265 -96 -33 120 -65 56 -117 44 -109 216 -25
7067 -25 -81 -27 21 -2 154 -41 -246 32 -12 52 97 -55 193 -95 -212 77 107 -126 -337 -44 147 -63 -54 -140
7091 -140 244 18 -8 76 -76 -73 93 -55 -192 141 13 -30 -266 -35 244 148 -7 -64 58 164 -69 -74 61
7114 61 62 -13 -72 261 -191 48 -126 -137 -255 -116 57 190 -79 -186 149 13 23 240 2 106 -139 87
7136 87 104 145 189 8 -3 -127 134 78 243 7 202 -29 -253 -128 100 -143 17 162 7 -96 214 -81
7158 -81 -156 11 -247 41 6 58 6 130 166 67 177 92 53 -264 18 109 -126 -184 45 159 -67 -178 -126 -111
7182 -111 -103 -29 66 57 40 124 -51 -22 -240 -272 -7 -75 -164 180 -145 -254 222 214 -50 4 75 325 -64 -159 -47 -241
7208 -241 -38 -13 -226 -44 26 -128 203 -102 121 -96 125 -196 -263 -96 131 -113 -69 249 133 -20 51 131
7230 131 187 -153 49 244 -21 47 210 9 26 164 -125 -17 -82 -64 -80 119 -170 0 -11 160 -74 257
7252 257 -54 -9 -43 -130 31 139 0 -82 82 -18 -94 -201 -104 -13 -173 159 53 -209 53 -201 -29 -66 174
7275 174 59 7 -175 -85 17 -338 -34 58 -127 -125 -13 -92 -128 -99 -91 -56 -96 -174 -5 -28 -1 -45 31 60 -99 -160
7301 -160 12 -245 15 -115 -22 -121 73 148 80 260 -21 23 -116 -91 -29 -4 155 160 76 70 -40 72 128 79 223
7326 223 -155 -108 145 -125 256 92 -33 30 -77 173 -140 -74 294 -84 2 -130 23 48 88 70 7 2 -78 -122
7350 -122 47 4 -243 24 -237 -60 -261 72 -26 -135 8 -11 -327 144 -313 46 102 122 -143 -141 134 -141
7372 -141 76 -44 -233 -253 60 130 10 267 -21 -288 -65 -94 299 10 -38 -81 11 -38 7 41 146 -141 22
7395 22 -114 49 -234 104 -41 197 -212 -217 -14 -100 247 106 -42 -296 -46 121 6 -14 63 -197 12 220
7417 220 -25 -204 -72 32 -37 -27 -192 105 278 -41 -131 -120 -4 6 -75 138 290 22 379 143 -122 -72
7439 -72 -97 113 -62 124 -76 -293 -173 247 70 78 108 51 -159 7 102 -33 -177 74 -161 -125 -116 -52 2 -152
7463 -152 101 105 12 125 243 -165 -64 19 209 -254 22 346 -133 125 230 1 50 57 -178 -80 66 -62 -25
7486 -25 137 -190 296 285 -62 168 99 153 192 -52 139 99 -160 -180 57 208 -206 -62 135 -3 40 -2 192
7509 192 -46 -60 -31 -134 -38 -225 130 157 35 54 100 205 -12 -66 25 241 -103 13 70 -93 -203 334 -101
7532 -101 -28 103 -197 23 -64 -46 -100 -238 47 127 -11 -194 57 154 233 -20 65 48 -255 -206 89 380 184
7555 184 -14 -163 303 64 -100 3 -26 -307 3 163 -195 -131 -47 -62 197 -95 -124 -20 30 -66 79 28 92
7578 92 -52 25 -35 -31 122 128 -37 -81 -31 137 -102 18 68 428 -37 -12 -66 91 24 152 220 38 -47 162 -29
7603 -29 -214 -92 -211 -326 -137 -310 -270 -289 158 97 -44 278 -200 110 -118 -181 -83 195 203 169 -175 217 39
7626 39 -68 -18 -28 15 136 158 -56 109 176 144 228 -54 -6 -42 -41 -74 -52 197 25 -99 -63 193 16 48 104 -40
7652 -40 -198 -67 120 -4 -126 13 -142 133 104 295 70 -311 -124 319 -56 -19 153 62 10 -87 219 63
7674 63 98 -77 44 -64 124 -109 129 140 263 -131 232 127 135 209 222 129 -2 13 -135 248 -254 38 -28
7697 -28 46 -133 109 -148 -238 33 -66 63 -206 -15 263 7 -83 -68 160 67 -300 52 -148 67 -184 67
7719 67 -14 -45 -7 39 -173 -172 -47 -116 35 -217 -182 -51 -54 -149 -79 -222 179 314 -67 -263 26 -16 100 153 82
7744 82 -6 -7 -86 -209 -176 -6 74 158 139 78 194 72 136 210 28 -230 82 10 -45 -101 102 147 9 90 110 75
7770 75 299 59 131 21 10 -102 151 119 -211 198 -262 96 -183 107 21 80 -7 -177 -145 -25 -46 -129 -208 176
7794 176 108 91 -5 41 62 102 -162 -100 -108 -214 217 -124 -129 -59 -135 -138 -162 -171 48 -28 -267 -223 38 -112 -65 33 -111
7821 -111 -184 -201 185 103 -148 -114 294 65 15 -327 -171 80 -163 -153 80 -279 -46 -7 52 43 -55 124 -110 283
7845 283 -34 -162 -25 -89 -52 36 111 67 -25 -6 276 154 -82 88 -205 -127 -223 -45 51 -79 29 14 -3 43
7869 43 332 -18 -134 -153 28 -162 175 -127 -24 -177 -297 180 318 -226 -25 -71 -129 -129 64 -79 112 -151
7891 -151 184 22 -189 -261 -205 83 -56 -203 -162 -63 40 155 -11 -87 -171 -29 -26 -142 -77 -38 194 10 -187
7914 -187 -96 232 302 58 -27 162 -40 84 1 -53 246 222 -177 -133 -280 265 -97 16 -92 -34 -40 232 26
7937 26 -17 35 -51 -93 -106 -178 -248 136 -57 -64 65 -68 64 144 139 190 14 42 -311 -63 -195 157 87 -112 -77 95
7963 95 -284 -80 140 91 49 98 102 8 50 -58 -13 5 -87 -26 -308 17 -122 -77 -10 -22 -146 4 41 42 -266 -38
7989 -38 -172 88 1 -20 71 -156 -185 -205 133 -63 -119 -33 272 55 31 -104 43 -98 -193 2 47 -271 -192 126
8013 126 352 161 -253 -93 -41 -138 200 -76 10 48 -14 -79 107 237 78 181 -217 76 150 115 39 -220 -94
8036 -94 162 97 -68 131 81 517 56 37 -35 -89 115 61 -12 167 26 92 -115 137 -63 -207 70 -141 -43
8059 -43 -33 -31 169 -106 234 212 28 -243 -97 152 13 -241 101 3 -73 57 -111 194 -195 168 177 -6 -16
8082 -16 40 54 -127 -41 50 143 267 -185 47 -69 28 -34 25 161 174 -25 -137 -71 -30 278 84 -215 14 -270
8106 -270 176 207 -12 286 305 166 -25 292 28 -36 85 -72 -59 -113 61 253 110 69 -343 70 -81 137
8128 137 99 -200 -276 -94 77 86 24 72 50 -183 23 -139 -67 -239 -12 -3 -129 137 29 220 -161 -81 -58 20
8152 20 -4 70 -130 -44 -68 84 -73 -143 -203 -6 -52 -155 -119 -1 146 -78 -45 72 255 -150 156 -100 151
8175 151 208 85 -35 22 -42 -33 -146 99 -207 15 0 31 84 110 89 128
8191A28
$$ Imaginary data points
##PAGE= N=2
##DATA TABLE= (X++(I..I)), XYDATA
0 0 0 0 0 0 0 0 0 0 0 0 0 0 -8 8 -8 8 -11 16 -16 24 -24 32 -40 45 -52 63 -72 81 -96 109 -125 143 -161 185
34 185 -208 233 -262 294 -328 366 -409 454 -503 559 -617 683 -754 832 -915 1010 -1113 1227
52 1227 -1350 1489 -1643 1819 -2019 2244 -2507 2813 -3182 3630 -4188 4904 -5868 7236 -9337
67 -9337 13013 -21288 83176 -102174 -157290 148729 38429 -84778 47068 82345 -40506
78 -40506 2387 39363 9692 15349 6055 -40694 1978 24778 -391 14601 18480 -31542 -11844
91 -11844 22985 -7136 -26187 -8112 -13116 -2989 13130 -4647 -11467 2469 -25748 -37637 16223
104 16223 28583 -29070 -31972 9872 -1421 -15956 17193 8625 -35917 -15338 16720 -9137
116 -9137 -8125 16489 -23845 -39639 28541 35650 -28952 -26303 4149 -18709 -17945 18744 7835
129 7835 -22227 -12282 3070 4525 2885 -8734 -17278 -12083 -8823 4215 26627 15168 -16831
142 -16831 -14224 8190 7132 -5028 -3262 8278 14686 4636 -237 20372 22579 -18747 -26257
155 -26257 19195 25551 -7260 2387 23352 -1271 -15148 11408 15732 -11655 -21696 -3778 16759
168 16759 15168 -6041 -10795 -2749 -11501 -9736 12129 3578 -22301 -12207 4697 2768 5559 -2450
182 -2450 -20288 -9764 5297 -2934 1270 4891 -15604 -10127 11112 -1853 -3947 14528 -9783
195 -9783 -27653 10784 16786 -15109 -1164 12200 -16570 -9058 23030 4391 -20823 -6553 2164
208 2164 -3060 3713 8488 3840 -3589 -12177 -1727 16206 2063 -18464 -3371 15094 7382 2695
222 2695 9004 2577 -10233 -4787 12894 15410 -1410 -6227 10223 16420 3257 -1762 7636 3467
236 3467 -12635 -2030 28320 16622 -19228 -3744 23056 -3779 -15721 18470 10695 -23186
248 -23186 -2418 21198 3432 -1327 320 -12583 -26 12477 -7991 -3169 16939 -9348 -20009
261 -20009 16304 15269 -12760 -4403 1098 -9092 6878 12285 -9555 -6026 5766 -4510 321
274 321 10549 -6326 -10449 2933 -2405 -2567 8885 -3101 -12035 3916 1648 -9157 4542 2580
288 2580 -19270 -6974 15488 1025 -11691 -263 1350 -8027 -4486 3067 2417 -3957 -8428 -1646
302 -1646 10003 4988 -7759 -4282 1933 -4484 -2134 12140 7299 -11062 -5951 10889 5982 -4841
316 -4841 756 3599 -4189 -943 10370 10420 -1070 -9318 -755 12208 4525 -7623 4869 10728
330 10728 -7219 -5644 15977 8963 -11032 -5080 6334 5047 2989 -685 -945 4046 -1365 -4402
344 -4402 9101 6621 -11787 -4431 9824 -425 -3016 7564 -2476 -10990 4079 6885 -3554
357 -3554 -884 -1055 -7764 914 8217 -641 -4426 -3125 -4747 1860 4913 -6127 -3766 4228 -8239
372 -8239 -7596 13477 3950 -18708 -4171 8682 -5844 -5882 5748 -2899 -9111 -921 -84 115 1662
387 1662 -8499 -8989 5740 1453 -8171 3942 4271 -13879 -6242 13061 2797 -11182 -2307 5106
401 5106 -746 -3001 3707 5834 -4603 -10276 5067 13270 -2841 -9110 4904 4542 -5315 2744
415 2744 9015 -3143 -8175 2833 7276 1683 -1528 -995 -574 702 2209 1529 2122 804 -5088 -2066
431 -2066 8542 4933 -6370 -1877 5368 -1791 -542 8196 634 -5834 2559 1237 -941 8132 3285
446 3285 -10490 -1144 9406 1064 -2841 570 -1800 -1368 -428 -1462 4365 680 -13483 -3409 12408
461 12408 -2805 -12331 3738 1007 -11947 -124 7320 -4511 -8098 -3190 -361 4369 -1299 -9379
475 -9379 1396 5880 -9242 -3083 12829 -53 -12525 2919 7944 -2026 149 4234 -788 -1328
489 -1328 2442 4609 5508 -261 -5003 3648 8098 -1395 4 8621 -725 -6910 7349 10655 -3131
504 -3131 -3938 4427 2839 993 4679 3266 -394 1140 966 3151 7572 2766 -4650 1908 7200 2260
520 2260 2636 5167 -1455 -2095 7214 3754 -2142 4212 2484 -6323 798 8875 -801 -6035 416 432
536 432 -2265 -204 -622 -2006 -2796 -6868 -2478 6386 -3664 -13847 -370 4556 -10156 -5243 7940
551 7940 -4843 -14489 -280 4876 -2689 -4026 -5251 -4077 3175 290 -5486 3110 1633 -10424
565 -10424 -84 11645 -3562 -9097 5386 2368 -6111 3165 5359 -4392 -3346 1805 802 2078
579 2078 894 -3337 270 1442 -3324 1953 6105 -4721 -6042 4861 4086 -1752 1485 1067 -3678
594 -3678 866 4574 1983 611 -5 -1046 2750 4640 339 -138 1460 -1147 394 4922 1251 -3123
610 -3123 365 1251 -1715 1225 3290 -2737 -5411 391 2880 -1249 -2858 -480 -1354 -4670 -2493 3664
626 3664 1051 -7153 -6125 3690 3282 -5061 -3851 3362 34 -6587 52 6463 -638 -6514 -537
641 -537 4145 755 -1918 147 1690 -975 -3365 2618 6274 -2098 -6511 2633 4023 -3348 391
656 391 4542 -3730 -4648 4748 3531 -1524 -1353 -1864 -229 3142 7 -1826 1592 -565 -2871 4525
672 4525 3910 -3805 521 4177 -2291 348 7178 892 -3321 2249 2630 1176 3929 1591 -1659 1055
688 1055 1988 1416 4361 758 -4181 1818 4588 -1151 90 3306 -2623 -3775 4197 4227 -2848 -2633
704 -2633 1286 495 -1621 475 2318 -1145 -3924 -769 3646 1764 -3454 -2538 2568 535 -3608 1734
720 1734 5127 -3777 -6975 3564 5085 -3791 -3013 1513 -896 -2101 753 629 -419 -2855 -4572
735 -4572 1320 4233 -4103 -5438 2908 -413 -5361 1823 3074 -5466 -3222 2246 -1733 -1147 2597
750 2597 -2293 -4244 1088 1775 114 940 -1696 -2294 2978 1737 -1774 2519 1781 -4419 751 6796
766 6796 -244 -3329 2879 1592 -1580 2731 3255 -1291 -1020 1014 654 2660 1466 -2209 407 2027
782 2027 -1502 1434 4815 -2495 -4290 4331 3070 -2934 1410 3563 -3091 -2285 3737 2451 -1000
797 -1000 -1989 -1151 2779 1963 -2603 241 3155 -3147 -3909 4684 2991 -5266 -2631 2468 -198 -2800
813 -2800 306 958 -1894 -3500 -653 2391 213 -4492 -2722 1127 -506 -2161 97 54 -3563 -2954
829 -2954 2272 861 -2919 -1222 40 -2234 -1 2281 -1304 -2868 -150 143 -223 1584 -675 -1739
845 -1739 206 -380 174 3454 -595 -4303 1745 3423 -2412 725 3613 -2693 -2503 3872 2383 -362
861 -362 454 -966 156 3267 -295 -798 3056 -997 -2987 4383 4184 -3494 -60 3490 -1502 -907
877 -907 4062 1302 -2711 -432 1779 1692 831 -1386 -329 1983 -859 -1435 3337 1839 -4449 -1614
893 -1614 4482 846 -2576 300 690 -1636 -981 1366 693 -1075 -2570 -1292 1531 608 -1978 -1257
909 -1257 111 -1891 -1062 1796 -131 -3878 -1086 1021 -1519 -509 1301 -2524 -2771 1269 889 -1071
925 -1071 -182 -130 -1612 70 1718 288 111 -1066 -1527 2255 3053 -1735 -825 3368 231 -1644 3587
942 3587 3758 -1924 -1429 2767 2109 869 876 -268 653 1236 -19 1902 2959 -1793 -2101 3833 2220
959 2220 -2233 1862 2432 -2762 -577 4174 1173 -2066 513 612 188 1385 439 -108 994 -1360 -855
976 -855 3519 770 -3688 92 2523 -2218 -1116 2588 -1165 -3406 335 811 -765 -426 -1399 -1835
992 -1835 416 -716 -1800 458 -789 -4001 -468 1820 -1727 -1593 347 -2069 -1843 2010 704 -2495
1008 -2495 -944 532 -457 -52 810 192 -1209 -1238 220 2315 888 -2457 -862 2509 359 -1392
1024 -1392 1448 2057 -2546 -1829 2940 1693 -1899 -697 1107 -119 -196 785 545 -108 -1320 -897 2353
1041 2353 1852 -2599 -839 2642 -761 -1375 3137 782 -3092 782 3108 -85 236 1487 -721 -264
1057 -264 1608 328 1149 816 -2111 -110 3430 -213 -2123 2039 214 -3130 1388 2642 -1837 -1393
1073 -1393 237 -985 -256 1035 -1434 -1080 -55 -1016 395 1872 -1683 -2240 961 -68 -1445 1189
1089 1189 703 -2634 -912 1962 109 -1120 154 437 -1164 -438 965 561 -644 -1787 -382 1350
1105 1350 9 -1384 31 723 -1667 -980 2164 350 -3295 -853 2177 -1 -1574 411 402 -876
1121 -876 -562 987 1370 298 -1386 -114 2179 500 -549 1616 1328 -1354 602 2877 717 -480
1137 -480 1035 668 248 1636 1503 15 -328 635 1042 1155 -130 -511 277 627 -340 766 1329 -1597
1155 -1597 -1500 1601 798 -1408 -138 656 -1207 -1212 1360 363 -946 -583 -754 -52 551 -441 -276 287 -1553
1174 -1553 -1146 2066 328 -3018 -550 1146 -1181 -525 1213 -1586 -2030 344 513 -400 -623 -1788
1190 -1788 -662 336 -1204 -1140 1535 -946 -3108 601 2060 -1304 -1389 832 -133 -1062 424 1077 604
1207 604 -861 -1089 776 1968 136 -558 724 776 92 998 1770 -210 -828 1383 1752 -412 361 1184
1225 1184 -456 -138 1891 455 -667 767 555 -401 1110 860 -524 653 -166 -1026 1421 1949 -1836
1242 -1836 -476 2039 -1143 -973 2471 167 -2626 317 1657 -293 108 -134 -921 177 241 -1080
1258 -1080 530 720 -2484 -493 1811 -1179 -1887 1549 -31 -2862 396 1758 -1268 -1407 -250 -526
1274 -526 -507 -38 -605 -422 -218 -1766 -308 1674 -1033 -2634 1094 1425 -1944 -483 1732 -721 -1494
1291 -1494 804 771 -218 159 -426 -83 1093 -96 -578 1511 257 -1639 838 1867 -335 -349 841
1308 841 -310 -10 1584 271 -1033 913 954 143 619 1190 -147 -470 824 790 731 413 -650 187
1326 187 1484 136 -432 1232 494 -1401 77 2076 -330 -988 541 205 -691 311 641 -417 -508
1343 -508 -812 71 1179 -519 -1668 559 646 -1585 -318 1566 -1281 -2159 559 206 -1317 -392 -411
1360 -411 -949 12 -310 -643 416 -753 -2102 108 1339 -1460 -1128 1129 -1009 -1119 1227 488 -1361
1377 -1361 -298 306 -262 742 357 -1038 351 694 -538 410 1403 -592 -478 1312 422 -75 1326
1394 1326 220 -758 1173 1303 -210 272 1567 -41 -478 1437 1022 -91 65 214 749 1028 336
1411 336 -285 883 559 -979 802 2069 -1024 -1488 1427 904 -956 209 887 -605 -491 688 298
1428 298 68 -658 -1216 161 852 -943 -1153 935 -721 -1746 535 1209 -1797 -1061 799 -622 -1023
1445 -1023 587 -361 -1283 -428 -373 -264 664 -1113 -1637 479 396 -1400 404 1096 -1816 -766 1375 -104
1463 -104 -968 604 -531 -859 915 314 -1061 393 94 -712 640 759 -472 37 735 -945 296
1480 296 1386 -677 -722 1547 208 -1023 1121 972 -974 -537 1175 709 -165 310 208 744 270 -455
1498 -455 677 1519 -602 -1049 1609 1613 -1040 -365 1427 222 -653 689 900 -242 -366 11 765 497
1516 497 -532 -439 573 80 -890 441 1101 -1126 -1290 1146 233 -1072 -176 -150 -937 -244 135 -771 -282
1535 -282 -266 -856 -221 547 -845 -881 190 -700 -248 753 12 -1389 -116 -75 -906 101 765 -1159 -809
1554 -809 747 -231 -116 475 -358 -853 111 488 16 182 -147 -730 753 448 -957 220 1329 -783
1572 -783 -734 1699 558 -1043 250 1092 296 81 258 248 782 136 -59 1396 1316 -1034 -22 1801
1590 1801 451 -635 1132 890 -531 27 830 373 -41 184 -34 672 377 -52 19 344 -412 -474 839
1609 839 178 -1270 -342 367 -427 -265 426 -355 -989 38 -249 -577 68 -204 -1281 -324 104 -488 -565
1628 -565 -261 -928 -670 263 -469 -419 89 -610 -981 763 418 -1172 -494 577 -694 -596 717 -6 -939
1647 -939 -152 144 394 512 -349 -219 579 -26 -417 958 784 -1479 -218 1824 38 -610 808 620
1665 620 -399 274 976 476 407 -273 12 1417 357 -953 483 1505 -857 -252 1542 291 -1110
1682 -1110 497 624 192 164 88 -189 28 -349 -319 729 364 -911 -377 933 -217 -397 512 -401 -906
1701 -906 269 323 -645 -367 139 -779 -318 750 -290 -958 -166 -268 -555 -21 -257 -756 -228 -384 -639
1720 -639 244 366 -1205 -620 692 -429 -793 629 -24 -1625 -210 942 -367 -519 119 -264 343
1737 343 291 -646 223 689 -785 -119 1646 232 -1314 705 1159 -599 -349 1307 326 -662 339 558
1755 558 445 453 -540 269 1082 -49 -452 1277 361 -1040 215 1569 -35 -534 681 203 -3 650
1773 650 103 -172 497 72 -379 950 319 -999 260 600 -562 82 792 -805 -583 422 -117 -465
1791 -465 737 -346 -1388 -38 614 -546 -217 -196 -833 -117 156 -473 -113 -370 -1038 -341 676 -602
1809 -602 -1150 392 400 -888 -226 465 -312 -1023 -205 118 -258 -165 -51 48 7 -323 143 731 -258 -882 174
1830 174 1221 -462 -444 1008 134 -764 346 704 -255 -44 185 258 587 -34 -537 871 820 -829 197
1849 197 1550 -383 -542 1024 226 -349 687 883 -283 188 515 -458 645 780 -755 126 1095 -120
1867 -120 -103 570 -211 -312 634 22 -850 355 106 -1208 429 500 -913 -591 714 -160 -739 5 -51
1886 -51 -533 -385 -324 -188 516 -271 -1063 204 434 -943 -316 792 -673 -1435 630 505 -763 -744 242
1905 242 -16 -307 -267 -210 52 -228 -873 277 942 -798 -850 684 7 -1036 424 997 -667 -364 762
1924 762 411 -176 12 -33 15 243 -352 124 816 -75 -586 1052 876 -240 139 824 -31 -69 707 265
1944 265 -228 388 392 172 588 422 -308 2 633 101 203 100 -280 81 192 -240 77 615 -249 -845 765
1965 765 406 -1236 -363 735 -239 -454 403 133 -463 -355 -470 40 321 -708 -647 684 -101 -1223 694
1984 694 560 -1018 -939 489 94 -800 -268 34 -215 -576 -267 224 368 -599 -460 695 201 -721 -55
2003 -55 193 -418 -373 459 531 -264 -188 -8 247 74 291 -57 135 36 64 385 625 -232 -130 469 594 -98
2025 -98 656 370 72 228 543 4 13 618 -42 56 572 342 -222 432 267 159 359 112 -43 354 -2
2046 -2 -519 582 402 -585 -204 770 19 -553 269 508 -533 -415 314 -72 -107 -527 -288 209 -265 -740
2066 -740 564 197 -684 -766 632 38 -1020 -248 486 -315 -587 201 50 -107 -281 -277 162 126 -516 -198
2086 -198 268 -313 -175 339 95 -438 -168 227 -159 -383 308 5 -468 346 251 -175 -166 151 26 370 261
2107 261 -149 109 465 -276 57 472 -245 -326 387 209 -199 309 588 -295 62 415 105 -313 421 251
2127 251 168 -131 78 478 46 -211 -107 895 33 -730 332 957 -356 -560 701 173 -533 -122 424
2146 424 -183 -207 -222 -224 76 -533 -608 485 252 -1080 -326 505 -388 -866 279 268 -1077 -279 226 -167 -395
2167 -395 -86 -212 -61 -170 -343 -210 395 -296 -170 641 -100 -705 94 80 -215 118 403 -395 -228 216
2187 216 -126 110 244 -207 -10 152 14 92 487 -77 -232 611 160 -301 384 546 -580 -133 980 209
2207 209 -406 148 429 -155 -205 232 482 -43 -110 297 617 655 -328 289 848 -82 -373 665 594 -738 -4
2228 -4 505 -305 -296 131 142 -9 32 -263 56 13 -577 -350 611 -108 -794 78 375 -638 -360 547 -160 -418
2250 -418 4 -35 -182 -72 -389 -228 238 -125 -497 80 -111 -501 302 207 -540 -245 176 -507 -472 331 -200
2271 -200 -375 199 -76 -381 -47 358 -34 -69 18 -267 347 427 -315 342 258 -319 -316 673 51 -725 411 853
2293 853 29 -90 783 57 -377 422 55 299 -177 -15 277 635 -335 -282 900 -195 -676 160 677 -21
2313 -21 -421 317 333 -131 338 358 40 -235 -10 -213 292 -301 -585 306 311 -443 -385 245 -340 -414 127 -59
2335 -59 -454 -351 -9 -308 -95 49 -39 -128 192 -118 -271 466 -551 -405 -132 -511 -533 373 70 -519 97
2356 97 279 -637 -320 207 -4 -313 -54 9 -124 -167 -277 137 369 -98 -104 546 -218 -395 78 618 -177 -298
2378 -298 539 287 -358 240 312 101 -265 73 403 121 -113 33 673 -23 -338 364 696 -303 -450 403
2398 403 244 -575 81 490 29 -375 207 169 -34 -398 -209 69 87 -112 -326 141 -117 -451 113 403 -471
2419 -471 -264 266 -28 -255 87 108 -248 -94 27 -14 -140 -112 -208 -36 -131 -63 246 28 -488 -282 86 -91
2441 -91 -133 394 161 -385 -515 443 -96 -543 146 32 -81 -187 36 -50 179 -179 92 164 76 -118 388 496
2463 496 -396 -105 460 297 -397 -76 582 20 -51 71 588 37 -272 351 280 -187 -114 452 393 -284 -384
2484 -384 475 5 -231 162 321 -334 -23 288 41 -227 -99 -21 -34 -113 -318 46 229 -111 7 77 156 -325
2506 -325 103 92 -503 -202 18 -191 -281 150 142 -79 -258 55 9 -250 -180 -59 205 -314 -369 47 -187 -321
2528 -321 -149 155 -301 -552 -119 44 -288 -208 272 -204 -152 77 21 263 33 -59 141 198 -241 -152 387 -136
2550 -136 -126 533 515 -191 -8 663 102 -167 -1 140 130 90 147 261 415 -86 -220 788 -4 -122 90
2571 90 338 -102 138 191 37 -111 119 267 -184 105 79 -122 129 -131 -330 217 295 -420 193 65 -96
2592 -96 -147 271 10 -210 269 74 -440 -372 155 -232 -34 113 -179 -228 -359 -91 7 62 -189 -51 -205 -262
2614 -262 -368 79 78 -379 -111 382 124 -450 25 240 -158 -63 233 103 -40 -52 -166 225 -276 -133 98
2635 98 167 -298 -23 536 41 -119 41 134 -114 -286 130 360 -299 68 165 159 198 -242 66 289 -355 198
2657 198 472 260 -251 119 241 -253 -65 382 147 -123 140 322 278 -50 62 28 266 -169 -172 182 16
2678 16 -455 282 243 -237 -327 54 -297 -175 -169 -104 -241 -169 -3 -190 -17 -90 74 194 -296 -199 -113 213 -334
2701 -334 -156 530 -323 -506 -56 422 66 -141 56 186 -209 -15 -50 -172 -142 -340 192 139 -249 -110 505
2722 505 208 -295 225 14 76 -49 411 -24 -263 -127 117 167 -251 -79 171 -2 -44 -89 160 248 -82 311
2744 311 440 38 -90 435 -35 -152 286 64 -61 178 322 186 58 -195 -195 304 -34 -22 -78 349 -162
2765 -162 -380 106 -36 -397 -52 261 -381 -83 229 18 -5 -229 6 253 -21 -346 31 101 -383 -111 351
2786 351 -94 -434 -13 8 -43 -562 10 -252 -332 -216 -3 -35 -495 -216 189 -95 -446 -200 63 -117 -414
2807 -414 53 441 -399 78 394 325 -215 1 197 -290 199 347 101 -76 13 62 274 189 -42 413 213
2828 213 219 -40 473 97 -45 368 486 -98 -309 301 -144 96 -57 277 -89 -13 100 -63 -23 -6 -57 351
2850 351 94 -404 12 408 -410 -162 147 276 -480 14 -169 306 -178 6 34 -244 70 -29 -52 -257 -274
2871 -274 -134 119 -145 -181 220 56 -258 26 -37 -251 -245 -82 -95 -389 -266 -92 193 -12 -381 -134 188 -340
2893 -340 -28 162 46 -364 -131 97 23 -52 80 18 -364 -87 39 15 106 -81 165 65 36 -24 222 -37
2915 -37 79 96 192 -122 -245 -35 360 38 57 238 -107 48 61 130 -41 -109 120 235 -197 -123 193 -71 -109
2938 -109 -83 355 -49 -206 -6 300 -228 -383 -38 233 -274 149 11 110 69 39 107 46 -269 -251 349 20
2960 20 -72 -151 358 -186 -244 -155 134 -320 -3 -9 -212 156 59 73 -179 -149 -85 148 40 -92 -136 -8 -198 -126
2984 -126 192 179 -227 31 237 87 15 103 189 -70 11 7 342 81 -203 140 -112 159 -140 292 401 -62
3006 -62 58 245 -74 -108 194 262 -284 111 390 -112 -93 92 149 79 -230 -25 193 163 -293 30 123 16 -54
3029 -54 308 87 -434 302 176 -58 15 -121 133 72 -46 -74 -239 117 -226 -55 92 -264 -210 241 26 -216
3051 -216 -267 433 -74 -114 3 -206 -208 -85 -9 -9 -64 -114 50 109 -139 -29 -144 -96 -213 -188 129 -145 -230 40
3075 40 -46 -120 -85 230 101 -50 108 141 123 405 144 111 468 -274 229 224 -113 -267 277 -26 -138 76 127
3098 127 -136 44 99 141 188 272 -68 272 111 -62 81 72 -192 -77 47 162 -181 113 123 -66 -68 65 204
3121 204 -11 -50 140 -130 -161 89 -63 387 -186 -279 -22 -39 -27 54 22 -283 -89 277 -127 -175 -86 86 -94
3144 -94 -101 104 59 -121 -376 -185 82 -135 70 18 72 35 -165 151 320 -340 -251 97 103 -141 -8 24 -170 -212
3168 -212 46 169 130 32 16 84 11 -177 207 187 -4 -44 227 -184 -178 301 236 -284 59 96 104 -230 -84 326
3192 326 57 -4 5 41 128 78 -348 72 4 -557 22 77 -101 155 129 -39 -119 38 88 39 -102 116 -28 17
3216 17 39 -260 20 106 -71 213 161 -179 -280 18 33 -134 -28 112 -115 -458 47 -12 -56 -112 143 -42 -191
3239 -191 -71 -13 43 -350 -346 -73 -60 -245 126 68 -172 296 86 47 -47 26 141 -54 14 14 91 -77 -55 -59 -117 162
3265 162 -312 136 -6 -191 -106 213 107 -49 -86 224 -237 65 -38 -64 10 -15 -17 298 -133 16 -36 120 -31
3288 -31 91 260 28 -27 279 66 3 -64 144 236 93 147 73 44 -124 -332 14 325 72 -73 -130 -144 -470
3311 -470 222 170 93 -120 111 45 -120 -95 99 226 -140 -153 -89 251 -156 -172 -44 -156 -165 -46 148 -226 -45
3334 -45 347 -14 -199 -32 -6 -175 -317 -216 153 -23 41 -58 -112 -17 -210 204 356 -77 66 390 5 -191
3356 -191 432 167 86 -358 390 151 -39 129 276 -96 195 334 371 104 46 292 192 242 -198 -157 120 -469
3378 -469 145 136 2 -60 204 72 -45 -172 242 342 201 3 35 22 -344 -177 178 319 -357 86 -88 -220
3400 -220 -599 286 -111 -568 103 97 52 -109 -347 26 96 316 255 -30 -33 137 86 405 -188 -421 -540 -266 -68
3423 -68 -99 -263 177 -60 -178 139 -129 -26 23 -44 250 465 -256 342 228 132 -212 62 -284 -758 203 260
3445 260 -402 117 372 157 107 -28 184 28 -234 125 6 229 215 -212 -32 493 827 -100 217 -186 387
3466 387 -258 -247 222 320 -421 -413 -503 13 274 -45 -156 241 -117 -28 219 101 79 -639 263 373 120 168 93
3489 93 101 -1 -181 225 74 -616 80 -194 178 -42 10 -130 223 -343 -120 647 -310 -139 410 240 -744
3510 -744 -72 256 -11 -95 309 -365 -117 41 -189 13 79 -46 223 33 -319 -182 48 184 -182 -332 602
3531 602 -79 -182 223 161 -102 291 61 -311 -141 10 -9 54 -12 111 303 142 -180 0 188 -278 -60
3552 -60 118 104 -125 312 93 -39 -97 -6 -10 -58 5 50 -250 -54 -142 243 68 -126 -101 88 291 -30 157 374
3576 374 -83 -19 172 106 -39 -243 -131 16 -36 26 17 -40 -169 -29 141 53 -100 42 67 -17 -49 162 152 -145
3600 -145 56 267 36 20 348 -303 211 -115 172 142 -16 25 81 -57 159 -253 235 132 -23 50 183 -370
3622 -370 -51 499 49 36 -85 328 213 206 -170 788 21 -189 -204 -172 67 42 231 173 -270 155 459 191
3644 191 30 130 -344 -105 69 151 922 -47 -545 -23 -271 -312 412 189 81 49 -166 497 467 -150 333
3665 333 396 610 -659 114 465 55 387 129 530 46 -273 -279 -250 479 214 182 392 -777 -20 -83 70
3686 70 -18 -419 -721 -392 216 356 -303 -1066 756 -224 329 -6 101 191 -191 144 -223 -143 113 -568 223
3707 223 63 -455 101 257 26 463 -170 377 339 -203 436 486 -122 292 619 415 437 40 193 486 -471
3728 -471 -26 354 -298 64 136 283 -247 909 -331 -161 560 -130 479 295 -441 -39 1012 395 -36
3747 -36 -441 554 -111 -371 202 -216 376 -75 -153 592 130 682 226 263 -324 -123 -409 -878 -327 -248 334
3768 334 -213 -469 1236 -595 -163 -516 -540 -169 105 -249 362 19 107 -415 747 92 -331 -210 -26 -391
3788 -391 -354 596 170 -340 -98 -325 77 409 -452 -170 102 297 569 140 92 -290 601 217 -37 -62 -187
3809 -187 488 306 -403 54 102 -253 651 138 -201 471 -82 84 -98 142 96 306 81 -278 -101 -244 18
3830 18 264 334 83 49 137 198 -27 -172 190 -1 37 245 -131 45 18 -102 50 47 -118 270 95 -43 165
3853 165 257 -196 -264 -20 126 166 -14 52 -172 -51 -313 -132 16 26 -95 -347 -154 -192 306 -121 354 58
3875 58 38 192 -404 -5 3 147 -261 166 180 332 -134 330 -1 -187 1 109 173 -141 -8 -308 -82 -85 -202
3898 -202 -198 73 183 -21 0 -270 -321 180 391 100 279 295 60 -8 -671 -141 127 -85 -228 -41 36 30 -146
3921 -146 356 96 87 -70 82 -275 -100 -72 -293 -218 -315 37 278 394 107 317 -105 10 -426 137 -309 -490
3943 -490 -161 2 -200 294 -316 -216 -56 -12 -12 384 187 73 115 -147 50 -12 241 -393 106 -97 -131 -367
3965 -367 160 140 -182 221 46 278 -313 83 186 31 -36 -80 420 -36 252 -114 84 -181 -2 15 -6 -26
3987 -26 240 141 391 -122 185 216 43 -43 -35 -104 12 -107 -165 -182 129 -107 221 148 11 -358 162 64 -162 -66
4011 -66 105 -85 -132 -180 43 -2 -21 215 388 147 -59 143 376 32 -78 379 94 -296 106 48 -91 15
4033 15 62 79 45 79 204 -268 -54 193 -106 -24 129 -96 131 77 340 -101 403 110 -32 631 152 328
4055 328 -78 166 -126 314 -326 100 0 465 -190 95 -87 -345 -117 458 -465 -77 514 -19 -192 251
4075 251 -47 99 250 648 807 3 295 168 -7 480 -698 519 -115 -232 879 28 329 181 267
4094 267 152 177 27 525 101 96 48 15 -168 -286 84 -117 106 -456 -161 35 -195 267 359 413 -535 -446 163
4117 163 -51 102 -254 198 431 118 127 -207 131 307 257 49 99 60 182 400 8 -128 264 -59 186 337
4139 337 220 34 -436 -399 244 -149 117 -5 254 35 -112 153 69 88 301 145 125 50 91 58 113 -174 -160
4162 -160 135 282 57 -141 -15 -91 270 151 93 80 -112 227 -102 -155 -136 168 -49 28 128 -88 -96 92 13
4185 13 49 114 -222 32 107 153 118 21 -101 44 102 130 67 100 49 -5 20 -223 202 21 -37 204 -116 23 34
4210 34 -147 150 -333 -112 -153 87 -226 -102 6 55 -77 -93 65 -65 -93 -134 42 -99 117 41 -165 86
4232 86 3 -133 -103 -76 -107 -28 44 192 -191 176 -78 -4 130 -45 -120 109 296 -36 -21 50 350 -133 145 99
4256 99 146 -2 37 155 289 -63 -18 32 -11 -30 -55 205 -263 -52 -207 156 -121 -245 -83 -48 181 42 306
4279 306 -69 -162 -144 58 -38 -5 -56 44 184 -28 223 10 -207 77 117 -22 -90 -80 -13 25 -83 156 -27
4302 -27 -7 -105 -231 8 -20 188 -175 -16 72 -93 41 134 -165 -23 37 -265 -200 298 182 -94 -251 157 227
4325 227 31 -43 128 283 -153 279 235 -168 -38 104 160 52 70 54 215 -278 -217 251 179 -36 -103 27 -127
4348 -127 53 -307 119 84 81 -229 -216 -13 249 -81 149 -11 -25 27 133 -154 85 54 108 68 208 301 365 -28
4372 -28 79 110 -72 307 -35 -68 -38 -20 175 110 -34 -71 31 -88 -119 -184 35 -64 127 13 -64 114 -241 196
4396 196 -156 -61 -157 -23 -140 -204 333 -240 154 11 -89 136 478 101 177 -4 -138 -19 42 -139 -209 40
4418 40 2 140 50 150 -130 -184 0 53 -21 -203 19 188 198 -37 81 -128 -28 -11 -28 4 -14 33 -179 17
4442 17 -1 260 70 -224 -158 148 170 -79 77 -29 -159 142 38 147 -98 -152 -28 133 47 -138 -105 43
4464 43 -62 -186 46 -15 -47 -183 34 -32 -12 135 55 12 113 100 -36 -76 -34 46 85 -320 -87 -67 -156 23 -79
4489 -79 -14 2 -23 64 -71 -85 -16 152 66 -168 -135 -97 42 45 90 13 -106 -218 102 -94 55 55 -125 -154 8 -211
4515 -211 23 2 127 72 143 215 -195 -66 398 52 -54 37 170 122 47 69 129 10 -144 176 64 257 76
4538 76 -21 74 44 2 27 -170 50 0 -58 -122 -242 -127 58 -170 -208 -96 133 179 -76 -24 44 -21 -34 -31 -163 -136
4564 -136 60 -84 -35 -16 70 140 -298 -187 71 88 -145 118 -206 102 -238 -159 11 -38 41 136 -233 -271 -173 16
4588 16 82 -265 55 220 -127 224 -67 47 -134 -64 267 185 126 130 62 -35 -283 42 182 -15 -124 12 83
4611 83 -95 131 150 173 26 107 -254 -257 -95 209 -26 -250 92 27 99 22 -120 -34 48 -119 0 19 -25 113
4635 113 63 67 -1 -122 78 100 20 -292 -2 230 17 155 101 143 43 -175 259 -87 -356 -27 -99 5 -121
4658 -121 -11 -189 -180 141 41 100 -176 -161 45 17 110 -31 -205 -209 54 -18 167 -176 -210 242 -7 -45 155 30
4682 30 165 -16 430 46 -124 -7 32 -124 -152 -31 -271 57 -65 -48 -337 27 114 51 123 -61 -56 -114 189
4705 189 -136 88 93 128 142 267 79 -39 -110 25 21 -222 15 112 126 -49 -30 263 -46 122 -42 144 154 43
4729 43 -169 -166 -90 -162 -49 34 59 17 -84 435 156 -105 75 -77 80 -42 163 94 -257 82 105 -140 -46 -26
4753 -26 -225 -195 92 -8 -38 -150 -19 132 -144 -212 225 102 5 -171 47 44 3 90 -88 143 -105 -84 -87 31
4777 31 112 -46 -27 89 274 -52 192 109 -68 -163 182 -74 -73 251 -33 -115 42 108 -21 -67 76 -157 -3
4800 -3 -163 -9 112 -27 -240 27 -143 -19 181 158 -246 85 29 58 71 22 -109 82 -13 -69 -56 -41 236 -236
4824 -236 -38 -125 -53 -139 -120 -301 -56 99 -122 -239 151 -168 -13 -320 72 51 -179 -35 41 50 -360 37 39
4847 39 89 -27 -10 -134 -101 -71 -208 171 -4 -201 -70 5 19 -182 149 103 -15 -99 -163 5 7 6 171 -120 -76
4872 -76 -113 189 -18 -27 -140 238 16 -82 487 -62 -225 226 361 153 -94 -113 -72 -28 113 76 72 135 -168 -183
4896 -183 233 169 182 115 114 105 8 264 -152 -74 289 144 76 39 233 83 92 -156 -46 27 0 -155 166 -129 67
4921 67 40 -186 -111 -86 49 -165 -92 -84 53 74 -76 -74 -169 165 -194 -7 111 -205 -74 89 170 42 -19 -47 226
4946 226 198 -117 205 228 42 52 -19 -224 77 4 -116 129 112 73 -35 207 -72 219 283 226 81 -163 -65
4969 -65 -143 228 -95 -68 -42 -101 214 326 -170 108 -31 81 -56 160 117 209 -51 -127 44 -22 53 148 -149 -60
4993 -60 171 148 135 240 73 -219 46 -38 386 -79 -53 -122 129 -74 -122 179 -120 28 105 233 55 85 350
5016 350 270 -6 138 -69 -111 56 -40 -24 -237 -294 -48 69 50 3 274 -8 -226 41 236 153 319 -151 -3
5039 -3 262 287 7 90 10 -32 7 -42 5 95 101 194 243 -107 251 68 -42 -67 253 82 -86 263 291 18 -163
5064 -163 -78 241 21 53 157 -134 52 -140 -45 170 105 119 250 156 38 102 115 95 -157 7 68 86 138 -22
5088 -22 -225 -89 134 314 -66 -156 27 -211 116 -136 -48 -66 242 -311 -59 89 168 150 -91 36 -209 11
5110 11 223 -114 -188 -9 4 21 -96 222 108 -125 45 -19 -211 -160 156 85 200 -174 115 186 210 45 8
5133 8 -150 279 143 44 59 92 177 218 -329 -56 78 267 150 17 -35 62 -95 43 -76 111 -182 -81 -39
5156 -39 -31 -136 -50 129 6 26 -65 -77 -3 125 32 -192 -128 -287 106 39 -102 -74 107 153 -9 26 -50 15 -211
5181 -211 22 -227 -37 -60 -62 -192 -142 4 135 -210 11 -168 240 -116 12 89 -109 102 -272 129 133 -269
5203 -269 -139 243 -151 -98 179 18 -337 -6 109 -51 102 19 51 -138 -131 -112 -161 233 -125 122 66 217 68
5226 68 -247 -165 -46 -97 -1 -50 41 -29 104 19 -158 119 123 38 54 359 -173 0 -147 -54 -161 17 104 -291 -526
5251 -526 -108 -40 167 -96 -81 -68 150 109 -1 117 137 -327 -203 182 51 -140 91 31 183 -51 21 120 -10
5274 -10 107 213 -213 -202 -173 298 140 -184 19 127 -56 -96 191 196 -99 -144 -85 6 -167 -167 12 97 -189 185
5298 185 119 -97 102 32 155 185 165 -313 -70 93 -27 121 41 31 99 20 176 317 98 -35 48 -290 129
5321 129 196 13 6 -68 -259 67 172 66 -178 7 -54 170 163 -122 -97 104 122 -48 -70 93 -3 97 10 35
5345 35 -2 -240 179 142 268 -146 -88 192 -172 33 4 -220 -23 151 -254 -102 -117 -54 139 -88 273 -51
5367 -51 -97 15 230 -52 139 158 177 81 -125 95 44 -142 -12 -18 33 125 85 54 -138 -7 50 230 -58 -201
5391 -201 63 -120 223 -26 14 228 -84 -136 9 277 -85 20 -5 -107 167 -235 -167 69 -169 -109 -12 81
5413 81 -19 165 -210 -169 234 63 21 -136 8 137 178 253 -8 99 -133 -24 64 136 101 360 295 236 114
5436 114 -61 86 88 -2 -93 314 -3 -123 249 -100 40 -44 -372 -179 -124 124 60 -61 197 -94 58 -34 8
5459 8 91 -180 -23 -104 -147 35 -80 166 -208 -24 -267 -24 118 -106 24 -41 148 19 -74 28 324 183
5481 183 -78 -135 -143 -152 95 150 83 163 97 92 104 94 66 -63 72 9 121 -3 -179 -158 355 330 302 120 237 -73
5507 -73 18 169 271 18 25 9 -53 -44 -271 146 -3 100 -97 -16 137 -28 -97 -28 7 -153 -141 -31 98 -92
5531 -92 -94 117 -27 16 -177 27 120 -293 360 150 118 -106 -72 25 11 -66 123 -81 -27 117 225 -118 -121 -115 -125
5556 -125 100 21 39 -108 44 -27 76 -94 -82 -114 -250 133 -232 159 47 54 -158 124 -199 -352 -100 5
5578 5 -245 33 49 -119 24 -89 58 -35 134 1 230 215 -132 29 90 122 169 -85 -59 -118 -132 116 5 1
5602 1 -182 183 -20 -24 41 64 100 29 256 118 -158 65 -39 108 -121 -135 158 -28 -221 -46 139 -132 -83
5625 -83 -132 -134 116 -140 118 -4 114 -8 35 -66 -140 -66 394 -168 4 -67 194 -165 -76 -136 -75 11 94 206
5649 206 -85 -272 84 -31 -75 -42 -4 -110 -95 -23 268 -65 63 14 59 22 -232 66 -21 -57 -130 -61 7 -72 34
5674 34 123 23 -143 -10 52 49 -184 169 176 -31 91 53 95 -48 -48 133 -89 69 102 76 427 -87 160 -27
5698 -27 -97 -159 92 -35 99 -43 269 30 -118 -92 296 -109 -206 155 11 11 -37 -187 -208 9 -64 -84 157 -76
5722 -76 -184 292 64 -212 -195 -176 0 -392 31 -37 -12 -88 56 -77 123 261 -5 -92 -54 30 72 0 -111 -25
5746 -25 0 -125 -198 -96 -57 -97 -170 -136 32 63 23 -150 87 122 -9 148 -164 -213 96 -130 -392 57 90 217
5770 217 -58 -14 172 208 -68 97 436 -18 -36 72 48 181 -39 -126 -143 81 -1 164 -174 -70 -109 -42 -63
5793 -63 -7 104 -24 -234 -264 92 -216 -195 -213 150 75 -26 -31 198 -273 -344 168 -50 63 -200 -61 -38 74
5816 74 81 -13 150 5 182 -34 -47 -90 -28 -93 50 -54 198 48 -52 -158 -39 -2 -45 -230 -140 147 -106 -53
5840 -53 -297 -119 69 183 95 -145 -44 115 -25 45 76 96 73 -135 -123 -95 217 -324 157 10 -8 80 -62
5863 -62 -108 30 8 -60 -128 -161 -36 -170 219 -266 -34 107 -202 29 87 -118 -135 255 78 122 -134 -82 58
5886 58 41 32 -190 373 20 -176 115 -180 -106 -45 -13 -5 -271 -9 -187 -107 -300 72 -32 -225 -255 259 -95 -12
5910 -12 -18 -58 -92 -184 -135 -22 227 -265 109 172 -59 -78 -62 144 -45 205 78 52 -61 129 -191 116 -153 196
5934 196 -33 -175 116 54 121 -230 -144 181 -67 37 17 97 23 27 -23 255 304 -165 -81 189 -258 -31 -360 -150
5958 -150 -63 -75 238 -38 -113 60 116 -107 -221 -185 -8 11 224 -188 47 71 12 21 6 141 -65 -313 -105 -120
5982 -120 5 258 59 91 -165 -52 14 -282 -141 240 -118 45 252 124 33 266 -35 -72 -181 77 140 -161
6004 -161 -32 -47 356 -100 82 -142 -228 -79 -83 -96 213 50 -174 34 15 -154 179 -61 127 -32 42 176
6026 176 81 41 103 132 -117 155 23 -221 -43 148 2 -132 -25 76 147 131 -3 63 30 -35 -2 -146 -193 -170
6050 -170 241 -42 -261 232 3 -164 103 -119 -68 -54 89 279 37 97 60 283 16 -144 -115 35 145 -87
6072 -87 120 96 57 -101 223 39 -19 -91 -34 100 -94 -184 256 -59 -133 52 115 151 45 266 60 -76 -88 22
6096 22 19 76 -60 122 -32 -151 -128 -62 -68 -242 38 142 -40 -251 114 225 24 -254 87 295 64 -48 383
6119 383 16 -130 89 181 38 67 -11 73 33 140 -31 123 -8 6 2 235 75 -56 82 138 -143 38 83
6142 83 -83 -369 93 265 -1 -269 130 19 -74 17 80 253 -95 149 186 44 -47 -33 -61 169 70 -44 61
6165 61 -97 -129 164 -220 110 -46 -36 91 -250 51 131 -21 -215 137 15 -7 -32 5 82 68 -83 -85 181 -131
6189 -131 -68 117 -4 58 32 78 -152 -201 -9 62 -140 -269 -34 -138 -37 -55 -147 50 -85 314 292 -83 64
6212 64 -54 150 -235 297 331 -51 147 6 -51 -61 22 13 -166 -256 -32 225 -57 -98 112 84 93 60 158 31 105
6237 105 158 7 106 20 -101 -33 111 -237 125 212 -82 8 120 10 -55 -334 111 -99 203 -29 80 -16 -175
6260 -175 116 -96 -91 -166 16 84 138 -30 -96 -120 -42 -67 -62 28 8 87 224 -128 -15 13 49 -79 -178 -65 11 86
6286 86 62 315 -129 -164 -142 -86 -73 69 98 -178 133 -132 64 -29 31 -83 -34 273 122 130 -81 83 -24 122
6310 122 53 142 153 53 122 -138 118 180 -17 46 -65 57 235 -71 -108 98 42 -8 -64 9 272 72 -60 -49
6334 -49 267 -93 101 127 57 64 -5 37 -179 -128 -143 -10 -191 32 -146 -134 -6 110 32 -125 -202 138 -284 81
6358 81 -135 -96 146 89 150 6 162 -185 -78 35 313 -38 -56 -75 -34 -53 16 -29 5 215 4 -100 61 -34
6382 -34 -181 3 31 111 106 63 64 -110 -210 97 -107 415 24 121 -121 450 87 10 63 -69 72 -159 116 90
6406 90 353 -88 142 34 60 -17 -33 -230 -82 21 95 -297 -80 -84 351 -98 -1 144 378 -39 -21 -197 -9
6429 -9 -62 56 -29 111 82 -212 18 31 -27 270 58 -148 -70 148 -99 -11 -229 -29 43 182 25 -44 57 -212
6453 -212 91 -247 -218 141 -10 -34 -283 300 -107 -292 19 86 152 -5 50 -78 80 -175 -103 -278 -71 -81
6475 -81 198 106 -143 -130 12 32 234 -86 117 -97 -112 88 41 -249 27 132 266 267 -39 150 2 78 -185
6498 -185 108 -75 -180 30 105 82 -22 50 -10 -166 51 213 87 -31 -168 63 100 -179 -29 68 -81 -311
6520 -311 -143 115 95 -56 158 151 136 -164 323 60 -43 128 -17 45 -44 -105 126 -146 -85 74 -101 -202 -175
6543 -175 113 -15 -205 101 127 -236 266 -45 -122 -120 -90 -96 163 27 -37 192 -183 -77 -47 -202 202 -14 -109
6566 -109 72 166 -41 94 88 -111 210 54 91 345 -84 262 22 141 189 -67 -163 -63 93 282 -128 -91
6588 -91 -24 -45 -15 28 163 -91 -203 -155 36 191 -178 -50 50 43 -88 16 290 -120 -27 82 146 -85 159
6611 159 148 -26 -243 -299 52 -153 25 21 -176 -186 -254 -13 3 146 -280 42 -198 -95 -300 -5 76 -115 51
6634 51 -21 -222 -80 -47 -156 -200 -124 75 -7 -161 15 113 -70 72 55 61 81 -30 -2 196 8 -39 -24 52 -312
6659 -312 -183 78 79 -3 -145 -55 147 71 138 281 30 58 95 -3 -35 2 101 -22 -70 109 329 -179 -184 -91 32
6684 32 -38 -11 139 109 -146 -22 6 173 79 -189 194 87 18 85 -15 -116 80 200 92 -149 -100 82 -143
6707 -143 7 148 -9 102 -71 25 -22 4 -59 -141 -111 -34 1 -103 -62 -128 -21 324 -111 -306 -101 115 -28
6730 -28 86 63 -171 -81 -203 25 337 -143 -30 -7 31 10 87 4 -215 -149 169 285 28 -71 53 59 71 -53
6754 -53 82 -58 -304 -111 -29 17 -118 142 49 -62 -183 224 -101 -59 -49 -119 66 -16 55 -64 106 -157 -270
6777 -270 77 -18 -172 -35 177 2 -234 -41 -30 154 32 -59 19 20 64 31 -337 61 -249 -107 194 -53 -77
6800 -77 -95 -138 42 -69 75 -154 113 261 -258 -191 -428 288 -148 -201 -117 190 198 -120 31 219 -168 -45 -36
6823 -36 75 31 31 28 85 135 294 -19 -27 67 73 216 37 -16 93 8 -58 147 126 -78 -60 321 -180 -89 208 250 -60
6850 -60 138 77 152 118 -126 79 198 -28 -74 79 195 -18 -28 6 61 109 -67 -21 -40 68 -120 214 139 -91
6874 -91 127 196 34 -234 -113 110 -48 191 219 -106 -284 168 -88 25 -27 -268 -28 -335 46 -61 99
6895 99 -138 61 -8 -79 -25 -239 -44 43 -186 -211 -169 -178 -1 -96 22 -22 -130 -106 -34 -45 150 47 107 -139 -69
6920 -69 -133 -13 -239 98 100 91 145 223 -62 -29 89 163 296 -54 125 21 74 -177 109 403 80 -7 19 -38 -102
6945 -102 -184 92 18 -205 48 15 60 9 349 -55 -32 -130 79 110 -92 11 12 119 -22 275 -108 128 52 -36
6969 -36 -22 136 -62 43 2 -28 -84 148 191 -16 202 248 145 -116 61 -5 -195 -83 -45 89 -176 285 379
6992 379 138 -84 -67 260 137 -291 -28 19 -121 114 -90 13 -110 -151 -115 48 7 -240 -132 168 20 28
7014 28 126 81 -59 -222 105 -32 -145 38 -31 210 57 260 73 21 217 63 56 66 197 152 -238 -4 287
7037 287 103 20 -42 174 68 14 143 49 -197 69 -21 248 29 -61 9 -52 -130 -61 46 -225 -104 -325 302
7060 302 -242 17 -267 69 -77 23 -229 105 169 -116 -319 -237 -93 -378 -51 -30 -167 13 208 -143 11
7081 11 29 105 -98 112 196 277 -114 -22 209 318 -176 38 -90 65 117 37 -23 -99 159 127 65 25 -2 253 105
7106 105 77 13 -296 -171 -89 -14 -77 90 -306 252 166 135 135 241 -62 -43 -11 -53 122 7 301 23 223 -100
7130 -100 138 111 25 -144 29 26 -143 -51 125 128 12 7 217 57 -173 214 58 -92 -98 -194 166 -205 -226 -29
7154 -29 95 53 -53 162 73 -248 -134 52 -43 38 378 18 -55 -239 -48 -12 -147 -26 -112 51 85 -75 233
7177 233 -161 -134 144 0 -71 34 8 76 -16 -67 49 -134 19 111 -114 -48 118 -329 178 -203 -49 51 75
7200 75 -85 268 251 112 -99 189 129 -57 191 -132 -99 -201 -72 45 -64 -157 -55 250 86 247 -277 41
7222 41 67 -13 -278 304 -26 89 176 25 -204 86 -51 75 -86 54 -149 -68 38 -75 66 -188 -231 15
7244 15 -117 40 -9 -18 -28 -83 11 -21 -127 -23 43 -32 -90 -115 108 88 -239 -120 -161 -121 77 143 -66 98 -361
7269 -361 72 237 -107 -238 -191 -36 -74 44 -146 394 182 95 -368 305 0 -163 -87 -132 141 -105 193 -84
7291 -84 42 -69 136 85 69 229 -140 -71 -82 145 -225 -104 -7 -103 40 36 46 280 -10 -297 48 372 -156
7314 -156 -12 248 -24 -18 -165 170 109 -115 -128 79 34 -94 42 -139 -96 -285 40 135 196 53 35 167 -132
7337 -132 20 31 -22 -4 132 -127 -372 206 -235 55 -156 -135 74 -112 -21 118 -55 -251 -28 -38 -81 -99 19
7360 19 -147 -107 -119 -138 48 208 192 88 116 -117 -33 17 229 -232 202 191 -95 -104 -122 82 -16 117 54 70 71 -146
7386 -146 70 -50 29 61 175 11 208 -262 22 35 -12 201 -19 -141 -146 -102 -187 -117 143 157 -137 51 219
7409 219 54 -10 -63 97 20 -141 75 108 62 18 14 111 -18 -60 274 -60 129 -64 137 180 130 235 -32 37
7433 37 41 -150 142 272 -100 -78 229 12 24 -59 184 73 -95 -163 164 -15 138 -40 286 31 56 162 -293
7456 -293 39 -89 93 -35 -70 1 109 -86 96 -116 119 146 72 -105 -140 90 61 -140 24 83 -163 -21
7478 -21 -70 -195 -64 247 -99 -99 109 132 -146 92 291 18 -228 -111 41 -50 -97 -181 298 127 -43 205 210
7501 210 76 3 -4 34 -377 71 111 -111 -16 213 63 -187 -233 -106 11 -108 71 -82 -55 25 -115 37 -71
7524 -71 -145 -88 -148 30 58 -25 -120 -39 87 79 125 -33 88 22 -26 -138 -47 176 -43 44 14 -75 -126 40 108 -155
7550 -155 -209 41 -37 -81 -341 -45 179 -30 48 139 185 -89 -33 70 -163 -151 -13 -103 76 -106 55 183 -105
7573 -105 -1 120 289 -18 86 -71 104 -213 162 156 -94 -77 -268 249 -32 20 120 22 -55 -155 378 143
7595 143 57 -75 -38 -80 1 -76 -92 148 68 265 -163 83 -12 -115 1 48 0 -10 -53 -146 13 16 -123 -2 -213
7620 -213 121 -118 -38 135 -78 -206 -57 -66 -205 -39 174 277 192 -51 -118 108 226 -119 -28 117 110 -67 482
7643 482 29 -157 79 242 -129 -49 77 -144 -193 84 160 182 -118 151 -31 238 163 -184 128 0 156 248
7665 248 23 292 -153 198 35 -286 118 404 51 140 94 87 -95 -81 -67 169 249 16 57 -26 148 134 -111
7688 -111 -113 12 36 -184 84 48 -129 47 -89 16 -106 -9 104 -30 -18 -121 -237 -358 -136 72 -163 138
7710 138 101 14 -44 -167 -27 -9 -3 -36 26 55 -156 97 158 185 -181 -58 276 50 59 -82 223 30 279 88
7734 88 -165 269 50 -324 -12 -47 92 120 -220 121 91 -141 -89 253 -158 -2 -113 50 127 44 -41 21 -45
7757 -45 -95 -105 -19 46 113 38 -44 -90 -102 -32 -78 144 195 -202 145 -227 61 123 -35 -72 -105 147 -27 29 -62 -30
7783 -30 -83 -83 196 -71 -23 -105 -10 -313 111 -30 63 -113 -397 198 -87 198 -205 68 18 -14 16 -175 168 -152
7807 -152 -45 295 65 -9 152 147 37 38 -54 147 -338 -216 -38 221 118 -74 6 236 -99 327 154 119 260
7830 260 -112 183 11 -11 -50 62 -56 155 -48 -213 93 5 14 175 190 78 -144 53 146 70 11 -100 130
7853 130 -36 -136 -118 63 44 -201 -158 -140 -67 -8 -292 150 -123 -49 118 88 -42 -110 240 -152 -10 -9 -207 130
7877 130 133 -233 239 -98 -154 85 163 -74 41 -12 239 140 -55 175 72 195 94 46 -98 -67 -90 9 335
7900 335 -53 -82 127 119 -155 72 132 -1 287 202 -34 117 188 66 -81 -93 -45 56 8 49 225 224 112 -5
7924 -5 35 218 -197 -144 354 99 -6 261 143 299 -177 155 100 -11 69 -80 -53 286 152 266 -42 166
7946 166 -182 -4 -100 -258 -46 -76 52 111 -70 236 151 -219 213 156 125 -357 147 -129 -54 11 -166 -88 30
7969 30 -145 57 -197 70 -39 -155 91 6 110 64 86 -73 46 -47 -183 -25 20 42 62 -46 -43 -16 -69 81
7993 81 205 -44 -173 100 64 -186 252 129 -190 -2 -249 46 -196 -58 181 160 -75 -126 -21 170 -363
8014 -363 55 -181 24 40 164 8 324 -269 -247 -137 151 -162 -40 14 70 190 109 18 -196 273 -179 -5
8036 -5 1 -120 271 -14 255 63 109 -182 307 60 -172 -76 6 -64 11 -126 -83 -75 -208 -149 -144 -134 85 61 -66 119
8062 119 -71 -142 74 -93 282 41 -40 80 69 -22 -164 -176 82 138 -82 -29 -161 14 133 260 -113 -72 258
8085 258 -80 53 144 20 -49 351 10 134 98 181 139 -155 -7 -3 -75 -169 53 250 263 -8 28 -53 13 -56 60
8110 60 14 -48 7 22 113 -66 -1 67 -283 -66 123 -14 100 44 92 -143 -143 65 61 179 -17 105 -119 -75 42
8135 42 171 -140 -24 161 -56 -157 -86 -231 38 77 -145 -231 136 40 172 -105 67 90 66 -36 63 171 108
8158 108 141 -320 -162 15 -26 127 -31 341 -81 -25 62 -119 -359 -35 40 22 -43 15 50 87 -29 -28 -14 -11 -107
8183 -107 328 269 154 -86 447 -79 95 0
8191@
##END NTUPLES=NMR FID
##END=
