##TITLE=1H_SL84-Dau(f6)
 CDCl3, 8 sc, 
 1.06.2021
##JCAMPDX= 6.0         $$ Bruker NMR JCAMP-DX V2.0
##DATA TYPE= NMR FID
##DATA CLASS= NTUPLES
##ORIGIN= UXNMR, Bruker Analytische Messtechnik GmbH
##OWNER= root
$$ XWIN-NMR		Version 3.5
$$ Tue Jun  1 13:41:02 2021 Russian Standard Time (UT+4h)  she@DPX200
##.OBSERVE FREQUENCY= 200.131506
##.OBSERVE NUCLEUS= ^1H
##.DELAY= (6, 6)
##.ACQUISITION MODE= SIMULTANEOUS
##.ACQUISITION SCHEME= undefined
##.AVERAGES= 8
##.DIGITISER RES= 18
##SPECTROMETER/DATA SYSTEM= spect
##.PULSE SEQUENCE= zg30
##.SOLVENT NAME= CDCl3
##.SHIFT REFERENCE= (INTERNAL, CDCl3, 0, 15.7039)
##AUDIT TRAIL= $$ (NUMBER, WHEN, WHO, WHERE, WHAT)
$$ ##TITLE= Audit trail, XWIN-NMR		Version 3.5
$$ ##JCAMPDX= 5.01
$$ ##ORIGIN= Bruker BioSpin GmbH
$$ ##OWNER= she
$$ F:/spectra/data/she/nmr/H-F/1/audita.txt
$$ ##AUDIT TRAIL=  $$ (NUMBER, WHEN, WHO, WHERE, WHAT)
(   1,<2021-06-01 13:39:28.89 +0400>,<she>,<DPX200>,
      <created by zg, POWCHK disabled, PULCHK disabled
       configuration hash MD5:
       00 E9 B6 7A A2 85 ED C7 34 08 36 98 17 FE 4E 26
       data hash MD5: 16K
       17 27 84 EF 62 4C 05 C6 1B 29 27 7C 12 B8 DC 7B>)
$$ ##END=
$$ 
$$ hash MD5
$$ BC 74 5D FE 35 2C C3 00 B0 BF 9C 45 D2 0C 87 AF
##$RELAX= 
##$RELAX= 
##$RELAX= 
##$RELAX= 
##$RELAX= 
##$RELAX= 
$$ Bruker specific parameters
$$ --------------------------
##$DU= <F:/spectra>
##$EXPNO= 1
##$NAME= <H-F>
##$PROCNO= 1
##$TYPE= <nmr>
##$USER= <she>
##$AMP= (0..31)
100 100 100 100 100 100 100 100 100 100 100 100 100 100 100 100 100 100 
100 100 100 100 100 100 100 100 100 100 100 100 100 100 
##$AQSEQ= 0
##$AQ_mod= 1
##$AUNM= <au_zg>
##$AUTOPOS= <>
##$BF1= 200.13
##$BF2= 200.13
##$BF3= 200.13
##$BF4= 200.13
##$BF5= 200.13
##$BF6= 200.13
##$BF7= 200.13
##$BF8= 200.13
##$BYTORDA= 1
##$CFDGTYP= 0
##$CFRGTYP= 5
##$CHEMSTR= <none>
##$CNST= (0..31)
1 1 145 1 1 1 1 1 1 1 1 1 1 1 1 1 1 1 1 1 1 1 1 1 1 1 1 1 1 1 1 1 
##$CPDPRG= <>
##$CPDPRG1= <>
##$CPDPRG2= <>
##$CPDPRG3= <>
##$CPDPRG4= <mlev>
##$CPDPRG5= <mlev>
##$CPDPRG6= <mlev>
##$CPDPRG7= <mlev>
##$CPDPRG8= <mlev>
##$CPDPRGB= <>
##$CPDPRGT= <>
##$D= (0..31)
0 1.2 0 0 0 0 0 0 0 0.06 0 0.03 0 0 0 0 0.0002 0 0 0 0 0 0 0 0 0 0 0 0 
0 0 0 
##$DATE= 1622540368
##$DBL= (0..7)
120 120 120 120 120 120 120 120 
##$DBP= (0..7)
150 150 150 150 150 150 150 150 
##$DBP07= 0
##$DBPNAM0= <>
##$DBPNAM1= <>
##$DBPNAM2= <>
##$DBPNAM3= <>
##$DBPNAM4= <>
##$DBPNAM5= <>
##$DBPNAM6= <>
##$DBPNAM7= <>
##$DBPOAL= (0..7)
0.5 0.5 0.5 0.5 0.5 0.5 0.5 0.5 
##$DBPOFFS= (0..7)
0 0 0 0 0 0 0 0 
##$DE= 6
##$DECBNUC= <off>
##$DECIM= 32
##$DECNUC= <off>
##$DECSTAT= 4
##$DIGMOD= 1
##$DIGTYP= 9
##$DL= (0..7)
0 120 120 120 120 120 120 120 
##$DP= (0..7)
150 150 150 150 150 150 150 150 
##$DP07= 0
##$DPNAME0= <>
##$DPNAME1= <>
##$DPNAME2= <>
##$DPNAME3= <>
##$DPNAME4= <>
##$DPNAME5= <>
##$DPNAME6= <>
##$DPNAME7= <>
##$DPOAL= (0..7)
0.5 0.5 0.5 0.5 0.5 0.5 0.5 0.5 
##$DPOFFS= (0..7)
0 0 0 0 0 0 0 0 
##$DQDMODE= 0
##$DR= 18
##$DS= 0
##$DSLIST= <SSSSSSSSSSSSSSS>
$$ [...]
##$SUBNAM2= <"">
##$SUBNAM3= <"">
##$SUBNAM4= <"">
##$SUBNAM5= <"">
##$SUBNAM6= <"">
##$SUBNAM7= <"">
##$SUBNAM8= <"">
##$SUBNAM9= <"">
##$SW= 16.9725357007746
##$SWIBOX= (0..15)
0 0 2 0 0 0 0 0 0 0 0 0 0 0 0 0 
##$SW_h= 3396.73913043478
##$TD= 16384
##$TD0= 1
##$TE= 0
##$TE2= 300
##$TE3= 300
##$TEG= 300
##$TL= (0..7)
0 120 120 120 120 120 120 120 
##$TP= (0..7)
150 150 150 150 150 150 150 150 
##$TP07= 0
##$TPNAME0= <>
##$TPNAME1= <>
##$TPNAME2= <>
##$TPNAME3= <>
##$TPNAME4= <>
##$TPNAME5= <>
##$TPNAME6= <>
##$TPNAME7= <>
##$TPOAL= (0..7)
0.5 0.5 0.5 0.5 0.5 0.5 0.5 0.5 
##$TPOFFS= (0..7)
0 0 0 0 0 0 0 0 
##$TUNHIN= 0
##$TUNHOUT= 0
##$TUNXOUT= 0
##$USERA1= <user>
##$USERA2= <user>
##$USERA3= <user>
##$USERA4= <user>
##$USERA5= <user>
##$V9= 5
##$VALIST= <valist>
##$VCLIST= <CCCCCCCCCCCCCCC>
##$VD= 0
##$VDLIST= <DDDDDDDDDDDDDDD>
##$VPLIST= <PPPPPPPPPPPPPPP>
##$VTLIST= <TTTTTTTTTTTTTTT>
##$WBST= 1024
##$WBSW= 4
##$XGAIN= (0..3)
0 0 0 0 
##$XL= 0
##$YL= 0
##$YMAX_a= 57395
##$YMIN_a= -43652
##$ZGOPTNS= <>
##$ZL1= 120
##$ZL2= 120
##$ZL3= 120
##$ZL4= 120
##$ABSF1= 10
##$ABSF2= 0
##$ABSG= 5
##$ABSL= 3
##$ALPHA= 0
##$AQORDER= 0
##$ASSFAC= 0
##$ASSFACI= 0
##$ASSFACX= 0
##$ASSWID= 0
##$AUNMP= <proc_1d>
##$AZFE= 0.1
##$AZFW= 0.1
##$BCFW= 1
##$BC_mod= 2
##$BYTORDP= 1
##$COROFFS= 0
##$CY= 11.3945322036743
##$DATMOD= 1
##$DC= 2
##$DFILT= <>
##$DTYPP= 0
##$F1P= 15.9154993809931
##$F2P= -4.1035820241983
##$FCOR= 0.5
##$FTSIZE= 0
##$FT_mod= 4
##$GAMMA= 1
##$GB= 0.15
##$INTBC= 1
##$INTSCL= 1
##$ISEN= 128
##$LB= 0.24
##$LEV0= 0
##$LPBIN= 0
##$MAXI= 10000
##$MC2= 0
##$MEAN= 0
##$ME_mod= 0
##$MI= 1.114404
##$NCOEF= 0
##$NC_proc= 0
##$NLEV= 6
##$NOISF1= 3.799351
##$NOISF2= 2.8
##$NSP= 1
##$NTH_PI= 0
##$NZP= 0
##$OFFSET= 15.70392
##$PC= 1
##$PHC0= -11484.51
##$PHC1= 17.80099
##$PH_mod= 1
##$PKNL= yes
##$PPARMOD= 0
##$PSCAL= 0
##$PSIGN= 0
##$REVERSE= no
##$SF= 200.130013532006
##$SI= 16384
##$SIGF1= 3
##$SIGF2= 2
##$SINO= 400
##$SIOLD= 16384
##$SREGLST= <1H.CDCl3>
##$SSB= 0
##$STSI= 0
##$STSR= 0
##$SW_p= 3612.71676300578
##$SYMM= 0
##$S_DEV= 0
##$TDeff= 0
##$TDoff= 0
##$TI= <>
##$TILT= no
##$TM1= 0
##$TM2= 0
##$TOPLEV= 0
##$USERP1= <user>
##$USERP2= <user>
##$USERP3= <user>
##$USERP4= <user>
##$USERP5= <user>
##$WDW= 1
##$XDIM= 8192
##$YMAX_p= 0
##$YMIN_p= 0
$$ End of Bruker specific parameters
$$ ---------------------------------
##NTUPLES= NMR FID
##VAR_NAME=  TIME,          FID/REAL,        FID/IMAG
##SYMBOL=    X,             R,               I
##VAR_TYPE=  INDEPENDENT,   DEPENDENT,       DEPENDENT
##VAR_FORM=  AFFN,          ASDF,            ASDF
##VAR_DIM=   8192,          8192,            8192
##UNITS=     SECONDS,       ARBITRARY UNITS, ARBITRARY UNITS
##FACTOR=    0.0002944,     1,               1
##FIRST=     0,             0,               0
##LAST=      2.4114304,     0,               0
##MIN=       0,             -43652,          0
##MAX=       2.4114304,     57395,           0
$$ Real data points
##PAGE= N=1
##DATA TABLE= (X++(R..R)), XYDATA
$$ plain form
0 0 0 0 0 0 0 0 0 0 0 0 0 0 0 0 0 0 -8 8 -8 8 -8 9 -16 16 -16 24 -24 32 -32 40 -48 49 -56 64 -72 83 -94 104
38 104 -116 130 -144 160 -178 195 -218 240 -265 291 -322 354 -390 428 -472 521 -577 638 -711 792
58 792 -889 1003 -1140 1312 -1529 1816 -2210 2796 -3747 5539 -10053 44380 57395 -43652
72 -43652 27270 16873 -16378 26366 12351 -5944 20863 8277 10310 14914 -315 -1409 14818
85 14818 11823 5762 9681 8077 8825 15158 -794 612 13955 5866 9772 17236 -2244 -5309 14946
100 14946 12435 -3529 3467 6016 -822 9142 5153 -5866 1102 1191 7226 2254 -15693 4557
114 4557 12122 -6313 4166 -913 -11964 8125 5164 -9143 324 2136 -601 5338 1040 -9373
128 -9373 -6242 2633 2967 -1212 -3905 -1406 -589 -4773 -4101 -4514 -7118 -884 2571 -2581 -8385 -7722
$$ packed form
0@%%%%%%%%%%%%%%%%qJ6j6J6j6J7k5L2l2M0m8N6o4P2q8R7j05J20j36J55j77J98
38A04k20K46k74L04l38L73m13M58n05N56o13O76p44Q18r00R93j098J215j349J503
58G92j681J892k143K452k841L345m026N006o543R286j5592N4433J3015j01047
72d3652P0922j0397l3251M2744j4015j8295K6807j2586K033M604j5229j094J6227
85A4818k995o061L919j604P48O333j5952J406J3343q089L906P464j9480l065K0255
100A4946k511j5964O996K549o838R964l989j1019O968Q9O035m972j7947K0250
114D557P565j8435J0479n079j1051K0089k961j4307R467J812k737N939m298j0413
128i373L131Q875L34m179k693K499Q17m184O72m13k604O234L455n152n804O63
$$ plain form
144 -7722 -1965 -3658 -3429 -1647 -7094 641 5699 -7796 -9336 -1324 1072 1580 -2217 -2315 -362 -1695
160 -1695 1706 -742 -8650 -771 6017 -2141 -3110 -451 -5978 -1031 2465 -6884 -4150 -1408 -4358
175 -4358 1230 -3839 -7297 -2990 -6579 1866 366 -14448 -2068 3632 -6110 -2443 -3474 -7320 -3133
190 -3133 640 -1049 -8392 -2588 2601 -5482 -2896 -3846 -7533 2356 898 -4141 -2245 -3077 2457 -502
206 -502 -5690 1834 -370 -770 7039 1266 -3970 2032 5311 1307 2665 5871 1544 4649 9088 1155
222 1155 2055 4555 5573 10560 2390 1819 9031 3106 6769 6763 -2168 5614 8877 4977 5947 2160 3363
239 3363 4690 5047 6289 -562 2968 9817 1634 834 4310 2452 2530 2884 3389 550 -616 5363 2415
256 2415 -2360 212 -461 248 1832 -201 -3701 -2522 2381 -1676 -5548 -973 -3021 -3437 610 -3260
$$ packed form
144g722N757j693K29J782n447P735N058j3495j540Q012K396N08l797r8J953j333
160a695L401k448p908P879O788q158r69K659n527M947L496r349K734K742k950
175d358N588n069l458M307l589Q445j500j4814J2380N700r742L667j031l846M187
190c133L773j689p343N804N189q083K586r50l687R889j458n039J896q32N534k959
206e02n188P524k204m00P809n773n236O002L279m004J358L206m327L105M439p933
222A155R00K500J018M987q170n71P212n925L663oq931P782L263l900R70l787J203
239C363J327L57J242o851L530O849q183q00L476j858P8L54N05k839j166N979k948
256B415m775K572o73P09J584k033l500J179M903m057l872M575k048m16M047l870
$$ plain form
272 -3260 -5791 -3562 -1143 -1853 -6798 -4757 -1477 -3713 -1785 -2908 -6735 -3700 -1231 -2173 -4779 -4160
288 -4160 -1306 -3053 -2481 -860 -5469 -3111 1368 -1775 -3141 -1555 -1432 -1605 -882 109 -3310 -2717 2990
305 2990 736 -3832 -741 345 -1384 297 198 -2818 -452 2451 5 -1446 -1471 -563 1081 889 -1112
322 -1112 -1701 -380 917 547 -1393 -2169 620 103 -866 549 -2087 -2447 2183 -152 -2674 -1110 -592
339 -592 488 223 -1739 -1006 -1031 541 1934 -1953 -2433 1647 1420 143 493 389 -876 1793 3859
356 3859 -1540 -165 3648 1298 1638 1991 666 2092 2616 3178 1470 -1205 4317 3359 1536 2575
372 2575 1089 2151 4167 4767 1801 932 3978 4409 2020 4355 2518 1164 5921 4798 1526 2579
388 2579 4562 5536 2206 2692 3653 865 4494 4976 182 826 2911 2698 1560 234 1300 -222 1022
$$ packed form
272c260k531K229K419p10m945K041L280k236J928j123l827L035K469r42k606O19
288d160K854j747N72J621m609K358M479l143j366J586J23j73P23R91l419N93N707
305B990k254m568L091J086j729J681r9l016K366K903k446j451k5R08J644j92k001
322a112n89J321J297l70j940p76K789n17r69J415k636l60M630k335k522J564N18
339e92J080k65j962P33k5J572J393l887m80M080k27j277L50j04j265K669K066
356C859n399J375L813k350L40L53j325J426N24N62j708k675N522r58j823J039
372B575j486J062K016O00k966q69L046M31k389K335j837j354M757j123l272J053
388B579J983R74l330M86R61k788L629M82m794O44K085k13j138j326J066j522J244
$$ plain form
405 1022 2515 -2040 -1360 1262 -676 -1238 -1044 -1964 -2098 -1113 443 -3631 -4573 -82 -1460 -2911 -2760
422 -2760 -3884 -2874 -2426 -2681 -3310 -5664 -2741 -1653 -4919 -3641 -4209 -5249 -1959 -3289 -5261 -3992
438 -3992 -3058 -1961 -3217 -4048 -2310 -2552 -2138 -651 -2452 -3633 -543 845 -1126 -1962 -976 -524 311
455 311 646 -695 -1257 350 1320 286 -1274 -155 715 452 1043 -439 -1207 971 2019 -77 -748
472 -748 931 318 467 2071 -125 -1801 1631 2553 -347 -710 714 910 841 584 525 -625 -200 2139
490 2139 257 -1678 372 196 -251 835 -679 -1952 517 1422 -73 -968 -40 770 1027 1099 178 -819
508 -819 1725 2805 915 102 1308 2104 1735 1836 2162 675 1953 3841 1090 1259 2091 1677 2401 2031
526 2031 1289 986 1357 3594 2036 -370 2205 1671 2347 2735 739 1302 2239 2250 2720 196 998 2536
$$ packed form
405A022J493m555O80K622j938n62J94r20j34R85J556m074r42M491j378j451J51
422b760j124J010M48k55o29k354K923J088l266J278n68j040L290j330j972J269
438c992R34J097j256q31J738k42M14J487j801j181L090J388j971q36R86M52Q35
455C11L35j341n62J607R70j034j560J119Q70k63N91j482p68K178J048k096o71
472g48J679o13J49J604k196j676L432R22k900l63J424J96o9k57n9j150M25K339
490B139j882j935K050j76m47J086j514j273K469R05j495q95R28Q10K57P2r21r97
508h19K544J080j890q13J206P96l69J01L26j487J278J888k751J69Q32m14P24l70
526B031p42l03L71K237j558k406K575n34O76L88j996N63R37J1M70k524Q02J538
$$ plain form
544 2536 1408 1924 1094 206 1595 1055 961 -326 -461 1030 438 265 -556 -2653 -214 537 -1253 -1837
562 -1837 -1994 -1176 -724 -2892 -1374 -2470 -2219 -183 -1358 -3520 -2144 -1407 -1666 -2882 -2182 -2362 -2564
579 -2564 -637 -2007 -3556 -2901 -1550 -1830 -2107 -2733 -2809 -2784 -1104 -2230 -4663 -2398 -798 -1809 -1706
596 -1706 -2409 -2173 -2060 -818 524 -1743 -1028 -91 -1133 93 -553 -90 556 676 759 -107 289 2504
614 2504 1268 957 944 194 363 2209 835 -327 864 1998 2121 379 1239 792 1607 2448 1234 821
632 821 1013 1612 1735 764 1058 1227 1316 364 1003 598 257 1167 1246 210 277 -226 907 1272 274 -387 -169
653 -169 944 188 -899 107 705 -367 283 80 -48 -538 764 1551 266 -867 526 634 825 875
671 875 108 817 1010 1221 651 -35 518 1191 475 1331 -17 -332 1607 963 385 -112 594 1346 293
$$ packed form
544B536j128N16q30q88J389n40r4j287j35J491n92j73q21k097K439P51j790n84
562a837j57Q18M52k168J518j096K51K036j175k162J376P37k59j216P00j80k02
579b564J927j370j549O55J351k80k77o26p6K5J680j126k433K265J600j011J03
596a706p03K36J13J242J342k267P15R37j042J226o46M63O46J20Q3q66L96K215
614B504j236l11j3p50J69J846j374j162J191J134J23j742Q60m47Q15Q41j214m13
632H21J92N99J23r71K94J69Q9r52O39m05l41R10P9j036O7n03J133L65r98o61K18
653a69J113p56j087J006N98j072O50k03j28m90J302P87j285j133J393J08J91N0
671H75p67P09J93K11n70o86N53O73p16Q56j348l15J939o44n78m97P06P52j053
$$ plain form
690 293 989 429 -796 1202 1188 -503 128 -135 232 678 197 -219 -907 443 340 -1275 -853 -227 -882
709 -882 -334 -567 -1315 -1695 -801 -265 -1793 -2107 -1090 -1864 -1039 -1572 -2927 -1740 -1703 -1376 -1791 -2879 -1877
728 -1877 -1688 -1772 -1444 -2491 -2158 -1474 -1651 -1976 -2391 -2131 -876 -1442 -1529 -1620 -1789 -616 -608 -1449 -1136 -1118 -165
749 -165 -167 -557 -510 -445 120 651 26 -106 279 717 851 813 546 584 1417 1798 860 595 1616 1787 1784 1348 1401
772 1401 1643 1629 2154 1915 1094 1338 2487 1751 1406 1441 1657 1708 1666 1384 848 1243 1995 935 1063 1121 555
793 555 1204 1608 636 -138 692 1203 779 140 607 368 390 1292 25 -428 511 701 167 168 -79 -53 80
814 80 89 -386 -854 -94 288 -283 114 -692 -411 277 -285 -470 -626 -282 288 -7 -314 -184 -382 359 413 -321
836 -321 -147 -200 204 441 -239 85 70 308 453 -212 -15 -30 126 54 -365 -569 -45 -93 -328 -563 -789 -452
$$ packed form
690B93O96n60j225J998j4j691O31k63L67M46m81m16o88J350j03j615M22O26o55
709h82N48k33p48l80Q94N36j528l14J017p74Q25n33j355J187L7L27m15j088J002
728a877J89q4L28j047L33O84j77l25m15K60J255n66q7r1j69J173Qq41L13J8R53
749a65kl90M7O5N65N31o25j32L85M38J34l8k67L8Q33L81r38k65J021J71lm36N3
772A401K42j4N25k39q21K44J149p36l45L5K16N1m2k82n36L95P52j060J28N8n66
793E55O49M04r72p74Q30N11m24o39M67k39K2R02j267m53R39J90n34Jk47K6J33
814H0Rm75m68P60L82n71L97q06K81O88n62j85j56L44N70k95l07J30j98P41N4p34
836c21J74n3M04K37o80L24j5K38J45o65J97j5J56p2m19k04N24m8k35k35k26L37
$$ plain form
858 -452 -380 -368 -1078 -1328 -505 -683 -818 -759 -1483 -1281 -602 -764 -986 -1458 -925 -568 -1730 -1175 -1748 -1446 -692
879 -692 -1095 -1960 -1592 -1334 -1081 -1081 -1299 -1194 -1544 -726 -654 -1541 -852 -397 -637 -301 -675 -672 -117 -125 503 -71 -160
902 -160 647 638 789 380 233 779 1586 994 759 615 1503 1507 1307 1237 617 1274 1875 1456 1006 1070 1901 1895 1669
925 1669 1508 1310 1278 1976 1645 1132 1501 1581 1431 1351 1017 766 964 1464 1162 565 508 719 782 370 356 -93
947 -93 117 369 73 -267 -512 103 279 -282 -707 -318 -107 -276 -130 -457 -1117 -257 24 -681 -976 -681 -180
968 -180 -372 -646 -685 -955 -376 -69 -1081 -825 -330 -645 -375 -308 -1239 -470 -444 49 -203 -1235 -222 -206 -610
989 -610 -33 -379 -825 179 -112 -169 -340 -643 -111 27 -284 -311 -858 70 253 -676 -422 -306 -538 -370 -479
1010 -479 -636 -944 -404 -44 -616 -614 -381 -593 -576 -554 -671 -798 -441 -182 -677 -1160 -361 -320 -425 -404 -1195 -566
$$ packed form
858d52P2J2p10k50Q23j78j35N9p24K02O79j62k22m72N33L57j162N55n73L02P54
879f92m03q65L68K58K53%k18J05l50Q18P2q87O89M55k40L36l74LN55qO28n74q9
902a60Q07rJ51m09j47N46Q07n92k35j44Q88Mk00p0o20O57O01m19m50O4Q31ok26
925A669j61j98l2O98l31n13L69Q0j50q0l34k51J98N00l02n97n7K11O3m12j4m49
947i3K10K52k96l40k45O15J76n61m25L89K11j69J46l27o60Q60K81p05k95K95N01
968a80j92k74l9k70N79L07j012K56M95l15K70O7r31P69K6M93k52j032J013J6m04
989f10N77l46m46J004k91n7j71l03N32J38l11k7n47R28J83r29K54J16k32J68j09
1010d79j57l08N40L60n72KK33k12J7K2j17j27L57K59m95m83P99M1j05K1p91O29
$$ plain form
1032 -566 -198 -572 -266 -589 -716 -338 -341 -144 -463 -734 -156 180 -175 61 -369 60 380 150 244 72 166
1053 166 957 794 277 513 901 677 795 699 862 1204 1305 1298 754 1153 1603 1156 1121 1430 1125 811 1670
1074 1670 1479 754 860 1205 1674 1077 753 908 998 1157 1185 360 928 1220 565 861 692 321 694 537
1094 537 470 57 -99 551 67 -423 -18 -476 -576 184 -469 -672 -711 -593 -406 -690 -881 -684 -994 -475 -733
1115 -733 -1305 -732 -519 -901 -1073 -889 -938 -739 -710 -823 -937 -1006 -560 -580 -841 -1027 -715 -534 -479 -522 -902 -768
1137 -768 -366 -346 -360 -384 -511 -289 -272 -149 -228 -575 19 235 -162 153 16 -198 445 10 -379 -231 314 325
1159 325 -85 -343 120 114 251 139 -497 -219 60 285 -220 -201 146 -27 60 69 139 -135 199 220 -345 -187 302
1182 302 52 -173 129 -502 -657 652 104 162 3 142 -147 -2 -437 596 -383 549 725 -656 818
$$ packed form
1032e66L68l74L06l23j27L78lJ97l19k71N78L36l55K36m30M29L20k30R4j72R4
1053A66P91j63n17K36L88k24J18r6J63L42J01pn44L99M50m47l5L09l05l14Q59
1074A670j91p25J06L45M69n97l24J55R0J59K8q25N68K92o55K96j69l71L73j57
1094E37o7m13j56O50m84m90M05m58j00P60o53k03l9J18J87k84j91J97l10N19k58
1115g33n72N73K13l82j72J84m9J99K9j13j14o9M46k0k61j86L12J81N5m3l80J34
1137g68M02K0j4k4j27K22J7J23p9l47N94K16l97L15j37k14O43m35l89J48N45J1
1159C25m10k58M63oJ37j12o36K78K79K25n05J9L47j73Q7RP0k74L34K1n65J58M89
1182C02k50k25L02o31j55J309n48N8j59J39k89J45m35J033r79R32J76j381J474
$$ plain form
1201 818 360 658 769 862 561 301 847 1270 439 318 791 695 352 505 9 929 875 992 932 560 896
1222 896 859 1023 1130 854 652 996 1072 486 506 726 737 481 486 401 251 540 373 127 26 247 -17 153
1244 153 -17 -62 -293 59 -195 -250 -402 -642 -295 -211 -442 -712 -651 -541 -697 -771 -933 -631 -583 -1133 -819 -666
1266 -666 -1097 -924 -435 -1025 -913 -1111 -538 -1054 -810 -448 -972 -758 -201 -1131 -893 -328 -370 -915 -490 -664
1286 -664 -593 -321 -85 -859 -812 -487 -119 253 191 -265 427 339 185 321 -164 139 298 -263 507 680 -73
1307 -73 -77 567 290 -238 1007 357 434 -49 -351 866 657 331 -661 -56 697 367 229 820 413 591 513
1328 513 767 569 183 803 449 266 18 180 152 187 268 -73 -218 192 325 28 36 75 348 -64 309 228
1350 228 61 429 354 215 196 158 425 364 229 411 97 378 769 478 195 395 335 477 331 386 119 296
$$ packed form
1201H18m58K98J11R3l01k60N46M23q31j21M73r6l43J53m96R20n4J17o0l72L36
1222H96l7J64J07k76k02L44P6n86K0K20J1k56Nq5j50K89j67k46j01K21k64J70
1244A53j70m5k31L52k54n5j52k40L47Q4k31k70O1J10j56p4j62L02M8n50L14J53
1266f66m31J73M89n90J12j98N73n16K44L62n24K14N57r30K38N65m2n45M25j74
1286f64P1K72K36p74M7L25L68L72o2m56O92q8j54J36m85L03J59n61P70J73p53
1307g3mO44k77n28J245o50P7m83l02J217k09l26r92O05P53l30j38N91m07J78p8
1328E13K54j98l86O20l54j83k48J62k8L5Q1l41j45M10J33k97QL9K73m12L73q1
1350B28j67L68p5j39j9l8K67o1j35J82l14K81L91k91k83K00o0J42j46N5k67J77
$$ plain form
1372 296 742 458 -122 557 618 174 264 400 175 165 612 294 77 280 379 -54 25 59 -163 -12 54 87 -527
1395 -527 -111 -386 -307 -206 -530 -680 -607 -168 -430 -914 -799 -542 -770 -876 -562 -1018 -609 -412 -729 -832 -579
1416 -579 -636 -1044 -647 -634 -920 -861 -310 -597 -949 -632 -557 -484 -690 -558 -542 -373 -8 -360 -422 -111 -260 -264 -97
1439 -97 -195 -173 -155 8 -5 -102 67 454 160 339 384 315 256 584 451 297 216 518 694 419 293 502 361
1462 361 816 825 291 532 902 758 362 450 566 189 464 768 156 119 683 252 136 550 342 332 803 206
1484 206 -84 -127 521 42 232 251 -167 59 74 293 93 -212 289 182 -401 250 268 -232 182 199 -346 226
1506 226 339 168 -297 379 56 29 151 195 -367 -136 231 178 8 57 242 -137 86 233 132 38 455 51
1528 51 -219 214 151 -324 -113 129 -360 -9 -70 -97 -70 -269 -104 -174 -145 -28 -232 -338 181 -174 -475 -136
$$ packed form
1372B96M46k84n80O79O1m44R0J36k25j0M47l18k17K03R9m33P9L4k22J51O6L3o14
1395e27M16k75P9J01l24j50P3M39k62m84J15K57k28j06L14m56M09J97l17j03K53
1416e79n7m08L97J3k86N9N51k87l52L17P5P3k06J32J6J69L65l52o2L11j49mJ67
1439i7r8K2J8J63j3r7J69L87k94J79M5o9n9L28j33j54q1L02J76k75j26K09j41
1462C61M55Rn34K41L70j44l96Q8J16l77K75L04o12l7N64m31j16M14k08j0M71n97
1484B06k90m3O48m79J90J9m18K26J5K19k00l05N01j07n83O51J8n00M14J7n45N72
1506B26J13j71m65O76l23k7J22M4n62K31L67n3j70M9J85l79K23J47j01r4M17m04
1528E1k70M33o3m75K11K42m89L51o1k7K7j99J65p0K9J17k04j06N19l55l01L39
$$ plain form
1550 -136 -332 -484 -261 -259 -558 -816 -461 -278 -716 -358 -604 -870 -413 -328 -674 -585 -674 -480 -732 -591 -353 -378
1572 -378 -363 -475 -377 -496 -360 -314 -480 -506 -359 -367 -210 15 -128 -343 -39 -4 -204 22 25 -7 237 296 235 -101
1596 -101 413 558 534 430 616 517 209 431 564 166 680 615 266 429 675 747 485 713 548 192 677
1617 677 775 518 334 644 566 417 585 686 215 455 347 144 376 525 278 144 252 -13 -44 92 182
1638 182 15 -131 55 -52 -90 33 -302 35 159 245 -212 -368 222 46 -87 -63 -287 -614 -263 -50 -176
1659 -176 -176 -38 -98 -67 -275 -33 -150 -140 51 -25 -442 -266 46 -204 -128 42 93 232 -29 125 -84 -45 -39 -3
1683 -3 -122 -196 -230 -206 82 -4 -161 -90 -32 -471 -76 -275 -165 -249 -33 -153 -312 -151 -247 -365 -216 -277 -300 -298 -206
1708 -206 -394 -321 -485 -23 -232 -500 -330 -130 -512 -392 -351 -559 -214 -137 -473 -304 55 -447 -145 35 -402
$$ packed form
1550a36j96j52K23Kk99k58L55J83m38L58k46k66M57Q5l46Q9q9J94k52J41K38k5
1572c78J5j12R8j19J36M6j66k6J47qJ57K25j43k15L04L5k00K26Ll2K44N9o1l36
1596a01N14J45k4j04J86r9l08K22J33l98N14o5l49J63K46P2k62K28j65l56M85
1617F77R8k57j84L10p8j49J68J01m71K40j08k03K32J49k47j34J08k65l1J36R0
1638A82j67j46J86j07l8J23l35L37J24Q6m57j56N90j76j33K4k24l27L51K13j26
1659a76%J38o0L1k08K42j17J0J91p6m17J76L12k50P6J70N1J39k61J54k09L9OL6
1683cj19p4l4K4K88q6j57P1N8m39L95j99J10q4K16j20j59J61r6j18J49o1k3KR2
1708b06j88P3j64M62k09k68J70K00l82J20M1k08L45P7l36J69L59n02L02J80m37
$$ plain form
1729 -402 -240 -107 -64 -97 -144 112 -154 1 73 -378 195 325 168 46 60 56 204 132 437 326 478 595 527
1752 527 567 382 545 258 297 465 551 366 650 466 789 133 594 408 538 482 364 446 654 503 626 193
1774 193 198 425 153 266 361 145 254 501 204 104 138 310 12 201 145 36 -104 44 -147 -355 -297 -142
1796 -142 -393 -250 -154 -531 -345 -299 -258 -294 -181 -182 -250 -354 -273 -412 -780 -292 -248 -286 -411 -251 -326 -266 -400 -206
1820 -206 -278 -135 -29 -239 -136 121 -352 -218 -218 -96 -249 -158 23 -459 17 -8 -57 147 5 -5 -104 170 -29
1843 -29 -9 60 61 62 22 -385 -165 -102 106 -187 -428 -396 52 -40 -83 8 11 -278 22 -383 -208 -65 212 1 -366
1868 -366 -229 -313 -333 19 -229 -262 -161 146 94 -233 -40 -38 27 -317 -7 -220 -31 102 57 175 207 53 165
1891 165 63 370 83 136 532 236 331 177 292 295 333 307 288 481 239 670 221 240 551 443 161 561 116
$$ packed form
1729d02J62J33M3l3m7K56k66J55P2m51N73J30j57j22J4mJ48p2L05j11J52J17o8
1752E27M0j85J63k87L9J68Q6j85K84j84L23o56M61j86J30n6j18Q2K08j51J23m33
1774A93NK27k72J13R5k16J09K47k97j00L4J72k98J89n6j09j40J48j91k08N8J55
1796a42k51J43R6l77J86M6M1l6J13jo8j04Q1j39l68M88M4l8j25J60p5O0j34J94
1820b06p2J43J06k10J03K57m73J34%J22j53R1J81m82M76k5m9K04j42j0r9K74j99
1843b9K0O9JJm0m07K20O3K08k93k41L2M48r2m3R1Lk89L00m05J75J43K77k11l67
1868c66J37q4k0L52k48l3J01L07n2l27J93KO5l44L10k13J89J33m5J18L2j54J12
1891A65j02L07k87N3L96k96R5j54J15LL8k6j9J93k42M31m49J9L11j08k82M00m45
$$ plain form
1914 116 480 417 378 288 61 363 499 345 447 101 -8 201 149 -109 129 179 51 104 43 194 -39 150
1936 150 8 -391 -104 87 -253 -49 -43 -365 -232 -175 -120 -228 -156 -228 -210 -211 -205 -500 -431 -228 -528 -400 -143 -416
1960 -416 -461 -400 -271 -438 -429 -194 -236 -416 -342 -217 -333 -142 -259 -205 -241 -205 -108 -32 -70 -298 -244 130 188 -139 50
1985 50 68 -125 4 29 175 -123 -1 146 -151 -45 152 206 -26 70 276 -122 -108 192 144 104 210 286 -59
2008 -59 62 224 78 205 -144 66 -11 207 202 210 183 373 179 -78 -89 35 -120 85 57 -34 -58 93 -67 147
2032 147 279 79 -63 361 250 -20 245 54 161 185 -155 84 25 66 377 228 -10 311 309 -70 342 211
2054 211 211 348 212 391 142 290 230 261 139 128 285 92 172 262 187 611 35 94 213 -52 165 -34 278
2077 278 -63 206 124 -233 -51 -24 13 -31 -7 -92 -151 -110 -288 -101 -204 -524 -328 -344 -18 -87 -229 -275 -254 -172
$$ packed form
1914A16L64o3l9r0k27L02J36j54J02l46j09K09n2k58K38N0j28N3o1J51k33J89
1936A50j42l99K87J91l40K04Ol22J33N7N5j08P2p2J8jOk95O9K03l00J28K57k73
1960d16m5O1J29j67RK35m2j80P4J25j16J91j17N4l6L6R7P6l8k28N4L74N8l27J89
1985E0J8j93J29K5J46k98J22J47k97J06J97N4k32R6K06l98J4L00m8m0J06P6l45
2008e9J21J62j46J27l49K10p7K18nQk7J90j94k57j1J24j55K05k8r1k4J51j60K14
2032A47J32k00j42M24j11k70K65j91J07K4l40K39n9M1L11j49k38L21kl79M12j31
2054B11%J37j36J79k49J48o0L1j22j1J57j93Q0R0p5M24n76N9J19k65K17j99L12
2077B78l41K69q2l57J82K7L7m4K4q5n9M1j78J87j03l20J96j6L26o9j42m6K1Q2
$$ plain form
2101 -172 -203 -495 -36 -192 -571 -264 -37 -228 -293 -401 -337 -302 -110 -215 -388 -236 -129 -190 -98 -285 -118 -41
2123 -41 -117 42 -64 -334 33 -72 -406 139 -233 63 -29 -261 -148 40 28 -150 19 106 136 226 -65 26 183
2146 183 352 -9 -5 312 6 17 108 48 185 339 180 188 95 51 52 -4 92 57 -48 421 130 199 -73 167 306
2171 306 198 -124 164 17 -5 75 48 -33 -144 67 58 150 209 127 -68 141 -38 176 43 107 133 -117 -195 89
2195 89 116 -109 111 -3 24 70 173 -41 -83 9 239 -50 27 315 58 308 -199 -148 -29 127 204 103 83
2218 83 -18 10 474 131 192 -61 269 29 121 70 -42 -157 10 182 25 64 -187 12 -18 -41 -201 -149 -151 -226
2242 -226 -214 -114 88 -198 -125 -190 -310 -289 -284 -318 -297 -115 -220 -471 -232 -154 -343 -225 -221 -202 -161 -384 -151 -64 -95
2267 -95 -105 -3 -163 -16 -95 -43 -121 -72 -127 170 -334 -138 67 99 166 -73 -34 187 29 -8 43 139 198 326 -11
$$ packed form
2101a72l1k92M59j56l79L07K27j91o5j08O4L5J92j05j73J52J07o1R2j87J67P7
2123d1p6J59j06k70L67j05l34N45l72K96r2k32J13J88j2j78J69Q7L0R0k91R1J57
2146A83J69l61ML17l06J1R1o0J37J54j59Qr3m4Jn6R6l5j05M69k91O9k72K40J39
2171C06j08l22K88j47k2Q0k7q1j11K11rR2N9q2j95K09j79K14j33O4K6k50p8K84
2195H9K7k25K20j14K7M6J03k14m2R2K30k89P7K88k57K50n07N1J19J56P7j01k0
2218H3j01K8M64l43O1k53L30k40R2n1j12j15J67J72j57L9k51J99l0k3j60N2kp5
2242b26J2J00K02k86P3o5j20K1Nl4K1J82j05k51K39P8j89J18MJ9M1k23K33Q7l1
2267i5j0J02j60J47p9N2p8M9n5K97n04J96K05L2O7k39L9K21j58l7N1R6N9J28l37
$$ plain form
2292 -11 148 324 413 100 27 259 27 93 211 12 217 308 144 185 258 281 235 167 -7 196 135 1 124 119
2316 119 121 30 201 122 -3 51 71 309 41 277 -341 39 -5 28 56 -213 -16 10 -94 19 16 25 45 5 130
2341 130 -22 62 21 224 -120 -290 -148 49 -72 44 53 -217 -36 -273 17 -160 145 84 30 -33 122 64 71
2364 71 -156 -24 109 -183 149 177 -189 -102 24 2 -2 -287 -227 -198 -44 -184 -137 -87 -167 -106 -140 -177 6 69 -439
2389 -439 -115 143 -180 -88 13 -135 -153 -77 -168 -287 -47 -222 -201 -187 -34 -166 -36 -151 -157 -350 -267 -243 -176 -221
2413 -221 -133 307 -245 -170 -98 -54 -25 -100 -345 -29 -244 -157 89 9 -99 -88 -113 6 230 172 -29 29 139 339
2437 339 66 219 289 220 32 144 60 170 163 173 76 274 172 390 213 224 172 -39 303 291 104 161 171 130
2461 130 210 24 289 122 80 -28 82 -72 224 227 -46 280 156 148 91 -6 117 -275 -21 -19 8 -141 99 192
$$ packed form
2292a1J59J76Q9l13p3K32k32O6J18j99K05R1j64M1P3K3m6o8j74K03o1j34J23n
2316A19Kr1J71p9j25N4K0K38k68K36o18L80m4L3K8k69J97K6j04J13lRK0m0J25
2341A30j52Q4m1K03l44j70J42J97j21J16Rk70J81k37K90j77L05o1n4o3J55n8P
2364G1k27J32J33k92L32K8l66Q7J26k2mk85O0K9J54j40M7N0q0O1l4l7J83O3n08
2389d39L24K58l23R2J01j48j8P6r1j19K40j75K1J4J53j32J30j15oj93Q3K4O7m5
2413b21Q8M40n52P5P2M4K9p5k45L16k15Q7K46q0j08J1k5J19K24n8k01N8J10K00
2437C39k73J53P0o9j88J12q4J10pJ0r7J98j02K18j77J1n2k11L42j2j87N7J0m1
2461A30Q0j86K65j67m2j08J10j54K96Lk73L26j24qn7r7J23l92K54KK7j49K40R3
$$ plain form
2485 192 -9 -232 -207 122 -108 -206 40 -27 -284 -88 42 -142 -13 16 -200 -40 -102 -79 -20 -96 211 45 161
2508 161 -87 -126 -92 6 -151 -12 193 72 -186 84 113 -120 128 -53 -231 126 30 139 2 99 -220 132
2530 132 -102 -55 -1 -82 127 -49 79 -87 -29 60 -62 137 -33 116 -199 -332 -83 -154 -13 -273 86 -102
2552 -102 -182 -194 6 -117 -37 44 -93 -13 -377 -300 30 101 -89 -103 -198 -1 -190 -9 -22 -29 -255 -63 98 110
2576 110 -24 59 159 69 118 120 190 33 162 -87 121 104 181 36 97 207 128 78 402 294 96 308 192 277
2600 277 105 344 2 -47 -75 -76 -7 190 208 78 271 72 416 -108 74 182 184 -30 -16 108 209 150 117 368
2624 368 -46 333 73 -6 15 -104 -18 -42 190 28 -5 -148 -260 -175 -147 -246 39 -49 -226 -257 -57 -234 -293 -310
2648 -310 -220 -181 -516 -182 -126 -129 -32 -221 29 -171 -374 -124 129 16 -129 -169 -136 16 -246 94 -96 160 -5
$$ packed form
2485A92k01k23K5L29k30r8K46o7k57J96J30j84J29K9k16J60o2K3N9p6L07j66J16
2508A61k48l9L4R8j57J39K05j21k58K70K9k33K48j81j78L57r6J09j37R7l19L52
2530A32k34M7N4q1K09j76J28j66N8Q9j22J99j70J49l15j33K49p1J41k60L59j88
2552a02q0j2K00j23Q0Q1j37Q0l64P7L30P1j90j4r5J97j89J81j3pk26J92J61J2
2576A10j34Q3J00r0M9KP0j57J29k49K08j7P7j45O1J10p9n0L24j08j98K12j16Q5
2600B77j72K39l42m9k8jO9J97J8j30J93j99L44n24J82J08Kk14J4J24J01n9l3K51
2624C68m14L79k60p9K1j19Q6k4K32j62l3j43j12Q5K8r9K85q8j77l1K00j77n9j7
2648c10R0L9l35L34N6lR7j89K50k00k03K50K53j13j45m0L3J52k62L40j90K56j65
$$ plain form
2671 -5 -66 282 92 83 -33 -128 -121 -21 -34 -33 -49 -123 -136 59 -106 -98 -59 31 -29 -33 -18 21 -127 140 184 -30 77 -107
2699 -107 -195 55 96 17 158 -166 -209 158 -144 271 69 -172 -250 56 103 257 311 -145 -145 -30 64 39 93 84 27
2724 27 -28 76 -94 -160 27 -176 -271 -64 166 -214 201 -16 54 154 190 -120 244 147 -49 158 -42 79
2746 79 145 57 214 270 216 404 7 172 -32 222 -68 -81 220 226 45 155 85 169 216 65 55 81 111 213 86
2771 86 36 84 20 -71 -27 222 146 196 10 46 60 -138 -147 -104 -99 159 169 -144 23 -272 -75 -162 -234 -60 -127 -239
2797 -239 -371 -127 -258 -272 -100 -142 -275 139 -84 -159 -129 -26 84 -243 -297 -197 -234 -186 -312 -135 -157 135 -229
2820 -229 -257 -119 -196 158 0 -61 -149 -214 194 133 -254 -100 -212 23 32 183 79 -110 -115 111 190 -163 105 164
2844 164 -50 -58 36 174 -94 13 214 -48 70 -140 217 -144 106 47 161 -70 68 -30 63 49 117 27 80
$$ packed form
2671eo1L48j90rj16r5PJ00j3Jj6p4j3J95j65QL9R0o0mJ5L9j48K67M4k14J07j84
2699a07q8K50M1p9J41l24m3L67l02M15k02k41p8L06M7J54N4m56%J15R4k5N4rn7
2724B7n5J04j70o6J87k03r5K07K30l80M15k17P0J00L6l10L64r7j96K07k00J21
2746G9O6q8J57N6n4J88l97J65k04K54k90j3L01Oj81J10p0Q4M7j51j0K6L0J02j27
2771H6n0M8o4r1M4K49p6N0j86L6J4j98rM3NK58J0l13J67k95J97q7p2J74o7j12
2797b39j32K44j31j4J72m2j33M14k23p5L0J03J10l27n4J00l7M8j26J77k2K92l64
2820b29k8J38p7L54j58o1q8o5M08o1l87J54j12K35RJ51j04j89nK26P9l53K68N9
2844A64k14qR4J38k68J07K01k62J18k10L57l61K50n9J14k31J38r8R3j4O8r0N3
$$ plain form
2867 80 55 148 277 45 -41 -43 -34 -190 121 227 151 -67 -12 101 13 73 38 -137 110 91 190 70 57 -37 -70 87
2893 87 63 -3 139 190 -84 -117 229 39 238 248 161 217 173 -30 17 56 -111 90 57 170 140 84 312 -22 -103
2918 -103 175 216 24 71 -15 -112 -307 -31 357 145 360 243 -360 70 -282 -140 -329 73 65 139 225 -511 -100
2941 -100 -252 -30 -388 -80 45 -366 136 -803 -460 425 643 62 -735 6 -148 -182 -18 -175 -83 117 -418
2962 -418 -94 -78 -189 -16 -64 83 -91 34 -83 -28 59 -63 28 -60 115 -71 -57 249 53 93 226 206 -80
2985 -80 105 107 -66 159 276 190 151 -154 1 251 34 40 334 266 -81 231 189 84 -30 89 74 -16 69 -15
3009 -15 61 77 46 9 218 53 -138 140 -30 -29 -56 283 -103 -148 50 -116 48 -136 46 -25 -51 83 -47 -171
3033 -171 -56 -26 29 -73 -49 -47 313 76 139 31 -66 98 -29 -289 140 -87 50 36 -34 190 -27 -206 42
$$ packed form
2867H0k5R3J29k32q6kRj56L11J06p6k18N5J13q8O0l5j75K47j9R9j20j3r4l3J57
2893H7k4o6J42N1k74l3L46j90J99J0q7N6m4k03M7L9j67K01l3J13l0n6K28l34q1
2918a03K78M1j92M7q6r7j95K76L88k12K15j17o03M30l52J42j89M02qP4Q6p36M11
2941a00j52K22l58L08J25m11N02r39L43Q85K18n81p97P41j54l4J64j57R2K00n35
2962d18L24J6j11J73m8J47j74J25j17N5Q7j22R1q8J75j86J4L06j96M0J33k0k86
2985h0J85Kj73K25J17q6l9l05J55K50k17OK94o8l47L12m2j05j14J19j5r0Q5q4
3009a5P6J6l1l7K09j65j91K78j70Jk7L39l86m5J98j66J64j84J82p1k6J34j30j24
3033a71J15L0N5j02K4KL60k37O3j08r7J64j27k60M29k27J37j4p0K24k17j79K48
$$ plain form
3056 42 -81 114 57 21 182 63 -31 209 26 6 22 98 -180 112 33 -88 -13 8 184 139 110 146 56 -178 -114
3081 -114 -39 -138 -27 73 -193 96 73 -120 158 -23 -24 -294 -168 -102 -83 -136 -103 -48 -232 -92 -209 -272 -229 43
3105 43 -231 167 3 -104 15 -127 63 -130 -212 142 -44 156 -90 -123 84 -94 76 -194 82 -240 161
3126 161 -14 64 -61 17 271 44 5 255 -296 85 138 253 120 366 314 510 290 305 14 58 10 79 -96
3149 -96 174 389 226 186 308 5 187 26 -1 321 -112 -19 16 -40 -40 -169 114 394 -28 -73 -24 99 -89
3172 -89 -21 224 -25 73 21 -87 196 38 -86 -211 -10 -10 -219 -180 -204 -126 -122 -193 -200 447 -47 97 -231 -8 -193
3197 -193 60 -32 -227 -173 64 358 -283 -14 551 88 -110 -73 188 -113 -537 -93 62 341 -913 438
3217 438 736 176 -195 -803 149 102 -177 -13 -133 -663 -62 -617 -70 53 -179 209 -607 -297 74 -128
$$ packed form
3056D2j23J95n7l6J61j19r4K40j83k0J6P6k78K92p9j21P5K1J76m5k9L6r0k34O4
3081a14P5r9J11J00k66K89k3j93K78j81jk70J26O6J9n3L3N5j84J40j17o3M3K72
3105D3k74L98j64j07J19j42J90j93q2L54j86K00k46l3K07j78J70k70K76l22M01
3126A61j75P8j25P8K54k27l9K50n51L81N3J15j33K46n2J96k20J5k91M4m8O9j75
3149i6K70K15j63m0J22l03J82j61k7L22m33R3L5n6%j29K83K80m22m5M9J23j88
3172h9O8K45k49R8n2j08K83j58j24j25K01%k09L9k4P8Mp1pO47m94J44l28K23j85
3197a93K53r2j95N4K37K94o41K69N65m63j98L7K61l01m24M44J55K79j254J351
3217D38K98n60l71o08R52m7k79J64j20n30O01n55N47J23k32L88q16L10L71k02
$$ plain form
3237 -128 -60 -213 -203 -315 -701 -340 -249 58 -850 537 328 8 167 -139 646 -128 -118 -334 4 -611 -85
3258 -85 -42 -81 -872 -535 317 190 -449 -13 515 714 669 -576 422 -308 -252 -838 150 303 466 -85 -62 -262
3280 -262 -124 221 203 -199 395 -59 427 -108 53 409 -207 482 248 901 -228 -47 -328 -578 282 -217
3300 -217 760 208 400 44 -39 355 -231 -26 586 115 -714 446 -829 193 120 -79 165 125 778 1014
3320 1014 -198 -473 569 11 416 -113 -402 744 249 -300 -564 -294 584 -4 -138 -157 -366 51 -514
3339 -514 -432 343 -483 -270 348 -903 -561 -368 130 68 277 -407 -620 -581 117 153 38 -746 -1081 254 -428
3360 -428 -74 -292 53 138 -376 177 83 -179 43 299 -557 -137 -279 -53 -341 563 25 -135 174 12 -146
3381 -146 -34 -10 -337 202 -120 -26 -81 446 -310 -500 -55 130 -143 160 302 -3 27 -319 217 1006 274
$$ packed form
3237a28O8j53J0j12l86L61R1L07r08J387k09l20J59l06P85p74J0k16L38o15N26
3258h5M3l9p91L37Q52j27o39M36N28J99m5j245R98p30N6n86R88J53J63n51K3k00
3280b62J38L45j8m02N94m54M86n35J61L56o16O89k34O53j129J81k81k50Q60m99
3300b17R77n52J92l56q3L94n86K05O12m71q29J160j275J022p3j99K44m0O53K36
3320A014j212k75J042n58M05n29k89J146m95n49k64K70Q78n88j34j9k09M17n65
3339e14Q2P75q26K13O18j251L42J93M98o2K09o84k13L9O98L6j15p84l35J335o82
3360d28L54k18L45Q5n14N53r4k62K22K56q56M20j42K26k88R04n38j60L09j62j58
3381a46J12K4l27N39l22R4n5N27p56j90M45J85k73L03J42l05L0l46N36P89p32
$$ plain form
3402 274 -642 -246 -313 30 -307 -175 -566 155 -153 -230 187 -49 339 190 -251 -229 -309 49 -184 307 -63
3423 -63 63 -94 179 -154 -165 -268 -127 -15 -141 126 32 43 115 -119 173 26 205 62 -23 213 226 168 69
3446 69 25 129 282 24 159 12 19 45 135 147 107 34 16 -123 52 96 -117 143 86 90 1 44 -48 -38 -174 78
3472 78 4 -108 44 -3 89 -91 18 239 11 -86 -287 -97 -289 -196 53 -242 16 -173 -46 3 -25 -365 -19
3495 -19 -140 148 -225 -229 -186 -159 -3 5 42 -225 -47 -103 -86 -184 144 -183 -302 116 62 285 82 16 116 173 44
3520 44 226 269 75 -117 194 2 -243 -399 31 -256 358 -88 540 249 273 640 -510 643 -410 106
3540 106 -522 167 50 -166 -101 -238 276 -45 -329 65 -252 -244 -132 236 214 -147 -160 80 292 -109 262 120
3562 120 -69 306 64 6 10 -173 -42 6 248 -13 197 156 -37 -163 206 -22 -55 126 260 97 -80 -237
$$ packed form
3402B74r16L96o7L43l37J32l91P21l08p7M17k36L88j49m41K2q0L58k33M91l70
3423f3J26j57K73l33j1j03J41J12j26K67r4J1P2k34K92j47J79j43q5K36J3n8r9
3446F9m4J04J53k58J35j47PK6R0J2m0p3j8j39J75M4k13K60n7Mq9M3r2J0j36K52
3472G8p4j12J52m7R2j80J09K21k28r7k01J90j92R3K49k95K58j89J27M9k8l40L46
3495a9j21K88l73mM3K7J56QL7k67J78n6J7r8L28l27j19M18n4K23k03o6J00N7j29
3520D4J82M3j94j92L11j92k45j56M30k87O14m46O28k91K4L67j150J153j053N16
3540A06o28O89j17k16O5j37N14l21k84L94l17QJ12L68k2l61j3K40K12m01L71j42
3562A20j89L75k42n8Mj83J31M8K42k61K10m1j93j26L69k28l3J81J34j63j77j57
$$ plain form
3584 -237 -142 -26 223 44 -57 135 50 130 75 254 158 107 -52 88 -39 16 37 -100 21 -40 3 107 -111
3607 -111 22 -19 176 47 90 173 -180 -72 -1 -165 -223 6 -179 17 145 -25 -224 -249 162 3 -15 93
3629 93 -391 -86 24 -133 126 -149 -121 -372 -1 87 -212 -7 118 -419 318 55 -309 -189 -471 241 17
3650 17 -130 -102 -62 -5 -141 186 277 -298 105 -340 486 287 -1033 -332 -1245 -189 386 -265 -176 -188 410 9
3672 9 199 208 24 -85 -72 67 -162 30 43 -218 238 -221 351 -339 66 146 14 -240 196 -194 -108 760 312
3695 312 -116 -67 649 -118 959 426 307 239 378 63 -130 712 461 145 756 158 -13 120 -173 -91 -120
3716 -120 -155 277 -250 49 150 -110 -304 146 144 73 -579 594 -573 448 -212 -253 -260 -518 59 -172 -107 -362
3738 -362 483 -507 -98 -266 -94 -109 310 154 30 8 -15 -106 -50 -15 47 74 -152 -47 157 21 -118 -15 -31
$$ packed form
3584b37R5J16K49j79j01J92q5Q0n5J79r6n1j59J40j27N5K1j37J21o1M3J04k18
3607a11J33m1J95j29M3Q3l53J08P1j64n8K29j85J96J28j70j99k5M11j59j8J08
3629I3m84L05J10j57K59k75K8k51L71Q8k99K05J25n37P37k63l64J20k82P12k24
3650A7j47K8M0N7j36L27R1n75M03m45Q26j99j320P01r13J056N75o51Q9j2N98m01
3672IJ90Rj84j09J3J39k29J92J3k61M56m59N72o90M05Q0j32k54M36l90Q6Q68m48
3695C12m28M9P16p67J077n33j19o8J39l15j93Q42k51l16O11n98j71J33k93Q2k9
3716a20l5M32n27K99J01k60j94M50kp1o52J173j167J021o60m1pk58N77k31O5k55
3738c62Q45r90M09j68J72j5M19j56j24k2k3r1N6L5O2K7k26J05K04j36j39J03j6
$$ plain form
3761 -31 -13 186 149 -317 261 -236 -585 -9 -330 -475 -305 -286 -426 189 5 159 -546 -141 -126 11 -11 90
3783 90 -115 -103 -225 -188 -188 72 -135 14 -451 267 -271 -194 142 -9 -398 -229 -416 -387 -105 147 32 -368
3805 -368 364 28 -408 229 -232 -396 147 42 -107 -73 24 -77 160 -79 19 370 118 128 278 195 8 -1
3827 -1 -280 -75 125 166 -17 -45 340 86 71 74 76 -94 38 228 7 -63 396 295 18 -81 39 135 223 144 49
3852 49 -61 -197 10 -113 -83 102 38 4 -59 -19 -55 65 -23 277 200 110 -197 73 65 -97 130 -234 231 -16
3876 -16 -55 -10 -32 -90 56 243 -66 -86 -302 -88 75 92 -88 139 44 119 253 -50 66 29 69 -31 28 95
3900 95 195 -10 -13 160 -135 -109 318 15 -53 8 -61 8 49 29 -170 113 -74 60 -258 61 -8 -27 2 -103
3924 -103 72 -326 288 -24 40 -107 -131 -10 -83 29 -279 -63 27 -18 -260 35 99 34 -217 -195 154 -322 -205
$$ packed form
3761c1J8J99l7m66N78m97l49N76l21j45J70J9j40O15j84J54p05M05J5J37k2J01
3783I0k05J2j22L7%K60k07J49m65P18n38P7L36j51l89J69j87K9K82K52j15m00
3805c68P32l36m36O37m61j64N43j05j49L4R7j01K37k39R8L51k52J0J50q3j87r
3827ak79K05K00M1j83k8L85k54j5LKj70J32J90k21p0M59j01k77r9J20R6Q8p9r5
3852D9j10j36K07j23L0J85o4l4o3M0l6J20q8L00p7r0l07K70qj62K27l64M65k47
3876a6l9M5k2n8J46J87l09k0k16K14J63J7j80K27r5P5J34l03J16l7M0j00N9O7
3900I5J00k05lJ73k95K6M27l03o8O1o9O9M1k0j99K83j87J34l18L19o9j9K9j05
3924a03J75l98O14l12O4j47k4J21p3J12l08K16R0m5k42K95O4o5k51K2L49m76J17
$$ plain form
3947 -205 13 -242 161 -19 -4 -180 48 280 62 -13 -96 17 81 64 58 162 -194 -10 155 -1 51 18 104
3970 104 -51 152 -13 -90 165 193 -47 -113 -28 -18 -72 99 -32 71 -14 -179 43 55 2 96 18 31 2 103
3994 103 71 185 -16 -157 -25 286 -251 11 291 57 202 -114 -72 -46 -105 -240 -31 50 274 -225 261 203
4016 203 1104 1016 111 -94 363 224 -511 333 -2 17 -72 -69 29 25 8 38 -262 164 -238 -44 -14 136 -167 -145
4040 -145 -168 -133 18 -95 -22 -71 -17 -4 101 -33 -75 -37 73 14 184 -97 -110 -253 -27 -52 -39 193 -119 24
4064 24 101 202 44 194 -18 -151 -79 -155 81 -3 112 293 30 -56 102 22 -104 -118 -44 -144 174 70 55
4087 55 132 -39 108 173 -11 18 -104 -182 -49 -47 -215 31 45 -46 93 10 -282 -160 -131 -209 -142 5 89 93 93 108
4113 108 -90 -199 72 105 -56 -64 -32 0 180 170 134 -34 -8 251 281 96 159 105 -16 204 113 128 199 -47 165
$$ packed form
3947b05K18k55M03j80J5j76K28K32k18p5q3J13O4j7oJ04l56J84J65j56N2l3Q6
3970A04j55K03j65p7K55K8k40o6Q5J0n4J71j31J03q5j65K22J2n3R4p8J3k9J01
3994A03l2J14k01j41J32L11n37K62K80k34J45l16M2K6n9j35K09Q1K24m99M86n8
4016B03R01q8r05k05M57j39p35Q44l35J9q9LR8mj7L0l00M26m02J94L0J50l03K2
4040a45k3L5J51j13P3m9N4J3J05j34m2L8J10n9J70k81j3j43K26k5J3K32l12J43
4064B4P7J01j58J50k12j33P2p6K36q4J15J81k63q6J58q0j26j4P4j00L18j04j5
4087E5P7j71J47O5j84K9j22p8J33Kj68K46J4r1J39q3k92J22K9p8O7J47Q4M%J5
4113A08j98j09K71L3j61qL2L2J80j0l6j68K6K59L0j85O3n4j21K20r1J5P1k46K12
$$ plain form
4138 165 151 -81 207 92 86 -24 -21 126 302 -39 -101 98 143 242 -95 -209 -97 -28 -43 -191 -52 -202 -233 -70
4162 -70 -20 145 9 -18 -134 -65 223 79 -13 184 244 338 -164 -264 -179 -31 20 26 187 -124 -15 102 24 -8
4186 -8 142 78 -198 -125 91 32 173 -157 48 60 -106 78 -330 -159 36 -124 34 -134 33 -113 -96 -94 13
4209 13 86 3 170 -120 54 -46 175 62 -29 -74 184 11 4 -16 182 191 31 -345 -51 71 101 122 -17 -33
4233 -33 62 33 3 34 -1 68 47 -161 221 -73 14 6 55 -128 78 155 -75 -324 202 -28 -161 114 -6 48 -43
4258 -43 -199 -47 39 36 -105 -37 -121 57 23 -102 64 -5 1 152 104 1 93 -47 -181 -95 -39 -128 285 15 110
4283 110 59 144 212 -104 -57 207 -20 200 16 42 -98 -1 0 -39 -86 78 -70 -93 -83 -79 -120 -90 -13 -42 -138 147
4309 147 79 231 51 19 285 -66 19 177 33 99 -27 0 -172 111 -109 172 -106 231 -6 28 -4 -106
$$ packed form
4138A65j4k32K88j15oj10LJ47J76l41o2J99M5R9l37j14J12O9j5j48J39j50l1J63
4162g0N0J65j36k7j16O9K88j44r2J97O0R4n02j00Q5J48N1OJ61l11J09J17p8l2
4186hJ50o4k76P3K16n9J41l30K05J2j66J84m08J71J95j60J58j68J67j46J7KJ07
4209A3P3q3J67k90J74j00K21j13r1m5K58j73pk0J98Rj60l76K94J22L0K1j39j6
4233c3R5k9l0L1l5O9k1k08L82k94Q7qM9j83K06P7k30k49N26k30j33K75j20N4r1
4258d3j56J52Q6lj41O8q4J78l4j25J66o9OJ51m8j03R2j40j34Q6N6q9M13k70R5
4283A10n1Q5O8l16M7K64k27K20j84K6j40R7Jl9m7J64j48k3J0Mm1L0P7k9r6K85
4309A47o8J52j80l2K66l51Q5J58j44O6j26K7j72K83k20K81k78L37k37L4l2j02
$$ plain form
4331 -106 -37 -56 -86 -218 132 -68 -189 58 -217 23 34 -307 55 87 -105 48 -187 -233 141 -13 -53 321
4353 321 17 66 -134 -50 20 193 -189 -64 117 87 -70 -86 115 -70 11 44 98 -29 45 -199 -175 75 -121
4376 -121 45 135 -181 101 90 -169 -169 259 76 42 -73 208 -148 -171 -28 -221 141 -262 -96 145 263 62
4398 62 -95 219 46 -181 -70 -13 -41 97 176 122 -18 -185 -113 97 -117 73 134 -173 37 -44 176 115 43
4421 43 66 66 -143 -109 89 157 179 207 30 150 325 82 175 33 118 124 28 -88 -25 -109 -76 53 78 82 12 221 -27
4448 -27 -30 -21 -47 -59 -125 107 -11 12 -119 -64 -196 -135 -146 249 130 119 -46 -66 -137 75 89 91 285 46 -68 -64 -237
4475 -237 -77 -94 -84 -47 -215 233 9 -54 -209 220 -98 105 -30 187 20 166 -49 -126 -49 82 -134 -238
4497 -238 45 -228 -66 -33 -53 17 -286 47 -142 -114 24 129 14 172 45 81 -56 -6 3 89 17 23 44 22 -144
$$ packed form
4331a06O9j9l0j32L50k00j21K47k75K40J1l41L62L2j92J53k35m6L74j54m0L74
4353C21l04M9k00Q4P0J73l82J25J81l0j57j6K01j85Q1L3N4j27P4k44K4K50j96
4376a21J66R0l16K82j1k59%M28j83l4j15K81l56k3J43j93L62m03J66K41J18k01
4398F2j57L14j73k27J11N7k8J38P9n4j40j67P2K10k14J90O1l07K10q1K20o1p2
4421D3K3%k09L4J98O8K2K8j77J20J75k43R3j42Q5Or6j16O3q4L3J29K5Mp0K09k48
4448b7lRk6j2o6K32j18K3j31N5j32O1j1L95j19j1j65k0p1K12J4KJ94k39j14Mj73
4475b37J60j7J0L7j68M48k24o3j55M29l18K03j35K17j67J46k15p7P7J31k16j04
4497b38K83k73J62L3k0P0l03L33j89K8J38J05j15J58j27L6j37N0RQ6p2OK1k2j66
$$ plain form
4522 -144 184 -10 217 -17 -15 -277 -128 58 -67 40 16 235 -103 -68 73 -66 -210 80 -91 67 -22 141
4544 141 157 -17 -207 -15 335 -188 -48 -62 5 52 -114 47 142 -95 94 64 -27 -13 135 -148 -160 -150 86
4567 86 25 -39 149 56 88 -15 -23 -156 -61 95 69 -64 -6 64 -45 76 -115 -3 -71 189 84 -94 51 -71
4591 -71 80 -50 16 89 -175 276 -43 105 -171 -7 40 52 -9 82 -90 -13 -35 48 -44 -342 -100 105 -64 -1
4615 -1 -76 -101 -37 -144 126 185 21 -137 -166 -111 -147 -189 -75 4 15 180 28 74 -117 -66 181 153 23 16 33 -59
4641 -59 -84 -91 -122 -160 -91 159 96 140 37 -63 18 27 -137 134 73 -22 11 -31 61 32 132 327 -53 -95 148 -169
4667 -169 79 208 76 -111 117 23 57 30 -67 137 254 -13 -194 37 137 -217 -95 -7 -150 43 169 180
4689 180 252 4 124 150 280 21 136 -123 88 15 94 196 76 -75 -211 98 -243 -360 17 65 -51 -119
$$ packed form
4522a44L28j94K27k34Kk62J49J86j25J07k4K19l38L5J41j39j44K90j71J58q9J63
4544A41J6j74j90J92L50n23J40j4O7M7j66J61R5k37J89l0r1J4J48k83j2J0K36
4567H6o1o4J88r3L2j03qj33R5J56k6j33N8P0j09J21j91J12o8K60j05j78J45j22
4591g1J51j30O6P3k64M51l19J48k76J64M7J2o1R1j72P7k2Q3r2k98K42K05j69O3
4615ap5k5O4j07K70N9j64j58k9N5l6m2J14P9J1J65j52M6j91N1K47k8j30pJ7r2
4641e9k5pl1l8O9K50o3M4j03j00Q1Rj64K71o1r5L3m2R2k9J00J95l80m2K43l17
4667a69K48J29j32j87K28r4L4k7r7K04J17k67j81K31J00l54J22Q8j43J93J26J1
4689A80P2k48J20K6J30k59J15k59K11p3P9J02j20j51j36L09l41j17L77M8j16o8
$$ plain form
4711 -119 31 115 -182 -57 43 -27 147 67 -32 249 210 -34 269 21 -24 136 -46 132 -200 100 -43 118
4733 118 192 -191 -87 4 -27 240 -19 -203 -109 16 6 -8 -170 24 -80 -173 -63 -139 -47 43 -70 42 34 -123
4757 -123 2 -166 -72 -19 11 153 -34 -173 -97 -183 234 -34 -30 -178 -79 -129 246 41 -91 -63 157 108 117 -86
4781 -86 22 -167 97 148 -27 -112 28 -108 17 -136 -304 -100 -87 153 -94 66 -34 502 233 108 -265
4802 -265 20 -197 96 111 -43 -44 63 -105 89 -179 79 -237 110 -184 -70 29 113 -47 -85 231 107 -56
4824 -56 -27 80 -19 -65 57 43 217 -19 -67 -16 53 176 98 143 212 -140 66 -233 -102 24 316 -118 105 -58
4848 -58 -26 -40 -121 -25 108 12 -14 -245 -216 -47 219 -139 67 203 -89 157 -64 69 112 29 -145 -225 43 7
4872 7 -157 -64 -196 -126 -37 18 -15 213 155 -5 179 197 183 -22 -164 162 81 34 -31 -161 -121 81 -117 39 67
$$ packed form
4711a19J50Q4k97J25J00p0J74q0r9K81l9k44L03k48m5J60j82J78l32L00j43J61
4733A18P4l83J04R1l1K67k59j84R4J25j0j4j62J94j04r3J10p6R2R0j13J12qj57
4757a23J25j68R4N3L0J42j87j39P6q6M17k68Mj48R9n0L75k05j32K8K20m9Rk03
4781h6J08j89K64N1j75q5J40j36J25j53j68K04J3K40k47J60j00N36k69j25l73
4802b65K85k17K93J5j54jJ07j68J94k68K58l16L47k94J14R9Q4j60l8L16j24j63
4824e6K9J07r9m6J22j4J74k36m8N1O9J23p8M5O9l52K06k99J31J26K92m34K23j63
4848e8L2j4q1R6J33r6k6k31K9J69K66l58K06J36k92K46k21J33M3q3j74q0K68l6
4872Gj64R3j32P0Q9N5l3K28n8j60J84J8j4k05j42L26q1m7o5j30M0K02j98J56K8
$$ plain form
4897 67 52 156 -151 143 87 -97 -70 -51 -59 -88 -202 -159 78 89 -42 21 46 -22 11 -53 -196 151 -27 -41 -23 26
4923 26 92 87 85 185 -94 241 10 -122 -69 -7 151 -194 -95 -158 269 -161 -7 -15 27 129 85 24 9 57 105 -119
4949 -119 -21 -43 140 46 -258 59 -113 -33 53 -152 113 132 -154 65 131 -73 191 108 -56 56 -194 -47 59
4972 59 135 24 -119 -94 116 -40 84 61 -147 24 230 -42 26 33 -34 43 -212 47 -131 51 -211 33 161
4995 161 95 34 -64 1 90 151 -135 -57 33 25 -30 39 -159 95 2 190 284 17 -224 -32 30 32 44 12 18 -36 22 107
5023 107 -51 -86 -117 117 -164 -53 80 -23 33 87 222 78 103 316 30 -38 -68 -80 -55 -175 -110 105 87 89
5047 89 79 295 103 25 148 -50 -122 -74 51 -55 28 17 182 27 49 41 -52 -116 -64 19 -190 73 116 358 -23
5072 -23 -130 56 58 -71 -115 83 -32 -8 35 129 -11 -71 91 -122 26 -52 103 -48 6 21 -48 33 -103 31
$$ packed form
4897F7j5J04l07K94n6j84K7J9qk9j14M3K37J1j31O3K5o8L3o4j43L47j78j4J8M9
4923B6O6nkJ00k79L35k31j32N3O2J58l45R9o3M27m30J54qM2J02m4o1j5M8M8k24
4949a19R8k2J83r4l04L17j72Q0Q6k05K65J9k86K19O6k04K64q3j64J12k50J47J06
4972E9P6j11j43K5K10j56J24k3k08J71K06k72O8Po7P7k55K59j78J82k62K44J28
4995A61o6o1r8O5Q9O1k86P8R0qn5O9j98K54r3J88R4k67k41J92O2KJ2l2On4N8Q5
5023A07j58l5l1K34k81J11J33j03N6N4J35j44K5K13k86o8l0j2K5j20O5K15j8K
5047H9j0K16j92p8J23j98p2M8J25j06Q3j1J65j55K2qr3o4N2Q3k09K63M3K42l81
5072b3j07J86Kj29m4J98j15K4M3R4j40o0J62k13J48p8J55j51N4J5o9Q1j36J34
$$ plain form
5096 31 -161 154 189 -193 58 93 279 218 179 -42 -74 -96 252 15 -10 6 -47 -114 24 -39 14 72 42 49 138 211
5122 211 192 11 -118 155 10 103 -42 7 -123 -93 74 -51 -72 198 -133 8 373 -51 3 -232 111 -121
5144 -121 -168 -10 -144 75 -80 14 98 -237 46 -15 -116 -102 -1 137 -161 -273 -23 -99 58 -188 -198 -141 -290
5167 -290 161 118 265 179 151 75 188 19 60 55 -40 -59 -126 -247 97 159 -117 -4 135 -17 112 19 139 218
5191 218 41 30 140 32 -192 -130 -115 125 54 80 -111 -166 56 293 167 157 123 -86 -182 14 29 -21 105 -29
5215 -29 113 -169 -114 -142 -94 162 -68 -9 14 -47 -12 154 39 58 164 36 -111 -150 35 52 -22 56 -88 -20 -33
5240 -33 49 68 182 128 45 -69 -23 32 9 -272 -10 86 -19 50 -190 -106 -252 174 -36 -6 212 16 -23 -90 -112
5265 -112 238 -74 10 -43 -45 -50 14 9 94 -181 -255 -61 -3 -153 -40 1 29 126 -187 -194 -157 -42 -9 -224 -314 -34 -106
$$ packed form
5096C1j92L15L5l82K51L5J86o1l9k21l2k2L48k37k5J6n3o7J38o3N3N8l0PQ9P3
5122B11j9j81j29K73j45R3j45M9j30L0J67j25k1K70l31J41L65m24N4k35L43k32
5144a21m7J58j34K19j55R4Q4l35K83o1j01J4J01J38k98j12K50p6J57k46j0N7j49
5167b90M51m3J47q6k8p6J13j69M1nr5j9o7j21L44O2k76J13J39j52J29r3J20P9
5191B18j77j1J10j08k24O2J5K40p1K6j91n5K22K37j26j0l4k09r6J96J5n0J26j34
5215b9J42k82N5k8M8K56k30N9K3o1L5J66j15J9J06j28j47l9J85J7p4P8j44O8j3
5240c3Q2J9J14n4q3j14M6N5k3k81K62R6j05O9k40Q4j46M26k10L0K18j96l9o7k2
5265a12L50l12Q4n3knO4nQ5k75p4J94N8j50J13M1K8R7l13pL7J15L3k15r0K80p2
$$ plain form
5292 -106 311 91 101 57 -25 -147 -118 -104 -122 -165 -58 -178 128 -171 -234 -79 -111 -111 -20 -225 -34 -7 257 33
5316 33 -132 153 157 17 -86 45 -5 -215 -9 -58 201 37 24 282 -147 257 -173 17 306 87 192 -442
5338 -442 -190 -244 214 -244 69 11 96 -41 438 -387 -26 -327 -138 285 97 -217 -379 -320 -30 349 -328
5359 -328 823 427 -66 -43 -428 -404 519 54 146 274 60 408 336 -656 159 -344 824 54 820 -77 -137
5380 -137 159 158 56 359 562 57 58 -161 709 713 -238 -62 1076 -123 -62 -72 -57 -176 583 -434 18 -286
5402 -286 339 -3 -198 510 425 124 -9 -173 151 -401 302 -355 -203 -277 -493 -106 -96 -259 59 260 -42
5423 -42 64 57 25 -68 15 100 -123 -107 -114 6 149 -231 9 -213 158 -581 -517 265 120 -15 32 -107 -130 -131 52
5448 52 33 -8 -300 254 658 -88 -229 -877 -615 -749 179 -549 -85 286 336 -175 -48 -136 198 -195 -22 -252
$$ packed form
5292a06M17k20J0m4q2j22K9J4j8m3J07j20L06k99o3J55l2%R1k05J91K7K64k24
5316C3j65K85Mj40j03J31n0k10K06m9K59j64j3K58m29M04m30J90K89k19J05o34
5338d42K52n4M58m58L13n8Q5j37M79q25L61l01J89M23j88l14j62N9K90L79o77
5359c28J151l96m93K3l85K4R23m65R2J28k14L48p2r92Q15n03J168p70P66q97o0
5380a37K96jj02L03K03n05Jk19Q70Mr51J76J138j199O1j0J5j19P59j017M52l04
5402b86O25l42j95P08q5l01j33j64L24n52P03o57J52p4k16L87J0j63L18K01l02
5423d2J06pl2r3Q3Q5k23J6pJ20J43l80K40k22L71p39O4P82j45j35M7j39k3jJ83
5448E2j9m1k92N54M04p46j41o48K62j34R28p28M64L71N0n11J27q8L34l93J73k30
$$ plain form
5470 -252 164 -161 31 -98 46 243 269 -148 -153 134 95 190 -106 -82 169 -31 69 -87 -6 39 177 -173 22
5493 22 -4 88 241 -129 3 60 -22 20 -87 -180 -25 -15 -22 -198 -14 86 -125 -92 -40 -148 39 -37 102 -113
5517 -113 11 55 190 -5 66 -53 -2 -76 -97 23 -29 94 142 -19 11 41 -119 -253 -147 -138 -49 -112 -231 233
5541 233 44 140 72 -136 -173 310 6 130 -32 -7 -207 90 24 50 14 -217 -69 -103 -75 -64 -53 -106 -163 -9
5565 -9 -58 60 -17 -51 87 -132 -147 -140 104 -73 -39 -144 74 -4 -8 -53 -9 -45 85 -172 -123 -24 159 -71 51 -260
5591 -260 -178 -181 -197 -98 -45 -25 -101 79 -89 -50 156 49 -5 120 132 -190 57 256 14 53 44 -116 -180 -110 190
5616 190 226 -79 -23 -5 -16 -143 -38 117 221 -115 -34 17 -77 149 127 44 -115 18 88 -28 278 51 34 2
5640 2 -6 113 114 23 -171 145 172 108 72 -210 -132 44 90 124 -50 174 81 122 24 -79 -18 25 -6 -16 33 91 -15
$$ packed form
5470b52M16l25J92j29J44J97K6m17nK87l9R5k96K4K51k00J00j56Q1M5J38l50J95
5493B2k6R2J53l70J32N7q2M2j07r3J55J0pj76J84J00k11L3N2j08J87p6J39k15
5517a13J24M4J35j95P1j19N1p4k1J20n2J23M8j61L0L0j60j34J06RQ9o3j19M64
5541B33j89R6o8k08l7M83l04J24j62K5k00K97o6K6l6k31J48l4K8J1J1n3n7J54
5565im9J18p7l4J38k19j5PK44j77L4j05K18p8mm5M4l6J30k57M9R9J83k30J22l11
5591b60Q2lj6R9N3K0p6J80j68L9K06j07n4J25J2l22K47J99k42L9rj60o4P0L00
5616A90L6l05N6J8j1j27J05J55J04l36Q1N1r4K26k2q3j59J33P0j16L06k27j7l2
5640BqJ19Jr1j94L16K7o4l6k82P8J76M6L4j74K24r3M1r8j03O1M3l1j0M9N8j06
$$ plain form
5667 -15 110 58 -9 66 55 -19 -40 -4 -146 5 -259 -211 -62 66 -108 -43 -80 15 -60 44 5 94 3 -202 -172 -23
5693 -23 84 11 95 -11 -7 -21 161 82 47 -89 -180 -50 163 117 -9 -14 -8 -342 316 -94 25 -64 -1 132 157 103
5719 103 -146 -147 -128 122 168 34 33 82 -17 -93 -50 75 -116 -125 -60 -185 -108 -106 -108 -113 125 67 46 -214 -178 -26 104 -177
5747 -177 -60 74 -45 18 105 -13 -77 -8 53 -63 -88 78 32 -75 21 322 174 23 164 -13 84 82 150 61
5771 61 197 82 -57 -64 -174 10 386 71 -20 374 55 63 13 -58 172 32 27 -70 -44 -68 68 -116 -245 -86
5795 -86 36 85 -97 -294 -182 2 -234 -102 6 -71 -11 -50 -4 79 -12 260 -65 -106 53 -120 -168 184 125 -217
5819 -217 58 -67 -141 -34 -91 -2 13 -230 -108 -294 -106 116 20 -128 -140 -12 15 159 -56 -39 -64 -168 -2
5842 -2 -18 -227 -99 163 -213 53 -3 -94 -266 -146 -106 172 -16 68 -303 34 -108 -23 132 -90 203 68 -106
$$ packed form
5667a5J25n2o7P5j1p4k1L6j42J51k64M8J49J28j74O5l7R5p5J04l9Q9r1k05L0J49
5693b3J07p3Q4j06Mj4J82p9l5j36r1J30K13m6j26nOl34O58m10J19q9O3J33K5n4
5719A03k49jJ9K50M6j34jM9r9p6M3J25j91rO5j25P7KknK38n8k1k60L6J52J30k81
5747a77J17J34j19O3Q7j18o4O9O1j16k5J66m6j07R6L01j48j51J41j77R7kO8q9
5771F1J36j15j39pj10J84L76l15r1L94l19Qn0p1K30j40nr7K6k4J36j84j29J59
5795h6J22M9j82j97J12J84k36J32J08p7O0l9M6Q3r1K72l25m1J59j73m8L52n9l42
5819b17K75j25p4J07n7Q9J5k43J22j86J88K22r6j48j2J28K7J44k15J7k5j04J66
5842bj6k09J28K62l76K66n6r1j72J20M0K78j88Q4l71L37j42Q5J55k22K93j35j74
$$ plain form
5865 -106 -24 244 122 83 -100 -26 -91 -155 -330 171 -68 -72 21 22 39 -88 -46 -72 -298 -108 -78 -61 -19 48 -34 -123
5891 -123 6 143 -6 -52 179 -15 29 60 12 -196 -172 -7 -59 -5 -76 -10 188 -18 -62 110 -124 -88 -1 94
5915 94 9 -67 -81 -104 -7 97 114 59 -83 -104 33 -50 343 -7 28 102 29 192 -133 -120 -14 132 -39 10 -192
5940 -192 91 42 -37 20 187 15 -99 41 -49 57 -58 65 179 16 310 9 -68 -13 -159 3 -60 91
5962 91 -58 90 -28 19 135 -11 -80 -124 -83 -58 33 -267 115 -64 10 -78 -136 116 -10 -103 -94 -126 -51 -74 -130 75
5988 75 205 103 -138 -22 115 -52 198 131 -107 103 200 -8 -114 -8 51 52 34 242 11 -141 -121 225 -7
6011 -7 110 -90 69 264 -229 148 -103 185 -52 47 168 24 132 -117 2 46 -153 85 147 15 167 31
6033 31 160 96 -91 4 143 41 -60 128 73 73 -53 -113 -47 -126 -334 66 36 -140 -19 -197 -136 -58 34 -29 -9
$$ packed form
5865a06Q2K68j22l9j83P4o5o4j75N01k39mR3JJ7j27M2k6k26J90L0J7M2O7q2q9
5891a23J29J37j49m6K31j94M4L1m8k08K4J65n2N4p1O6J98k06m4J72k34L6Q7R5
5915I4q5p6j4k3R7J04J7n5j42k1J37q3L93l50L5P4p3J63l25J3J06J46j71M9k02
5940a92K83m9p9N7J67j72j14J40r0J06j15J23J14j63K94l01p7N5j46J62o3J51
5962I1j49J48j18M7J16j46o9m4M1K5R1l00L82j79P4q8n8K52j26r3Rl2P5k3n6K05
5988G5J30j02k41J16J37j67K50o7k38K10R7k08j06J06N9Jj8K08k31j52K0L46k32
6011gJ17k00J59J95m93L77k51K88k37R9J21j44J08k49J19M4j99K38O2j32J52j36
6033C1J29o4j87R5J39j02j01J88n5%j26o0O6p9k08M00l0j76J21j78O1P8R2o3K0
$$ plain form
6058 -9 -22 65 -39 9 93 -192 -36 13 -104 139 -151 -209 7 216 -88 -148 103 43 -33 129 -45 -163 59 -75
6082 -75 195 -52 10 240 2 -58 79 5 -54 71 113 3 -70 105 25 -7 -49 -102 171 -251 -203 -105 83 45 -60
6107 -60 148 16 -67 -53 91 -95 35 -79 177 -115 77 -67 110 -47 -26 29 -113 -147 -286 -9 44 26 -112
6130 -112 -9 56 -70 -15 -38 -45 -111 -122 -62 -90 133 31 37 100 -88 -228 14 12 -14 -22 -29 -56 -27 -101 92 35 -99 -158
6158 -158 -98 157 125 -55 -206 -55 199 2 21 70 122 57 -104 82 39 -129 -64 317 103 180 -9 -223 -157
6181 -157 26 163 46 -89 -130 -154 -243 -52 209 48 -132 -2 -101 -51 10 -42 32 11 -59 175 326 -41 -75 -76
6205 -76 -140 72 107 -163 10 59 -84 -168 -305 -148 83 -36 107 -180 -98 -167 132 -105 -142 53 222 70 -92
6228 -92 -87 -133 78 -200 81 161 68 27 33 167 -84 -100 -148 21 -89 -18 12 19 17 61 30 -145 -40 134 -20 -5 -388
$$ packed form
6058ij3Q7j04M8Q4k85J56M9j17K43k90n8K16K09l04o0K51o0p6J62j74j18K22j34
6082g5K70k47O2K30k38o0J37p4n9J25M2j10p3J75q0l2m2n3K73m22M8R8J88l8j05
6107f0K08j32q3J4J44j86J30j14K56k92J92j44J77j57K1N5j42l4j39K77N3j8j38
6130a12J03O5j26N5k3po6j1O0k8K23j02OO3j88j40K42kk6qpk7K9p4J93n7j34n9
6158a58O0K55l2j80j51J51K54j97J9M9N2o5j61J86m3j68O5L81k14P7j89k14O6
6181a57J83J37j17j35m1k4q9J91K61j61j80J30r9N0O1n2P4k1p0K34J51l67l4j
6205g6o4K12L5k70J73M9j43q4j37J57K31j19J43k87Q2o9K99k37l7J95J69j52j62
6228i2Nm6K11k78K81Q0r3m1OJ34k51j6m8J69j10P1L0PkM4l1j75J05J74j54J5l83
$$ plain form
6255 -388 -130 -40 79 5 -42 217 -69 69 5 149 83 83 -176 -104 15 196 55 -259 -47 -118 -187 -249 -102 -58
6279 -58 -35 -26 22 30 -233 -3 -33 -98 -91 160 99 217 -2 -142 -7 -197 -36 26 -66 123 71 -64 -150 -74 11 -121
6305 -121 -156 -265 200 227 -154 -204 192 -12 190 109 9 -232 20 -21 210 101 -135 -19 42 -39 301 54
6327 54 -99 27 85 114 114 -9 -103 83 49 119 -171 -53 -22 166 -14 254 -104 -14 -196 -177 -220 -42 49 1 -110
6352 -110 74 -129 -7 116 -154 -29 -186 156 -49 -62 227 82 34 185 -66 -155 -136 23 14 -127 61 -37
6374 -37 162 -98 -61 -36 128 195 -62 -50 -106 -85 47 110 75 12 -57 213 -61 143 -8 5 -43 122 -47 -2 160
6399 160 236 253 336 -127 64 86 20 -1 64 -20 177 -40 38 40 98 51 -322 53 -167 -37 35 -76 138 68 38
6424 38 -41 -179 -40 -296 -27 97 -56 -158 148 -149 -42 -82 32 -47 -234 256 -119 116 -141 53 -2 170
$$ packed form
6255c88K58R0J19p4m7K59k86J38o4J44o6%k59P2J19J81j41l14K12p1o9o2J47M4
6279e8K3RM8Qk63K30l0o5PK51o1J18k19j40J35j90J61O2r2J89n2j35q6P6Q5j32
6305a21l5j09M65K7l81n0L96k04K02q1j00k41K52m1K31j09k36J16O1q1L40k47
6327E4j53J26N8K9%j23r4J86l4P0k90J18L1J88j80K68l58R0j82J9m3J78R1m8j11
6352a10J84k03J22J23k70J25j57L42k05j3K89j45m8J51k51q9J9J59rj41J88r8
6374c7J99k60L7K5J64O7k57J2n6K1J32O3l5o3o9K70k74K04j51J3m8J65j69M5J62
6399A60P6J7Q3m63J91K2o6k1O5q4J97k17P8KN8m7l73L75k20J30P2j11K14p0l0
6424C8p9j38J39k56K69J24j53j02L06k97J07m0J14p9j87M90l75K35k57J94n5J72
$$ plain form
6446 170 -58 67 -164 -30 58 -66 -1 -140 -33 28 -76 -108 14 248 -198 -14 61 5 20 84 135 -65 16
6469 16 170 203 -8 -34 18 237 38 -108 200 -70 59 142 -179 256 8 227 -155 51 245 30 -43 167
6491 167 -182 -234 95 55 23 -85 -3 68 -63 -125 72 30 -367 -168 -237 -10 -189 102 83 -224 -42 -188 -126
6514 -126 -24 160 -145 306 -89 -87 -147 90 116 86 107 244 62 -41 -28 205 -131 -191 95 -75 -190 24 8
6537 8 -79 -46 -50 11 22 224 -176 -167 -126 -109 31 104 -123 98 -379 296 -112 -163 -130 27 129 56 74 220 -122 -218
6563 -218 47 36 122 202 107 -178 103 -20 -189 84 -104 -56 -32 2 128 334 -132 -8 -73 -123 106 84 -119
6586 -119 79 -117 -123 -8 -6 41 -81 -62 12 -23 35 -88 44 -13 12 -66 447 55 98 282 -20 83 -45 140
6610 140 -183 26 -20 32 17 164 -166 113 -303 179 -15 -14 -68 -226 48 -82 89 -24 50 -23 62 -107 -58
$$ packed form
6446A70k28J25k31J34Q8j24O5j39J07O1j04l2J22K34m46J84P5n6J5O4N1k00Q1
6469A6J54L3k11k6N2K19j99j46L08k70J29Q3l21M35k48K19l82K06J94k15p3K10
6491A67l49n2L29m0l2j08Q2P1j31o2J97m2l97J99o9K27j79K91j9l07J82j46O2
6514a26J02J84l05M51l95Ko0K37K6l0K1J37j82j03J3K33l36o0K86j70j15K14j6
6537Hq7L3mO1J1K02m00RM1J7J40P3k27K21m77O75m08n1L3J57J02p3J8J46l42r6
6563b18K65j1Q6Q0r5k85K81j23j69K73j88M8K4L4J26K06m66J24o5n0K29k2k03
6586a19J98j96oJ15KM7j22J9P4l5N8j23J32n7K5p8N13l92M3J84l02J03j28J85
6610A40l23K09m6N2j5J47l30K79m16M82j94Jn4j58K74j30J71j13P4p3Q5j69M9
$$ plain form
6633 -58 281 -129 18 208 74 -228 81 -75 5 -106 22 132 -144 -89 -202 -64 -305 19 -121 -27 -63 160
6655 160 184 214 -25 -47 107 -183 -295 137 7 -111 -163 -36 17 -179 -85 -48 97 -53 4 -95 -34 -194 -21
6678 -21 64 -241 -216 -33 -43 125 -9 135 360 96 189 -89 86 -6 228 116 26 -130 -230 -18 -34 -45 -102
6701 -102 25 -80 -67 65 218 143 41 141 -119 34 13 39 38 -83 -139 154 -16 145 -34 9 -120 -67 132
6724 132 25 -212 123 66 73 26 -47 -32 100 -117 -7 35 -104 -146 -165 62 -223 -57 128 114 -107 57 138 262
6748 262 54 -365 -148 599 -161 -382 -433 -387 -40 595 -68 -174 -163 74 -68 97 151 198 -114 -96 -92 -58 -31
6771 -31 18 124 91 54 -64 -138 -47 9 35 -47 -238 -298 252 -2 -1 203 -217 -39 -196 39 194 122 -1 -36 -55
6796 -55 -54 -95 195 -272 -56 -142 -237 29 -140 -247 29 75 109 -18 -69 -137 -181 153 -27 -194 -64 48 -84 -136
$$ packed form
6633e8L39m10J47J90j34l02L09j56Q0j11J28J10k76N5j13J38k41L24j40R4l6K23
6655A60K4L0k39k2J54k90j12M32j30j18n2J27N3j96R4L7J45j50N7r9O1j60J73
6678b1Q5l05K5J83j0J68j34J44K25k64R3k78J75r2K34j12r0j56j00K12j6j1n7
6701a02J27j05J3J32J53p5j02J00k60J53k1K6jj21n6K93j70J61j79M3j29N3J99
6724A32j07k37L35n7Pm7p3J5J32k17J10M2j39m2j9K27k85J66J85j4k21J64Q1J24
6748B62k08m19K17P47p60k21n1M6L47O35o63j06J1K37j42J65N4M7l12J8ML4K7
6771c1M9J06l3l7j18p4R1N6K6q2j91o0N50k54JK04m20J78j57K35J55p2j23l5j9
6796e5Jm1K90m67K16q6r5K66j69j07K76M6L4j27n1o8m4L34j80j67J30J12j32n2
$$ plain form
6820 -136 64 -111 -47 -17 72 -174 -87 -25 68 -141 -67 -111 -115 -127 17 73 -14 97 -80 3 21 29 6 7 -37 -78 -1 40
6848 40 -125 -178 109 11 53 53 159 -161 9 -207 -85 19 -64 -157 222 188 255 144 79 -183 185 232 175 147 -111
6873 -111 44 289 -321 121 -190 -57 -120 -255 23 260 -158 -86 -305 -180 -2 -160 -20 -228 -203 49 -21
6894 -21 68 298 -96 56 -20 -8 -125 476 106 -39 99 -196 -79 -8 -181 20 136 -113 -280 300 -308 93
6916 93 714 59 415 -319 84 -216 73 -183 43 327 97 409 -577 151 -427 -26 -325 -765 -861 346
6936 346 176 533 -295 -787 262 -316 -73 256 161 55 100 -11 125 -326 -93 -168 103 -198 -403 143 -200
6957 -200 -224 215 -357 27 67 157 -210 112 86 -301 32 -59 -110 83 27 -90 -10 -130 317 154 -175 -173 -1
6980 -1 78 -180 -73 46 -33 -51 48 -87 -18 -328 27 -115 -175 -208 224 138 127 -115 -307 44 -51 81 -47 113
$$ packed form
6820a36K00j75O4L0Q9k46Q7O2R3k09P4m4mj2J44N6q7J11j77Q3J8Qk3Jm4m1P7M1
6848D0j65n3K87r8M2%J06l20J70k16J22J04q3r3L79l4O7j11o5k62L68M7n7k8k58
6873a11J55K45o10M42l11J33o3j35K78K37m18P2k19J25J78j58J40k08K5K52p0
6894b1Q9K30l94J52p6J2j17O01l70j45J38k95J17P1j73K01J16k49j67N80o08M01
6916I3O21o55L56p34M03l00K89k56K26K84k30L12r86P28n78M01k99m40r6J207
6936C46j70L57q28m92J049n78K43L29r5j06M5j11J36m51K33p5K71l01k05N46l43
6957b00k4M39n72L84M0R0l67L22k6l87L33r1n1J93n6j17Q0j20M47j63l29KJ72
6980aP9k58J07J19p9j8R9j35O9l10L55j42o0l3M32q6j1k42j92L51r5J32j28J60
$$ plain form
7004 113 -17 -114 -81 26 148 -27 93 -77 -164 15 73 -87 106 19 -7 37 165 -10 52 7 -180 -143 -73 142
7028 142 44 -298 -240 -167 -119 73 -352 -150 -6 180 169 -77 -7 -6 60 15 78 -145 15 -58 -66 -114 69 -66 -134
7053 -134 -68 91 68 63 27 93 -67 166 -5 -270 -35 -60 -137 -5 -120 -6 60 200 -103 -332 -114 216 109
7076 109 -177 -109 -88 -103 19 -242 -32 -135 -68 143 -130 -64 -200 -146 -166 -46 -35 17 -170 60 145 11 37 155
7100 155 -25 138 156 19 -103 29 -93 -25 36 -70 58 113 -39 -49 33 206 -134 42 -246 -157 -136 18 -5
7123 -5 157 240 -242 -48 -114 145 60 -51 46 395 -204 108 174 37 14 122 -187 39 -93 -41 -135 158 61 -39
7147 -39 73 159 126 -102 31 -120 29 104 -97 -313 -26 52 228 163 -205 -41 -156 -86 153 -22 -44 184 -42
7170 -42 6 -113 185 -91 -93 -147 70 27 -160 -34 -83 53 -56 -76 -201 -100 -38 197 151 123 -55 -91 79 -334
$$ packed form
7004A13j30r7L3J07J22j75J20j70q7J79N8j60J93q7k6M4J28j75O2m5j87L7P0K15
7028A42r8l42N8P3M8J92m25K02J44J86j1k46P0JO6m5O3k23J60p3qm8J83j35o8
7053a34O6J59k3nl6O6j60K33j71k65K35k5p7J32j15J14O6J40l03k29K18L30j07
7076A09k86O8K1j5J22k61K10j03O7K11k73O6j36N4k0J20J1N2j87K30Q5j34K6J18
7100A55j80J63J8j37j22J32j22O8O1j06J28N5j52j0Q2J73l40J76k88Q9K1J54k3
7123eJ62Q3m82J94o6K59q5j11R7L49n99L12O6j37k3J08l09K26j32N2r4K93r7j00
7147c9J12Q6l3k28J33j51J49P5k01k16K87P8J76o5l68J64j15P0K39j75k2K28k26
7170d2M8j19K98k76kn4K17m3j87J26m9J36j09k0j25J01O2K35m6k8j78l6J70m13
$$ plain form
7194 -334 -143 -143 60 118 150 -92 -191 7 23 -234 -17 -130 -73 -71 -170 -111 -111 288 91 186 100 159 47 74 0 83
7220 83 280 -178 -112 -103 121 230 27 111 -128 -141 5 135 -271 -526 -63 473 -181 67 309 -173 -47 129
7242 129 -333 -49 4 -393 310 322 -4 -168 203 432 -403 -396 199 180 -350 233 -639 -424 -152 293 -268 -92
7264 -92 190 35 114 117 -22 -191 41 -9 80 143 76 115 -16 -238 -5 -89 50 -122 277 172 -121 145 11
7287 11 -95 -38 -33 43 -72 -34 34 164 -71 -91 -4 97 -94 -75 -54 109 51 -67 134 -59 71 -46 41 -124
7311 -124 -140 112 73 -254 93 104 -228 178 -36 -98 130 3 -194 -218 72 95 683 -28 -186 -143 596 -217
7333 -217 185 -50 148 51 -51 -34 99 12 89 102 58 210 -66 -69 44 -57 207 40 -47 148 -144 210 73
7356 73 169 15 -102 215 104 -30 -50 -165 -233 9 114 -54 -15 -145 -84 -99 -130 63 -192 229 163 -40 -43 -129
$$ packed form
7194c34J91%K03N8L2k42r9J98J6k57K17j13N7Kr9N9%L99j97R5q6N9j12K7p4Q3
7220H3J97m58O6RK24J09k03Q4k39j3J46J30m06k55M63N36o54K48K42m82J26J76
7242A29m62K84N3l97P03J2l26j64L71K29q35PN95j9n30N83q72K15K72M45n61J76
7264i2K82j55P9Lj39j69K32n0Q9O3o7L9j31k22K33q4J39j72L99j05k93K66j34
7287A1j06N7NP6j15L8O8J30k35k0Q7J01j91J9K1J63n8j18K01j93J30j17Q7j65
7311a24j6K52l9l27L47J1l32M06k14o2K28j27j97k4K90K3N88p11j58M3P39q13
7333b17M02k35J98r7j02J7J33q7P7J3m4J52k76lJ13j01K64j67q7J95k92L54j37
7356G3R6j54j17L17j11j34k0j15o8K42J05j68L9j30O1j5l1J93k55M21o6k03lq6
$$ plain form
7380 -129 40 -154 -136 -202 -27 -88 129 244 134 222 -2 1 -159 -104 -34 -19 -210 -76 -197 124 -166 361 -169
7403 -169 -166 106 62 80 60 7 -64 -70 -283 -100 -114 4 -117 -263 132 6 -114 121 152 -66 -82 124 -139 264
7427 264 38 182 193 138 -156 -21 -195 91 222 -273 34 53 -445 -226 -386 374 -327 60 -466 67 -180
7448 -180 402 -169 -25 257 -275 435 76 -281 266 -45 -374 -23 -193 -892 583 -376 485 357 6 -9
7468 -9 -153 184 -120 -19 -434 211 16 -137 -55 -354 -167 -114 -404 241 -160 183 -201 147 184 -142 -325 -164
7490 -164 -153 182 78 177 -182 -163 -56 -135 33 233 17 -73 -99 26 -315 5 190 -14 -103 226 -96 -7 39
7513 39 -106 -5 -62 -176 155 -67 113 103 46 -46 -65 88 -8 -32 171 -26 37 -85 -144 187 -136 49 91 -89
7537 -89 -11 7 223 53 124 -7 35 -92 178 -171 103 -185 260 96 -77 226 -70 110 -111 67 99 17
$$ packed form
7380a29J69j94J8o6J75o1K17J15j10Q8k24Lj60N5P0J5j91J34j21L21k90N27n30
7403a69LK72m4J8k0n3p1ok13J83j4J18j21j46L95j26j20K35L1k18j6K06k63M03
7427B64k26J44J1n5k94J35j74K86J31m95L07J9m98K19j60P60p01L87n26N33k47
7448a80N82n71J44K82n32P10l59l57N47l11l29L51j70o99J475r59Q61j28l51j5
7468ij44L37l04J01m15O45j95j53Q2k99J87N3k90O45m01L43l84L48L7l26j83J61
7490a64J1L35j04R9l59J9J07p9J68K00k16r0k6J25l41L20J85k04q9L29l22Q9M6
7513C9j45J01n7j14L31k22J80j0n7r2j9J53r6k4K03j97O3j22n9L31l23J85M2j80
7537h9P8J8K16j70P1j31M2j27K70l49K74k88M45j64j73L03k96J80k21J78L2q2
$$ plain form
7559 17 -8 -157 -59 -137 -73 -75 1 83 -70 -180 16 135 240 -52 -68 -69 -39 -27 -264 26 109 -103 -11 184 -52
7584 -52 62 -118 127 103 -45 -48 129 51 90 29 166 -168 157 78 68 -50 104 141 30 38 130 19 -241 60
7608 60 -70 241 -5 -157 -7 120 6 67 -214 -93 223 -123 -108 108 -39 -266 -11 -100 -25 -25 38 -42 -92
7631 -92 -96 -151 49 -22 -146 -10 -81 -134 47 -17 -90 -102 144 158 -217 -190 -97 28 -68 -83 -236 -140 -2 87 -135 171
7657 171 107 -178 102 -110 176 172 146 -141 124 -118 58 -55 41 -172 -89 162 63 84 54 -155 -11 -14 -194 45
7681 45 83 -10 29 -56 -140 -68 -97 -53 42 -100 154 99 -9 363 54 57 -63 101 167 -53 174 131 -221 105 297
7706 297 333 236 246 -45 -212 -132 -98 -105 53 -7 66 35 -8 -55 305 292 -50 -117 -64 -191 -61 -77 -35 -95 -203 33
7732 33 -301 195 -80 -48 11 349 -69 -231 -57 33 77 -186 27 -105 95 -19 -70 -277 -251 180 45 -71
$$ packed form
7559A7k5j49R8p8O4kP6Q2j53j10J96J19J05k92j6jL0J2k37K90Q3k12R2J95k36
7584e2J14j80K45k4j48lJ77p8L9o1J37l34L25p9j0j18J54L7j11QR2j11k60L01
7608F0j30L11k46j52J50J27j14O1k81J21L16l46J5K16j47k27K55q9P5%O3q0n0
7631i2mn5K00p1j24J36p1n3J81o4p3j2K46J4l75K7R3J25r6j5j53R6J38Q9k22L06
7657A71o4k85K80k12K86mk6k87K65k42J76j13R6k13Q3K51r9K1l0k09J44lj80K39
7681D5L8r3L9q5q4P2k9M4R5j42K54n5j08L72l09Lj20J64O6k20K27m3l52L26J92
7706B97L6r7J0k91j67Q0L4pJ58o0P3l1m3m7L60j3l42o7N3j27J30j6M2o0j08K36
7732C3l34M96k75L2N9L38m18j62J74R0M4k63K13j32K00j14n1k07K6M31j35j16
$$ plain form
7754 -71 150 -213 -99 -26 68 -121 -115 -81 -155 -53 251 -15 43 -157 92 51 143 -85 -21 -27 -142 -13 -67 43 219
7779 219 -52 -213 -139 -98 171 11 120 114 224 51 175 55 -5 22 -7 -48 -5 71 45 -80 64 -137 -19 -176
7803 -176 -57 63 173 66 160 137 -92 -41 205 -198 -43 1 -178 -226 -21 -45 -76 -22 64 -125 174 179 173 215 166
7828 166 82 39 -96 181 220 -46 -137 18 104 -32 140 140 48 -165 -123 -178 36 142 224 110 22 -23 80 -49
7852 -49 240 -155 -157 -68 -102 20 70 -38 122 -106 149 137 98 133 24 235 26 -45 -64 41 99 110 -12 170
7876 170 -32 46 224 -35 -260 -180 -137 108 -179 -178 -294 -77 38 -280 -245 -68 83 -117 175 48 -21 82
7898 82 228 256 56 126 -277 -280 -9 120 -108 -106 6 -116 -71 -222 -4 401 154 -142 432 594 -348 -149 -104
7921 -104 -675 -132 45 173 -774 145 201 178 -305 -325 -657 -73 171 -386 -470 -122 214 -19 -278 141 181 -463
$$ packed form
7754g1K21l63J14P3R4j89OL4p4J02L04k66N8k00K49m1R2k28O4oj15J29n4J10J76
7779B19k71j61P4M1K69j60J09oJ10j73J24j20o0K7k9m1M3P6k6j25J44k01J18j57
7803a76J19J20J10j07R4k3k29N1K46m03J55M4j79m8K05k4l1N4Q6j89K99NoM2m9
7828A66q4m3j35K77L9k66r1J55Q6j36J72%r2k13M2n5K14J06Q2j14q8m5J03j29
7852d9K89l95kQ9l4J22N0j08J60k28K55j2l9L5j09K11k09p1j9J05N8J1j22J82
7876A70k02P8J78k59k25Q0M3K45k87Jj16K17J15l18L5J77J51k00K92j27o9J03
7898H2J46K8k00P0m03lK71J29k28KJ12j22M5j51K18M05k47k96N74J62r42J99M5
7921a04n71N43J77J28r47R19N6k3m83k0l32N84K44n57q4L48L36k33k59M19M0o44
$$ plain form
7943 -463 -382 -387 260 -256 -1224 -93 553 77 9 -352 128 -179 599 -274 -402 145 -52 -154 214 -7 -236
7964 -236 37 -3 38 5 225 -26 12 -301 -48 453 301 -550 156 991 -133 314 155 334 38 -32 -255
7985 -255 155 -73 267 384 -232 -199 35 -36 -257 144 -333 -227 -409 -41 -141 676 590 -19 -171 289 -37
8006 -37 -68 -476 429 205 80 -332 187 291 -403 -98 106 470 -50 -124 -482 -257 -309 121 336 601 -228
8027 -228 -195 -342 418 -67 317 445 -410 -237 125 -342 -367 -370 -479 -339 -933 -216 429 442 -217 11 120 173
8049 173 154 169 -181 280 -126 56 -132 -3 -100 106 -83 150 79 66 -32 -70 -118 -95 94 -29 226 -74 -85
8072 -85 146 6 -126 -191 129 -69 10 -95 -92 118 79 89 -164 459 156 240 -154 103 252 -347 19 38 70
8095 70 -76 230 -2 -109 -241 -12 -55 143 71 176 -118 26 84 -80 -81 221 156 -106 -41 -371 241 -144 -219
$$ packed form
7943d63Q1nO47n16r68J131O46m76o8l61M80l07P78q73j28N47j97j02L68k21k29
7964b36K73m0M1l3K20k51L8l13K53N01j52q51P06Q35j124M47j59J79k96p0k23
7985b55M10k28L40J17o16L3K34p1k21M01m77J06j82L68j00Q17q6o09j52M60l26
8006c7l1m08R05k24j25m12N19J04o94L05K04L64n20p4l58K25n2M30K15K65q29
8027b28L3j47P60m85L84J28q55J73L62m67k5lj09J40n94P17O45J3o59K28J09N3
8049A73j9J5l50M61m06J82j88J29r7K06j89K33p1j3r8l8m8K3J89j23K55l00j1
8072h5K31j40j32o5L20j98P9j05LK10l9J0k53O23l03Q4l94K57J49n99L66J9L2
8095G0j46L06k32j07j32K29m3J98p2J05k94J44N8j64jL02o5k62O5l30O12l85p5
$$ plain form
8118 -219 -53 -286 -339 -29 -249 121 -253 -284 7 318 449 -330 -30 15 120 -328 -535 -155 458 -77 182
8139 182 186 105 -167 -55 -47 25 171 -127 -115 95 205 -127 -79 -83 -195 17 60 -34 19 -98 60 47 -183 -8 -122
8164 -122 261 60 -73 47 -76 214 -83 -11 -183 -167 147 -59 21 -81 78 100 -118 -97 -90 -95 -32 -37 -55 21 225
8189 225 -88 -228
$$ packed form
8118b19J66k33n3L10k20L70l74l1K91L11J31p79L00M5J05m48k07L80O13n35K59
8139A82Mq1k72J12QP2J46k98J2K10J10l32M8mj12K12M3r4N3j17J58j3k30J75j14
8164a22L83k01j33J20j23K90k97P2j72J6L14k06Q0j02J59K2k18K1PnO3nj8P6K04
8189B25l13j40
8191b28
$$ Imaginary data points
##PAGE= N=2
##DATA TABLE= (X++(I..I)), XYDATA
$$ plain form
0 0 0 0 0 0 0 0 0 0 0 0 0 0 0 0 0 0 -8 8 -8 8 -8 16 -16 16 -24 24 -30 32 -40 44 -48 56 -64 73 -84 95 -105 119
38 119 -133 149 -165 183 -205 228 -251 278 -306 338 -372 411 -452 496 -551 605 -668 740 -819
57 -819 908 -1015 1138 -1284 1463 -1681 1964 -2336 2859 -3652 5009 -8001 32652 -33527 -11302
72 -11302 51927 -24032 19216 26334 -12405 14137 15155 -4871 10069 -6018 -5849 8142 7761
85 7761 -4450 -4295 -444 -4707 -3660 -5936 -15625 2809 728 -11146 1350 -11481 -21534 5203
99 5203 2184 -16927 -9001 -1934 -8135 -3785 -3294 -14146 -9229 -2307 -4816 -6033 -17225 -7545 9657
114 9657 -11816 -13136 -1283 -16737 -2716 5592 -17098 -6466 2384 -6967 -629 -3675 -12191 -4683
128 -4683 3431 4519 -2289 -4926 -306 -116 -2197 -1741 -824 8 1639 4816 -105 -8531 -3761 2111
$$ packed form
0@%%%%%%%%%%%%%%%%qJ6j6J6j6K4l2L2m0M8n4O2p2Q4r2J04j20J37j57J79k00K24
38A19k52K82l14L48l88M33m79N29n84O44p10P83q63R48j047J156j273J408j559
57h19J727j923K153k422K747l144L645m300N195o511Q661j3010M0653o6179K2225
72a1302O3229p5959M3248P118l8739K6542J018k0026J4940j6087J69J3991l81
85G761j2211J55L851m263J047k276r689J8434k081j1874J2496j2831j0053K6737
99E203l019j9111P926P067o201M350M91j0852M917O922k509j217j1192R680J7202
114I657k1473j320J1853j5454J4021Q308k2690J0632Q850r351O338l046q516P508
128d683Q114J088o808k637M620J90k081M56R17Q32J631L177m921q426M770N872
$$ plain form
144 2111 -149 -766 -783 -3354 2 3594 -6360 -10585 606 4136 -894 -2711 -4213 -1959 -764 -1676
160 -1676 -819 -5648 -2293 8104 -1332 -6223 1338 -3407 -777 5018 -4611 -3097 2920 -1313 2108
175 2108 -1085 -5299 720 -784 2215 3674 -8444 -682 9718 -1244 -2063 2272 -1017 1685 6730
190 6730 4046 -1605 2955 9446 2028 1589 5447 2273 7907 9380 1589 3204 5396 6758 6283 641
206 641 5540 7849 3265 7915 5512 -2317 3826 9004 2883 2507 6533 2501 2916 6799 112 -665
222 -665 4275 4164 5643 495 -2672 5508 1921 -154 3015 -4016 -524 5990 -751 -2379 -2564 -2707
238 -2707 -59 -753 -1443 -5120 -4103 2441 -3827 -8483 -1828 -2457 -4823 -3502 -3230 -5095 -5916 -1768
254 -1768 -2460 -8006 -5653 -3044 -4324 -2499 -3537 -7080 -5006 -645 -3185 -7669 -3329 -1971 -4198
$$ packed form
144B111k260o17j7k571L356L592r954m225J1191L530n030j817j502K254J195r12
160a676Q57m829L355J0397r436m891P561m745K630N795r629J514O017m233L421
175B108l193m214O019j504K999J459j2118P762J0400j0962q19M335l289K702N045
190F730k684n651M560O491p418m39L858l174N634J473p791J615K192J362m75n642
206F41M899K309m584M650k403p829O143N178o121l76M026m032M15L883o687p77
222f65M940j11J479n148l167Q180l587k075L169p031L492O514o741j628j85j43
238b707K648o94o90l677J017O544o268m656O655o29k366J321K72j865q21M148
254a768o92n546K353K609j280J825j038l543K074M361k540m484M340J358k227
$$ plain form
269 -4198 -1434 -2867 -6320 -2784 93 -1315 -4579 -3638 1407 -609 -1619 -743 -3503 -1498 2929 682
285 682 -1930 -258 1949 1259 374 1581 -496 -505 5067 2226 -876 1667 2305 1160 2081 2079 271 312
303 312 4644 3849 -2275 554 3883 707 1559 2308 -850 1021 3625 1263 -1130 31 1582 1970
319 1970 1359 -238 -893 1296 2372 884 -294 -674 1976 2404 -168 1372 581 -753 3669 2338
335 2338 -1576 1123 2079 2353 2185 134 1185 1845 2256 3241 67 -591 3228 3293 1500 777 1836 605
353 605 2644 4861 117 218 5053 3005 872 3269 2127 3457 3407 2886 1621 -984 3514 3524 344
370 344 1194 985 1064 3017 2639 140 -1311 1199 1726 -1948 -411 -907 -2788 677 -126 -4005 -2516
387 -2516 -616 -193 -3339 -4018 -1425 -3355 -2096 -390 -5339 -4800 -1516 -2307 -3624 -4705 -3464 -3630
$$ packed form
269d198K764j433l453L536K877j408l264R41N045k016j010Q76k760K005M427k247
285F82k612J672K207o90q85J207k077rN572k841l102K543O38j145R21kj808M1
303C12M332p95o124K829L329l176Q52P49l158J871K604k362k393J161J551L88
319A970o11j597o55K189J076j488j178l80K650M28k572J540p91j334M422j331
335B338l914K699R56K74j68k051J051O60M11R85l174o58L819O5j793p23J059j231
353F05K039K217m744J01M835k048k133K397j142J330n0n21j265k605M498J0l180
370C44Q50k09P9J953l78k499j451K510N27l674J537m96j881L465q03l879J489
387b516J900M23l146o79K593j930J259J706m949N39L284p91j317j081J241j66
$$ plain form
403 -3630 -3950 -2136 -5084 -5838 -2065 -3638 -4510 -3848 -4171 -3991 -3843 -2348 -4518 -5909 -694 -840 -4017
420 -4017 -2667 -2666 -1643 -498 -1436 -1124 -2187 -376 2254 -1639 -1075 747 -884 1415 1324 -1510 170
437 170 1530 1509 528 -684 746 1636 799 1708 725 -699 1969 3487 964 -136 1569 2581 2660 2507
455 2507 1603 1251 2549 3226 2345 1036 1914 3045 2515 2306 1610 899 2212 3402 1162 322 2189 1976
473 1976 926 2241 894 -1108 1957 3284 -87 -746 1317 1450 790 663 474 118 616 2202 1200
490 1200 -1133 557 1864 379 1166 442 -838 1360 2103 -110 -730 194 1200 841 217 8 -939
507 -939 1076 2299 -120 -903 781 1602 946 641 1154 86 784 2920 439 -63 1639 881 1377 1449
525 1449 207 343 338 1695 979 -2514 202 799 -949 -202 -1891 -1858 -53 -1638 -823 -2788 -2672 -357
$$ packed form
403c630l20J814k948p54L773j573q72O62l23J80J48J495k170j391N215j46l177
420d017J350JJ023J145r38L12j063J811K630l893N64J822j631K299r1k834J680
437A70J360k1r81j212J430Q90q37R09r83j424K668J518k523j100J705J012P9j53
455B507r04l52J298O77q81j309Q78J131n30k09o96p11J313J190k240q40J867k13
473A976j050J315j347k002L065J327l371o59K063J33o60j27j89l56M98J586j002
490A200k333J690J307j485P87p24j280K198P43k213o20R24J006l59o24k09r47
507i39K015J223k419p83J684Q21o56l05N13j068O98K136k481n02J702p58M96P2
525A449j242J36nJ357p16l493K716N97j748P47j689L3J805j585Q15j965J16K315
$$ plain form
543 -357 -2208 -2575 -2246 -2953 -1344 -1127 -2669 -2855 -3200 -1163 -1667 -3396 -1757 -3817 -2513 -536 -3201
560 -3201 -3290 -3030 -1846 -1471 -3854 -2724 -2201 -3186 -730 -719 -3389 -1924 -568 -771 -1300 -1766 -473 -566
578 -566 924 1071 -1599 67 1416 1664 1041 632 1112 892 2616 2001 239 1337 3138 1224 798
595 798 2255 2010 2288 1874 2708 699 1059 2998 2929 1693 1368 1573 2965 2492 2180 1221 1508 2755 1780
614 1780 1001 1929 1167 748 2753 1408 -289 1186 2212 767 -21 760 1231 647 1268 130 -692 -683
632 -683 525 -55 -623 -798 -89 357 539 62 -1128 -561 408 76 -492 -366 -747 550 550 -984 -1379 -712
652 -712 492 794 -1625 34 -590 -71 -292 333 -469 -501 -67 424 -389 -1259 385 669 -120 -54 -993 -549
672 -549 578 244 -120 -1315 -360 983 -608 55 -141 -1525 509 244 -1376 -749 -680 -117 -1036 -1101 -929
$$ packed form
543c57j851l67L29p07J609K17j542j86l45K037n04j729J639k060J304J977k665
560c201q9K60J184L75k383J130N23r85K456J1k670J465J356k03n29m66J293r3
578e66J490J47k670J666J349K48o23m09M80k20J724o15j762J098J801j914m26
595G98J457k45K78m14Q34k009L60J939o9j236l25K05J392m73l12r59K87J247r75
614A780p79R28p62m19K005j345j697J475J026j445p88P81M71n84O21j138q22R
632f83J208n80n68j75P09M46J82m77j190N67R69l32n68J26l81J297%j534l95O67
652g12J204L02k419J659o24N19k21O25q02l2M34M91q13q70J644K84p89O6r39M44
672e49J127l34l64j195R55J343j591O63j96j384K034k65j620O27O9N63r19o5J72
$$ plain form
691 -929 -2115 -647 -151 -2260 -1746 -1065 -1486 -1035 -1417 -1939 -1831 -1513 -570 -2380 -2049 -704 -1639 -963 -1364
710 -1364 -2097 -1736 -974 -466 -1560 -2042 -496 -1111 -824 -589 -1581 -635 -102 -558 -20 -926 -249 659 -66
729 -66 404 -396 -160 1345 876 358 625 701 1696 1110 737 1608 1099 1859 2445 1345 1528 2014 2281 2308 1612
750 1612 1690 2163 2048 2627 1984 1541 2236 2401 2011 1768 1495 1496 1776 2110 1160 562 2105 1684 1267 839 755
771 755 1007 1041 854 578 -274 264 989 269 -442 -444 20 153 -60 -327 -738 -567 76 -543 -1157 -743 -934
792 -934 -613 -400 -1360 -1585 -626 -380 -1098 -1351 -1100 -762 -1072 -293 -768 -1863 -447 -151 -1000 -931 -892 -612
812 -612 -273 -382 -582 -980 -625 236 -546 -518 -304 -561 178 -201 -821 -588 -328 136 -133 -1001 -387 -338 -472
833 -472 7 -895 -735 -376 -167 -267 -873 -782 -573 -577 -284 -700 -870 -369 -467 -662 -669 -1076 -265 -202 -738 -725 -1317
$$ packed form
691i29j186J468M96k109N14O81m21M51l82n22J08L18R43j810L31J345r35O76m01
710a364p33L61P62N08j094m82J546o15K87K35r92R46N33m56N38r06O77R08p25
729f6M70q00K36J505m69n18K67P6R95n86l73Q71n09P60N86j100J83M86K67K7o96
750A612P8M73j15N79o43m43O95J65l90k43k73JK80L34r50n98J543m21m17m28q4
771G55K52L4j87k76q52N38P25p20p11kM64J33k13k67m11J71O43o19o14M14j91
792i34L21K13r60k25R59K46p18k53K51L38l10P79m75j095J416K96q49O9L9K80
812f12L39j09k00l98L55Q61p82K8K14k57P39l79o20K33K60M64k69q68O14M9j34
833d72M79r02J60L59K09j00o06R1K09mK93m16j70N01r8j95pm07Q11O3n36J3n92
$$ plain form
856 -1317 -461 -275 -908 -784 -1242 -82 -112 -906 -917 -705 -701 64 10 -640 -534 -120 680 -340 -49 475 65
877 65 996 961 48 776 871 1054 1050 490 858 930 1207 1612 356 662 1788 1336 1260 1186 1208 1595 1563 1393 1315
900 1315 869 1920 1540 1555 1680 1083 1632 2357 1515 1032 1056 1718 1629 1063 1150 716 720 1492 947 138 347 740
922 740 789 217 -81 142 -141 558 -35 -432 -513 -392 -300 -105 -754 -1137 -375 -469 -680 -1468 -1140 -898 -873 -1322
944 -1322 -1332 -1162 -945 -1011 -1088 -1557 -1527 -1119 -838 -1144 -1645 -1158 -844 -1008 -1006 -1170 -1514 -958 -266 -667 -1007 -928
966 -928 -372 -226 -429 -669 -514 -383 429 -236 -800 273 -180 163 200 -364 -431 365 321 282 -533 -120 523
987 523 -44 250 161 -561 478 603 -126 -37 -152 442 190 -54 -362 -230 387 987 -470 -209 334 -120
1007 -120 220 201 -166 -335 -130 350 -221 -446 -77 61 -125 237 -180 155 126 301 164 -349 143 581 511
$$ packed form
856a317Q56J86o33J24m58J160l0p94j1K12MP65n4o50J06M14Q00j020K91N24m10
877F5R31l5r13P28R5J83mn60L68P2K77M05j256L06J126m52p6p4K2L87l2j70p8
900A315m46J051l80J5J25n97N49P25q42m83K4O62q9n66Q7m34MP72n45q09K09L93
922G40M9n72k98K23k83O99n93l97q1J21R2J95o49l83P62r4k11p88L28K42K5m49
944a322j0J70K17o6p7m69L0M08K81l06n01M87L14j64Kj64l44N56O92m01l40P9
966i28N56J46k03k40J55J31Q12o65n64J073m53L43L7n64o7P96m4l9q15M13O43
987E23n67K94q9p22J039J25p29Q9j15N94k52k44l08J32O17O00j457K61N43m54
1007a20L40j9l67j69K05M80n71k25L69J38j86L62m17L35k9J75j37n13M92M38p0
$$ plain form
1028 511 685 -126 286 710 541 745 321 619 1385 906 757 829 671 1122 1079 920 926 666 1196 1436 774
1049 774 551 860 820 1527 1195 513 862 1396 1011 715 571 642 897 579 471 630 420 629 573 181 357
1070 357 180 -48 350 124 -595 -584 -206 -85 -411 -802 -540 -698 -1006 -632 -1550 -937 -515 -1485 -1283 -782
1090 -782 -1620 -1125 -969 -1339 -1194 -1465 -836 -1061 -1736 -801 -1179 -1422 -882 -1034 -1418 -1121 -806 -669 -1065 -1329
1110 -1329 -619 -679 -552 -456 -988 -721 -113 -650 -349 -165 -410 -50 -97 -98 -286 -99 348 259 198 109 418 288
1132 288 413 508 215 399 754 561 399 405 377 429 828 422 400 458 633 954 -86 192 685 192 707 556
1154 556 12 167 408 665 155 -287 421 452 290 543 43 102 391 451 109 23 350 519 266 48 315
1175 315 9 378 635 93 -26 463 207 -26 89 631 -46 767 711 219 444 561 626 417 337 50 -37
$$ packed form
1028E11J74q11M12M24j69K04m24K98P66m79j49P2j58M51m3j59Ok60N30K40o62
1049G74k23L09m0P07l32o82L49N34l85k96j44P1K55l18j08J59k10K09n6l92J76
1070C57j77k28L98k26p19J1L78J21l26l91K62j58l08L74r18O13M22r70K02N01
1090g82q38M95J56l70J45k71O29k25o75R35l78k43N40j52l84K97L15J37l96k64
1110a329P10o0J27R6n32K67O08n37L01J84k45L60m7jj88J87M47q9o1q9L09j30
1132B88J25R5k93J84L55j93j62Ok8N2L99m06k2N8J75L21j040K78M93m93N15j51
1154E56n44J55K41K57n10m42P08L1j62K53n00N9K89O0l42q6L27J69k53k18K67
1175C15l06L69K57n42j19M89k56k33J15N42o77Q13n6m92K25J17O5k09q0k87q7
$$ plain form
1196 -37 607 771 350 -95 863 454 979 -483 -355 773 -446 946 124 -242 421 184 9 797 -203
1215 -203 -202 -84 268 -266 172 -126 62 -295 -457 -618 -462 -35 -383 -629 -619 -375 -363 -621 -774 -785 -1114 -746
1237 -746 -437 -991 -1291 -957 -990 -880 -1044 -580 -987 -981 -917 -1395 -1105 -726 -779 -1089 -984 -680 -751 -795 -551 -264
1259 -264 -948 -525 -240 -357 -581 -219 106 -94 -58 303 -60 12 249 -100 -156 219 75 265 708 373 461
1280 461 610 718 100 473 614 711 571 1157 681 218 636 1231 536 1022 830 575 680 206 832 352
1300 352 1115 827 538 512 114 805 142 753 1041 483 543 1020 91 -115 695 245 140 362 64 -832 339
1321 339 162 -263 620 942 -444 -44 932 -385 -271 255 -23 193 -305 -239 228 -140 45 61 -118 301
1341 301 347 136 -11 -4 254 38 143 252 10 287 113 -183 62 -166 179 40 19 190 -149 -228 374 -135
$$ packed form
1196c7O44J64m21m45R58m09N25j462J28J128j219J392q22l66O63k37j75P88j000
1215b03JJ18L52n34M38k98J88l57j62j61J56M27l48k46J0K44J2k58j53j1l29L68
1237g46L09n54l00L34l3J10j64M64m07OO4m78K90L79n3l10J05L04p1m4K44K87
1259b64o84M23K85j17k24L62L25k00L6L61l63P2K37l49n6L75j44J90M43l35Q8
1280D61J49J08o18L73J41R7j40N86m76m63M18N95o95M86j92k55J05m74O26m80
1300C52P63k88k89k6l98O91o63O11K88n58O0M77r29k06Q10m50j05K22k98q96J171
1321C39j77m25Q83L22j386M00R76j317J14N26k78K16m98O6M67l68J85J6j79M19
1341C01M6k11j47PK58k16J05J09k42K77j74k96K45k28L45j39k1J71l39p9O02n09
$$ plain form
1363 -135 -340 95 20 -99 -99 -208 -324 -278 -26 -38 -706 -263 -51 -519 -247 -506 -544 -560 -261 -406 -716 -543
1385 -543 -345 -542 -616 -523 -832 -824 -606 -400 -967 -875 -601 -886 -932 -618 -859 -432 -309 -506 -703 -596 -367 -604
1407 -604 -509 -313 -503 -159 66 -369 -322 67 101 -446 225 309 -52 58 610 115 210 102 543 315 412 368
1429 368 394 683 727 831 361 834 549 743 642 665 793 707 587 732 601 680 939 978 713 671 545 379
1451 379 755 623 439 603 340 705 430 143 558 302 251 302 -137 257 225 35 -168 12 -37 -36 -185 21
1473 21 -364 -183 55 -135 -437 -139 -220 -262 -87 -208 -364 -499 33 136 -563 -58 -130 -291 -80 -262 -246 -280
1495 -280 136 -14 -201 -145 176 -185 -42 -130 -339 -159 96 -208 -418 -69 57 -231 -131 -33 -367 -257 59
1516 59 -301 -232 -77 -37 -114 -189 48 -227 -288 -58 -349 -411 -232 -108 -280 -288 -291 -590 -279 86 -128 -539 -427 -453
$$ packed form
1363a35k05M35p5j19%j09j16M6K52j2o68M43K12m68K72k59l8j6K99j45l10J73
1385e43J98j97p4R3l09QK18K06n67R2K74k85m6L14k41M27J23j97j97J07K29k37
1407f04R5J96j90L44K25m35M7L89L4n47O71Q4l61J10N52m95R5j08M41k28R7m4
1429C68K6K89M4J04m70M73k85J94j01K3J28q6j20J45j31P9K59L9k65m2j26j66
1451C79L76j32j84J64k63L65k75k87M15k56n1N1m39L94l2j90k03J80m9Jj49K06
1473B1l85J81K38j90l02K98q1m2J75j21j56j35N32J03o99N05p2j61K11j82J6l4
1495b80M16j50j87N6L21l61J43q8k09J80K55l04k10L49J26k88J00R8l34J10L16
1516E9l60O9J55M0p7p5K37k75o1K30k91o2J79J24j72qlk99L11L65k14m11J12k6
$$ plain form
1540 -453 -415 -336 -394 -637 -392 -117 -51 -386 -310 -246 -439 -135 -371 -446 -122 -168 -54 -307 -195 72 -378 -37 62
1563 62 -140 -41 187 59 134 -38 130 640 309 580 331 296 466 735 475 282 335 573 443 529 862 699
1585 699 473 557 588 645 606 666 459 671 598 467 889 909 516 109 539 418 424 497 317 136 373 428 169 253
1609 253 405 248 -103 350 -206 -210 -74 249 -217 -232 60 -21 -60 -199 -64 -408 -197 -131 -575 -319 -197 -284
1631 -284 -313 -288 -438 -458 -361 -340 -400 -303 -196 -624 -537 -153 -206 -688 -201 -199 -579 -77 -178 52 -166 -14 -67 -385
1655 -385 -44 112 74 -236 135 -119 -67 -79 -123 -33 -358 -63 -108 -310 -297 140 -116 -221 -85 -92 -128 72 -71
1678 -71 -36 83 246 -231 -366 -153 -134 -342 76 -26 -67 -85 -172 -22 -180 46 5 -215 -167 -298 -323 -121 -132
1701 -132 -97 -185 -115 207 -114 -180 123 -25 51 309 205 8 71 112 81 275 152 84 322 360 368 174 393 389 191
$$ packed form
1540d53L8P9n8k43K45K75O6l35P6O4j93L04k36p5L24m6J14k53J12K67m50L41R9
1563F2k02R9K28j28P5j72J68N10l31K71k49l5J70K69k60j93N3K38j30Q6L33j63
1585F99k26Q4L1N7l9O0k07K12p3j31M22K0l93m07M30j21OP3j80j81K37N5k59Q4
1609B53J52j57l51M53n56mJ36L23m66j5K92q1l9j39J35l44K11O6m44K56J22q7
1631b84k9K5j50k0R7K1o0R7J07m28Q7L84n3m82M87Kl80N02j01K30k18J52n3l18
1655c85L41J56l8l10L71k54N2j2m4R0l25K95m5k02J3M37k56j05J36pl6K00j43
1678g1L5J19J63m77j35K13J9k08M18j02m1j8q7J50j58K26m1k20M8j31k5K02j1
1701a32L5q8P0L22l21o6L03j48P6K58j04j97O3M1l1J94j23o8K38L8Qj94K19mj98
$$ plain form
1726 191 529 541 290 303 334 183 286 687 470 308 598 517 512 307 900 488 472 663 409 558 303 343 417
1749 417 369 94 368 162 153 200 136 113 222 399 29 112 25 -172 -96 39 -124 -127 -285 -186 -174 -453 -506 -511 -405
1774 -405 -580 -293 -435 -549 -472 -350 -440 -337 -558 -211 -285 -760 -507 -240 -170 -236 -364 -240 -529 -428 -366 -229
1796 -229 -330 -121 -647 -441 -222 -154 -172 -351 -264 -135 -154 -81 -73 -209 -57 155 -274 -94 130 -17 164 204 85
1819 85 96 315 112 145 -180 51 120 66 175 111 433 237 177 -38 26 228 251 -4 39 34 135 305 189 -47
1843 -47 106 204 26 195 31 -20 48 39 -84 -29 -32 84 131 81 434 114 223 321 265 -66 185 73 205 261 160
1868 160 101 67 49 338 82 70 77 318 215 168 359 328 206 448 452 149 142 -44 233 436 223 133 245 241 305
1893 305 214 433 387 315 -176 189 140 223 275 185 160 -103 172 -82 125 -85 -101 141 150 -115 -216 -28 114 -99
$$ packed form
1726A91L38J2k51J3L1j51J03M01k17j62K90q1nk05N93m12j6J91k54J49k55M0P4
1749D17m8k75K74k06rM7o4k3J09J77l70Q3q7j97P6J35j63lj58R9J2k79n3nJ06
1774d05j75K87j42j14P7J22r0J03k21L47p4m75K53K67P0o6j28J24k89J01O2J37
1796b29j01K09n26K06K19O8j8j79Q7J29j9P3Qj36J52K12m29J80K24j47J81M0j19
1819H5J1K19k03L3l25K31O9n4J09o4L22j96o0k15O4K02K3k55M3nJ01J70j16k36
1843d7J53R8j78J69j64n1O8rj23N5lJ16M7n0L53l20J09R8n6l31K51j12J32N6j01
1868A60n9l4j8K89k56j2PK41j03m7J91l1j22K42Ml03pj86K77K03k13r0J12mO4
1893C05r1K19m6p2m91L65m9Q3N2r0k5k63K75k54K07k10j6K42Rk65j01J88J42k13
$$ plain form
1917 -99 -305 -336 -117 -271 -29 -334 -392 -128 -279 -379 -290 -298 -327 -451 -288 -498 -334 -379 -443 -501 -495 9 -363 -352
1941 -352 -229 -280 -509 -386 -93 -251 -391 -56 -425 -330 -55 -250 -362 -61 81 -151 37 191 2 179 27
1962 27 -13 128 247 192 -163 68 198 17 325 367 188 -30 319 263 354 78 145 382 312 239 21 12 334 171
1986 171 324 176 75 246 198 165 232 255 104 258 68 -28 18 176 47 61 -1 324 174 269 97 -93 -84 -106
2010 -106 12 -71 57 16 40 105 88 -10 180 -19 16 -48 130 159 143 35 227 30 119 94 -37 -80 -122 -115 207
2035 207 192 60 141 202 -96 116 22 150 -8 -23 333 70 204 -15 246 -91 -58 -95 75 -60 -212 177
2057 177 -40 -132 25 -92 -220 29 -189 -194 -255 -234 -254 -298 -55 -48 -491 -482 -374 -368 -234 -394 -388 -208 -155 -109 -171 -327
2083 -327 -265 -468 -305 -248 -369 -312 -275 -127 -298 -167 -462 -265 -243 -319 -194 -123 -81 -377 -91 -165 -2 -296 -134
$$ packed form
1917i9k06l1K19j54K42l05n8K64j51j00Q9qk9j24J63k10J64m5o4n8ON04l72J1
1941c52J23n1k29J23K93j58j40L35l69R5K75j95j12L01J42k32J88J54j89J77j52
1962B7m0J41J19n5l55K31J30j81L08M2j79k18L49n6R1k76O7K37p0p3k18rL22j63
1986A71J53j48j01J71m8l3O7K3j51J54j90r6M6J58j29J4o2L25j50R5j72j90Rk2
2010a06J18q3J28m1K4O5j7r8J90j99L5o4J78K9j6j08J92j97Q9k5j31m3m2PL22
2035B07j5j32Q1O1k98K12r4J28j58j5L56k63J34k19K61l37L3l7J70j35j52L89
2057A77k17r2J57j17j28K49k18no1K1k0m4K43Pm43RJ08OJ34j60OJ80N3M6o2j56
2083c27O2k03J63N7j21N7L7J48j71J31k95J97K2p6J25P1M2k96K86p4J63k94J62
$$ plain form
2106 -134 38 -49 -131 306 55 70 245 284 191 226 144 142 -39 190 11 68 363 239 328 220 253 279 402 242
2130 242 218 -19 180 261 247 407 291 454 329 363 -90 -4 -11 155 131 253 224 -16 -100 -44 -160 -115 260 215
2154 215 -35 -103 -24 -50 -80 -118 -36 54 67 -150 61 -314 -166 -121 -6 17 34 -274 -25 -170 -127 152 -60 -159
2178 -159 78 19 -93 25 -72 17 40 -207 -230 -150 -128 -74 237 -37 -57 143 -60 30 -15 -24 63 59 -258 -241 12 -99
2204 -99 -233 -20 -19 -41 109 -107 114 84 -106 16 -111 172 -272 -232 -348 -83 -266 -472 -62 -5 -189 -166 -59
2227 -59 -185 -193 -132 -274 -169 -138 -187 -240 -106 -300 -353 31 -162 -336 -164 -21 -36 -120 -175 -104 -281 -137 -128 -211 -258
2252 -258 57 -222 -65 -131 29 78 74 -76 69 38 295 -57 22 157 214 -31 283 385 9 208 61 291
2274 291 308 80 25 222 429 138 107 150 414 224 82 236 87 263 212 376 -65 -139 62 214 266 162
$$ packed form
2106a34J72q7q2M37k51J5J75L9r3L5q2kj81K29j79N7K95j24Q9j08L3K6J23j60
2130B42k4k37J99Q1j4J60j16J63j25L4m53Q6pJ66k4J22k9k40q4N6j16M5L75m5
2154B15k50o8P9k6l0l8Q2R0J3k17K11l75J48M5J15K3J7l08K49j45M3K79k12r9
2178a59K37n9j12J18r7Q9K3k47k3Q0K2N4L11k74k0K00k03R0m5rQ7ml17J7K53j11
2204i9j34K13Jk2J50k16K21l0j90J22j27K83m44M0j16K65j83k06M10N7j84K3J07
2227e9j26qO1j42J05L1m9n3J34j94n3L84j93j74J72J43j5q4n5P1j77J44Rq3m7
2252b58L15k79J57o6J60M9mj50J45l1K57l52P9J35N7k45L14J02l76J99j47K30
2274B91J7k28n5J97K07k91l1M3K64j90j42J54j49J76n1J64m41p4K01J52N2j04
$$ plain form
2296 162 -49 8 64 175 -81 80 -56 -54 165 -163 -153 -72 -165 -40 -59 -16 -11 191 -173 -82 -112 -12 36 -190 -15
2321 -15 -307 -219 -291 -330 39 114 -288 -51 -279 -67 -214 -146 -137 -167 -86 -70 -23 69 -174 -106 -99 -77 348 -137 21 -284
2347 -284 -135 131 97 -198 -155 -240 -35 -57 65 -123 -89 4 -43 90 -182 -173 -7 -78 -300 26 120 209 -178 -192
2371 -192 82 -120 55 31 -18 -151 -84 -57 -30 -19 -76 -328 -67 -69 59 15 -42 -17 -128 -214 -12 12 -83 120 -18
2396 -18 137 -101 -67 -17 -34 -160 -5 41 86 -156 -35 -53 216 59 140 397 0 39 25 234 117 105 159 -17
2420 -17 96 191 210 214 131 183 -66 232 106 290 89 2 312 106 248 185 265 37 246 -63 160 140 265 87
2444 87 -49 237 97 155 -39 35 -142 30 -146 50 -122 95 -69 -143 -192 15 -343 103 -136 -197 -223 -227 -148
2467 -148 -42 -121 -153 -146 -302 -267 132 -12 -351 -348 -40 -395 -354 -107 -414 -193 -52 -195 -154 -19 -31 -307 -222 -75
$$ packed form
2296A62k11N7N6J11k56J61j36KK19l28J0Q1r3J25j9M3NK02l64R1l0J00M8k26J75
2321a5k92Q8p2l9L69P5m02K37k28K12j47O8Rl0Q1J6M7R2k43O8PK2M25m85J58l05
2347b84J49K66l4k95M3q5K05k2J22j88L4R3m7J33k72RJ66p1k22L26R4Q9l87j4
2371a92K74k02J75k4m9j33O7K7K7J1n7k52K61kJ28m4n7K5j11q6K02K4r5K03j38
2396a8J55k38L4N0j7j26J55M6M5k42J21j8K69j57Q1K57l97L9j4K09j17j2N4j76
2420a7J13R5J9Mq3N2k49K98j26J84k01q7L10k06J42o3Q0k28K09l09K23k0J25j78
2444H7j36K86j40N8j94P4j77J72j76J96j72K17j64p4m9K07l58M46k39o1k6mP9
2467a48J06p9l2Pj56L5L99j44l39LL08l55M1K47l07K21J41j43M1J35j2k76Q5J47
$$ plain form
2491 -75 -254 -157 -42 -250 -150 -261 -28 268 -8 100 64 83 7 -122 -69 -9 -5 -112 78 -9 2 -144 196 251
2515 251 -140 -145 -4 -102 -111 72 -80 93 38 -164 -78 -91 -43 -90 115 -57 -6 21 -36 185 56 58 226 72 92
2540 92 109 84 78 -44 32 20 75 -8 -2 52 -20 104 -9 -176 14 71 58 107 282 66 88 105 121 42 120 169 18
2567 18 33 273 284 -23 76 -6 272 -106 32 31 240 144 291 231 114 112 40 136 111 295 200 253 219 209 -194 -13
2593 -13 4 121 -187 51 -98 12 -57 106 121 46 78 43 89 -170 -110 -92 -16 -1 -148 -270 -60 65 -308 -379
2617 -379 -193 -138 -257 -19 -71 -371 98 49 -34 -298 7 -198 -458 -261 -158 -383 -107 -280 -188 -10 -259 15
2639 15 -248 154 -54 -69 -99 -79 39 148 73 -37 -233 -36 -63 -19 -30 52 51 109 44 75 123 47 104 -123 -53 174
2665 174 105 -118 219 70 215 244 -33 62 195 189 -34 109 -244 -74 -69 -92 -115 305 -44 138 -130 -205 1
$$ packed form
2491g5j79R7J15k08J00j11K33K96k76J08l6J9p6j29N3O0Mj07J90q7J1j46L40N5
2515B51l91nJ41r8rJ83j52J73n5k02Q6j3M8m7K05j72N1K7n7K21j29KJ68j54K0
2540I2J7k5oj22P6j2N5q3ON4p2J24j13j67J90N7j3M9J75k16K2J7J6p9P8M9j51
2567A8J5K40J1l07R9q2K78l78J38jK09r6J47o0j17kp2R6k5J84r5N3l4j0m03J81
2593a3J7J17l08K38j49J10o9J63J5p5L2l5M6k59O0J8P6J5j47j22K10J25l73p1
2617c79J86N5j19K38n2l00M69m9q3k64L05k05k60J97J03k25K76j73R2J78k49K74
2639A5k63M02k08j5l0K0J18J09p5j10j96J97k7M4j1Q2jN8o5L1M8p6N7k27P0K27
2665A74o9k23L37j49J45K9k77R5J33ok23J43l53J70Nk3k3M20l49J82k68p5K06
$$ plain form
2688 1 248 236 -21 208 118 78 -18 378 40 104 -79 -41 -59 -82 -208 -56 174 75 33 -23 -115 -123 22 47 88 62
2714 62 221 130 29 -73 84 53 276 41 68 83 64 -108 83 71 263 172 -48 -174 23 21 276 54 41 152
2738 152 274 179 122 -17 -136 204 -237 108 48 68 183 -38 75 57 -22 24 6 -16 -216 -177 -84 -195 -339 162
2762 162 -53 -139 -126 64 -33 -48 -135 -6 -252 -227 -189 -106 -98 -195 -111 -80 -355 -45 -74 -62 -62 -66 67 -19 -258 -260 128
2789 128 -416 -238 -89 -175 -241 10 215 -4 33 -130 -59 -40 52 223 -182 38 -75 78 -76 456 -28 -160
2811 -160 -106 -28 62 -117 -42 122 -11 61 100 291 -7 -27 143 6 55 229 1 -3 -90 -44 122 -134 30 225
2835 225 264 110 18 -231 183 -53 -53 -32 128 71 -139 128 90 32 246 118 3 207 -1 130 -57 -17 -154
2858 -154 44 -107 63 82 -128 89 -31 -176 248 -20 -143 136 -114 -5 -224 88 -53 124 -242 86
$$ packed form
2688AK47j2k57K29r0m0r6L96l38O4j83L8j8k3j26J52K30r9m2n6r2qJ45K5M1k6
2714F2J59r1j01j02J57l1K23k35K7J5j9j72J91j2J92r1k20j26J97kK55k22j3J11
2738A52J22r5n7j39j19L40m41L45o0K0J15k21J13j8p9M6j8k2k00L9R3j11j44N01
2762A62k15q6J3J90r7j5q7J29k46K5L8Q3Qr7Q4L1k75L10k9J2%mJ33q6k39kL88
2789A28n44J78J49q6o6K51K05k19L7j63P1J9R2J71m05K20j13J53j54N32m84j32
2811a60N4P8R0j79P5J64j33P2L9J91k98k0J70j37M9J74k28mq7M6J66k56J64J95
2835B25L9j54r2k49M14k36%K1J60n7k10K67l8n8K14j28j15K04k08J31j87M0j37
2858a54J98j51J70J9k10K17j20j45M24k68j23K79k50J09k19L12j41J77l66L28
$$ plain form
2878 86 -121 -27 61 -25 -121 19 46 63 -46 185 38 103 -105 -110 75 -52 228 80 -216 -81 -6 -9 -36 68 90
2903 90 130 -92 6 17 -172 4 135 -121 68 128 2 175 -34 -157 -73 -315 -195 -184 -300 -17 -269 -50
2925 -50 -106 56 -169 49 -6 136 54 54 -509 -484 -394 -309 -93 185 -31 -50 185 -544 -296 -273 14 -82 -936 111
2949 111 451 -124 -225 131 60 -478 145 -309 66 239 117 167 30 142 194 67 60 50 187 79 274 87
2971 87 77 275 22 45 97 315 291 289 -22 33 184 164 204 -44 -54 -53 100 30 33 84 -1 -54 -140 27 -227 270 321
2998 321 171 -227 -257 -11 -263 123 -66 94 -7 -288 -25 -162 -18 -36 -279 -101 -103 -22 90 -43 274 109
3020 109 -107 -230 -135 128 -10 21 45 -257 -96 -34 -34 130 -127 62 76 -170 6 -65 -107 -237 -104 111 -138
3043 -138 -81 -147 24 76 -30 -117 4 -29 -108 25 -215 -44 181 -215 152 41 117 -41 27 -202 104 -106 37
$$ packed form
2878H6k07R4Q8q6r6J40K7J7j09K31j47O5k08nJ85j27K80j48k96J35P5lk7J04K2
2903I0M0k22R8J1j89J76J31k56J89O0j26J73k09j23Q4k42J20J1j16K83k52K19
2925e0n6J62k25K18n5J42q2%n63K5R0Q5K16K78k16j9K35p29K48K3K87r6q54J047
2949A11L40n75j01L56p1n38O23m54L75J73j22N0j37J12N2j27pj0J37j08J95j87
2971H7j0J98k53K3N2K18k4kl11N5J51k0M0k48j0JJ53p0LN1q5n3q6J67k54M97N1
2998C21j50l98l0K46k52L86j89J60j01k81K63j37J44j8k43J78kQ1J12j33L17j65
3020A09k16j23R5K63j38L1K4l02J61O2%J64k57J89J4k46J76p1m2j30J33K15k49
3043a38N7o6J71N2j06q7J21l3p9J33k40J71K25l96L67j11P6j58O8k29L06k10J43
$$ plain form
3066 37 49 47 -25 -324 53 -56 -83 -17 -402 -76 -183 6 -12 -49 -166 -11 -220 -112 -115 166 -108 -2 -138 -364
3090 -364 115 66 17 -187 151 -184 -258 -51 138 -196 80 22 19 -155 -225 53 -46 -17 35 -96 84 -94 27
3113 27 -33 1 169 218 22 16 -71 235 175 12 68 182 155 -143 10 501 -110 -96 23 325 164 45 -26 476
3137 476 543 -313 -73 -133 255 -236 84 355 -63 -84 20 277 -360 -214 143 79 -93 129 231 398 340 156
3159 156 161 -146 -209 -44 98 30 74 182 -142 11 57 120 -117 111 161 -166 2 -198 -38 213 92 -67 -67
3182 -67 -113 -24 63 -20 52 -258 -223 -136 184 277 110 273 2 50 -253 -67 161 -144 -144 349 51 -8 656 -787
3206 -787 -496 -378 -186 -411 -48 -137 133 -688 222 565 316 429 -154 -298 -754 -156 -171 -578 -261 -1016 -259
3227 -259 552 -441 188 -205 -463 306 539 -275 -120 52 -639 -430 -50 -617 169 -1010 80 -181 600
$$ packed form
3066C7J2kp2k99L77j09k7O6l85L26j07J89j8l7j17J55k09J08lK81k74J06j36k26
3090c64M79m9m9k04L38l35p4K07J89l34K76n8lj74p0K78r9K9N2j31J80j78J21
3113B7o0L4J68M9j96oq7L06o0j63N6J14k7k98J53M91o11J4J19L02j61j19p1N02
3137D76O7q56K40o0L88m91L20K71m18k1J04K57o37J46L57o4j72K22J02J67n8j84
3159A56Nl07o3J65J42o8M4J08l24J53M6O3k37K28N0l27J68k00J60K51j21j59%
3182f7m6Q9Q7q3P2l10L5Q7L20R3j67J63k71M8l03J86K28l05%M93k98n9O64j443
3206g87K91J18J92k25L63q9K70q21R10L43k49J13n83j44m56N98j5m07L17p55P57
3227b59Q11r93O29l93k58P69K33q14J55J72o91K09L80n67P86j179J090k61P81
$$ plain form
3246 600 -676 455 -607 -563 227 240 -179 73 -162 605 -141 -294 -154 -556 -442 -56 -918 296 -45
3265 -45 201 271 -521 509 311 115 -139 520 -133 498 267 -188 675 -515 1189 291 108 -710 372
3284 372 188 -531 -479 -160 -810 49 677 -49 622 68 165 91 -574 68 139 -136 -25 105 -289 -35 441
3305 441 -585 267 -742 -569 -362 -362 -247 -276 667 -352 -877 93 -453 -330 26 -905 -53 292 236 -224
3325 -224 371 -175 -803 -274 -567 -197 251 144 -431 -456 -123 123 426 -27 447 187 773 -882 416 251
3345 251 -315 -437 -6 -314 -413 -351 -23 215 -495 -154 -129 -67 -324 332 -584 -401 -310 287 -613 -91 -461 353
3367 353 -106 143 -130 -56 362 -21 -194 -337 233 246 165 -283 -236 -315 -377 102 -256 -956 -222 -432 208 -320
3389 -320 649 -342 -124 105 -188 193 -60 85 264 -1 -222 -131 -239 -262 119 313 750 -40 -36 29 226 266
$$ packed form
3246F00j276J131j062M4P90J3m19K52k35P67p46j53J40m02J14L86q62J214l41
3265d5K46P0p92J030j98j96k54O59o53O31k31m55Q63j190J704q98j83q18J082
3284C72j84p19N2L19o50Q59O28p26O71n54R7p4o65O42P1k75J11J30l94K54M76
3305D41j026Q52j009J73K07%J15k9R43j019n25R70n46J23L56r31Q52L45n6m60
3325b24N95n46o28N29k93L70M48j07n75k5L33K46L03m53M74k60N86j655J298j65
3345B51n66j22M31l08r9O2L28K38p10L41K5O2k57O56r16J83R1N97r00N22l70Q14
3367C53m59K49k73P4M18l83j73j43N70J3q1m48M7p9o2M79l58p00P34k10O40n28
3389c20R69r91K18K29k93L81k53J45J79k65k21R1j08k3L81J94M37p90MO5J97M0
$$ plain form
3411 266 -931 -231 -242 -304 -470 166 -106 109 137 -340 -364 -29 356 276 362 90 33 313 188 130 -80 -40 -118
3434 -118 -100 296 112 -27 -82 -72 -195 -14 4 45 101 -211 -58 25 -96 14 45 -151 44 -166 -72 -161 160
3457 160 -22 19 24 -161 -342 30 54 242 3 144 -118 -179 36 123 -178 -38 -54 -36 -80 -111 185 27 -198
3480 -198 2 -76 13 -33 -7 55 164 13 61 -54 218 41 -70 -24 -46 2 194 -19 89 324 329 -76 -174 -98
3504 -98 -32 110 1 68 -49 313 139 229 17 46 -150 -47 165 70 -73 -198 -243 -77 49 -118 -556 230
3526 230 -107 83 243 173 262 -20 -164 170 297 164 111 356 596 374 -220 -412 417 -335 132 111 -370
3547 -370 -41 30 120 -236 -219 142 -100 214 152 122 -110 95 -8 63 10 -237 115 62 88 79 5 75 -61 56
3571 56 -246 138 -35 18 47 120 93 104 -225 34 -120 -182 -6 -178 149 6 -12 -168 2 132 177 -57 -111
$$ packed form
3411B66j197P00j1o2j66O36k72K15K8m77k4L35L85q0Q6k72n7K80j25n8k10M0p8
3434a18J8L96j84j39n5J0j23J81J8M1N6l12J53Q3j21J10L1j96J95k10R4q9L21
3457A60j82M1Nj85j81L72K4J88k39J41k62o1K15Q7l01J40j6J8m4l1K96j58k25
3480a98K00p8Q9m6K6O2J09j51M8j15K72j77j11M6k2M8J92k13J08K35Nm05r8P6
3504i8O6J42j09O7j17L62j74R0k12K9j96J03K12r5j43j25m5J66J26j67m38P86
3526B30l37J90J60p0Q9k82j44L34J27j33n3K45K40k22n94j92Q29p52M67k1m81
3547c70L29P1R0l56J7L61k42L14o2l0k32K05j03P1n3k47L52n3K6rp4P0j36J17
3571E6l02L84j73N3K9P3k7J1l29K59j54o2J76j72L27j43j8j56J70J30M5k34n4
$$ plain form
3594 -111 34 -87 124 -102 -84 200 -73 -78 -42 -9 -47 -7 -154 14 -202 -80 48 46 -170 -144 -82 -115 -148 -88 -176
3619 -176 -29 208 -289 -56 -139 -145 -142 -505 -74 -193 64 32 -78 143 31 216 -151 -195 301 167 90 117 -332
3642 -332 53 255 88 -24 145 -103 36 642 128 -84 175 363 -88 39 -360 -947 256 627 -215 -131
3662 -131 15 -66 -21 755 -152 -69 324 -82 460 57 174 -69 142 43 301 -9 1 25 91 7 218 71 -33
3685 -33 -87 -75 269 -99 105 -45 -122 165 87 -28 53 482 493 -453 167 298 186 468 -416 -310 -162 -210 -406
3708 -406 374 41 -143 -251 103 6 -5 -106 45 78 -106 149 354 -65 199 7 72 -639 363 -393 -291
3729 -291 -221 -349 -46 -842 -63 285 369 -231 -194 -93 366 108 86 -7 -100 19 64 0 -41 8 86 -133 134 -157
3753 -157 -183 15 -162 -60 -237 -196 -3 -100 33 -91 107 -79 122 -221 189 243 -173 -216 35 283 224 440
$$ packed form
3594a11J45j21K11k26J8K84k73nL6L3l8M0j47J68k16J22J28kk16K6O2l3l3O0q8
3619a76J47K37m97K33q3oLl63M31j19K57l2j10K21j12J85l67m4M96j34p7K7m49
3642c32L85K02j67j12J69k48J39O06n14k12K59J88m51J27l99n87J203L71q42Q4
3662a31J46q1M5P76r07Q3L93m06N42m03J17k43K11r9K58l10J0K4O6q4K11j47j04
3685c3n4J2L44l68K04j50p7K87p8j15Q1M29J1r46O20J31j12K82q84J06J48m8j96
3708d06P80l33j84j08L54r7j1j01J51L3j84K55K05m19K64j92O5p11J002p56J02
3729b91P0j28L03p96P79L48Q4o00L7J01M59k58k2r3r3J19M5o4m1M9P8k19K67k91
3753a57k6J98j77J02j77M1J93r7J33j24J98j86K01l43M10N4m16m3K51K48n9K16
$$ plain form
3775 440 72 -279 57 147 -98 271 -312 143 -176 209 75 -74 -126 -304 80 223 -208 -328 134 306 -166
3796 -166 586 -10 3 330 -591 -625 65 -83 243 184 185 183 81 -320 -266 0 -39 304 141 -48 -71 86 -127
3819 -127 209 50 177 -3 -32 53 120 100 175 30 14 208 23 -193 31 -65 -11 97 -7 151 111 24 119 -125
3843 -125 -92 95 360 64 155 2 151 -18 -221 173 37 155 -269 7 -177 -20 -35 -46 111 13 -159 208
3865 208 187 -10 114 -67 -30 66 -1 90 -155 -213 -31 183 -103 -161 -133 29 -127 21 -43 54 -177 -9 104
3888 104 72 -107 -214 25 -356 9 -7 73 4 33 61 -123 -34 60 -9 -134 -53 93 247 -61 224 -218 -9
3911 -9 202 -21 -39 -26 71 -286 31 59 -86 145 80 106 -131 -269 124 86 143 -63 53 81 107 222 67 68 -104
3936 -104 -61 -48 -57 24 -55 158 -141 -163 58 289 336 -186 -40 -36 80 -37 225 136 35 201 -131 139 -42 -12
$$ packed form
3775D40l68l51L36R0k45L69n83M55l19L85j34j49n2j78L84J43m31j20M62J72m72
3796a66P52n96J3L27r21l4O90j48L26n9Jkj02m01N4K66l9L43j63j89k3J57k13
3819a27L36j59J27j80k9Q5O7k0P5j45j6J94j85k16K24r6N4J08j04J58m0q7R5k44
3843a25L3J87K65k96R1j53J49j69k03L94j36J18m24K76j84J57j5j1J57r8j72L67
3865B08k1j97J24j81L7R6o7R1k45n8J82K14k86n8K8J62j56J48o4R7k31J68J13
3888A04l2j79j07K39l81L65j6Q0o9K9K8j84Q9R4o9j25Q1J46J54l08K85m42K09
3911iK11k23j8J3R7l57L17K8j45K31o5K6k37j38L93l8N7k06J16K8K6J15j55Jj72
3936a04M3J3rQ1p9K13k99k2K21K31M7n22J46MJ16j17K62q9j01J66l32K70j81L0
$$ plain form
3960 -12 -5 -56 -10 380 165 -247 373 -58 -57 104 57 17 121 186 293 8 -14 50 138 105 -103 -33 125 -106 8
3985 8 112 -131 -125 195 -35 -23 226 -29 -251 138 53 -482 75 -124 24 -86 -352 -155 -79 60 -48 418
4007 418 -429 35 14 -400 395 300 -28 -647 -394 205 747 205 -142 -133 -121 166 -269 89 80 228 -145 73
4029 73 -235 248 -91 -58 -169 70 46 -76 -194 -35 -52 75 -85 231 -81 -191 61 47 -205 -54 133 -63
$$ packed form
3960a2Pn1M6L90k15m12O20m31JJ61m7m0J04O5J07k85k2O4Q8l3k08P0J58k31J14
3985HJ04k43OL20k30J2K49k55k22L89q5n35N57j99J48j10k66J97P6J39j08M66
4007D18q47M64k1m14P95r5l28o19K53N99N42n42l47RJ2K87m35L58rJ48l73K18
4029G3l08M83l39L3j11K39k4j22j18J59j7J27j60L16l12j10K52j4k52J51J87j96
$$ [...]
8191d
##END NTUPLES=NMR FID
##END=
