##TITLE=1H_SL83_Dau(f9)
 CDCl3, 8 sc, 
 11.05.2021
##JCAMPDX= 6.0         $$ Bruker NMR JCAMP-DX V2.0
##DATA TYPE= NMR FID
##DATA CLASS= NTUPLES
##ORIGIN= UXNMR, Bruker Analytische Messtechnik GmbH
##OWNER= root
$$ XWIN-NMR		Version 3.5
$$ Tue May 11 09:56:08 2021 Russian Standard Time (UT+4h)  she@DPX200
##.OBSERVE FREQUENCY= 200.131506
##.OBSERVE NUCLEUS= ^1H
##.DELAY= (6, 6)
##.ACQUISITION MODE= SIMULTANEOUS
##.ACQUISITION SCHEME= undefined
##.AVERAGES= 8
##.DIGITISER RES= 18
##SPECTROMETER/DATA SYSTEM= spect
##.PULSE SEQUENCE= zg30
##.SOLVENT NAME= CDCl3
##.SHIFT REFERENCE= (INTERNAL, CDCl3, 0, 15.7039)
##AUDIT TRAIL= $$ (NUMBER, WHEN, WHO, WHERE, WHAT)
$$ ##TITLE= Audit trail, XWIN-NMR		Version 3.5
$$ ##JCAMPDX= 5.01
$$ ##ORIGIN= Bruker BioSpin GmbH
$$ ##OWNER= she
$$ F:/spectra/data/she/nmr/H-F/1/audita.txt
$$ ##AUDIT TRAIL=  $$ (NUMBER, WHEN, WHO, WHERE, WHAT)
(   1,<2021-05-11 09:54:46.87 +0400>,<she>,<DPX200>,
      <created by zg, POWCHK disabled, PULCHK disabled
       configuration hash MD5:
       00 E9 B6 7A A2 85 ED C7 34 08 36 98 17 FE 4E 26
       data hash MD5: 16K
       00 5E CF 27 59 70 CE 1A 1C 2D 5A 09 6B 2A D3 2C>)
$$ ##END=
$$ 
$$ hash MD5
$$ 07 71 35 13 C0 EE 76 A6 CF CC 29 4B 2E 1E 3D A6
##$RELAX= 
##$RELAX= 
##$RELAX= 
##$RELAX= 
##$RELAX= 
##$RELAX= 
$$ Bruker specific parameters
$$ --------------------------
##$DU= <F:/spectra>
##$EXPNO= 1
##$NAME= <H-F>
##$PROCNO= 1
##$TYPE= <nmr>
##$USER= <she>
##$AMP= (0..31)
100 100 100 100 100 100 100 100 100 100 100 100 100 100 100 100 100 100 
100 100 100 100 100 100 100 100 100 100 100 100 100 100 
##$AQSEQ= 0
##$AQ_mod= 1
##$AUNM= <au_zg>
##$AUTOPOS= <>
##$BF1= 200.13
##$BF2= 200.13
##$BF3= 200.13
##$BF4= 200.13
##$BF5= 200.13
##$BF6= 200.13
##$BF7= 200.13
##$BF8= 200.13
##$BYTORDA= 1
##$CFDGTYP= 0
##$CFRGTYP= 5
##$CHEMSTR= <none>
##$CNST= (0..31)
1 1 145 1 1 1 1 1 1 1 1 1 1 1 1 1 1 1 1 1 1 1 1 1 1 1 1 1 1 1 1 1 
##$CPDPRG= <>
##$CPDPRG1= <>
##$CPDPRG2= <>
##$CPDPRG3= <>
##$CPDPRG4= <mlev>
##$CPDPRG5= <mlev>
##$CPDPRG6= <mlev>
##$CPDPRG7= <mlev>
##$CPDPRG8= <mlev>
##$CPDPRGB= <>
##$CPDPRGT= <>
##$D= (0..31)
0 1.2 0 0 0 0 0 0 0 0.06 0 0.03 0 0 0 0 0.0002 0 0 0 0 0 0 0 0 0 0 0 0 
0 0 0 
##$DATE= 1620712486
##$DBL= (0..7)
120 120 120 120 120 120 120 120 
##$DBP= (0..7)
150 150 150 150 150 150 150 150 
##$DBP07= 0
##$DBPNAM0= <>
##$DBPNAM1= <>
##$DBPNAM2= <>
##$DBPNAM3= <>
##$DBPNAM4= <>
##$DBPNAM5= <>
##$DBPNAM6= <>
##$DBPNAM7= <>
##$DBPOAL= (0..7)
0.5 0.5 0.5 0.5 0.5 0.5 0.5 0.5 
##$DBPOFFS= (0..7)
0 0 0 0 0 0 0 0 
##$DE= 6
##$DECBNUC= <off>
##$DECIM= 32
##$DECNUC= <off>
##$DECSTAT= 4
##$DIGMOD= 1
##$DIGTYP= 9
##$DL= (0..7)
0 120 120 120 120 120 120 120 
##$DP= (0..7)
150 150 150 150 150 150 150 150 
##$DP07= 0
##$DPNAME0= <>
##$DPNAME1= <>
##$DPNAME2= <>
##$DPNAME3= <>
##$DPNAME4= <>
##$DPNAME5= <>
##$DPNAME6= <>
##$DPNAME7= <>
##$DPOAL= (0..7)
0.5 0.5 0.5 0.5 0.5 0.5 0.5 0.5 
##$DPOFFS= (0..7)
0 0 0 0 0 0 0 0 
##$DQDMODE= 0
##$DR= 18
##$DS= 0
##$DSLIST= <SSSSSSSSSSSSSSS>
$$ [...]
##$SUBNAM2= <"">
##$SUBNAM3= <"">
##$SUBNAM4= <"">
##$SUBNAM5= <"">
##$SUBNAM6= <"">
##$SUBNAM7= <"">
##$SUBNAM8= <"">
##$SUBNAM9= <"">
##$SW= 16.9725357007746
##$SWIBOX= (0..15)
0 0 2 0 0 0 0 0 0 0 0 0 0 0 0 0 
##$SW_h= 3396.73913043478
##$TD= 16384
##$TD0= 1
##$TE= 0
##$TE2= 300
##$TE3= 300
##$TEG= 300
##$TL= (0..7)
0 120 120 120 120 120 120 120 
##$TP= (0..7)
150 150 150 150 150 150 150 150 
##$TP07= 0
##$TPNAME0= <>
##$TPNAME1= <>
##$TPNAME2= <>
##$TPNAME3= <>
##$TPNAME4= <>
##$TPNAME5= <>
##$TPNAME6= <>
##$TPNAME7= <>
##$TPOAL= (0..7)
0.5 0.5 0.5 0.5 0.5 0.5 0.5 0.5 
##$TPOFFS= (0..7)
0 0 0 0 0 0 0 0 
##$TUNHIN= 0
##$TUNHOUT= 0
##$TUNXOUT= 0
##$USERA1= <user>
##$USERA2= <user>
##$USERA3= <user>
##$USERA4= <user>
##$USERA5= <user>
##$V9= 5
##$VALIST= <valist>
##$VCLIST= <CCCCCCCCCCCCCCC>
##$VD= 0
##$VDLIST= <DDDDDDDDDDDDDDD>
##$VPLIST= <PPPPPPPPPPPPPPP>
##$VTLIST= <TTTTTTTTTTTTTTT>
##$WBST= 1024
##$WBSW= 4
##$XGAIN= (0..3)
0 0 0 0 
##$XL= 0
##$YL= 0
##$YMAX_a= 57782
##$YMIN_a= -53310
##$ZGOPTNS= <>
##$ZL1= 120
##$ZL2= 120
##$ZL3= 120
##$ZL4= 120
##$ABSF1= 10
##$ABSF2= 0
##$ABSG= 5
##$ABSL= 3
##$ALPHA= 0
##$AQORDER= 0
##$ASSFAC= 0
##$ASSFACI= 0
##$ASSFACX= 0
##$ASSWID= 0
##$AUNMP= <proc_1d>
##$AZFE= 0.1
##$AZFW= 0.1
##$BCFW= 1
##$BC_mod= 2
##$BYTORDP= 1
##$COROFFS= 0
##$CY= 11.3945322036743
##$DATMOD= 1
##$DC= 2
##$DFILT= <>
##$DTYPP= 0
##$F1P= 15.9154993809931
##$F2P= -4.1035820241983
##$FCOR= 0.5
##$FTSIZE= 0
##$FT_mod= 4
##$GAMMA= 1
##$GB= 0.15
##$INTBC= 1
##$INTSCL= 1
##$ISEN= 128
##$LB= 0.24
##$LEV0= 0
##$LPBIN= 0
##$MAXI= 10000
##$MC2= 0
##$MEAN= 0
##$ME_mod= 0
##$MI= 1.114404
##$NCOEF= 0
##$NC_proc= 0
##$NLEV= 6
##$NOISF1= 3.799351
##$NOISF2= 2.8
##$NSP= 1
##$NTH_PI= 0
##$NZP= 0
##$OFFSET= 15.70392
##$PC= 1
##$PHC0= -11120.21
##$PHC1= 14.401
##$PH_mod= 1
##$PKNL= yes
##$PPARMOD= 0
##$PSCAL= 0
##$PSIGN= 0
##$REVERSE= no
##$SF= 200.130013532006
##$SI= 16384
##$SIGF1= 3
##$SIGF2= 2
##$SINO= 400
##$SIOLD= 16384
##$SREGLST= <1H.CDCl3>
##$SSB= 0
##$STSI= 0
##$STSR= 0
##$SW_p= 3612.71676300578
##$SYMM= 0
##$S_DEV= 0
##$TDeff= 0
##$TDoff= 0
##$TI= <>
##$TILT= no
##$TM1= 0
##$TM2= 0
##$TOPLEV= 0
##$USERP1= <user>
##$USERP2= <user>
##$USERP3= <user>
##$USERP4= <user>
##$USERP5= <user>
##$WDW= 1
##$XDIM= 8192
##$YMAX_p= 0
##$YMIN_p= 0
$$ End of Bruker specific parameters
$$ ---------------------------------
##NTUPLES= NMR FID
##VAR_NAME=  TIME,          FID/REAL,        FID/IMAG
##SYMBOL=    X,             R,               I
##VAR_TYPE=  INDEPENDENT,   DEPENDENT,       DEPENDENT
##VAR_FORM=  AFFN,          ASDF,            ASDF
##VAR_DIM=   8192,          8192,            8192
##UNITS=     SECONDS,       ARBITRARY UNITS, ARBITRARY UNITS
##FACTOR=    0.0002944,     1,               1
##FIRST=     0,             0,               0
##LAST=      2.4114304,     0,               0
##MIN=       0,             -53310,          0
##MAX=       2.4114304,     57782,           0
$$ Real data points
##PAGE= N=1
##DATA TABLE= (X++(R..R)), XYDATA
0 0 0 0 0 0 0 0 0 0 0 0 0 0 0 0 0 0 -8 8 -8 8 -8 9 -16 16 -16 24 -24 32 -32 40 -45 48 -56 64 -72 82 -91 104
38 104 -115 128 -141 157 -173 195 -213 235 -259 288 -316 348 -384 422 -466 515 -570 629 -700 781
58 781 -879 990 -1129 1295 -1514 1799 -2196 2783 -3739 5546 -10109 45208 57782 -53310
72 -53310 18962 11720 -15695 26413 -3824 -11396 22770 -3779 5744 9010 -9793 4684 6475
85 6475 -3312 7682 5902 -671 2013 9490 -427 -5279 9025 665 1388 19527 -10998 -14582 22831
100 22831 4265 -12866 4417 -841 1543 4695 -8014 -313 1599 -6047 4061 -2288 -12482
113 -12482 2880 3060 -7777 3432 1249 -14889 -732 11286 -6720 -7500 2734 -2159 4365
126 4365 6089 -11175 -6929 6144 1307 -1300 -1431 114 3757 -6021 -5784 6677 -3157 -5572 8426
141 8426 -266 -4645 2851 -4860 -338 8031 -3911 -5426 7220 10151 -624 -7804 1144 6492
155 6492 6433 4910 -3654 2260 8386 2062 3086 -3780 573 14215 -3306 -2282 9510 -7415 2159
170 2159 8787 -7560 1760 581 -4842 6537 -1436 -3529 -1580 -4875 6755 -224 -10952 1471
184 1471 1541 -1657 -1874 -4640 1401 -3549 -3745 1364 -8706 17 4969 -9470 -1992 -1250 -9454 1311
200 1311 404 -5408 -2880 -4389 -26 -304 -5978 -2609 -2737 -2152 4509 855 -6452 -1969 3917 -2008
216 -2008 -1864 4750 -848 361 6000 -1522 -1390 2640 1171 4107 2380 1070 2151 9 4415 3422
232 3422 -2611 1210 4061 4171 1623 -1054 1348 1099 4050 3429 -5538 2195 8450 -2342 -2301 2124
248 2124 438 2247 517 -847 -1100 -1280 2653 1805 -2268 -1472 -1299 -1333 373 1153 -5258 -4606 4603
265 4603 -1771 -6391 1507 -4062 -4338 3578 -2988 -4743 40 -1495 -1009 -4105 -3651 1686 -1373 -960
281 -960 212 -4758 -1589 1938 -1529 -2247 383 1243 -1793 1057 2384 -4551 9 4805 -1205 770
297 770 1698 -168 2599 1376 303 490 13 4604 2934 -1439 1747 1993 548 2727 3307 38 -1324
314 -1324 4083 3674 -1546 1776 431 -352 4969 124 -2671 2569 1679 1186 -385 -2383 1966 1093
330 1093 -1417 157 -1419 -960 1730 57 -3667 -2317 1005 -1791 -1578 1458 -3498 -3000 1425 -2308
346 -2308 -1953 -1569 -2804 1011 -291 -1915 -1389 -3350 399 2316 -4062 -2330 2435 628 -1416 -163
362 -163 -697 -1933 2294 1905 -2568 677 1435 -957 2035 150 -921 1686 1028 1644 105 -347 2944
379 2944 1425 25 2771 975 258 3240 3357 -71 -538 4179 2576 227 3101 479 352 4304
395 4304 866 571 929 -177 2592 643 -374 1594 -1534 371 2335 -2634 -1475 775 306 -114
411 -114 -1559 -660 -1683 -298 2061 -4244 -3028 2718 -1799 -1293 -798 -3671 86 -1367 -2367 604
427 604 -3612 -1167 787 -4085 -598 -1023 -4059 892 12 -3674 -985 -454 -716 -506 -1093 -508 -1319
444 -1319 1112 2608 -1946 -1317 2466 1878 631 -531 1100 3174 111 701 2351 170 1982 2471
460 2471 -538 1748 2197 -1166 2018 2624 -1309 363 674 858 1858 -1182 -509 1394 150 1416
476 1416 -1228 -2391 1981 1192 -1763 -687 198 272 -1842 -668 300 -2873 141 -127 -3369 889 -1808
493 -1808 -3494 897 -1533 -2194 -1992 -3736 1314 -1646 -4957 185 -1487 -567 596 -3289 -477 1166
509 1166 -148 -324 -2290 1661 1692 -2584 2069 509 -1568 2497 -917 866 2817 -2914 1489 2153
525 2153 -811 2617 -2301 -253 6197 -1937 -1293 2676 -104 2404 409 -1364 3244 616 870 1327
541 1327 -932 3378 1424 -1281 2647 824 -161 1709 -63 2417 417 -2017 1793 180 89 1477
557 1477 -3512 445 3974 -2941 -2136 1068 -262 212 -1773 -2175 1240 -744 -1094 -298 -1594 387
573 387 47 -2302 789 234 -2235 -668 585 321 -2097 -2109 976 22 -772 -148 -2552 674 1763
590 1763 -2594 -1136 754 46 482 -1803 0 1802 -1270 709 978 -1123 1628 670 -104 2805
606 2805 333 -195 666 2224 2456 -1589 528 3364 -5 1284 585 -880 3249 889 -754 1015
622 1015 -242 2365 764 -2509 2588 705 -1776 2165 -277 -599 1029 -1263 1012 435 -1400 4
638 4 -1278 1277 548 -3561 -65 804 -1624 -611 -1783 -523 548 -2216 -352 -1320 -1963 1092 -1818
655 -1818 -2049 1179 -1814 -1367 693 -1422 -1227 -505 -639 838 -272 -1012 -198 -352 919 326 -1434
672 -1434 48 1657 8 -561 667 1129 647 572 538 12 450 1422 629 279 1197 417 -29 1472 1245
691 1245 -353 126 1048 1737 541 -612 1360 1009 434 1046 -334 -94 1657 38 -765 416 459 -243
709 -243 184 444 -1004 -487 494 -347 -547 -255 -1184 -505 -307 -798 -1119 -1877 367 225 -2459 -916 69
728 69 -1138 -299 -898 -1786 -398 -290 -360 -984 -1144 217 -578 -427 116 -859 -365 -135 229 245 -599 36
748 36 740 -267 874 -348 -548 1802 687 -880 598 649 891 763 308 452 -25 1037 1211 72
766 72 232 1018 557 540 859 567 4 582 1321 -324 -125 1095 233 321 531 -481 -106 716 79 -771
786 -771 -595 236 35 -714 -102 -408 -673 -109 -114 -773 -1421 -179 106 -1027 -42 -738 -1793 298 286 -1209
806 -1209 -667 -603 -148 -484 -848 -778 -412 180 -67 -1146 -542 309 -45 -570 -305 176 -321 -140 1011 -240
826 -240 -392 768 43 143 734 10 171 806 855 297 -211 1256 1107 629 863 476 659 900 995 849
846 849 49 1268 1057 -253 759 840 -509 958 991 -419 282 252 378 144 -492 47 -213 50 561
865 561 -720 -1077 276 -8 -475 -709 -242 -186 -741 -44 -927 -1405 5 -333 -1140 -535 -468 -1133 -534 -527 -773
886 -773 -1178 -719 189 -717 -971 -157 -447 -144 109 -477 -491 382 300 -125 100 277 124 187 1173 644 -238
907 -238 1011 1147 380 656 422 218 772 666 354 303 -18 1409 80 -53 1345 276 -19 1358 -59
926 -59 -259 774 -124 632 -349 24 484 -352 752 314 -1225 490 266 -239 -110 -1071 312 216 -1445
945 -1445 -760 -1520 -617 -54 -1133 -907 385 -1012 -210 -67 -1028 -405 -766 91 -125 -1444 287 371 -1074
964 -1074 422 -794 -1138 536 -40 27 -274 -145 1096 -424 -9 796 -537 509 693 -595 432
981 432 334 -165 865 107 186 498 -463 1452 834 -1005 940 654 435 1050 -287 87 760 578 782
1000 782 -82 431 1555 -511 15 805 -801 654 382 -158 307 -287 -35 436 -585 264 -367 -935
1018 -935 1084 -202 -1510 346 -224 -413 149 -1233 157 69 -958 30 -1042 -524 596 -1313 -85
1035 -85 431 -1204 -330 -141 -191 25 -1183 -285 510 -716 415 -544 -738 1707 -580 -955 633 132
1053 132 716 -11 -533 1152 186 249 1133 -360 633 1053 -455 1012 736 -81 673 175 1105 324 -446
1072 -446 1172 433 -275 791 -431 491 1107 -759 209 -41 284 819 -659 137 690 -976 287 343
1090 343 -1096 328 -229 -456 209 -355 -329 -279 -319 333 -882 -1005 777 -993 -888 -432 -856 166 -283
1109 -283 -869 243 -816 -29 239 -1320 42 316 -979 339 197 -609 82 -300 -14 340 -513 146
1127 146 199 379 697 -477 -226 1142 77 214 353 77 527 366 586 459 93 588 848 41 568
1146 568 747 -246 965 408 41 499 359 645 142 -115 570 196 -36 591 -514 -366 742 -141 -325
1165 -325 -103 -81 85 -448 -76 -508 -1076 178 -242 -671 -283 -483 -684 -25 -536 -471 -355 -450 109 -880 -477
1186 -477 192 -353 -514 -221 -608 -244 -174 -47 -327 -450 98 -212 -248 317 -104 -146 574 364 89 24 111 621
1208 621 258 331 316 60 510 504 -134 347 611 203 261 197 334 198 461 365 10 258 464 206 27 338
1230 338 -9 -87 152 126 -137 -275 368 356 -263 -25 -96 -252 101 51 -637 -433 153 -273 -206 17 -239 -531
1252 -531 -225 -219 -269 -586 -397 23 -708 -207 -290 -759 -188 -108 -494 -597 -107 177 -350 -96 -319 -218 7 78
1274 78 -188 -195 183 -51 134 160 280 60 -24 581 273 15 405 490 -32 314 184 263 734 591 44 -141
1296 -141 768 606 205 265 260 398 372 278 61 -62 302 547 -114 90 319 -413 186 436 -230 -128 166 247
1318 247 -359 -489 -92 227 -391 -48 -525 -399 18 -311 -319 -332 -98 -396 -494 -49 -417 -621 -514 -224 -628
1339 -628 -459 -135 -727 -142 -299 -251 -390 -12 103 54 -401 84 130 -92 -13 215 147 115 290 -44 228 173
1361 173 302 285 347 615 209 137 652 198 293 418 245 590 210 32 77 364 696 450 -145 387 501 -371
1383 -371 198 223 -141 183 206 141 -89 -202 90 -107 -466 242 -629 -161 335 -273 -364 -201 -188 41 -490 -517
1405 -517 54 -379 34 -369 -626 152 -417 -350 -299 -461 -4 -140 -475 78 -252 -173 164 -288 -66 212 -625
1426 -625 259 188 -65 -269 -125 275 312 -353 199 8 -150 738 -112 -60 474 -56 184 491 193 458 -155
1447 -155 451 936 -42 142 469 73 250 306 -146 317 464 5 117 -280 684 -199 -402 251 136 -54
1467 -54 80 -371 -100 69 -321 -41 -166 -318 52 -877 -125 181 -864 -265 -10 -573 -152 -396 -413 235
1487 235 -190 -28 -343 -516 150 -385 -820 380 -412 -143 127 -479 256 59 -330 330 -137 -92 487 -539
1507 -539 510 508 -413 290 471 -52 476 -345 257 552 -357 289 -129 -58 890 -394 -9 601 -86 -9 30
1528 30 -4 239 -310 349 694 -76 371 -8 -230 838 62 -446 244 -297 542 -257 -326 440 122 -271 206
1549 206 -344 -22 -50 -467 -170 -126 -320 -127 -231 171 19 -625 -225 -47 -198 10 -403 -166 345 -512 -188
1570 -188 -179 -208 142 -437 -314 320 -81 -124 142 -426 194 -137 -187 184 342 10 349 -74 324 456 -414 583
1592 583 491 -192 321 227 172 498 -244 448 515 286 571 -123 68 499 -116 19 296 -203 408 -51 256
1613 256 314 -177 85 63 -249 158 105 -356 375 63 -468 -184 47 179 -156 -274 -328 -457 -151 154 -582
1634 -582 -404 -157 -477 22 -161 -207 -129 -520 5 51 -286 -20 -309 -186 139 -293 -401 258 98 -56 -131
1655 -131 152 251 -70 -22 256 -218 196 26 91 -24 359 221 -72 195 315 77 138 222 -37 28 164 206
1677 206 323 119 -55 217 50 242 306 -95 -18 386 -114 -102 -4 -22 280 135 -419 -197 185 70 -74 -49
1699 -49 -90 -267 -268 -42 63 -92 -128 -214 -158 5 -84 -259 112 -288 -169 -393 -315 -58 -218 -150 -153 -262 16 -125
1723 -125 -258 -117 64 176 -16 235 114 -12 -250 93 -218 -134 285 166 87 109 256 96 238 321 356 25
1745 25 255 257 168 147 130 12 93 186 2 -7 84 179 97 206 397 -79 -45 -99 211 271 -10 100 -113 -194 -12 -140
1771 -140 -170 206 -259 -55 -197 -85 -274 -116 -228 -181 -240 -301 -264 -252 -22 -80 -135 -505 -24 -158 -178 -363 115
1794 115 -433 -73 46 -254 -169 115 -185 -364 76 -179 -240 23 -114 101 -263 188 99 49 -76 229 638
1815 638 390 539 10 111 -209 576 255 392 -179 43 660 802 84 101 657 -393 568 -14 -508 -328
1835 -328 -606 -174 366 -60 151 458 -40 41 -103 -69 -85 405 -40 228 -72 -79 9 -194 75 -146 -255 301
1857 301 -148 -272 -262 -57 -135 -98 -582 2 -124 -12 -244 -443 7 -14 -159 -96 -14 -27 222 50 40 35 -219
1880 -219 168 -133 81 213 241 -76 148 -81 -141 218 131 322 -5 79 392 -47 44 -148 -25 538 221 -55
1902 -55 122 199 339 100 -225 133 113 61 361 284 69 247 -284 -45 415 -127 -385 -10 179 229 -162 5
1924 5 137 -456 -137 45 -151 195 -373 -328 -65 -355 -62 -372 -290 188 -246 -343 133 -310 -101 -225 -370 235
1946 235 16 -184 -6 -194 255 -146 -384 -65 31 -61 208 131 53 127 -120 119 205 -88 7 -334 210 504
1968 504 -364 -69 408 -50 130 37 29 294 -235 -55 100 -163 208 124 -180 470 -50 -103 52 -179 242 -19
1990 -19 -63 365 182 -78 -138 -203 12 70 -322 -113 -143 1 76 -274 -93 -27 -305 -65 -27 -350 350 -600 2
2013 2 -16 -111 -223 -113 -117 66 -323 -120 159 -158 -69 74 -80 342 -69 -152 204 -81 130 47 148 198 -36
2036 -36 -230 145 16 -31 151 53 226 378 -65 -53 -156 228 271 -211 256 226 -97 254 -19 -98 288 14
2058 14 13 230 109 86 -159 68 484 -213 -113 355 -51 -115 -61 -551 -66 -75 -219 -78 -267 -131 26 -587 -69
2081 -69 -113 -178 50 -86 -109 324 -407 165 -379 -610 10 -328 23 15 349 -200 411 147 -141 -452 248 -142
2103 -142 39 229 -15 371 672 -120 -251 1 41 -184 5 239 453 99 38 -93 20 224 20 136 109
2124 109 172 -335 13 -105 -100 28 -18 232 198 -29 -102 299 296 157 -233 -112 92 128 -38 -18 66 187 -83 -251
2148 -251 40 -20 66 -381 -267 -89 38 -180 -208 -50 -25 -105 -65 -36 19 -94 -16 -258 -233 -302 -161 -241 -22 -123
2172 -123 -5 -104 113 355 -130 -16 132 120 44 -18 88 51 85 111 96 -164 181 190 99 84 38 148 -21 128
2196 128 284 70 91 92 61 246 11 -274 301 276 276 3 212 219 -52 41 -61 -5 21 119 221 25 164 -150
2220 -150 -45 230 -57 -283 -93 178 -61 -36 -340 -232 -190 -162 46 117 188 40 -259 -151 -206 -128 -153 -29 -210
2243 -210 -55 -132 -8 -245 -150 -109 4 -198 333 -498 -138 449 1 47 12 -75 -41 -32 124 130 157 369 83 8
2267 8 -168 -30 -47 74 106 392 7 -37 418 256 52 190 -245 74 197 125 52 149 81 -220 31 110 3
2290 3 77 -213 103 -6 30 138 -136 -11 167 -147 -55 -42 -136 -195 9 -21 -210 -287 -2 -174 -181 -6 -136 -241
2314 -241 61 -5 -84 -207 120 -121 -154 -348 109 -395 -426 89 104 257 -46 107 196 101 -83 -324 -132 225
2336 225 -111 108 -143 100 214 260 372 217 74 83 -29 125 56 145 188 21 99 206 87 50 124 196 96
2359 96 47 4 96 129 -111 -57 87 -18 -72 71 117 -2 -112 4 -43 -203 276 -93 -199 -280 51 92 -216 -195
2383 -195 -6 -119 -173 91 -138 208 -173 -460 105 -72 -114 61 -60 94 -128 -363 280 -89 -398 -31 -146
2404 -146 100 30 -94 85 -189 -122 190 100 178 353 -4 40 165 -121 200 395 31 359 -16 84 351 -146
2426 -146 207 35 134 120 104 -23 -46 -81 149 77 -24 54 142 -30 235 -357 -67 157 -331 114 -50 117 0
2449 0 182 -61 -167 -314 87 -321 -56 -80 -280 -29 92 -45 -239 85 -257 115 -157 -78 60 -185 -201 -156
2471 -156 -175 509 6 -199 -115 45 45 146 -62 -82 -207 -181 267 -308 172 -162 -225 137 294 32 -41 -50 44 213
2495 213 -187 151 195 211 160 36 49 140 260 -7 338 -46 235 78 -76 69 -66 0 105 -162 318 -22
2517 -22 -64 407 120 34 243 -205 113 61 -416 -37 -21 -149 -91 -138 155 160 -184 -109 -34 148 -32 -297 -29 112
2541 112 -436 -92 -39 -322 66 -221 -157 252 -183 -1 74 174 215 -153 -206 230 -154 -32 -226 -80 98 16
2563 16 31 284 4 187 135 -186 179 95 -23 75 217 94 -26 20 -54 4 -164 148 270 74 121 -94 -114
2586 -114 110 -3 123 44 -157 174 -68 -124 179 -109 -175 132 -209 -43 -419 -238 16 -148 197 -93 -23
2607 -23 98 -173 -114 98 50 -214 150 72 -54 -126 -118 -53 -312 -91 73 -157 8 10 -149 -61 4 140 23 36
2631 36 -148 140 51 -107 -8 -136 198 170 -112 -42 82 37 9 33 36 155 -58 269 -47 -29 204 20 136 203
2655 203 100 -278 -13 63 93 -37 20 -353 232 21 4 -93 -110 -219 -65 19 141 97 -91 -74 65 -41 78
2678 78 -56 -100 76 53 -110 -137 254 -105 -292 124 -106 3 -138 -126 89 -136 -25 50 190 160 233 -81 29
2701 29 -39 -121 -124 217 -42 60 302 61 -42 -157 11 23 -73 301 70 9 0 -190 -31 199 -7 273 237 -54
2725 -54 -54 -22 142 218 180 -93 -101 -66 113 116 184 99 157 190 267 262 -116 -188 261 -15 119 -3 -62 136 208 -57 -4
2752 -4 -6 -70 233 -12 68 0 -73 104 -217 3 -312 -184 78 99 -101 37 137 -16 -59 -70 -3 -141 27 75
2776 75 -205 -1 -71 -137 106 -120 23 170 50 47 82 -308 126 36 -106 134 26 -15 85 42 -135 168 36
2799 36 211 -157 173 104 191 158 269 61 2 149 121 -11 51 -91 -9 -47 151 -30 248 42 -146 -36 76
2822 76 54 10 -1 -216 174 -261 -41 -42 -231 -21 52 -289 -32 -40 -101 -97 10 -332 -64 -304 -91 -103 -111 -139 120
2847 120 -332 -17 35 -54 85 -206 -176 125 104 -55 -112 -145 108 51 -209 -19 -31 206 6 -200 139 281 168
2870 168 -97 74 31 -57 23 79 311 -15 91 -37 10 -33 89 80 -108 219 96 111 297 86 -33 -101 169
2893 169 6 -42 -136 84 -15 -4 81 86 -135 -111 -89 -91 118 66 -42 -92 -128 67 136 8 -52 99 -78 -166 -136 186
2919 186 -139 -305 200 -323 -156 -298 16 -184 -37 -48 -38 -70 196 -6 -135 126 -155 -64 -151 89 92 -10
2941 -10 -156 119 -79 77 136 -180 358 130 116 -6 103 -82 160 153 154 150 77 183 46 -35 87 204 121 6
2965 6 16 -18 56 -16 100 -51 -230 12 78 -41 -99 -4 41 101 -315 -57 -82 -144 51 -379 -141 235 -384 -114
2989 -114 -38 -39 -30 -19 -313 -124 129 1 -51 70 44 154 -198 23 -17 -7 -36 -197 158 34 107 -142 129 200
3013 200 205 -158 53 12 119 4 21 337 59 23 88 -137 39 192 -191 236 54 72 35 100 38 -12 12 -48
3037 -48 71 12 103 96 -43 132 212 -92 -53 -18 36 -102 -27 108 232 -323 24 -78 271 10 58 61 181 -243
3061 -243 152 22 -344 -71 -213 6 -20 295 -46 34 -35 -65 -223 -224 -75 -5 186 -67 247 168 -101 -202 116
3084 116 -138 -61 116 -28 20 113 123 269 51 -55 188 88 159 -57 -92 130 53 -2 -134 -112 2 100 12 9
3108 9 137 48 41 26 287 188 -31 69 -52 -68 -25 141 -114 188 -63 83 80 -84 233 -41 -274 -28 -30 -219
3132 -219 -34 69 -131 -224 -154 25 -230 -25 -40 -62 95 -186 -327 39 -19 -53 243 -201 122 183 -352 -132
3154 -132 -4 -11 69 30 -52 -84 237 -53 -71 -134 -116 -82 2 172 135 8 159 207 28 23 98 226 -28 -59 135 -82
3180 -82 291 -26 133 110 76 -195 -7 -61 138 79 43 -347 -145 221 4 125 -58 60 54 -110 85 92 107 283
3204 283 -3 32 198 -41 -164 17 -8 -368 -2 29 -144 -136 -102 -321 -137 -58 -157 -10 -118 -84 71 -56 -131
3227 -131 19 37 23 124 -5 53 -28 206 -107 -228 -2 -125 247 92 -156 104 305 -103 32 114 30 -14
3249 -14 57 -58 63 0 227 50 -25 96 0 -135 215 141 -51 77 309 213 90 -81 37 12 58 17 139
3272 139 -8 108 -199 -194 214 -53 -80 -176 266 -100 10 -74 -427 -25 -8 -68 -8 42 266 81 -153 -261 186
3295 186 -161 72 -113 -296 33 -134 -205 -253 48 -58 -33 -119 4 31 -19 -93 189 153 266 -83 -35 81 55
3318 55 53 -105 -80 291 -160 -43 -58 171 175 180 276 -56 -148 190 68 42 -64 9 149 149 -76 -102 9 -43 -1 177
3344 177 169 145 -36 28 -78 -280 -176 -151 -62 -60 -142 -131 -115 -39 29 -55 -39 155 53 -53 18 38 4 38 -184 61
3370 61 4 -217 23 -95 98 -20 -28 25 -12 -140 -73 -60 -7 176 50 91 -10 145 25 126 171 154 -122 -63
3394 -63 19 61 214 133 134 152 236 62 43 82 183 201 125 186 255 153 145 130 130 60 -210 193 98 13 -146 -52 71 124
3422 124 57 129 147 46 167 183 -70 -109 -210 -168 9 -192 261 -266 -58 -64 111 88 29 -191 -340 -97 -171 31
3446 31 -1 -52 -169 -237 141 18 -232 25 137 36 -122 -217 112 -113 83 -95 -33 -157 139 -73 10 -7 -137
3469 -137 -147 87 -193 67 192 -45 -56 -164 95 242 76 121 164 8 128 -161 64 31 -163 70 0 106
3491 106 -170 135 170 19 0 -155 56 -449 104 -179 137 15 30 -204 142 35 -82 92 147 -69 -13 44
3513 44 68 25 -239 -190 -62 -52 -251 63 -78 -372 101 -88 -136 -255 4 69 -127 27 133 190 -324 12 62
3536 62 55 -113 88 -131 76 -85 41 85 -263 143 123 -39 171 32 22 209 10 -99 99 -121 -108 -29 -154
3559 -154 317 87 -143 -152 -75 114 154 239 58 3 107 26 -85 91 -4 -19 70 -179 -67 12 136 5 135 -35
3583 -35 -122 99 -96 25 10 300 -125 -281 133 -237 92 107 -101 -210 139 223 -175 -223 -54 129 10 -113
3605 -113 31 -82 172 -5 63 4 172 54 -55 -29 73 66 -131 -62 140 6 -136 -143 -33 35 -15 49 43 -228
3629 -228 227 -51 131 -93 132 214 89 60 -13 50 52 200 5 -144 -292 20 55 149 -60 -228 -130 -61 15 -291
3653 -291 86 -110 -44 42 -210 -1 206 -86 147 15 -303 -342 93 -55 -125 -103 58 22 -29 -198 -209 74 -92
3676 -92 161 81 27 40 33 -40 84 141 -104 -92 0 -160 39 -248 10 98 79 70 -97 -44 168 -18 8 -78 130 -164
3702 -164 40 -65 80 268 152 9 -58 55 -16 -71 131 316 20 -220 20 -30 -257 81 -28 148 182 33
3724 33 99 -117 133 112 -105 66 -138 37 -52 29 -25 -156 -38 48 0 -191 129 -117 -183 -269 -116 -105 -27 -137
3748 -137 199 -108 -190 -204 32 65 -46 117 -43 -42 72 77 102 50 -130 292 -17 -215 143 52 -124 110 318
3771 318 -57 137 238 36 176 -4 60 43 -214 115 54 29 100 13 313 -29 230 178 55 15 162 176 31
3794 31 83 -72 -178 74 -69 -99 203 71 -42 58 -49 122 -101 113 -187 -78 -195 -63 -96 121 96 192
3816 192 -70 53 -186 -227 313 -270 -17 28 209 2 175 -46 -85 -45 -49 112 -33 -82 213 8 -14 221 34
3839 34 -135 -299 -270 -132 -41 163 247 -53 3 111 93 85 -53 14 -12 -30 -17 56 152 306 237 76 -41 51 81 -144
3865 -144 266 28 -30 -131 -65 150 142 -141 -74 -116 -48 -50 -91 -240 119 -53 -226 -263 81 -79 -157 -62 -208 -113 -220
3890 -220 -68 198 -193 14 -100 -108 -16 -96 -146 -344 -129 109 -118 -144 -74 119 -36 -132 -53 -69 -34 -183 -68 -60
3914 -60 49 155 125 152 55 -46 -125 219 5 -32 108 -162 302 66 155 -9 -13 83 45 -126 -158 97 -123 256
3938 256 192 -203 155 46 122 139 188 261 -65 242 39 21 165 92 -89 -89 -103 -21 35 -75 1 -98 54 110 -33
3963 -33 -116 -2 -247 -188 -80 -51 -55 -86 -107 163 -10 184 69 45 -124 13 -152 4 -173 6 145 97 64 -40
3987 -40 62 18 -67 40 203 -280 208 24 -33 -55 152 50 -99 46 -152 -20 159 78 -105 -283 55 -79
4009 -79 74 265 175 138 52 -22 57 -36 94 -50 -40 24 -58 74 39 98 113 69 -76 -152 285 155 -215 -139 -5
4034 -5 -53 25 -44 -159 96 229 -30 -193 38 -439 -21 164 -157 66 -142 -111 34 -305 -174 8 102 19 83
4057 83 -2 121 -38 -230 34 52 -58 88 -82 46 70 -88 -135 288 -201 80 88 -52 289 -107 164 35
4079 35 14 39 178 62 137 34 -56 82 62 75 -45 34 -137 -147 195 -30 -123 73 -162 -138 61 54 59 -91 74
4104 74 56 93 17 168 -1 146 28 -343 129 -65 -73 -62 -170 -57 -79 -101 -154 87 -52 262 -53 -71 -3 -286
4128 -286 -186 19 -49 -11 174 -144 22 66 -86 -105 -53 228 22 -273 168 -29 -224 189 123 38 35 142 -29
4151 -29 150 216 67 261 89 -19 -43 56 137 30 109 150 4 151 134 245 73 19 -178 41 73 121 -150 307
4175 307 118 87 120 51 -21 -110 -45 6 -70 -1 0 -154 -63 -158 78 67 -94 -102 66 -82 88 36 -149 -321 51 72
4201 72 51 25 -54 -70 30 -90 -92 -102 9 -32 -189 -150 171 -241 155 -22 -137 33 -38 43 -87 84 14 -105
4225 -105 47 -127 13 -217 52 97 88 24 -80 0 -25 132 -123 -204 -68 12 143 -215 54 88 119 166 -178 -6
4249 -6 45 34 17 -12 -26 -107 24 45 58 -53 90 160 85 98 108 157 25 -17 137 -143 -302 -32 -1 -12 5 -163
4275 -163 -139 -70 79 -103 32 297 -241 81 52 -110 190 -214 -123 -120 -252 49 29 -58 107 80 135 -143 14
4298 14 64 85 25 -57 85 13 -23 -118 -60 17 143 -72 -54 91 6 -133 110 72 23 219 69 12 3 262 122 27
4324 27 -289 245 -3 119 -16 290 226 98 -27 -11 6 -6 92 -4 142 129 -284 -123 -93 164 107 -240 -117
4347 -117 -55 175 -187 40 146 116 94 -89 11 281 -7 37 110 20 -73 284 39 149 -32 -192 163 -44
4369 -44 163 -35 65 273 -1 -154 -6 68 -126 127 -98 116 129 21 50 -50 -104 -5 -353 104 172 154 -15
4392 -15 -29 -111 74 23 154 94 -115 -113 -39 74 39 178 139 35 10 143 26 -196 260 -180 225 8 121 -265
4416 -265 -124 66 82 183 12 15 92 -60 128 -18 -59 -1 -11 -46 -185 46 -133 -303 -110 -452 -200 105 -48
4439 -48 100 106 -225 89 98 29 62 -39 -21 130 -33 -98 -89 -206 140 -69 -65 129 230 24 58 -93 115 39 -19
4464 -19 -30 105 -24 -7 337 111 215 219 180 142 64 -132 -98 347 14 -233 173 1 113 248 48 -42 202
4487 202 -111 128 -19 8 -87 -44 -226 -170 37 -1 70 -114 -80 -68 -94 83 72 -211 85 97 -175 -57 49 53
4511 53 -95 -37 -130 -170 96 185 94 37 16 -11 144 -49 56 81 73 -99 -134 236 18 2 38 117 -63 61 -76
4536 -76 -32 112 166 -72 -39 223 -221 201 -20 125 -111 114 19 88 34 -100 -187 -101 100 28 -22 8 -12 -51 31
4561 31 86 150 5 165 -104 -25 140 -44 -71 -78 -65 -20 6 -39 51 -129 102 -216 -154 -91 136 -16 -94 -62 64
4586 64 39 -62 -164 -10 38 82 -19 -105 276 -169 -244 87 -131 24 123 157 -205 -125 -163 68 -11 153 218 -19
4610 -19 298 131 126 130 9 -342 -51 -20 46 109 4 105 419 232 -55 118 10 -73 7 -316 100 77 1 -174
4634 -174 0 -151 120 142 126 -49 175 95 46 -137 -23 140 -235 24 -99 -130 -175 117 24 -38 -145 -18 -50
4657 -50 37 75 48 -129 -189 -170 -95 14 -264 19 282 -41 -21 40 27 -51 -92 -83 3 -177 126 -128 274 -29 71
4682 71 104 125 -128 150 38 145 -92 -95 13 218 71 -76 182 45 132 110 55 260 54 -70 103 134 8
4705 8 0 8 175 171 42 -61 53 -139 -97 131 -75 8 85 11 -233 195 273 47 -112 168 107 85 103 3 -81 -12
4731 -12 111 120 127 133 -11 -140 182 -91 -229 15 -65 171 -148 -224 60 -258 13 -75 -146 -129 64 -84 -124 -4
4755 -4 64 -27 6 90 -130 178 161 -127 44 211 129 149 -119 -1 86 84 83 -168 -77 52 -158 -86 -39 37 -38 -6 348
4782 348 10 -54 -139 -41 -386 179 317 26 -177 39 126 -41 18 50 127 -125 64 146 80 45 224 -149 -76 -30
4806 -30 176 -8 -107 26 235 -69 11 -6 159 4 -47 -69 42 -161 63 -43 6 93 143 173 -102 41 85 -4
4830 -4 -57 -89 25 -34 122 -69 -201 64 120 210 -2 33 86 186 -68 9 -182 -165 224 -194 98 22 156 91
4854 91 -42 -5 -28 -46 -57 20 -79 -107 69 -27 90 235 -150 285 -124 75 153 9 8 -21 30 -86 -7 -192 -111
4879 -111 29 -176 -172 -95 26 -55 8 -85 60 -134 141 3 -119 103 -172 40 28 -85 -49 70 150 210 134 -58
4903 -58 35 52 -43 -175 -114 124 -70 154 -19 90 56 -26 105 -217 -320 -59 -113 208 143 -188 -81 15 146
4926 146 -16 58 76 55 97 -200 20 -300 -194 -92 -195 28 -19 -255 -91 -238 17 115 53 -56 12 0 40
4949 40 -341 72 181 -47 -101 25 139 -77 -125 71 46 -239 64 16 -48 -101 122 -48 -10 205 -117 -220 -27
4972 -27 -108 -61 106 -14 88 58 -103 -65 -53 129 59 -114 -22 47 -37 120 30 71 25 158 62 134 -2 14 -44 -34
4998 -34 -44 -36 -27 -39 14 -81 -23 14 -67 -115 -172 109 107 -137 -75 142 31 59 31 14 5 -71 -136 -300 102 -64 -145 -74 -14
5027 -14 57 1 -70 25 -134 -99 229 74 31 170 65 9 -22 -334 6 -132 -45 -7 -257 34 192 -163 108 -150
5051 -150 -92 21 47 -93 -58 -56 29 109 -132 -71 70 -22 -228 199 2 -34 55 114 -62 -84 105 -189 12 29 -104
5076 -104 -103 -11 12 -47 92 37 55 -87 -196 -189 -304 115 249 -98 -42 -122 40 94 -68 85 137 40 -9 -123 105
5101 105 -39 10 -38 -160 -170 0 -77 -193 -125 7 -40 -106 15 -4 95 -6 95 -120 249 131 -146 165 -119
5124 -119 -1 11 -45 61 47 -203 233 -84 57 -36 80 -2 47 -92 97 72 182 -78 -8 -168 29 35 57 -85
5148 -85 86 -52 -43 -2 -179 -170 95 -117 -68 73 -93 -99 200 -86 -159 117 117 -68 17 137 127 -187 -186 228 -41
5173 -41 -69 246 -217 72 -343 -153 -56 80 -175 -240 3 -35 25 37 48 8 104 -81 -158 -5 -90 120 96 -98
5197 -98 -218 22 188 -86 -348 -169 -68 -121 9 149 -12 -108 283 18 34 -147 69 53 -33 24 -108 41
5219 41 -5 134 -3 127 -78 -133 191 22 -4 17 -51 -137 8 -19 -99 -185 -148 -58 191 -201 85 199 41 59
5243 59 82 -107 -52 -101 146 99 76 -204 -97 -102 36 -249 -115 -68 96 -138 -42 -101 168 -58 82 -72 -154 38
5267 38 -21 50 109 152 -245 37 4 -99 55 -82 5 262 150 -175 -116 149 25 -125 55 -49 -127 44 130
5290 130 70 96 -38 145 -112 115 -58 44 -24 211 -19 -63 75 152 196 -170 -130 49 111 197 93 153 147 65
5314 65 -267 -107 95 38 -15 53 -97 228 58 52 214 -325 -138 120 119 -30 132 -162 304 -19 11 152 12
5337 12 -45 -135 -80 -86 -20 -118 121 -50 -300 -200 -87 -8 -131 236 240 -37 75 -68 157 152 -126 -233 116 29 -254
5362 -254 91 259 74 -230 103 -47 -320 -153 123 -137 -84 148 -12 -38 -139 -158 42 -156 43 -131 179
5383 179 177 63 -82 239 92 -111 91 -30 75 -245 -39 232 -124 -193 3 -118 -14 -109 271 -99 119
5404 119 -67 159 351 -116 174 3 190 -110 -95 -275 -168 -126 -44 -79 92 -38 -71 -18 162 -171 11 0
5426 0 -123 66 116 -80 -21 144 123 186 -106 -32 -38 194 66 -6 122 20 159 -102 -51 75 4 2 -23 -41 243
5451 243 -108 174 41 92 25 -119 21 -176 262 -49 -47 180 -38 45 -169 40 23 190 85 -227 41 -108
5473 -108 -127 -130 -185 -30 56 -11 -58 210 -164 13 -46 -160 -6 180 -13 209 75 -10 307 -267 191 207 254 -66
5497 -66 -185 90 55 41 -61 -7 112 131 -152 -191 -37 -59 -119 17 -59 -42 -246 -29 27 -13 -173 -146 -55 -146 40
5522 40 2 -136 197 48 171 93 282 -65 -61 -45 5 160 174 -14 8 53 75 -161 14 15 -100 -39 -79 19 56 -2
5548 -2 170 -98 -213 130 2 -32 57 -166 -122 -93 -217 -60 -71 -192 8 -147 5 118 148 -86 48 -29 -152
5571 -152 106 93 -114 122 -181 245 2 -195 40 -153 105 -245 0 200 16 -56 72 193 -12 47 -36
5592 -36 132 -38 -69 236 -66 -153 71 118 152 219 -89 47 136 -302 37 58 98 -122 55 108 90 226 -62 -69
5616 -69 -35 91 -60 -44 -217 -103 255 -138 -336 131 -84 -45 -64 -112 57 -288 261 115 159 59 77 -38 -277
5639 -277 136 -194 -218 -41 133 -44 79 109 4 0 -220 48 -4 -106 139 285 -48 -197 -14 165 -44 90
5661 90 -15 -58 65 54 127 62 -85 48 -19 185 111 92 -4 82 143 2 -145 203 19 -272 -110 -6 -289 76
5685 76 6 0 21 61 -33 -84 226 152 130 -79 -216 -50 57 -151 57 65 82 -82 88 79 -66 -276 -14 32 -78
5710 -78 4 47 -81 64 156 -8 234 25 -119 -12 16 61 -145 231 -107 17 -21 150 0 -98 -33 -33 152 -77
5734 -77 -8 -104 -242 -94 18 -218 211 -28 -10 -207 164 -6 209 200 -68 -96 15 30 8 -12 1 -147 -46 -102
5758 -102 83 39 -20 56 -69 -152 -343 -67 -134 136 -90 115 -234 -116 -278 80 24 92 3 24 -137 51 295
5781 295 -58 -36 42 77 -12 143 168 -11 -120 118 -38 46 96 21 177 -105 -50 -45 8 -185 -14 23 -239 -147 -213
5806 -213 -11 119 -248 -88 269 -87 -60 -153 139 105 6 -57 -176 40 -5 106 178 6 77 -101 -193 178 71
5829 71 247 -96 34 -91 48 82 -80 324 -114 5 20 -51 -148 153 -140 14 -9 80 64 58 -66 130 155 -45
5853 -45 -221 91 -51 -204 -23 78 113 -170 -138 13 -122 -101 -72 -35 -8 -120 77 -214 104 -87 40 -85
5875 -85 -114 91 -42 -44 -187 -12 -60 -142 -190 224 99 53 -209 -103 174 217 -77 -104 -112 -59 70 85 226 -84 -288
5900 -288 97 91 237 -79 -118 107 32 -136 -32 -41 -33 -21 -208 -36 -85 -33 -82 70 -25 -214 11 -20 114 -22 58
5925 58 22 -89 -128 -84 172 234 -38 107 -175 -267 -75 -84 -101 -136 -5 2 -206 -102 100 -103 100 53 -130 109
5949 109 -128 -4 -103 -64 -204 97 -64 -79 15 51 -157 216 -15 -79 179 115 48 -31 -110 -182 -1 69 199 -22
5973 -22 -29 112 -38 57 11 -84 154 -73 74 71 236 111 -46 -76 57 -89 197 -90 -73 101 150 21 54 -103
5997 -103 126 -24 132 77 175 71 -96 -213 -127 28 -120 -38 69 -128 90 69 11 116 -11 8 111 -93
6019 -93 -1 -11 67 -171 116 5 -2 -122 12 197 65 -28 -16 -54 56 48 -164 138 179 -136 -58 -5 -107 117 -132
6044 -132 74 9 25 2 338 201 -10 89 32 -14 -62 -22 94 -58 116 -35 31 61 -4 -103 -57 -70 140 -23 78
6069 78 -17 19 -13 178 -57 -37 66 -362 -159 -2 -16 489 -97 -148 -46 -105 112 188 -345 -222 28 33 -87 187
6093 187 -6 -44 -87 -91 -34 -126 -120 193 59 -18 -189 -28 3 -106 67 164 100 97 -219 -127 120 -67 -184 -51 130
6118 130 -57 -3 -229 -175 6 71 86 57 -57 -36 223 -13 -188 -55 -23 4 -87 -32 -49 -63 33 103 -107 123 -56
6143 -56 194 -106 -31 225 -157 -48 -43 -17 141 178 127 -89 -130 -72 212 124 272 -120 104 243 32 116 -14 74
6167 74 -162 5 18 131 19 96 -66 131 204 -264 -29 -47 -25 -165 -114 -135 -16 10 -4 -11 10 138 287 -9
6191 -9 330 96 132 -94 -29 96 6 21 48 -199 -91 -25 -15 -39 26 86 -107 95 -84 80 223 -16 -7 212 58
6216 58 22 39 9 56 120 220 -44 127 -6 -123 -30 -73 9 53 135 140 -3 -81 88 -15 -128 182 172 125 109 58
6242 58 45 3 216 125 133 60 -143 60 -157 -77 -49 106 43 -127 -259 -66 106 -100 61 44 84 -151 -48 -68
6266 -68 -228 -28 -63 -143 -20 198 264 30 -219 237 152 -23 -30 56 80 -282 -144 0 -75 146 79 52 -97 -105 162
6291 162 -60 25 -129 66 24 -83 2 -71 59 -95 75 61 53 -6 -33 -218 90 225 135 -227 -17 221 -191
6314 -191 111 -97 -180 166 27 -67 -73 28 82 3 -11 32 -236 83 62 229 -136 134 -261 103 236 -116 10
6337 10 -64 126 43 -77 93 -20 -2 80 -41 117 -163 -22 -62 -32 -75 -140 89 79 -84 258 21 93 30 -4
6361 -4 -64 39 26 66 6 55 -36 -88 -76 32 83 -104 122 64 -101 114 -54 -77 121 296 -47 -3 -83 -222 99
6386 99 230 50 53 -37 -148 -130 -17 43 72 -12 78 13 48 193 37 -50 -208 -110 -3 -169 -78 268 -39 -88 -188
6411 -188 -123 6 128 -65 182 -233 61 62 -27 207 49 -43 103 17 -167 95 -20 19 -66 -62 -8 49 -13 106
6435 106 38 217 32 -173 221 -216 212 -54 218 -4 96 -186 21 -117 -47 16 33 -59 -65 147 27 -145
6457 -145 -136 -123 -116 31 -9 -67 -136 107 -64 -28 150 -127 -4 56 -67 -55 -38 -44 4 -24 164 -99 -103 153 118 -101
6483 -101 21 108 170 121 53 -73 -101 -84 -7 10 234 87 -124 171 30 56 11 46 -89 164 -68 -133 234 69
6507 69 123 240 -55 -219 1 -40 -143 -53 62 -196 88 74 -173 126 42 -108 -27 55 -151 16 97 -26 -168
6530 -168 5 13 -235 -43 -2 71 -115 -138 27 -34 -163 -137 48 73 -34 -15 -208 136 108 -204 196 -22 -205
6553 -205 -65 -19 -83 27 -325 7 38 21 -24 -39 25 -6 119 -183 259 -146 90 -63 -120 -275 41 37 -15 -73
6577 -73 73 -81 -47 -53 31 99 137 -76 79 36 296 -130 -91 45 87 29 -257 -72 107 71 -143 54 21 -269
6601 -269 183 199 -295 193 -391 -4 195 71 -13 123 16 24 -44 -46 -25 16 9 -69 -77 -126 256 -14 127 113 -64
6626 -64 -131 -101 -44 -50 17 149 -187 165 -141 -24 185 33 161 -41 -5 -234 100 130 151 -15 33 -119 29 205
6650 205 108 143 -83 -67 33 243 -151 48 -129 -105 -58 -228 -58 -34 203 -131 -102 -107 292 -197 179 -101 -17
6673 -17 -76 -29 -47 181 57 159 -50 41 -64 42 -98 -57 140 29 30 -95 -146 -233 151 1 -275 -230 -42 -76
6697 -76 -133 43 57 86 -184 48 -74 -168 -36 -98 -144 -8 11 190 116 46 -80 -83 318 2 -17 52 -42 -79 -27 -90
6723 -90 365 -22 -113 -84 -194 -156 282 -98 -98 -171 23 65 180 -68 -86 -11 -9 -70 32 -117 20 -53 2 -113 70
6748 70 117 -157 -139 -57 348 145 111 -25 134 -21 -254 -210 183 111 -90 -26 -83 -102 -272 37 -8 9 169 206
6772 206 -88 116 -134 -107 191 135 60 31 89 6 140 103 142 -261 189 -102 -50 7 28 22 279 -39 -54 -44 -5
6797 -5 135 209 134 -18 -13 -100 -48 58 -134 -118 252 97 272 -37 -114 175 22 74 187 50 -39 91 -127 10
6821 10 -99 1 -9 177 55 -172 190 -97 -85 -174 -167 -30 -88 87 235 -87 -145 -255 214 -34 -48 301 -73
6844 -73 -60 -2 -163 -107 -83 -243 393 -114 -323 -3 -32 -249 -52 -106 -220 85 267 78 99 -115 -43 -195 61
6867 61 -101 -91 -59 -83 -107 -118 -42 77 -153 -37 68 -143 1 -29 -73 157 -2 51 -274 152 86 152 -252 -40
6891 -40 31 30 114 96 -93 -52 -250 -147 -105 -137 19 -85 103 -49 114 -127 -77 -171 -113 41 -101 -339 -30 -330
6915 -330 -32 -166 163 61 49 -147 133 -220 72 -26 197 -10 221 -21 53 98 -64 -70 -245 -126 229 113
6937 113 23 -48 50 -198 -35 12 -39 -144 -32 2 155 -68 -190 -24 197 151 0 34 84 -82 51 -28 -93 116
6961 116 -22 64 -22 -127 -51 -16 -19 103 -69 93 114 -6 53 -137 21 -205 6 6 -140 -70 28 -89 115 -163
6985 -163 59 185 -159 137 98 140 -66 -23 -167 -45 -150 -144 13 -19 56 58 -145 84 69 179 -39 -54 12 10 147
7010 147 -129 -235 -102 97 -105 -52 -159 63 -82 -62 16 -244 191 -32 93 208 80 304 23 -45 6 -208
7032 -208 -59 -133 -174 130 -111 -170 -43 -18 98 0 -30 38 -301 165 87 -124 -19 -2 -303 133 161 -125 -57 -9
7056 -9 -123 -84 -27 86 -21 -118 -5 -135 -66 -217 -352 -277 80 177 -156 36 -114 -174 -38 191 52 -58 -199
7079 -199 -222 90 -118 -29 -18 120 -18 90 -379 180 2 -129 23 23 -375 -20 4 -84 11 -52 -154 202 -241
7102 -241 -45 30 129 4 -32 38 159 -14 -214 133 77 49 146 -12 37 -203 28 114 -181 125 74 122 -72 10
7126 10 153 6 131 -85 -86 114 -28 -29 114 -15 -112 99 -18 5 -132 41 -181 -99 54 33 -344 -22 159
7149 159 -34 -67 -153 1 -126 -2 -217 110 -93 96 -69 -12 -184 7 -29 108 -8 -7 40 70 128 -110 -122
7172 -122 -128 -180 307 275 245 75 195 198 277 179 194 18 -1 65 -65 -23 -105 69 -51 74 78 192 329 -4 213
7197 213 -81 24 293 -26 -104 -65 19 -41 -193 -49 83 -138 238 -9 -28 21 14 112 -183 -164 2 -167 36
7220 36 91 194 -117 171 -91 -83 37 -192 12 111 9 -33 123 -196 -112 -29 -42 76 264 31 -13 -24 -115 185
7244 185 -125 19 186 54 34 -14 59 108 -323 91 -146 75 166 -183 -140 -53 45 141 -40 -57 -28 -12 10 -124
7268 -124 -23 124 156 15 -145 -52 -212 -53 11 -65 37 -210 62 -70 -15 47 -110 -189 21 -178 15 -12 -294
7291 -294 48 -223 61 144 62 -151 -69 67 105 -135 98 66 -27 -31 -139 -85 105 -5 -61 -174 -45 91 69 -191
7315 -191 43 -35 -51 -173 119 -77 -24 -30 60 186 -115 -133 -25 125 79 -64 -21 -111 140 68 19 24 -20 123 -8
7340 -8 -92 3 20 -81 64 153 261 -164 -79 -12 -85 -46 -188 -123 148 -26 13 182 -146 -220 124 209 89 122 -118
7365 -118 -86 175 326 -119 -32 -33 28 -69 -121 120 -103 4 74 -140 78 64 -87 -114 230 84 38 34 186 -61
7389 -61 -27 -112 26 -43 180 54 10 73 -40 -146 -67 -393 -122 35 72 -94 -1 -68 -106 -124 -142 -141 -163 108 -32
7414 -32 96 -62 93 -73 -204 55 -11 -136 200 -49 -62 55 35 -56 -13 29 -140 25 -72 243 257 265 19 77
7438 77 134 -54 -58 -67 82 -142 -199 122 110 110 48 42 -153 -28 -412 -227 -71 12 30 -137 50 -38 13 -146 280 -50
7464 -50 -136 34 -196 55 49 45 -23 -131 192 186 -144 178 41 222 285 236 71 -176 -285 64 -120 -276 101 -92
7488 -92 -201 -37 143 122 21 174 138 -12 -36 16 -61 -170 25 23 2 -11 129 16 242 187 -147 6 35 56
7512 56 -312 -299 -103 -8 120 37 -23 -223 40 140 -133 -29 78 -106 132 115 -348 -25 -71 120 87 175 -35
7535 -35 -122 186 4 -42 -12 -67 -14 -150 -115 85 30 -106 61 -121 173 99 -6 160 185 28 -40 159 9 -27
7559 -27 72 -6 68 -141 -69 5 -23 12 -86 194 29 -157 357 -37 -140 -79 -30 98 32 292 -164 211 -193 -76
7583 -76 191 130 198 50 139 -54 134 -70 179 146 67 -41 143 91 131 -111 -20 -22 -42 -71 122 -130 219 -165
7607 -165 104 102 31 -300 146 -9 -47 73 -190 -69 135 72 -12 -175 -114 -87 -16 -42 113 -113 22 -25 118 -53
7631 -53 56 -299 -151 7 -72 -15 -112 -251 123 16 -28 -103 115 222 103 95 9 -26 124 -53 25 35 146 -190
7655 -190 -66 237 -11 -45 -205 -10 -90 95 106 126 -13 8 145 7 -163 -154 -26 -233 -20 -59 84 244 -140
7678 -140 125 -75 -134 -322 10 -78 -180 94 132 -54 -337 373 70 -103 29 243 -133 -385 -10 -274 -157
7699 -157 97 94 -15 -189 -29 -42 323 -74 -108 -74 -81 178 -20 4 74 87 -171 38 -65 41 -124 50 -22 106
7723 106 56 -103 -56 -22 276 48 106 -78 -79 -244 -61 -106 -156 110 -57 72 -36 -101 25 -99 155 170 -32
7746 -32 -167 46 -188 63 -40 -79 -25 -50 -47 49 -145 57 6 7 90 -2 81 109 -32 171 -137 -216 41 -247 55
7771 55 61 60 -154 -94 52 -195 31 109 90 -118 -46 87 -13 -65 -117 56 -21 -9 -2 202 -133 149 91 -63 -92 -116
7797 -116 7 45 153 -99 -45 -120 -99 2 -190 -34 -82 209 -45 -63 47 -146 -198 -128 19 -40 -244 -209 -59
7820 -59 -43 99 -46 -109 -74 38 -58 -132 7 6 25 -170 135 -205 -89 -98 157 116 -5 -36 -86 9 -209 140 137 -174
7846 -174 209 41 -103 -36 154 -22 -36 38 -53 80 7 -14 -114 -55 -42 105 49 -214 11 -97 -54 -42 -76 163
7870 163 -168 22 52 66 43 -118 -31 -70 17 26 -82 50 53 83 59 274 75 136 -39 34 56 206 61 -81 -21
7895 -21 -12 12 -263 -57 -74 -197 -87 -84 94 -39 47 -276 -43 36 62 50 3 -179 52 66 -52 71 43 -130 40
7920 40 -178 101 -38 196 -22 136 -155 -125 -4 6 47 113 40 -97 -222 51 62 37 4 27 300 -19 114
7943 114 87 91 -253 -131 -18 -81 -194 -149 -43 75 -69 -308 -93 110 -68 61 -22 -221 246 -105 -166 -86 204
7966 204 -175 184 -133 -28 88 40 -169 -270 80 9 97 76 -92 134 127 169 62 86 247 176 70 79 81 -130
7990 -130 -2 -54 155 96 38 -17 11 -110 -24 -156 56 -34 54 53 155 -208 63 11 -157 101 110 -84 31 102 -34
8015 -34 48 112 -212 -218 -52 168 180 -160 30 37 -232 -151 -106 28 -202 15 -99 -280 95 35 115 -31 -38 11 132
8040 132 -47 34 -132 -118 -184 96 -94 -69 -8 -69 -99 -54 -188 92 291 136 -347 22 -205 -14 213 -196 -168
8063 -168 118 9 -26 -199 85 -134 -301 -25 -214 35 69 199 47 78 270 47 -8 -31 78 52 -88 159
8085 159 -28 -188 -188 13 65 -325 99 45 -249 211 172 -51 76 134 -65 67 -261 -44 -170 32 37 -153 -113
8108 -113 -186 -11 95 64 -151 -41 -104 -140 13 -126 104 -291 -167 -229 228 -23 -120 386 -196 -74 119 -3
8130 -3 -80 53 -102 -8 -106 -9 43 21 36 -37 56 82 50 -127 15 -152 109 203 16 118 -156 -89 77 -45 132
8155 132 76 -154 144 -94 2 395 18 18 -218 33 132 -133 66 -20 187 -229 236 153 51 -238 -14 46 -4
8178 -4 292 -68 -69 -122 -79 -49 160 46 -112 21 -51 75 91
8191I1
$$ Imaginary data points
##PAGE= N=2
##DATA TABLE= (X++(I..I)), XYDATA
0 0 0 0 0 0 0 0 0 0 0 0 0 0 0 0 0 5 -8 8 -8 8 -8 16 -16 16 -24 24 -32 32 -40 48 -53 61 -69 79 -88 101 -112
37 -112 125 -141 157 -173 196 -214 238 -264 293 -322 356 -393 433 -476 525 -579 638 -704 779
56 779 -862 959 -1072 1200 -1354 1542 -1772 2070 -2462 3013 -3843 5262 -8357 33256 -41745
71 -41745 -20056 50675 -24267 19971 13151 -19263 21910 7965 -9479 13154 -11425 143
83 143 8084 -5842 1602 1610 -6759 -4066 -1640 -1650 -13865 832 2452 -11653 7074 -8522 -25372
98 -25372 16779 4953 -23446 -253 905 -4788 1457 -9668 -4656 1805 -6276 -1446 -1395 -10828
112 -10828 -666 6017 -7230 -4139 3509 -11971 -3763 14266 -5622 -10703 6622 1664 2065 5262
126 5262 -7911 -4324 10970 7680 -77 1850 4017 5247 933 -1735 9326 6288 -3771 9475
140 9475 6190 -6323 4588 1657 -1703 8968 -1882 -6288 6853 6202 -3804 -10582 -534 7471
154 7471 961 -812 -6380 -3793 6201 -3121 -4460 -3010 -4648 9598 -2905 -12063 6764 -5378
168 -5378 -6437 7925 -8768 -4973 2711 -7625 2113 -1098 -8914 -1522 -4593 1741 456 -12678
182 -12678 -461 3614 -4293 -2570 -4060 673 -431 -4402 3292 -3189 -896 8432 -5094 -3002
196 -3002 5573 -3451 3058 6875 -2376 136 1908 2542 3611 -1824 248 3585 2085 5103 3153
211 3153 -4404 -323 7192 1435 -1285 5791 2000 -873 5654 403 -2226 4014 2998 2484 2029 -374
227 -374 1302 562 2232 2665 -3126 -457 4035 1618 -1301 -2933 -699 473 253 316 -5909 -2069 6241
244 6241 -3738 -7354 797 -490 -1938 -1478 -3379 -2626 -1792 182 -160 -4252 -3668 -905 -1163 -404 427
261 427 -3600 -4107 4196 925 -6692 1263 911 -3489 4492 678 -4447 2218 1485 -491 -622 -1038 3995
278 3995 2542 -702 2058 -849 83 4905 1285 -432 2747 3404 790 1352 3755 -1611 286 7007
294 7007 949 -404 3314 323 1831 2205 -138 1250 858 3015 2603 -2754 -233 2462 -378 376
310 376 988 -1203 -2379 1443 2365 -3486 -1815 203 -2519 1481 -511 -5482 297 866 -2491 -1881
326 -1881 -3439 38 752 -3500 -1404 -1261 -1721 568 -625 -3841 -2357 1795 2 -2013 1248 -1505
342 -1505 -2988 2539 -510 -2222 890 -563 1395 1474 -1856 207 -139 1159 3757 -1305 -1382 4549
358 4549 2540 -650 795 1849 785 3205 3942 -935 848 3906 505 2055 2129 -438 2480 2231
374 2231 861 649 -979 1883 1638 -1507 949 334 -1572 1220 710 -2219 -2969 1250 1067 -3109 -487
391 -487 -664 -2965 1497 -504 -3402 -571 -1750 -96 -403 -3301 -230 -1727 -2364 875 -3357 -3306 802
408 802 -766 -1888 -2259 -1858 -1135 -1411 1021 -2843 -3917 3297 -170 -2751 670 -1866 179 1509
424 1509 -1667 1618 -159 -826 3481 -1601 -534 2878 -1604 1772 3096 -2053 311 2341 592
439 592 452 154 551 574 782 2363 -1352 -2047 2864 2081 -707 -836 519 2333 19 -847 1447 -27
457 -27 93 1983 -901 -162 2309 -1504 238 2472 -2196 -1274 788 -458 549 -1619 -1993 1120 -487
474 -487 -617 -1359 -3330 948 1064 -3305 -1646 -103 -194 -1798 -1450 759 -1951 -996 1557 -2727 95
491 95 1083 -2714 1023 918 -2135 -55 -1088 2119 1622 -4088 1020 1111 -991 1132 -1764 -739 3023
508 3023 491 306 -275 1362 3471 -1516 1485 3093 -1160 2978 1909 -378 4053 -486 1072 4780
524 4780 -328 1919 1036 -958 6008 -10 -3161 3821 497 591 818 -2341 1410 977 -1570 487
540 487 -1727 429 1197 -3334 360 652 -2562 141 -519 -382 -120 -3471 193 613 -2549 29 -2607
557 -2607 -1745 2960 -2916 -4220 1232 -409 -1202 -1258 -2198 578 -117 -1963 -438 -1579 -200 695 -2253
574 -2253 260 1408 -1562 -222 1634 1072 -849 -540 2292 1696 -459 1400 307 1267 3581 -885
590 -885 -706 3075 1073 899 66 -39 2719 -523 22 2310 -843 826 1405 -762 1504 386 -1481
607 -1481 653 1316 1192 -1579 -1272 2833 -424 -1445 438 -1709 1239 686 -2506 -5 -623 -362 428
624 428 -3696 117 920 -3332 323 -402 -2674 107 -1607 -1294 484 -2491 -1098 -698 -383 709 -3208
641 -3208 -1032 1960 -1396 -814 -484 -521 1369 -1075 -658 788 -1015 1543 445 -1742 1713 382
657 382 -1261 2366 543 -1012 914 583 1375 566 -483 939 1329 1110 1039 -430 730 2403 844
674 844 -549 794 1529 794 336 512 97 368 1173 508 -614 445 237 -549 538 486 -896 -602 281
693 281 2 -569 -1568 -49 350 -1017 -247 -1502 -1235 635 -455 -2120 -369 61 -1235 -805 -381 -1295
711 -1295 -923 306 -555 -1196 -655 -890 -533 69 -529 -697 -878 143 898 -1791 -446 1399 -661 -103
729 -103 107 -735 456 765 433 69 -72 1036 564 41 1138 567 466 1057 955 851 -10 550 1610
748 1610 499 794 654 -152 1833 1151 -771 447 1259 677 409 235 351 123 375 682 -462 -439 408
767 408 204 -96 -95 -361 -608 -269 689 -950 -1223 314 -331 -844 -382 -1196 -974 -50 -185 -1506 -874 221
787 221 -325 -1189 -701 -692 -676 -273 -215 -476 -972 -258 488 -794 -280 264 -945 375 772 -608 -129 571
807 571 612 398 13 185 916 796 1090 37 91 1454 1120 121 519 1312 658 520 1459 340 -178 1100
827 1100 1026 143 544 107 301 642 477 109 -608 650 587 -393 -199 -164 -75 152 -184 -656 -750 -177 347
848 347 -1030 -857 172 -1318 -621 202 -980 -1064 -26 -441 -293 -1108 -720 -578 -486 76 -802 -1208 359
867 359 -232 -773 -794 -179 87 -853 -248 -9 -755 480 477 -675 88 229 -108 447 428 -3 -56 337 919
888 919 282 -308 541 650 220 501 142 -289 502 719 95 -63 667 637 93 1001 397 -256 629 1126 -56
909 -56 -5 360 243 653 32 -102 243 -386 909 98 -849 592 -11 -906 495 -41 -1282 116 -49
928 -49 -561 -698 -505 202 -167 -866 -121 -1416 -301 291 -704 -843 -199 656 -172 -934 -764 165 -852 596
948 596 321 -1175 568 -848 -242 583 -405 75 -302 176 1061 -1137 -452 907 -304 349 845 -370
966 -370 1368 838 74 472 489 1451 394 79 1567 247 653 1492 -209 653 1172 -479 986 497
984 497 -322 701 -173 691 962 -1232 -85 563 -464 170 -336 -240 372 -179 -474 -843 -747 864 -800
1003 -800 -1094 421 -909 -401 100 -951 -204 -642 -1201 379 -630 -622 -69 -1365 447 54 -1926 -8
1021 -8 275 -915 76 -740 -574 545 -701 -148 22 -393 1144 -608 -122 1205 -420 468 949 105
1039 105 548 -74 382 1422 -10 73 606 -454 1639 674 -1048 1121 706 120 577 -655 1035 795
1057 795 -414 734 -211 33 1294 -476 197 819 -830 296 195 100 -183 -1075 436 462 -1047 471
1075 471 -271 -548 855 -1134 -877 58 -473 120 -935 -987 467 -788 -876 363 -1316 -314 -25 -780
1093 -780 182 -433 -746 258 -299 506 -522 -1057 969 -267 -811 227 -130 274 424 -526 375 182
1111 182 96 836 -501 286 1330 -222 518 671 -266 563 559 186 604 -25 101 549 183 851 252 -271
1131 -271 1142 483 -40 375 412 321 324 -111 157 -305 27 501 -700 -295 609 -435 -59 167 -775 -244
1151 -244 -103 -391 -474 -770 -94 74 -751 -152 -586 -736 677 -420 -1048 -328 -688 -306 -548 -277 -156 -567
1171 -567 -162 190 -632 -418 32 -414 262 -209 -391 165 38 447 -261 -236 669 272 -267 392 -261 314
1191 314 602 197 76 -30 474 639 143 740 115 210 754 544 118 186 274 636 338 -42 329 210 496
1212 496 454 -423 -85 490 93 -7 300 150 -177 208 217 58 -434 -124 28 -212 -223 -235 -578 -192 -194 -758
1234 -758 -916 41 -215 -557 -458 -86 -563 -446 -74 -665 -689 -46 -226 -551 -157 -122 -338 132 128 -156 -465 39
1256 39 434 -97 -278 306 -15 358 539 28 61 713 321 203 247 361 302 369 535 152 299 422 389 364
1278 364 371 288 313 476 638 243 -358 121 421 -33 -89 12 96 -29 -66 -148 -210 387 292 -410 -339 -98 -163 -73
1302 -73 -245 -441 -357 -218 -154 -414 -425 -62 -388 -280 49 -448 -501 -254 -92 -230 -664 -504 -70 -341 -348 -362 -303
1325 -303 -16 47 -371 -359 116 93 -119 -39 219 119 -47 467 -102 -120 423 1 -2 258 212 20 377 478 74
1348 74 -13 470 284 273 286 345 158 272 340 21 -43 404 154 267 119 239 -250 117 522 132 -406 225
1370 225 88 -108 160 -189 -86 2 273 -305 -244 -185 150 -462 -208 -216 -551 -175 -263 -450 -304 -414 -416 -259 -353
1393 -353 -82 -668 -623 384 -460 -562 -195 -60 7 -281 -444 -31 -194 63 59 -403 382 271 -306 285 429
1414 429 105 461 11 351 318 23 539 88 293 309 -314 214 775 -6 -15 63 388 670 -48 177 522 9
1436 9 277 -32 -308 730 52 -58 332 -192 -31 1 -135 538 -186 -461 319 -171 -249 -75 -452 200 235
1457 235 -274 -56 -201 40 41 -779 -110 -74 -667 -113 -589 -465 42 -575 -479 -126 -297 -16 -617 -132 457
1478 457 -537 -416 103 -287 154 -251 -576 465 31 -399 425 -337 634 263 -486 734 564 -205 240
1497 240 137 126 380 -204 592 162 96 720 -12 595 832 -385 264 720 -3 267 -280 198 527 51
1517 51 -87 417 -308 556 -139 -617 565 -234 -236 131 -55 79 -393 -365 378 -510 -413 -93 -620 254 52
1538 52 -1040 -129 -55 -148 -360 -543 96 293 -525 -77 -202 -402 220 -522 -206 351 -82 -99 -250 -54 228
1559 228 -375 -48 567 -155 34 62 -238 466 -25 -192 406 293 427 353 -141 635 34 -146 615 383 97
1580 97 442 -81 367 389 54 210 -75 -27 239 -460 175 582 -337 114 33 -62 166 -510 -116 76 -129 64
1602 64 -182 -255 338 -332 -399 118 -477 -152 -58 -535 121 -220 -250 22 -585 -183 -189 -442 72 -122 -462 -13
1624 -13 9 106 212 -476 257 -14 35 304 -539 -344 239 -30 -190 11 184 170 91 320 320 -175 372 287 -126
1647 -126 465 258 37 475 148 186 91 421 624 391 130 500 67 171 -44 -381 318 195 7 207 27
1668 27 233 1 -117 359 -97 -208 -23 152 -123 -186 -47 -178 75 -451 -162 -157 104 320 -310 -188 110
1689 110 -259 -165 119 -394 -93 -129 -94 -310 -316 80 -161 -118 -10 -120 -357 85 -69 -102 149 45 -186 180
1711 180 -1 149 -95 131 351 274 30 100 283 91 320 31 247 182 543 -19 30 287 112 -13 343
1732 343 23 398 161 335 -35 30 272 148 83 79 168 -96 -16 339 -49 -121 -99 192 -127 -50 -130 -290 88
1755 88 -107 -169 -257 245 -78 -109 -161 76 -262 60 35 -215 -214 -75 73 -136 -11 25 -160 -67 123 -142 -136 110
1779 110 -40 -15 -194 -43 -169 66 -166 -127 -132 150 -146 -86 172 419 -158 302 181 -85 86 26 133 128 347
1802 347 300 337 -79 483 288 316 688 603 114 -294 403 104 513 4 9 390 -260 163 -337 -99 -395 -194
1824 -194 -112 343 309 -666 186 -589 -1120 -585 -165 295 -372 156 -409 -475 -383 39 -128 -289 -197 233 -298 113
1846 113 -354 -93 -152 -38 -102 -98 -9 -68 -287 184 156 -137 19 118 -129 -89 -128 -105 210 -122 53 177 72 153
1870 153 -71 177 341 -113 60 14 230 263 241 96 111 117 418 -67 -5 393 129 73 223 -1 200 -16 27
1893 27 32 -8 152 -96 161 -58 -101 -271 -155 243 3 -229 -125 -59 -344 -334 -171 24 -199 -126 -129 -297 151
1916 151 -223 -232 -141 -218 -179 -311 -325 -67 -265 -348 79 -280 -95 -247 -66 267 -261 -216 -168 -46 -43 -78 -334 357
1940 357 57 69 9 -14 259 257 -285 112 157 68 252 -306 234 479 -283 339 216 15 141 -188 64 159 33
1963 33 158 -116 176 533 -182 -28 154 43 -70 193 23 494 36 -10 119 -9 5 -57 -333 111 434
1984 434 -413 31 82 -181 95 -356 -206 -80 -520 -111 -261 66 307 -495 -260 323 -316 -228 -352 72 215
2005 215 -379 7 193 -69 291 -134 -446 283 -92 -211 242 -86 126 83 -262 320 74 -11 -195 -126 140
2026 140 335 -89 175 229 -115 -95 -220 188 107 -98 320 214 -8 149 -66 -23 397 -3 26 16 172 223
2048 223 -90 -202 379 -116 -191 265 -179 303 -10 -206 236 -55 -90 17 -221 329 -164 -411 41 -109 -250
2069 -250 -209 -190 -130 -27 -350 20 -20 -112 203 -57 -249 196 -353 -96 117 -213 230 -337 -252 96 -133 -122
2091 -122 47 -22 338 64 -49 423 187 403 -257 104 266 230 241 267 320 206 -62 -272 176 -173 24 90
2113 90 -18 -147 54 19 455 95 -227 318 -203 196 338 -53 -74 78 20 -125 -37 40 181 7 135 16
2135 16 -307 -218 -165 -372 294 -13 -307 -82 -67 -206 -203 -33 164 -138 -277 150 -200 -70 32 11 277 -145
2157 -145 -55 -40 -119 168 -162 25 -60 -54 118 48 163 -50 103 78 -39 140 274 249 -80 -16 357 307 104 223
2181 223 23 335 154 142 -41 119 248 284 -72 149 101 -31 164 -22 28 -66 -197 129 -44 28 -3 -26 227
2204 227 -14 -215 275 25 78 -143 -184 73 -74 -174 -103 -129 -101 -45 -88 -239 -134 -226 -293 -27 15 82 -147 -119
2228 -119 102 -28 -75 -17 -132 -110 211 -204 -192 42 -40 -83 150 22 -39 123 146 -75 27 74 130 72 268 174
2252 174 295 264 651 537 -164 396 -68 35 132 -57 237 7 372 -368 -105 80 71 43 -113 -24 171 -32
2274 -32 132 -123 -91 126 16 51 -115 14 -190 -70 201 -10 -158 -47 88 -217 -164 45 -89 -2 -112 -222
2296 -222 -101 -71 -133 -179 -31 150 -177 -310 -101 45 -159 258 -10 85 214 -83 -110 42 226 202 34 68
2318 68 199 254 -42 -126 298 -138 -132 54 65 143 227 162 172 115 98 -129 46 -54 58 10 -122 209 26 120 221
2343 221 39 100 -72 -417 115 -12 64 -182 25 114 20 -157 -17 -14 -172 -159 -236 -182 33 -122 -173 12 -159
2366 -159 1 -188 51 70 -107 -205 -13 -279 -95 -255 -180 33 -169 -51 -235 -170 80 -116 -192 236 20 -91
2388 -91 175 26 177 314 -151 140 -82 80 137 -119 -111 81 -189 81 117 -16 -81 -199 -87 -40 67 182
2410 182 128 -34 295 41 121 155 -130 74 83 -141 -95 179 132 78 -175 92 43 -436 158 13 -292 -313 -243 -57
2434 -57 97 -452 -270 -86 75 -78 -175 125 294 2 51 109 -152 -29 -131 -243 221 -348 -4 -160 -254 -18
2456 -18 -132 -123 191 -77 -198 211 176 230 -177 -25 118 317 173 154 -10 87 207 -64 134 160 49 65 -74
2479 -74 389 72 -230 -36 151 -49 -53 163 169 212 124 259 0 141 56 -74 -48 -29 -137 -64 24 61 -9 -223 -99
2504 -99 -90 -146 65 -87 28 101 -272 -237 3 132 -255 -144 -59 58 62 -167 -211 -155 89 -167 -247 -221 -8 -258
2528 -258 -77 -79 139 186 -66 53 26 48 318 -113 -7 220 -181 45 157 94 36 90 -13 232 37 -56 166
2551 166 -21 154 70 -61 183 158 -325 160 161 59 -59 174 143 130 0 161 16 -24 18 -115 165 124 192
2574 192 302 -271 38 278 -258 7 76 117 -157 -91 100 -27 -206 -287 -103 -195 -94 -206 31 193 -338 -173
2596 -173 -204 -252 -303 -19 35 85 159 -86 -24 -160 -121 9 -205 -117 2 -295 240 -36 -43 109 -33 -63 52 -207
2620 -207 47 9 -102 352 -39 37 308 57 61 108 -162 41 207 -176 -84 68 139 -182 47 60 53 109 86 142
2644 142 23 -40 234 35 -387 60 183 -87 -13 -117 -2 -69 14 53 269 -90 -211 -60 68 -92 -219 -71
2666 -71 2 125 -174 -378 116 -146 -382 -114 -91 -170 -1 46 -154 -75 114 -79 78 336 33 -84 -80 -55 33
2689 33 -140 -124 343 104 -9 -20 129 61 60 -71 -11 206 -49 23 -37 -35 17 93 311 164 107 75 172 101 257 -7
2715 -7 -24 -76 152 -79 97 -102 129 -78 194 -219 159 65 -32 170 21 87 -127 11 168 -55 -313 -32
2737 -32 70 -148 -47 39 -150 131 -77 29 -317 -185 -269 -76 -169 -45 10 -126 -131 92 -181 -65 35 -203
2759 -203 -112 235 91 -290 15 -45 -358 124 135 291 78 214 -66 -148 89 -158 -58 188 -8 241 175 61
2781 61 57 -99 23 -70 146 185 -26 -130 -115 139 92 -29 162 297 -16 -107 -6 -91 -63 168 279 -232 149
2804 149 77 -7 -12 -145 48 -11 -58 84 -60 -138 100 -11 -104 -36 -311 -131 -198 -59 262 -46 104 -86 -45 -298
2828 -298 105 -203 36 -159 -44 4 123 34 164 -8 -11 159 -2 49 123 -55 -44 185 236 55 233 149 -86
2851 -86 -63 58 -26 176 29 79 -3 69 -223 65 179 -79 220 -64 -154 31 -63 -78 9 10 76 86 -55 53 81
2876 81 180 72 -249 -103 186 -10 276 -98 -148 200 -121 -55 -82 -117 -14 -80 -247 -79 49 -52 -237 0
2898 0 -80 -276 -33 -93 86 -225 -187 47 -73 -242 -15 70 -40 -364 149 -318 81 -137 184 163 22 -102
2920 -102 52 -55 237 97 125 82 148 42 157 68 -31 317 -44 292 138 199 160 43 -58 11 100 255 213
2943 213 -117 99 -55 -6 -8 58 -103 208 64 148 142 -351 66 158 122 44 -227 136 150 -309 134 -157 -232 16
2967 16 -179 260 83 -116 -25 -209 192 -45 -166 176 -9 59 152 -113 -227 95 -77 -15 -51 -200 211 -94
2989 -94 103 159 -9 -192 90 -100 361 -35 175 246 -38 -61 101 116 193 183 -200 -18 36 15 211 -40 149
3012 149 203 -41 98 40 31 -282 40 -97 133 -89 143 -203 86 32 -5 47 17 41 -166 212 90 -93 -23
3035 -23 -154 169 -50 -65 -70 35 -113 68 -314 -87 149 9 75 -152 -33 -93 -30 47 -77 -76 -93 -197 -173 118
3059 118 -374 301 -27 47 65 154 -90 50 -150 153 75 119 176 160 -81 80 -97 151 270 -127 120 51 128
3082 128 31 141 132 236 76 166 -20 -14 127 84 -148 56 -141 -135 21 -163 74 -136 -83 78 -169 136 -75
3105 -75 -18 -76 33 -115 -7 -153 -226 -20 -143 -119 -86 -278 -79 -57 -51 227 43 -149 -133 -33 -175 36 -96
3128 -96 -40 136 -160 -250 -52 187 115 -261 121 -209 -166 -155 -178 -27 101 -129 -149 75 69 -18 -184 62 -105 7
3152 7 121 14 40 -85 -210 -41 -3 -48 -65 160 149 135 12 82 117 -20 -116 -37 9 -79 -272 -11 -44 79 -116
3177 -116 -278 -13 10 138 -52 -242 165 -252 35 182 -97 129 -34 1 14 86 -65 8 -183 -133 -99 -25 -23
3200 -23 93 29 71 -77 -90 -94 -149 -65 -38 -92 32 10 -32 216 -12 -198 85 -310 72 136 -45 106 43 242 241
3225 241 -28 204 282 -22 235 241 238 -219 31 36 -35 -134 85 226 184 263 42 87 71 -18 87 60 76 110 133 203
3251 203 17 -51 191 78 -66 268 -203 169 4 -49 183 -82 -4 0 -20 62 -189 17 -89 -106 -128 -7 -342
3274 -342 -236 -153 -248 -144 -64 -25 41 -24 -203 -134 -180 -89 40 51 129 146 -65 -211 -291 -7 78 55 -89 30 198
3299 198 -129 -70 11 -12 -204 234 -214 1 -8 -41 178 86 -36 176 175 6 285 77 146 142 153 11 31 -165 110
3324 110 209 197 -1 250 -242 14 -161 -128 -116 -100 -220 -141 -100 -23 -155 207 -57 163 -26 -129 87 -131 -40
3347 -40 -49 12 -121 39 -36 79 29 64 82 -30 -150 -38 -68 -97 163 198 53 403 184 -157 -83 73 293 105
3371 105 -67 135 247 131 71 -148 233 33 124 -118 152 65 135 126 -108 -5 143 94 77 193 142 -210 197
3394 197 151 -131 119 -54 -110 79 181 96 -65 79 132 -64 -236 154 -134 92 82 -121 300 -131 18 -25
3416 -25 -388 32 63 -188 213 -2 -197 -40 -147 1 155 -266 -29 -237 -196 -174 -205 147 -20 -71 23 -60 -206
3439 -206 -52 -138 -32 -91 -131 228 2 -90 -85 -47 214 68 30 94 123 -16 128 -80 -136 181 -34 10 45 -11 178
3464 178 56 -27 213 -31 155 77 -53 54 -44 249 69 71 -261 101 -169 92 -3 -250 42 -87 -155 182
3486 182 -40 123 -131 -256 -63 -100 143 -6 -32 -100 -87 -96 -62 -6 -24 -160 -257 -223 4 -191 -82 32 -108 -102
3510 -102 -318 -167 21 -284 133 -91 -134 -53 186 -51 251 -161 243 205 -71 260 344 45 135 -85 293 -20
3532 -20 -78 241 52 108 1 165 -5 7 -49 16 45 -53 23 144 40 76 -99 -65 222 164 -155 287 116 -22
3556 -22 102 23 125 -101 -50 15 -136 80 -254 -92 138 201 35 -58 -375 36 38 -161 -145 -132 -12 -119 12
3579 12 -99 -122 -199 22 -133 146 -59 -159 40 32 37 -171 -36 -233 -57 -116 76 -67 6 -59 -213 -71 163
3602 163 -22 -56 51 0 66 80 155 7 -112 159 17 -8 -159 171 44 -294 40 80 -39 -150 -62 93 208
3625 208 414 129 127 195 -81 12 95 -114 170 -27 53 253 -132 -38 303 92 67 158 70 -275 -165 131 -139
3648 -139 14 -216 63 105 -108 -44 -66 -220 -98 -65 -1 -42 -54 -138 79 -73 -222 208 -27 -74 10 -127 -121 -9
3672 -9 57 158 -123 70 -54 148 270 -59 138 129 -81 28 214 -3 26 77 -40 4 151 57 147 -105 21
3695 21 58 134 171 188 -27 151 -178 153 -78 -34 -51 82 -238 163 4 -140 116 -33 -166 -154 -38 -233 205
3718 205 11 -54 87 125 -21 -4 -88 -121 -194 10 -261 91 256 120 89 -89 -36 -314 -219 -192 -101 6 33 55
3742 55 94 -17 -122 -23 -46 214 185 48 105 258 147 -100 -102 70 0 152 373 117 121 151 268 -108 60 -91
3766 -91 -98 -238 9 202 -100 -14 98 -32 -152 248 23 -4 -100 189 116 -188 -59 -23 -98 -43 -163 39 25 -97
3790 -97 -222 94 29 8 -31 -88 144 -26 -234 -7 1 170 -65 27 -8 -15 127 -139 -21 -43 -278 106 151 172 11
3815 11 61 -26 -48 19 123 -47 -179 63 314 1 21 136 -91 136 67 -260 -51 73 92 -23 181 162 -63
3838 -63 18 82 104 86 56 37 470 160 35 79 67 -8 127 -113 97 -96 147 29 -238 -94 -24 -67 148 -110
3862 -110 -193 64 -78 -194 -341 -99 -226 -19 -39 -7 -41 -134 87 144 -298 -84 -185 -110 140 -211 -22 -24 27
3885 27 168 -82 -80 124 -225 -155 51 -68 -49 -199 -29 72 -33 23 -50 43 -250 201 159 97 111 -7 138 -20
3909 -20 52 62 97 81 185 28 64 -16 -70 -200 -79 -119 -123 -73 190 91 139 39 9 133 -99 235 -33 131 -200
3934 -200 215 298 -123 -68 241 113 -83 -97 -82 -340 -37 79 -162 93 -194 -311 35 -101 -239 20 -301
3955 -301 114 -49 -79 -167 -96 -87 -139 -179 102 -72 -158 246 45 -55 -25 -280 12 160 87 132 -185 22 162 48
3979 48 204 62 -5 260 159 59 33 166 -225 75 5 265 197 58 347 97 76 196 159 190 -85 -115 76
4002 76 -89 117 170 -121 143 57 -196 -125 301 6 -69 1 -328 90 -92 43 123 124 -42 -19 -47 63 -180 -78
4026 -78 -173 -26 -79 -185 -136 149 -67 276 -129 -149 151 -95 -106 -6 301 151 -216 134 159 133 41 -79 -71 140
4050 140 49 -134 88 -133 -80 -155 -83 112 -183 4 -28 22 190 97 147 -257 -25 74 233 -137 -56 4 110 -186
4074 -186 -259 215 -199 -186 15 70 74 19 126 269 93 49 -41 27 147 212 -52 -50 -115 20 352 9 -35 -13 -117
4099 -117 20 36 245 -3 -76 -208 -30 61 -83 114 -82 -228 -45 -148 -65 2 78 -23 143 106 91 -262 201
4122 201 -63 27 94 -104 169 29 -4 212 -247 143 -174 -1 14 -74 25 235 42 97 102 220 47 63 152 -84
4146 -84 27 -96 141 -33 -11 183 131 -171 231 196 -2 83 168 102 51 -54 55 170 56 199 96 25 68
4169 68 14 -22 -7 -48 152 21 116 -180 -89 115 -51 -98 52 1 1 211 37 24 86 147 -85 59 -118 -104 73
4194 73 -83 -149 125 72 4 104 -60 171 -9 -57 174 1 -73 42 -38 41 38 19 -281 -22 314 226 -168 -61
4218 -61 101 247 50 214 217 -66 -148 6 -115 163 -93 -70 -44 -41 -127 -205 75 -113 -70 -61 -105 -97 -79 32 73 55
4244 55 77 11 155 -171 -228 -52 10 -139 -153 124 -160 -46 -136 -123 -50 -19 -56 -43 -72 -113 -32 -86 101 -34 31 255
4270 255 -90 -99 -217 -163 -61 14 140 34 -57 -151 -110 -187 70 320 -33 211 75 -114 17 -2 101 78 -99
4293 -99 -119 203 -83 -123 -241 167 66 -32 32 88 145 301 15 224 -36 47 168 194 -112 -5 352 183 -28
4316 -28 114 1 77 39 126 -145 46 96 -77 -247 -150 73 24 -37 22 43 -131 -5 252 -39 -230 -193 17 128
4340 128 74 -135 -98 -98 -15 20 32 91 -11 -88 -135 101 121 -205 -114 136 134 -89 45 101 222 -187 123 -124 -145
4365 -145 8 165 128 -23 301 -150 -67 -26 193 78 236 -47 -109 -341 131 455 6 19 89 111 198 -25 -16
4388 -16 150 11 -189 34 -247 44 16 -132 2 159 151 129 -12 37 38 3 53 23 230 -9 -191 89 -120 -262
4412 -262 -214 -72 -163 -72 94 -135 60 -36 -105 -234 -99 -115 -97 -77 14 -94 1 -42 49 34 -274 -16 -79 -43 9
4437 9 -83 -169 185 298 -18 75 28 -84 -134 -84 174 63 87 112 -29 201 -18 26 -15 169 -166 -49 -54 -151 122
4462 122 76 165 -234 -39 113 -186 -161 112 -135 62 -170 -66 -16 26 -65 70 -44 -20 -211 129 56 119 61
4485 61 159 -47 54 -125 -83 -12 -53 141 17 50 151 -19 -115 161 293 -91 79 -179 -7 100 -153 -206 112
4508 112 -97 -4 -69 44 178 -299 -198 9 224 228 111 25 102 -115 358 135 -81 82 46 -16 166 80 -169
4531 -169 12 -42 23 -114 -105 -2 105 -39 -104 -88 -100 -15 16 -129 103 -136 -92 -90 -13 90 277 94 -9 139
4555 139 -142 170 17 92 80 -51 -65 -169 -120 61 130 -104 -69 42 -64 129 18 212 -119 143 61 -134
4577 -134 121 83 -60 9 -95 -18 82 -178 -43 203 87 96 -283 12 -99 -226 109 116 -66 -17 -77 -91 83
4600 83 138 24 -25 -110 -57 29 230 -80 -119 -14 25 -90 84 222 161 162 -270 54 -67 -110 136 106 24 -89 -208
4625 -208 64 -14 65 -81 39 -181 -149 -81 -155 222 45 65 -167 -207 -90 131 -77 11 -50 -27 -193 -177 -286 -48
4649 -48 -182 94 127 -170 -165 103 116 -11 36 -24 229 -149 73 128 9 163 21 -12 -93 146 74 17 10 88 45
4674 45 88 -66 91 466 65 305 129 -77 107 -27 313 -43 82 56 -29 5 -64 368 83 40 188 181 -40
4697 -40 -96 454 52 47 168 14 -3 66 24 50 -47 -204 208 -85 39 26 -223 -57 -239 -492 -8 232 -171
4720 -171 -151 -249 124 112 83 -1 18 62 239 -21 31 -3 110 -43 -87 75 -30 -249 -51 -50 -104 -58 116 72 -135
4745 -135 -116 137 -68 71 116 -148 -193 -41 -43 -142 -15 127 177 49 123 -88 139 14 241 210 -66 -72 49 255
4769 255 -42 -237 -168 150 45 19 -69 -220 40 14 -103 -202 54 -116 30 -9 111 -144 -27 -91 16 11 -327
4792 -327 -21 -112 291 -162 -166 13 -270 -174 62 -205 63 158 285 67 16 125 58 105 217 231 -71 -125 -74 44
4816 44 51 8 208 -10 68 -25 37 14 -194 93 124 -180 -22 -126 -129 318 16 60 -75 -52 109 -163 41 19 -45
4841 -45 2 117 137 36 24 -142 65 -19 -312 140 212 64 85 -90 -136 -79 187 -25 -45 24 51 -58 -89 -236
4865 -236 133 -128 52 -13 51 -165 191 -22 -13 -17 46 -33 -149 25 -4 123 -31 40 -283 59 138 167 -122 -37
4889 -37 85 21 127 5 102 134 150 232 114 29 -237 -49 234 157 -194 3 -30 -69 263 -11 287 58 -108
4912 -108 30 -116 -196 -3 -49 -150 158 27 -37 46 -3 230 174 -85 309 -224 17 -68 25 117 79 36 -122 9
4936 9 -66 -114 119 -39 -33 -74 146 -44 -4 64 -92 -8 -58 -2 -171 -70 -96 173 -157 -36 -256 37 -161 133
4960 133 -12 49 51 -143 -138 11 89 -93 -111 -240 11 -39 -4 -73 -146 -54 146 -28 114 273 218 -132 -199 -258 236
4985 236 131 117 172 90 -33 -1 275 29 21 -75 62 -78 161 326 203 2 -111 159 48 -224 -115 0
5007 0 56 -6 -113 31 -116 154 -190 -95 19 -88 9 168 -57 -176 -67 -10 97 73 90 -63 137 22 -103
5030 -103 -203 10 -59 -167 50 -99 204 164 -25 9 83 -222 -52 83 -220 140 117 -136 -42 47 148 163 68
5053 68 86 103 -193 -47 32 -139 -10 -43 -18 63 189 -111 15 -53 -153 -14 181 134 32 56 120 116 238 -191
5077 -191 277 83 -106 73 228 -209 -68 226 156 -15 -72 -105 -137 48 -217 -69 41 -170 222 -64 -103 76
5099 76 -152 61 -75 -20 -92 -204 -204 -41 -41 116 -81 -85 -82 -48 118 219 523 -4 75 8 26 -56 203 104 59 65 40
5126 40 32 -51 -67 -34 -180 -159 18 75 78 50 39 -66 35 -100 82 75 -160 211 -87 98 -292 -241 -92 -98 208 -26
5152 -26 37 116 -145 -123 -80 -125 52 222 88 -74 87 3 -29 -77 235 2 -244 -209 -10 -126 -36 17 200 -116
5176 -116 -38 15 143 180 228 -110 63 -26 28 -68 72 -110 20 25 71 179 -127 156 -148 151 -46 -115 -8 85
5200 85 -149 120 94 177 90 219 220 33 216 15 -192 20 -167 -98 -197 -26 -155 -53 7 68 27 -183 150 64
5224 64 115 -3 83 202 -61 -105 3 57 44 26 30 -28 -57 -114 -19 -199 -85 45 188 107 23 103 -131 31 134
5249 134 -224 152 -65 -66 5 331 -121 -210 44 -58 124 61 35 -14 105 -84 140 98 128 -206 128 149 178 -31
5273 -31 -113 -104 -169 125 90 122 -29 -40 77 -42 -170 101 43 -104 -235 90 -20 -12 99 28 43 38 145 -127 236
5298 236 -152 -127 172 50 -138 -116 -32 -24 -132 101 142 -67 -215 -116 67 -147 -481 128 31 -24 184 112 131 -26
5322 -26 -185 179 61 -63 194 -56 187 -14 -12 76 123 -212 -139 79 63 157 -126 -13 8 -95 -187 -102 -14 144
5346 144 -86 107 -208 80 339 251 298 36 -81 -151 -33 -128 -39 -106 81 -3 50 166 -33 -68 188 -142 191
5369 191 24 -116 21 -139 -249 88 -25 -107 137 -119 83 -54 140 -193 -279 -143 78 240 65 -125 -133
5390 -133 -160 -189 43 -135 -100 -96 86 -176 -404 -249 -280 64 63 -60 120 195 116 -114 131 -110 105 109 241 269
5414 269 312 234 158 70 149 -12 40 327 18 184 -53 -120 90 162 -31 187 -122 -4 294 -24 63 27 48 18
5438 18 172 145 10 -31 24 -90 -57 131 162 79 281 -68 139 -75 49 -125 -101 274 -183 39 42 -214 102
5461 102 2 47 196 155 50 -137 -197 -21 -172 -38 -26 -233 94 91 66 38 -164 -64 -64 -74 113 110 -164 140
5485 140 131 -69 -215 220 -83 26 76 149 -95 -166 131 47 5 51 91 0 189 52 45 -85 148 90 -14 -92 3
5510 3 14 42 -76 279 42 119 132 243 -87 113 -380 -28 220 -109 -42 25 90 -54 23 42 -67 149 -32 57
5534 57 126 154 4 27 251 -33 265 -108 -84 -52 186 -183 -109 -117 27 235 -212 -162 -356 -61 -202 55 153 -22
5558 -22 -86 -3 287 137 -45 203 284 34 36 -129 177 -17 -4 154 98 12 -202 122 -148 -149 -34 19 115 -72
5582 -72 -29 58 -126 127 -62 -54 80 -180 78 -133 179 68 -22 41 -165 -92 -32 175 142 -219 -4 20 163 2
5606 2 -64 160 81 -75 25 -75 -202 33 259 0 58 -12 -62 -25 -54 -32 -26 207 -216 46 22 79 -230 -60 21
5631 21 -88 -101 -78 -86 128 62 180 287 -273 12 23 -50 192 170 -22 7 -23 122 -100 46 33 56 254 160 196
5656 196 21 122 -183 0 43 127 28 10 -170 21 -142 219 156 -140 50 59 -288 -68 97 -111 26 -104
5678 -104 -102 -40 107 -86 -10 -36 -104 61 -24 159 -49 214 143 0 -39 3 90 210 -111 -32 79 -47 -68 45
5702 45 -105 -58 103 49 -45 170 -407 -119 -70 -160 94 92 -26 78 108 -255 53 -27 -109 -24 30 -72 -35 16 -37
5727 -37 233 121 101 -187 -132 101 -53 129 -174 -64 -101 97 -8 7 91 60 -18 -99 -128 -196 -186 -131 262 -5
5751 -5 -53 -67 255 -152 -32 -171 -80 -88 -74 -36 2 -227 -35 -18 206 212 38 261 -80 65 83 28 67 131 150 178
5777 178 -116 -9 -28 -133 77 -132 37 -10 -196 17 -237 -35 -36 72 -171 147 35 -132 296 52 -10 -13
5799 -13 71 181 215 43 7 -26 -139 6 -41 -238 4 -48 97 -30 15 10 -86 10 -131 -163 186 -53 -31 -234 -4
5824 -4 109 -92 106 121 -81 -209 4 30 121 -30 -184 -191 40 -38 212 -39 -98 32 66 160 -18 -67 -44 -131 -91
5849 -91 63 67 305 26 57 4 -228 -145 -157 -148 -35 24 -1 83 106 -214 91 -108 -78 37 -28 78 96 144 -111 204
5875 204 -8 74 126 -88 -107 43 4 -147 157 73 106 48 75 -13 30 91 51 -18 -144 -132 -175 19 -312 4 103
5900 103 3 67 288 150 3 20 -95 169 207 148 17 75 171 62 263 -58 -131 95 -55 -72 -6 46 -46 -40
5924 -40 -126 -275 -30 201 108 -167 110 177 -13 190 8 -315 33 -2 -127 -156 -51 110 203 63 -213 160
5946 160 121 154 216 69 101 -13 -8 80 -177 -115 73 -37 160 170 -60 5 9 94 78 38 106 69 -38 35 -78 46
5972 46 88 283 204 -245 -132 291 318 93 -199 -64 73 -24 26 -7 -9 -27 -111 -228 203 -151 -99 -34 -26 -62 -94 357
5998 357 110 -60 -116 44 12 173 36 54 -42 98 -121 136 102 138 85 92 85 -123 206 -216 169 -72 -28 291
6022 291 -72 145 -49 102 -49 -199 -83 186 -156 -2 -132 -145 33 96 107 -113 -103 -263 -74 -260 -21
6043 -21 -24 -11 -145 145 81 -2 -8 111 -49 -66 140 127 -75 -3 -190 63 170 -94 96 4 96 -237 290 93
6067 93 7 71 162 -46 -187 102 98 -21 64 -66 38 29 25 32 -77 -115 22 -50 220 224 46 -68 41 137 -51 62
6093 62 -16 134 167 55 -5 43 -158 12 31 3 176 130 -45 47 -28 204 146 33 -68 -94 124 97 -44 111
6117 111 -171 62 -55 -29 2 -193 148 -64 -33 73 149 -95 -158 68 107 105 51 155 -40 -1 -140 -74 63 52
6141 52 -26 -42 -45 -161 -192 44 -40 97 -115 172 35 -19 21 5 -210 7 -70 215 -98 65 218 -197 -65 21
6165 21 -172 -177 -55 -173 173 97 -248 -176 -94 -26 113 110 -130 -94 2 -24 57 -37 181 34 -16 -16 61 3 -30 166 49
6192 49 32 35 -220 214 284 120 51 -8 -39 -158 120 69 183 22 -38 -35 -86 -61 -1 192 58 149 -49 -116 74 108
6218 108 -177 165 -122 143 -56 29 118 -18 -138 212 -42 30 -31 -135 -147 104 5 -89 -94 22 49 -128 55
6241 55 -70 118 84 -98 38 -196 -83 14 54 5 143 -48 69 -18 0 39 71 85 -247 62 128 118 197 -35
6265 -35 10 123 -133 170 43 -30 85 -80 101 250 -16 -127 6 146 -32 -121 64 63 190 -148 -122 31
6287 31 164 -32 -21 -213 43 5 53 -54 82 73 -32 -194 -201 -210 84 -88 -189 -116 -80 85 15 -171 -87 14 105
6312 105 -49 -5 -24 -129 -75 254 109 -77 1 66 188 -116 -77 -235 94 -38 -43 -86 99 73 199 59 -104
6335 -104 -109 -116 100 -42 102 -65 63 66 185 -202 261 -326 79 -53 -108 -242 -265 -127 173 129 -151 -121 -93 23
6359 23 262 42 -38 -171 -149 129 21 22 -131 -156 11 -251 -46 -178 55 -11 35 -58 -83 -60 -173 182 74 93
6383 93 150 -233 -127 -170 -53 245 53 -106 52 51 -155 -64 23 -30 -3 46 -118 95 -97 -23 -106 5 22 71 -236
6408 -236 37 169 -161 15 154 -101 91 85 -74 -82 -213 46 -68 44 137 -74 -18 14 -18 -210 20 -52 118
6431 118 131 -22 -42 86 29 126 -5 -91 -218 8 -11 -59 106 -213 21 44 -16 -30 255 255 98 -65 24 123 -118
6456 -118 -204 33 -30 14 48 35 84 -106 87 71 92 34 -14 -30 15 -70 -81 32 69 -118 207 163 6 115 88 240
6482 240 -371 281 2 109 7 -57 -8 246 -123 -124 120 -86 38 -64 -30 13 83 72 -111 111 -219 -54 -47
6505 -47 180 -90 -119 8 1 -25 -125 23 168 57 -111 -166 -51 -137 -24 289 155 61 -260 3 65 -78 263
6528 263 -94 128 -4 -118 47 93 -41 -57 9 12 -193 -28 -135 -242 -111 7 -54 63 218 69 69 156 11
6551 11 53 128 -39 15 8 286 -192 19 -43 -6 -99 37 -55 -32 57 39 -53 272 -86 -36 -94 11 156 27 19 2
6577 2 -73 -12 -267 -9 53 -70 -27 -106 -200 -50 -115 152 223 -91 38 26 -1 -91 217 -105 103 -27 93 24 96
6602 96 -136 10 -3 116 -38 -2 91 -70 2 -91 -4 346 211 -53 3 -111 -130 -25 -155 -103 66 -199 222
6625 222 -33 105 -39 -83 191 -3 64 -91 -202 41 51 147 122 115 -99 -110 0 199 -128 80 23 162 -75
6648 -75 -272 23 -63 183 -133 81 22 41 173 -188 147 83 -69 -80 -310 -97 -139 -288 175 15 -66 -4 -35
6671 -35 222 127 -185 -20 -179 -77 -129 -168 87 52 -29 -11 169 49 -231 39 102 81 265 -60 -45 -91 -48 116
6695 116 273 -163 134 2 -163 17 -31 71 -32 -147 187 2 -104 -174 -56 15 -38 45 -9 -27 81 134 154
6718 154 95 -105 23 279 -151 -18 -163 213 -167 -175 -186 94 334 -41 -129 -58 137 -23 -101 -42 -33 -166 115
6741 115 61 -149 -55 -9 -193 -206 -74 52 31 -63 -255 -12 -152 -92 -62 -100 38 -89 -131 213 45 -16 123 -3
6765 -3 3 145 -180 -215 -41 65 -92 17 115 -29 -75 118 33 105 40 -175 41 14 -4 226 -39 -171 27 -2
6789 -2 81 -261 213 92 -90 -86 107 14 -75 -53 -39 161 6 -234 186 180 -166 -43 -10 -8 43 -61 18 10 -164 102
6815 102 -190 -97 -56 -30 92 41 -17 -184 -49 78 -141 172 182 100 153 -20 -120 -59 -9 183 -28 -397 300
6838 300 171 -117 -130 -54 -35 28 -92 -30 -88 -103 50 -28 214 -11 -85 156 61 -168 -111 -25 36 146 -79 -74 -29
6863 -29 -16 184 121 -70 296 124 -93 -156 -56 -7 -144 180 -265 -4 -148 -56 -68 -65 202 -261 -227 -156 -121 -94
6887 -94 -54 -89 94 391 -14 -247 94 3 145 55 112 -242 -116 -113 -52 174 11 143 36 -216 26 15 -92
6910 -92 -258 -182 115 -154 -233 60 46 -90 59 -71 122 -214 -34 40 198 -94 48 -62 -85 3 -88 77 -145
6933 -145 5 226 11 258 -67 23 160 -11 -28 124 -128 -95 37 -212 -80 175 157 -73 122 -199 -65
6954 -65 -93 -51 125 -38 -107 -125 197 -87 -208 -83 -40 106 193 160 87 160 -72 36 35 70 15 -119 -2 -118 116
6979 116 118 291 -98 -31 5 65 -72 -96 -1 -117 31 -96 -31 -21 -146 56 -50 -70 -87 46 -2 253 4 -52
7003 -52 121 124 114 105 18 -131 355 201 17 -69 -65 145 25 166 62 171 97 76 234 -182 -306 17 62 -28 -101
7028 -101 -223 63 -249 -95 -110 85 259 38 3 47 48 -27 -100 85 94 -143 28 -197 145 -91 0 -290 13
7051 13 -201 -103 58 -50 150 41 175 -37 319 -3 7 37 -65 -169 -57 -43 80 166 -51 -21 276 125
7073 125 86 119 -154 -48 -58 128 -57 54 -97 37 137 152 2 -94 181 -55 -21 48 115 122 228 -56 -87 115
7097 115 -238 226 45 -153 -12 -49 15 25 -28 -162 70 -186 -117 286 -40 -32 80 81 -131 183 322 170 191
7120 191 114 -198 89 -78 93 133 -102 -35 108 190 -143 -29 107 -86 -87 285 62 -105 -167 28 -11 -35 -59
7143 -59 -67 -153 96 22 139 -118 -126 138 30 -124 61 336 158 -116 163 -39 86 -31 -132 -301 88 -32
7165 -32 -62 -19 -18 -214 40 -73 -5 -187 -267 291 -7 279 -20 -8 64 -50 72 74 45 274 -121 -148 -29 152
7189 152 94 182 105 -9 -209 -50 -67 -58 -17 -21 8 -52 112 225 2 -129 -34 277 -22 -72 -92 26 -179 144 -65
7214 -65 20 -30 -46 -16 -13 -212 160 -74 89 54 -157 80 115 47 -64 -47 28 -57 -181 87 -17 -97 124 69 65 109
7240 109 18 -159 67 -233 205 -7 -88 18 -159 -96 85 52 11 52 238 11 226 -77 0 -165 -202 149 163
7263 163 172 -111 -151 -173 40 63 24 26 237 216 203 148 17 53 -55 -148 -60 58 11 -175 -69 186 92 -6 -142 151
7289 151 -69 -153 38 113 -177 158 57 67 180 29 -64 -124 38 -78 -171 15 34 78 86 91 33 64 36 -11 69 -40
7315 -40 14 142 271 -115 292 120 -59 -54 85 323 185 42 -103 36 -78 206 59 68 71 -115 -102 48 -79
7338 -79 16 -103 -123 67 6 -96 -80 -77 339 -76 -146 275 -131 -12 51 -69 91 71 -177 50 30 -62 14 -42 -75
7363 -75 -210 62 105 -53 18 -147 12 166 15 100 82 -31 -208 73 -153 59 15 -263 40 -174 64 29
7385 29 147 323 -141 323 -119 251 139 209 -52 26 169 -8 -90 -95 143 198 93 14 -75 -5 75 -20 40 -79
7409 -79 117 -6 21 61 9 -115 48 -140 -38 63 94 -122 -151 9 135 51 246 -54 -150 186 -60 241 35
7432 35 33 98 -31 16 -75 50 -213 -29 -131 -83 -2 -50 -296 -144 -67 -250 166 -208 92 56 25 -105 168 22
7456 22 -10 49 115 284 23 -53 -137 38 227 -100 30 -48 -133 63 -181 11 93 160 -17 70 166 146 -75 -43 -118
7481 -118 106 114 33 149 -117 63 14 93 -109 234 221 2 -299 331 102 -52 94 34 44 -84 -129 11 157
7504 157 95 -143 -76 115 -81 121 -107 11 -1 39 192 -73 -48 39 -76 39 83 -107 181 237 -133 -8 -15
7527 -15 -86 85 173 -178 165 27 -103 -10 75 113 164 -15 -110 -57 -135 10 145 19 -25 382 -78 -74 131 -156
7551 -156 18 103 97 -14 -148 -77 239 -2 39 156 112 162 -21 90 89 -40 -190 -109 -35 -87 -85 53 -224 19 192
7576 192 87 22 -136 31 154 72 -122 -310 -34 157 -4 -18 76 183 -51 -118 -24 222 58 155 -87 170
7598 170 218 3 -70 48 -124 39 -261 -87 254 -58 -7 -224 87 -20 113 57 9 -72 107 -26 -63 -33 40
7621 40 -90 39 100 -130 -111 -91 96 225 155 19 -58 -49 67 19 68 114 148 107 -36 26 -87 -11 88 -12 -150
7646 -150 -72 23 -66 -127 7 -34 -120 -232 6 193 -91 -63 59 1 -88 57 60 -74 -178 109 3 -217 1 -57
7670 -57 249 43 -156 -143 81 -11 117 18 90 -97 -153 52 101 -166 -12 40 -109 11 70 -157 184 -96 21
7693 21 176 -43 -5 214 101 99 102 -22 76 21 300 68 36 113 120 24 -116 -166 -70 144 -56 36 50 -53 -6 -49
7719 -49 12 100 192 -71 101 154 91 151 -34 -38 -57 4 -42 -316 -62 -119 -245 28 104 63 134 111 -141 -107 -255 9
7745 9 107 259 -19 -186 6 104 103 -147 -87 170 3 170 106 -107 -121 97 48 172 -69 22 51 -124 -60 104
7769 104 134 188 111 50 23 99 8 48 71 167 0 -122 184 -141 -8 130 64 73 -13 -194 -161 -47 -66 66 1 -82
7795 -82 47 25 -64 -146 -72 195 -201 21 -3 2 17 189 53 36 270 -69 -123 -203 217 86 -55 11 -25 91 -42
7820 -42 -92 -17 106 141 -52 -151 -148 -115 128 167 -56 62 -17 48 100 43 174 -85 104 49 -145 56 -60 -131 2
7845 2 319 -50 50 -202 75 82 196 139 16 -163 97 -343 110 81 -202 -296 80 103 -50 -81 23 187 -66
7868 -66 -66 97 -221 -117 -114 -5 209 102 32 -251 -20 54 3 -14 119 56 75 47 -81 -182 -82 57 -48 39
7892 39 158 -147 -131 -161 -152 -31 369 27 203 79 -34 -22 99 -98 -291 -46 18 -18 -55 -26 -49 78 96 -225
7916 -225 -267 35 111 108 40 -63 71 142 9 -149 -54 -45 13 2 198 164 125 -104 -52 178 -82 119 1 100 -15
7941 -15 0 -192 51 57 -67 102 -124 -154 122 124 -29 121 182 -36 135 -70 248 -49 2 69 -22 278 155 32
7965 32 48 -169 114 -176 3 32 -179 14 -120 -240 -189 -12 160 -55 15 -156 98 158 -25 -221 20 -71
7987 -71 293 -38 23 180 90 -217 8 -74 13 -50 83 167 13 39 145 -32 -17 -21 176 76 222 -2 -52 13
8011 13 -340 -166 219 -119 -137 113 134 -2 -56 -113 12 63 198 12 -109 174 -42 47 268 -18 95 223
8033 223 -32 -94 114 6 -62 280 -28 24 -158 135 -144 -21 44 -407 200 171 11 -84 86 -14 -61 -78 -57
8056 -57 -53 -65 -60 -47 215 -289 6 -28 -13 26 -61 -48 45 84 -22 94 14 -61 40 23 166 107 166 91 60 4 187
8083 187 58 327 -15 -37 27 -52 78 -165 13 33 -135 118 90 -273 -95 66 38 78 78 -295 -12 -35 -75 158
8107 158 46 -11 27 -94 54 -261 -229 -154 93 235 -51 -109 -163 -135 -47 -124 -189 52 -247 24 -103 80 83 -22
8131 -22 -165 -172 47 95 46 56 -44 -28 112 -131 155 -127 -182 66 219 121 -86 116 129 -176 78 -65 168
8154 168 -38 -166 -102 -239 -27 50 184 19 -108 -98 185 -43 -231 135 96 151 -8 -176 -68 103 -79 46
8176 46 -390 -60 -105 -67 180 123 257 66 -122 -145 1 99 -106 -117 -10
8191a0
##END NTUPLES=NMR FID
##END=
