##TITLE=1H_SL83_Dau(f7-4)
 CDCl3, 8 sc, 
 11.05.2021
##JCAMPDX= 6.0         $$ Bruker NMR JCAMP-DX V2.0
##DATA TYPE= NMR FID
##DATA CLASS= NTUPLES
##ORIGIN= UXNMR, Bruker Analytische Messtechnik GmbH
##OWNER= root
$$ XWIN-NMR		Version 3.5
$$ Tue May 11 10:01:56 2021 Russian Standard Time (UT+4h)  she@DPX200
##.OBSERVE FREQUENCY= 200.131506
##.OBSERVE NUCLEUS= ^1H
##.DELAY= (6, 6)
##.ACQUISITION MODE= SIMULTANEOUS
##.ACQUISITION SCHEME= undefined
##.AVERAGES= 8
##.DIGITISER RES= 18
##SPECTROMETER/DATA SYSTEM= spect
##.PULSE SEQUENCE= zg30
##.SOLVENT NAME= CDCl3
##.SHIFT REFERENCE= (INTERNAL, CDCl3, 0, 15.7039)
##AUDIT TRAIL= $$ (NUMBER, WHEN, WHO, WHERE, WHAT)
$$ ##TITLE= Audit trail, XWIN-NMR		Version 3.5
$$ ##JCAMPDX= 5.01
$$ ##ORIGIN= Bruker BioSpin GmbH
$$ ##OWNER= she
$$ F:/spectra/data/she/nmr/H-F/1/audita.txt
$$ ##AUDIT TRAIL=  $$ (NUMBER, WHEN, WHO, WHERE, WHAT)
(   1,<2021-05-11 10:00:47.45 +0400>,<she>,<DPX200>,
      <created by zg, POWCHK disabled, PULCHK disabled
       configuration hash MD5:
       00 E9 B6 7A A2 85 ED C7 34 08 36 98 17 FE 4E 26
       data hash MD5: 16K
       91 85 0B 8D 63 DF 61 DA 5F 5F 05 B1 93 56 EF 9A>)
$$ ##END=
$$ 
$$ hash MD5
$$ B3 97 6C 48 CA B6 6D 36 64 4C 18 A6 5F AB 83 EC
##$RELAX= 
##$RELAX= 
##$RELAX= 
##$RELAX= 
##$RELAX= 
##$RELAX= 
$$ Bruker specific parameters
$$ --------------------------
##$DU= <F:/spectra>
##$EXPNO= 1
##$NAME= <H-F>
##$PROCNO= 1
##$TYPE= <nmr>
##$USER= <she>
##$AMP= (0..31)
100 100 100 100 100 100 100 100 100 100 100 100 100 100 100 100 100 100 
100 100 100 100 100 100 100 100 100 100 100 100 100 100 
##$AQSEQ= 0
##$AQ_mod= 1
##$AUNM= <au_zg>
##$AUTOPOS= <>
##$BF1= 200.13
##$BF2= 200.13
##$BF3= 200.13
##$BF4= 200.13
##$BF5= 200.13
##$BF6= 200.13
##$BF7= 200.13
##$BF8= 200.13
##$BYTORDA= 1
##$CFDGTYP= 0
##$CFRGTYP= 5
##$CHEMSTR= <none>
##$CNST= (0..31)
1 1 145 1 1 1 1 1 1 1 1 1 1 1 1 1 1 1 1 1 1 1 1 1 1 1 1 1 1 1 1 1 
##$CPDPRG= <>
##$CPDPRG1= <>
##$CPDPRG2= <>
##$CPDPRG3= <>
##$CPDPRG4= <mlev>
##$CPDPRG5= <mlev>
##$CPDPRG6= <mlev>
##$CPDPRG7= <mlev>
##$CPDPRG8= <mlev>
##$CPDPRGB= <>
##$CPDPRGT= <>
##$D= (0..31)
0 1.2 0 0 0 0 0 0 0 0.06 0 0.03 0 0 0 0 0.0002 0 0 0 0 0 0 0 0 0 0 0 0 
0 0 0 
##$DATE= 1620712846
##$DBL= (0..7)
120 120 120 120 120 120 120 120 
##$DBP= (0..7)
150 150 150 150 150 150 150 150 
##$DBP07= 0
##$DBPNAM0= <>
##$DBPNAM1= <>
##$DBPNAM2= <>
##$DBPNAM3= <>
##$DBPNAM4= <>
##$DBPNAM5= <>
##$DBPNAM6= <>
##$DBPNAM7= <>
##$DBPOAL= (0..7)
0.5 0.5 0.5 0.5 0.5 0.5 0.5 0.5 
##$DBPOFFS= (0..7)
0 0 0 0 0 0 0 0 
##$DE= 6
##$DECBNUC= <off>
##$DECIM= 32
##$DECNUC= <off>
##$DECSTAT= 4
##$DIGMOD= 1
##$DIGTYP= 9
##$DL= (0..7)
0 120 120 120 120 120 120 120 
##$DP= (0..7)
150 150 150 150 150 150 150 150 
##$DP07= 0
##$DPNAME0= <>
##$DPNAME1= <>
##$DPNAME2= <>
##$DPNAME3= <>
##$DPNAME4= <>
##$DPNAME5= <>
##$DPNAME6= <>
##$DPNAME7= <>
##$DPOAL= (0..7)
0.5 0.5 0.5 0.5 0.5 0.5 0.5 0.5 
##$DPOFFS= (0..7)
0 0 0 0 0 0 0 0 
##$DQDMODE= 0
##$DR= 18
##$DS= 0
##$DSLIST= <SSSSSSSSSSSSSSS>
$$ [...]
##$SUBNAM2= <"">
##$SUBNAM3= <"">
##$SUBNAM4= <"">
##$SUBNAM5= <"">
##$SUBNAM6= <"">
##$SUBNAM7= <"">
##$SUBNAM8= <"">
##$SUBNAM9= <"">
##$SW= 16.9725357007746
##$SWIBOX= (0..15)
0 0 2 0 0 0 0 0 0 0 0 0 0 0 0 0 
##$SW_h= 3396.73913043478
##$TD= 16384
##$TD0= 1
##$TE= 0
##$TE2= 300
##$TE3= 300
##$TEG= 300
##$TL= (0..7)
0 120 120 120 120 120 120 120 
##$TP= (0..7)
150 150 150 150 150 150 150 150 
##$TP07= 0
##$TPNAME0= <>
##$TPNAME1= <>
##$TPNAME2= <>
##$TPNAME3= <>
##$TPNAME4= <>
##$TPNAME5= <>
##$TPNAME6= <>
##$TPNAME7= <>
##$TPOAL= (0..7)
0.5 0.5 0.5 0.5 0.5 0.5 0.5 0.5 
##$TPOFFS= (0..7)
0 0 0 0 0 0 0 0 
##$TUNHIN= 0
##$TUNHOUT= 0
##$TUNXOUT= 0
##$USERA1= <user>
##$USERA2= <user>
##$USERA3= <user>
##$USERA4= <user>
##$USERA5= <user>
##$V9= 5
##$VALIST= <valist>
##$VCLIST= <CCCCCCCCCCCCCCC>
##$VD= 0
##$VDLIST= <DDDDDDDDDDDDDDD>
##$VPLIST= <PPPPPPPPPPPPPPP>
##$VTLIST= <TTTTTTTTTTTTTTT>
##$WBST= 1024
##$WBSW= 4
##$XGAIN= (0..3)
0 0 0 0 
##$XL= 0
##$YL= 0
##$YMAX_a= 133105
##$YMIN_a= -138336
##$ZGOPTNS= <>
##$ZL1= 120
##$ZL2= 120
##$ZL3= 120
##$ZL4= 120
##$ABSF1= 10
##$ABSF2= 0
##$ABSG= 5
##$ABSL= 3
##$ALPHA= 0
##$AQORDER= 0
##$ASSFAC= 0
##$ASSFACI= 0
##$ASSFACX= 0
##$ASSWID= 0
##$AUNMP= <proc_1d>
##$AZFE= 0.1
##$AZFW= 0.1
##$BCFW= 1
##$BC_mod= 2
##$BYTORDP= 1
##$COROFFS= 0
##$CY= 11.3945322036743
##$DATMOD= 1
##$DC= 2
##$DFILT= <>
##$DTYPP= 0
##$F1P= 15.9154993809931
##$F2P= -4.1035820241983
##$FCOR= 0.5
##$FTSIZE= 0
##$FT_mod= 4
##$GAMMA= 1
##$GB= 0.15
##$INTBC= 1
##$INTSCL= 1
##$ISEN= 128
##$LB= 0.24
##$LEV0= 0
##$LPBIN= 0
##$MAXI= 10000
##$MC2= 0
##$MEAN= 0
##$ME_mod= 0
##$MI= 1.114404
##$NCOEF= 0
##$NC_proc= 0
##$NLEV= 6
##$NOISF1= 3.799351
##$NOISF2= 2.8
##$NSP= 1
##$NTH_PI= 0
##$NZP= 0
##$OFFSET= 15.70392
##$PC= 1
##$PHC0= -11122.47
##$PHC1= 15.801
##$PH_mod= 1
##$PKNL= yes
##$PPARMOD= 0
##$PSCAL= 0
##$PSIGN= 0
##$REVERSE= no
##$SF= 200.130013532006
##$SI= 16384
##$SIGF1= 3
##$SIGF2= 2
##$SINO= 400
##$SIOLD= 16384
##$SREGLST= <1H.CDCl3>
##$SSB= 0
##$STSI= 0
##$STSR= 0
##$SW_p= 3612.71676300578
##$SYMM= 0
##$S_DEV= 0
##$TDeff= 0
##$TDoff= 0
##$TI= <>
##$TILT= no
##$TM1= 0
##$TM2= 0
##$TOPLEV= 0
##$USERP1= <user>
##$USERP2= <user>
##$USERP3= <user>
##$USERP4= <user>
##$USERP5= <user>
##$WDW= 1
##$XDIM= 8192
##$YMAX_p= 0
##$YMIN_p= 0
$$ End of Bruker specific parameters
$$ ---------------------------------
##NTUPLES= NMR FID
##VAR_NAME=  TIME,          FID/REAL,        FID/IMAG
##SYMBOL=    X,             R,               I
##VAR_TYPE=  INDEPENDENT,   DEPENDENT,       DEPENDENT
##VAR_FORM=  AFFN,          ASDF,            ASDF
##VAR_DIM=   8192,          8192,            8192
##UNITS=     SECONDS,       ARBITRARY UNITS, ARBITRARY UNITS
##FACTOR=    0.0002944,     1,               1
##FIRST=     0,             0,               0
##LAST=      2.4114304,     0,               0
##MIN=       0,             -138336,         0
##MAX=       2.4114304,     133105,          0
$$ Real data points
##PAGE= N=1
##DATA TABLE= (X++(R..R)), XYDATA
$$ plain form
0 0 0 0 0 0 0 0 0 0 0 0 0 0 -8 8 -8 8 -8 16 -16 18 -24 31 -32 40 -48 56 -64 72 -80 96 -106 122 -138 155
34 155 -177 198 -222 250 -277 307 -343 381 -422 469 -517 569 -628 692 -762 840 -924 1020
52 1020 -1124 1240 -1372 1520 -1691 1889 -2118 2392 -2723 3132 -3657 4351 -5311 6735 -9047
67 -9047 13409 -24359 104736 133105 -138336 55210 16050 -51992 67687 -11290 -26123 36381
79 36381 -20578 34464 9728 -43507 10177 8422 3427 8599 -14057 12977 5301 8731 2187
92 2187 -29989 21146 19600 -11114 39718 -20276 -39890 58674 10359 -31884 19215 -7275 3356
105 3356 24660 -16530 -3624 -1228 -6494 30031 -14770 -38161 25399 14236 -14671 6048 -7363
118 -7363 -17709 9671 15450 -10383 -11278 11529 5564 5704 8105 -22313 -6702 23089 2185 1474
$$ packed form
0@%%%%%%%%%%%%qJ6j6J6j6K4l2L4m2N5o3P2q8J04j20J36j52J76k02K28k60K93
34A55l32L75m20M72n27N84o50P24q03Q91r86J086j197J320j454J602j764J944
52A020k144K364k612K892l211L580m007M510n115N855o789Q008r662J2046j5782
67i047K2456l7768J29095K8369k71441J93546l9160o8042J19679p8977j4833O2504
79C6381n6959N5042k4736n3235N3684j755m995N172k2656K7034p676L430o544
92B187l2176N1135j546l0714N0832n9994j9614R8564m8315m2243N1099k6490J0631
105C356K1304m1190J2906K396n266L6525m4801k3391O3560j1163k8907K0719j3411
118g363j0346K7380N779k5833q95K2807n965J40K401l0418J5611K9791k0904p11
$$ plain form
132 1474 3163 -1617 8018 -11505 -3865 10513 -16705 11479 22685 -25689 -9817 4692 -9068
145 -9068 6323 -4740 -10083 1696 2040 13957 -15791 -29082 13998 9225 3688 5150 -17341
158 -17341 8037 6396 -7014 14498 -16241 1441 34435 -19937 187 16335 -24397 17696
170 17696 9195 -21965 15668 -5291 -4239 17225 -19112 -3191 1935 -10010 19401 -13611 -22504
183 -22504 18147 -2322 -6213 -461 -12397 2735 -5104 1143 6814 -22402 6375 15797 -22192
196 -22192 -875 541 -11764 14500 -840 -11400 825 -9308 2228 2725 -12738 1871 -1809
209 -1809 -3118 11276 -10328 -17832 5574 4365 -2340 2156 382 -3795 1115 6256 -6992 -8324
223 -8324 12904 11257 -2712 320 956 1189 5348 4641 3083 -3164 3715 17498 144 -10388 4976
$$ packed form
132A474J689m780R635j9523P640J4378k7218K8184J1206m8374J5872J4509j3760
145i068J5391j1063n343J1779L44J1917k9748j3291M3080m773n537J462k2491
158a7341K5378j641j3410K1512l0739J7682L2994n4372K0124J6148m0732M2093
170A7696q501l1160L7633k0959J052K1464l6337J5921N126j1945K9411l3012q893
183b2504M0651k0469l891N752j1936J5132p839O247N671k9216K8777R422l7989
196b2192K1317J416j2305K6264j5340j0560J2225j0133J1536M97j5463J4609l680
209a809j309J4394k1604p504K3406j209o705M496j774m177M910N141j3248j332
223h324K1228j647j3969L032O36K33M159p07j558o247O879J3783j7354j0532J5364
$$ plain form
238 4976 2523 3586 9550 -5899 -4537 9401 2592 -3348 -859 2407 -675 -823 8781 -4090 -11865
253 -11865 10495 7057 -8466 -3816 -859 3710 620 -1974 2590 -10373 -100 12478 -11237
266 -11237 -4999 5620 -8330 6284 3271 -12950 -938 -749 306 435 -8733 4353 1408 -6971
280 -6971 4060 -7166 -7488 7023 1824 -505 -4373 -2793 4282 -4053 2525 1678 -11217 8837
294 8837 10399 -7568 -554 -555 273 7014 339 804 803 2012 7914 -2332 -4081 5626 3978 3494 3839
311 3839 -1060 -2612 3882 10170 -2668 -5816 7631 1762 275 6478 -4656 -3868 5834 3282 -343
326 -343 -4068 -138 4408 611 -403 -2259 -2351 3475 2289 -3146 -4381 1670 5822 -2565 -1915 96
342 96 -6035 3010 6341 -6188 -3801 1917 993 -788 -3364 -1643 -1936 40 4447 -2790 -5911 831
$$ packed form
238D976k453J063N964j5449J362J3938o809n940K489L266l082j48R604j2871p775
253a1865K2360l438j5523M650K957M569l090k594M564j2963J0273J2578k3715
266a1237O238J0619j3950J4614l013j6221J2012J89J055J29r168J3086k945q379
280f971J1031j1226l22J4511n199k329l868J580P075q335O578q47j2895K0054
294H837J562j7967P014jQ28O741o675M65jJ209N902j0246j749R707j648m84L45
311C839m899j552O494O288j2838l148J3447n869j487O203j1134P88R702k552l625
326c43l725L930M546l797j014j856r2N826j186n435j235O051M152q387O50K011
342I6o131R045L331j2529K387N718r24j781k576J721k93J976M407p237l121O742
$$ plain form
358 831 1142 -922 -1510 -612 -48 183 5142 -2049 -8391 5496 5318 -2242 3024 -320 -1783 4785 2998
375 2998 -618 -2884 1469 7203 634 -2078 1034 -1493 1768 4330 -2310 -3579 2578 3602 -2381
390 -2381 -2570 565 -2163 792 4508 -3146 -5669 2702 4058 -1431 -1745 -766 -1877 2770 3442 -2990
406 -2990 -3231 666 4694 108 -5728 1788 456 -2912 4411 -2878 -7599 3060 831 -3883 -2834
421 -2834 -3894 -415 163 -1002 -3961 -6894 1481 1793 -5742 -1371 -1076 -2805 153 -617 -659 -5564 -1600
438 -1600 7803 -3696 -5491 3975 -2651 -492 3328 -4357 -2175 1723 2135 25 -4984 -398 1241
453 1241 75 2529 -3526 -2528 4207 1254 -140 -1999 24 4803 -886 2328 4108 -5160 4871
468 4871 7894 -3477 2446 4163 127 5583 2826 -25 1219 1541 7159 1056 -5113 3525 3159
$$ packed form
358H31L11k064n88Q98N64K31M959p191o342J3887j78p560N266l344j463O568j787
375B998l616k266M353N734o569k712L112k527L261K562o640j269O157J024n983
390b381j89L135k728K955L716p654k523Q371J356n489l14R79j111M647O72o432
406b990k41L897M028m586n836P516j332l368P323p289m721J0659k229m714J049
421b834j060L479N78j165k959k933Q375L12p535M371K95j729K958p70m2m905L964
438a600R403j1499j795R466o626K159L820p685K182L898M12k110n009M586J639
453A241j166K454o055R98O735k953j394j859K023M779n689L214J780r268J0031
468D871L023j1371N923J717m036N456k757k851J244L22N618o103o169Q638l66
$$ plain form
483 3159 223 1443 -2472 -1088 2162 514 -551 -3557 -419 1839 -3358 481 74 -5908 2545
498 2545 3051 -5308 -248 93 -2124 2803 -1563 -2736 323 -1276 4115 -450 -7563 3296 2173
513 2173 -3567 2304 -2577 -2856 3301 -49 -1155 -2058 -561 3419 -1473 732 2329 -3740 3471 4455
529 4455 -2228 1315 858 3799 4006 -2113 3177 1509 560 8115 -1741 -2458 7442 234 975 3219
545 3219 -1612 1789 625 1108 2005 -4518 1410 2070 -3552 1441 -1962 -3085 1388 -1064 510 -4849
561 -4849 -4047 6364 -3709 -4336 2610 -5731 1340 3504 -7352 351 384 -2657 2188 -3986 -979
576 -979 1294 -4816 2449 -909 -5856 2562 -1672 -2535 860 -3691 -861 -287 -283 1187 -6562 41 6052
593 6052 -4898 -16 2453 -4058 3473 2485 -2907 2235 -660 2064 4138 -3173 1827 2520 -2171
$$ packed form
483C159k936J220l915J384L250j648j065l006L138K258n197L839m07n982Q453
498B545N06q359N060L41k217M927m366j173L059j599N391m565p113J0859j123
513B173n740N871m881k79O157l350j106r03J497L980m892K205J597o069P211R84
529D455o683L543m57K941K07o119N290j668r49P555r856p17R900p208P41K244
545C219m831L401j164M83Q97o523N928O60n622M993l403j123M473k452J574n359
561d849Q02J0411j0073o27O946q341P071K164j0856P703L3l041M845o174L007
576i79K273o110P265l358m947Q418m234q63L395m551K830N74MJ470p749O603O011
593F052j0950M882K469o511P531r88n392N142k895K724K074p311N000O93m691
$$ plain form
608 -2171 5159 834 -3751 4430 1783 -779 1792 -1318 420 1634 1410 997 -4126 1296 5057 -3170
624 -3170 -862 1459 -1754 2590 326 -1569 970 -2159 2952 1670 -4650 2350 -10 -2360 4596
639 4596 -2613 -3654 3038 -496 457 -1398 -3448 2033 -593 85 -662 -5650 2116 1861 -3762 -148
655 -148 -2407 -657 2017 -2818 653 -2190 -2829 6011 -3114 -3584 3988 -3190 1272 2723 -5138 1374
671 1374 1537 361 3178 -4207 191 4094 -2101 2805 -369 -3131 4944 981 -573 874 -2150
686 -2150 3908 1033 -1774 3361 -2872 501 6024 -4032 -145 3223 -1531 3734 198 -2696 2894
701 2894 -360 2012 1760 -4729 2604 2990 -2601 2294 -963 -2458 3177 -158 -1164 -1259 -1633 2670
717 2670 -1087 -1935 1145 -3278 936 2147 -4239 -571 140 -1360 1730 -2650 -1945 1774 -2057 1363
$$ packed form
608b171P330m325m585Q181k647k562K571l110J738J214k24m13n123N422L761q227
624c170K308K321l213M344k264j895K539l129N111j282o320P000k360k350O956
639D596p209j041O692l534R53j855k050N481k626O78p47m988P766k55n623L614
655a48k259J750K674m835L471k843o39Q840r125m70P572p178M462J451p861O512
671A374J63j176K817p385M398L903o195M906l174k762Q075l963j554J447l024
686b150O058k875k807N135o233L373N523j0056L887L368m754N265l536k894N590
701B894l254K372k52o489P333L86n591M895l257j495N635l335j006r5l74M303
717B670l757q48L080m423M214J211o386L668P11j500L090m380P05L719l831L420
$$ plain form
733 1363 31 -5191 2648 985 -2814 1742 -1904 -1134 2357 -794 225 -1518 -793 3702 -1497 -804
749 -804 1801 -1771 2424 1889 -2426 897 181 2089 1788 -2919 2324 749 -1151 5066 -1744 -1938
765 -1938 4799 -789 1078 1990 -2339 2351 1082 65 2237 -2545 2107 3394 -2373 1263 421 -791
781 -791 2741 -580 -59 4 -1506 3262 -1202 -2533 2413 -2143 -131 2058 -3765 -569 552 -1820
797 -1820 523 -2534 -1494 718 -2593 199 -818 -4187 845 656 -2835 -767 -1150 -362 -26 -925
813 -925 -608 -2248 -105 1900 -1616 -1138 1019 -1196 599 652 -1514 -92 453 488 255 -1206 180
830 180 964 -398 1120 74 -1145 1907 1692 -545 272 811 964 1370 474 408 -75 1177 2526 -216
848 -216 -499 1535 532 971 796 -672 179 564 905 -143 -1964 313 681 -1141 701 -1193 -2130
$$ packed form
733A363j332n222P839j663l799M556l646P70L491l151J019j743P25M495n199O93
749h04K605l572M195n35m315L323p16J908l01m707N243j575j900O217o810j94
765a938O737n588J867R12m329M690j269j017K172m782M652J287n767L636q42j212
781g91L532l321N21O3j510M768m464j331M946m556K012K189n823L196J121k372
797a820K343l057J040K212l311K792j017l369N032j89l491K068l83P88L36q99
813i25L17j640K143K005l516M78K157k215J795N3k166J422N45L5k33j461J386
830A80P84j362J518j046j219L052k15k237Q17N39J53M06q96o6m83J252J349k742
848b16k83K034j003M39j75j468Q51L85L41j048j821K277L68j822J842j894r37
$$ plain form
865 -2130 1033 -131 -1999 -1229 -859 -31 -786 -1194 -442 -1760 82 896 -1367 -1087 25 16 -127 -476
883 -476 -299 -762 196 1613 -1000 -1670 1053 321 54 136 -789 -553 1050 903 -688 -640 627 740 393
902 393 263 41 364 561 1407 613 -903 1162 1514 122 1476 239 -330 2221 1058 -288 -137 445
920 445 1987 -19 -552 875 -708 881 1042 -1388 29 678 227 325 -1177 372 -40 -1128 1799
937 1799 -614 -1949 1333 -254 -417 745 -1862 250 1313 -98 -97 -1588 234 1367 -1549 -335
953 -335 45 -1299 907 -579 -1173 -284 -999 437 -976 -1672 685 -1706 -949 1522 -2144 -1096 878
970 878 -614 441 -1106 -1351 1514 181 66 35 -1819 1606 1178 -1491 888 267 -287 1339 -357
987 -357 514 411 -523 2169 -408 -595 2010 -1527 411 2405 -1938 174 1235 -263 2078 -1159
$$ packed form
865b130L163j164j868P70L70Q28p55m08P52j318J842Q14k263K80J112rj43l49
883d76J77m63R58J417k613o70K723p32k67Q2r25K36J603j47j591M8J267J13l47
902C93j30k22L23J97Q46p94j516K065L52j392J354j237n69K551j163j346J51N82
920D45J542k006n33J427j583J589J61k430J417O49m51R8j502J549m12j088K927
937A799k413j335L282j587j63J162k607K112J063j411Jj491J822J133k916J214
953c35L80j344K206j486n94Q89p15J436j413o96K357k391P57K471l666J048J974
970H78j492J055j547k45K865j333j15l1j854L425m28k669K379o21n54J626j696
987c57Q71j03r34K692k577j87K605l537J938J994m343K112J061j498K341l237
$$ plain form
1003 -1159 -464 2637 -1077 730 493 -2121 2666 645 -2187 1856 -677 240 1515 -1657 974 -484
1019 -484 -1667 2519 -1740 -898 1361 -2710 946 613 -3206 513 -1027 -340 1413 -3892 598 1413
1035 1413 -3056 1694 -1230 -2378 3119 -1686 -1031 1244 -2519 1275 -105 -1528 2173 -2215 -123
1050 -123 2783 -2035 584 328 -1357 2370 -855 -1139 1416 -845 2413 -73 -2837 3351 156 -677
1066 -677 2394 -1904 772 2231 -1310 1560 122 -352 2650 -1050 581 1865 -2070 1772 1448 -1558
1082 -1558 1235 -569 451 1809 -1812 509 346 -769 2453 -1904 -1793 2480 -1717 127 672 -2720
1098 -2720 1554 -217 -2123 1287 -2481 -366 1721 -2854 646 72 -2983 2086 -670 -1884 846
1113 846 -1741 800 730 -2907 1640 -485 -951 2184 -2771 -282 2190 -2078 968 -84 -1863 2608
$$ packed form
1003a159O95L101l714J807k37k614M787k021k832M043k533R17J275l172K631j458
1019d84j183M186m259Q42K259m071L656l33l819L719j540O87J753n305M490Q15
1035A413m469M750k924j148N497m805O55K275l763L794j380j423L701m388K092
1050a23K906m818K619k56j685L727l225k84K555k261L258k486k764O188l195q33
1066f77L071m298K676J459l541K870j438m74L002l700J631J284l935L842l24l006
1082a558K793j804J020J358l621K321j63j115L222m357J11M273m197J844N45l392
1098b720M274j771j906L410l768K115K087m575L500n74l055N069k756j214K730
1113H46k587K541p0l637M547k125m66L135m955K489K472m268L046j052j779M471
$$ plain form
1129 2608 -1206 -245 1952 -2383 1965 1306 -2459 2694 -386 -1120 3115 -1211 499 1257 -1280 2902
1145 2902 -59 -1386 2896 -849 559 1765 -2165 1950 1063 -1025 2055 -1206 455 2068 -2028
1160 -2028 1467 513 -1897 2463 -877 -1415 1699 -2021 260 874 -1922 1212 -861 -995 1408 -2276
1176 -2276 -226 1089 -2238 692 -445 -1967 1186 -1365 -186 698 -1993 1038 -317 -1818 1651
1191 1651 -1334 -1045 1737 -1968 233 879 -1914 1253 -325 -767 1568 -1791 413 1592 -2178 1245
1207 1245 475 -1659 2023 -686 -264 1484 -1253 1363 387 -1344 2057 -640 -338 2265 -1419 518
1223 518 1337 -1241 1558 -220 -1201 2112 -977 556 1417 -2272 1579 777 -1785 1697 -726 -742 1826
1240 1826 -1582 230 365 -1605 1705 -665 -1115 1483 -1497 339 782 -2038 678 -162 -984 1067
$$ packed form
1129B608l814R61K197m335M348o59l765N153l080p34M235m326J710P58k537M182
1145B902k961j327M282l745J408J206l930M115q87k088L080l261J661J613m096
1160b028L495r54k410M360l340n38L114l720K281O14k796L134k073j34K403l684
1176b276K050J315l327K930j137j522L153k551J179Q84k691L031j355j501L469
1191A651k985K89K782l705K201O46k793L167j578m42K335l359K204J179l770L423
1207A245p70k134L682k709M22J748k737K616r76j731L401k697L02K603l684J937
1223E18Q19k578K799j778r81L313l089J533Q61l689L851q02k562L482k423j6K568
1240A826l408J812J35j970L310k370m50K598k980J836M43k820K716q40q22K051
$$ plain form
1256 1067 -1750 102 784 -1829 1130 -359 -1696 1732 -1033 -953 660 -1577 696 639 -1570 921
1272 921 -924 -470 1204 -1694 -61 638 -1126 1043 -214 -723 791 -453 927 333 -1289 1484
1288 1484 78 -470 1536 -969 349 1872 -494 632 546 -376 1842 -165 -95 1270 -959 1036
1304 1036 863 -854 866 478 -287 1474 -661 -12 613 -667 1024 -293 -812 1229 -567 -244 895
1321 895 -1153 220 552 -815 534 -822 -524 991 -1317 -174 172 -1630 455 -278 -1313 305
1337 305 -790 -403 105 -1143 -202 -567 -894 844 -1169 -757 747 -795 -11 161 -865 743 -273
1354 -273 -89 373 -953 887 1005 -946 761 179 -600 1266 -199 195 732 -354 966 305 -197
1371 -197 962 -197 570 1007 -910 623 713 -128 820 -172 -28 980 -131 506 35 -634 1033 -150
$$ packed form
1256A067k817J852O82k613K959j489j337L428k765Q0J613k237K273n7k209K491
1272I21j845M54J674k898J633O99j764K169j257n09J514j244J380n94j622K773
1288A484j406n48K006k505J318J523k366J126q6r22K218k007P0J365k229J995
1304A036j73j717J720l88p65J761k135O49O25j280J691j317n19K041j796L23J139
1321H95k048J373L32j367J349j356K98J515k308J143L46j802K085p33j035J618
1337C05j095L87N08j248R41l65l27J738k013M12J504j542P84J72j026J608j016
1354b73J84M62j326J840J18j951J707n82p79J866j465L94N37j086J320o61n02
1371a97J159j159P67M37j917J533R0q41R48r92J44J008j111O37m71o69J667j183
$$ plain form
1389 -150 -637 938 -555 -139 412 -497 3 -375 -315 381 -562 -562 -6 -985 -9 -260 -1307 -115 -308 -160
1409 -160 -384 -981 -39 -82 -441 -54 -810 -589 344 -653 -324 130 -328 141 -141 -611 319 -283 -105 506
1429 506 -95 -28 257 -240 555 293 -383 411 546 341 -140 -119 696 361 134 716 -94 310 965 -41
1449 -41 370 462 301 302 124 209 236 -228 622 465 -287 383 116 -39 579 130 -90 162 183 113 -566 -323 285
1472 285 -194 -295 -241 -386 -123 -152 -489 -218 -375 -285 -430 -532 184 -352 -660 -42 -48 -363 -176 -272 162 78
1494 78 -343 -604 -485 257 -226 -605 -220 342 77 -417 52 199 -215 343 99 -134 469 333 -2 378
1514 378 203 63 56 246 823 -72 -1 782 202 559 337 -189 752 544 -158 312 106 551 568 -407 571
1535 571 181 -268 575 284 -180 346 -289 111 50 -200 -192 -579 217 359 -941 -205 253 -134 -192 -506 -401
$$ packed form
1389a50m87J575j493M16N51r09N00l78O0O96r43%N56r79R76k51j047J192j93J48
1409a60k24n97R42m3l59L87p56K21R33r97L29M54m58M69k82m70R30o02J78O11
1429E06o01O7K85m97P95k62o76P94J35k05m81K1Q15l35k27N82q10M04O55j006
1449d1M11R2j61Jj78Q5K7m64Q50j57p52O70k67j55O18m49k20K52K1p0o79K43O08
1472B85m79j01N4j45K63k9l37K71j57R0j45j02P16n36l08O18ol15J87r6M34q4
1494G8m21k61J19P42m83l79L85N62k65m94M69J47m14N58k44k33O03j36l35L80
1514C78j75j40pJ90N77q95P1P83n80L57k22n26R41k08p02M70k06M45J7r75R78
1535E71l90m49Q43k91m64N26o35M00o1k50Ql87P96J42j300P36M58l87n8l14J05
$$ plain form
1556 -401 36 -266 -186 -420 -631 132 -449 -740 551 -528 -756 341 -354 -356 -207 -301 65 -156 -257 -56
1576 -56 -328 393 418 -868 107 401 77 411 -285 88 277 -134 454 -192 -296 787 -191 101 800 -206
1596 -206 186 467 -146 253 64 209 904 -541 411 586 -348 812 380 -1032 787 63 223 447 -596
1615 -596 701 38 -432 965 -421 -301 803 -532 144 34 -896 412 -215 -512 570 -1026 257
1632 257 387 -1441 280 -39 -724 643 -920 -594 383 -835 360 -721 -811 720 -574 -323 570
1649 570 -1189 23 200 -1050 604 -197 -193 939 -574 118 313 -828 931 342 -788 855 -244
1666 -244 -22 810 -720 467 505 -50 1258 -477 123 1124 -581 518 602 -683 1018 404 -108 594
1684 594 -732 539 740 -663 869 -211 -678 1312 -473 -496 710 -614 457 11 -762 532 -412
$$ packed form
1556d01M37l02Q0k34k11P63n81k91J291j079k28J097o95kJ49r4L66k21j01K01
1576e6k72P21K5j286R75K94l24L34o96L73J89m11N88o46j04J083r78K92O99j006
1596b06L92K81o13L99j89J45O95j445R52J75r34J160m32j412J819p24J60K24j043
1615e96J297o63m70J397j386J20J104j335O76j10r30J308o27k97J082j596J283
1632B57J30j828J721l19o85J367j563L26R77j218J195j081r0J531j294K51Q93
1649E70j759J212J77j250J654q01MJ132j513O92J95j141J759n89j130J643j099
1666b44K22Q32j530J187L8n55J308j735O00J001j705J099Q4j285J701o14n12P02
1684E94j326J271K01j403J532j080m67J990j785k3J206j324J071m46p73J294r44
$$ plain form
1701 -412 -296 735 -1202 279 250 -1129 672 -528 -856 622 -825 74 48 -1315 758 -471 -857
1718 -857 917 -984 -4 939 -1338 275 269 -421 997 -783 -357 1074 -703 466 339 -1364 932
1735 932 39 -539 676 -771 307 885 -639 906 -94 -601 1527 -529 -71 940 -819 759
1751 759 581 -846 793 -205 140 804 -952 733 650 -955 1124 53 -729 1142 -451 182 482
1768 482 -846 702 72 -736 1101 -688 -200 1103 -1121 280 301 -726 602 -417 -375 661 -888
1785 -888 311 61 -1236 859 -298 -754 496 -898 -49 292 -911 676 -258 -868 654 -694 -234
1802 -234 634 -930 509 -49 -692 569 -187 -40 676 -732 412 407 -681 1045 -131 -598 948 -301
1820 -301 151 872 -481 603 246 -182 933 -678 80 760 -635 725 787 -613 630 -47 -142 773
$$ packed form
1701d12J16J031j937J481k9j379J801j200l28J478j447Q99k6j363K073j229l86
1718h57J774j901R80R43k277J613oo90J418j780M26J431j777J169j27j703K296
1735I32q93n78J215j447J078N78j524J545j000n07K128k056M58J011j759J578
1751G59j78j427J639r98L45O64j756J685q3j605K079j071p82J871j593O33L00
1768D82j328J548o30q08J837j789M88J303k224J401K1j027J328j019M2J036j549
1785h88J199k50j297K095j157m56J250j394Q49L41j203J587r34o10J522j348M60
1802b34Q68j564J439n58o43J261p56J47P16j408J144nj088J726j176m67J546j249
1820c01M52P21j353J084l57m28J115j611P58O80j395J360O2j400J243o77r5R15
$$ plain form
1838 773 -574 386 536 -313 795 -155 -593 893 -616 -185 775 -771 431 -23 -594 420 -671
1855 -671 54 328 -1023 385 -19 -525 390 -365 -404 237 -1121 91 -2 -675 363 -378 -566 428 -664
1874 -664 88 264 -362 76 -126 -361 179 -367 -14 92 -404 506 13 -424 636 24 -143 757 -83 358
1894 358 219 -215 639 19 162 727 -245 305 515 -193 383 203 32 331 -63 99 302 -255 348 27
1914 27 27 683 -23 -346 869 89 74 -36 -124 294 -182 -200 38 -361 -229 245 -195 -102 -18 -346 15 -59 -185
1937 -185 -170 -233 397 -181 -563 85 -249 -265 40 -341 -298 46 -234 -51 -453 -53 122 -327 130 118 -417 14
1959 14 -77 18 -100 -284 -253 88 211 164 -131 -100 357 2 160 457 101 -48 121 384 16 36 187 240 351
1982 351 126 62 131 364 143 -23 -71 213 375 37 -22 170 -126 96 -156 24 115 45 -93 -447 -171 -185
$$ packed form
1838G73j347R60J50q49J108r50m38J486j509M31R60j546J202m54n71J014j091
1855f71P25K74j351J408m04n06R15p55l9O41j358J212r3o73J038p41j88R94j092
1874f64P52J76o26M38k02k35N40n46L53J06m96R10m93m37J060o12j67R00q40M41
1894C58j39m34Q54o20J43N65r72N50K10p08N76j80j71K99l94J62K03n57O03l21
1914B7%O56p06l23J215p80j5j10q8M18m76j8K38l99J32M74m40R3Q4l28L61p4j26
1937a85J5o3O30n78l82O48l34j6L05l81M3L44k80J83m02M00J75m49M57j2n35M31
1959A4r1R5j18j84L1L41J23m7k95L1M57l55J58K97l56j49J69K63l68K0J51N3J11
1982C51k25o4O9K33k21j66m8K84J62l38n9J92k96K22k52J80R1p0j38l54K76j4
$$ plain form
2004 -185 -328 -50 109 -508 -165 19 -216 -54 -235 -342 -138 -246 -105 -424 -325 512 -84 -336 203 20
2024 20 -232 30 -422 114 -31 -24 -218 -230 225 -77 -608 231 -18 -253 124 -3 314 92 -14 422 89
2045 89 -165 406 -181 81 664 -333 63 324 200 414 93 -86 552 -216 458 457 -395 689 4 -335 654
2066 654 267 -91 476 -84 354 24 -243 384 -300 -244 283 -652 169 282 -421 -112 -68 -173 188 -361 97
2087 97 55 -436 296 -60 -543 444 -370 -181 202 -569 -4 -99 -218 355 -648 -381 479 -710 291 121
2107 121 -842 473 -332 -472 208 -322 452 41 -523 304 5 -340 884 -500 -266 484 -259 423 -5
2126 -5 -66 403 -90 -24 689 -669 583 228 -380 739 -158 -267 564 16 225 356 -232 578 -177 -422
2146 -422 548 -311 -82 438 -290 333 125 -447 365 -210 -218 221 -786 260 171 -616 521 -133 -554 285
$$ packed form
2004a85j43K78J59o17L43J84k35J62j81j07K04j08J41l19R9Q37n96k52N39j83
2024B0k52K62m52N36j45Pj94j2M55l02n31Q39k49k35L77j27L17k22j06M36l33
2045H9k54N71n87K62N83r97L96K61j24K14l21j79O38p68O74jq52J084o85l39R89
2066F54l87l58N67n60M38l30k67O27o84N6N27r35Q21J13p03L09M4j05L61n49M58
2087I7m2m91P32l56m83R87q14J89L83p71N65r5j19N73j003K67Q60j189J001j70
2107A21r63J315q05j40O80n30P74m11n64Q27k99l45J224j384K34P50p43O82m28
2126eo1M69m93O6P13j358J252l55o08J119q97j09Q31n48K09J31n88Q10p55k45
2146d22R70q59K29N20p28O23k08n72Q12n75qM39j007J046q9p87J137o54m21Q39
$$ plain form
2166 285 -663 -108 -185 -508 431 -280 -583 561 -503 -253 625 -494 275 50 -656 449 -176 -188 450
2185 450 -677 462 332 -454 654 -194 -252 663 -315 62 469 -502 585 143 -136 673 -337 52 629
2204 629 -329 502 262 -187 722 -202 59 486 -463 535 430 -530 646 -71 -295 740 -302 -137 511
2223 511 -242 636 -227 -295 623 -461 -46 512 -1060 218 175 -617 360 -487 -362 308 -362 12 -136 -1005
2243 -1005 670 -428 -477 409 -988 -185 466 -522 108 -408 -125 573 -631 -149 757 -672 447 240
2261 240 -617 572 -307 -362 336 -221 686 148 -303 663 -109 -174 686 -487 -56 247 -287 683 106 40
2281 40 542 -290 272 755 -740 566 338 -369 683 -174 -224 854 -284 293 -45 -537 605 -338 -443
2300 -443 470 -629 -69 633 -514 553 -22 -359 155 -195 -196 214 -564 563 -97 -868 353 -411 -425
$$ packed form
2166B85r48N55p7l23R39p11l03J144j064K50Q78j119P69k25p06J105o25j2O38
2185D50j127J139j30p86J108q48n8R15r78L77M07r71J087m42k79Q09j010L89N77
2204F29r58Q31k40m49R09r24K61M27r49R98j05r60J176p17k24J035j042J65O48
2223E11p53Q78q63o8R18j084M15N58j572J278m3p92R77q47J25O70o70L74j48q69
2243a005J675j098m9Q86j397Q03O51r88O30n16K83O98j204M82R06j429J119k07
2261B40q57J189q79n5O98n57R07n38m51R66p72o5Q60j173M31L03n34R70n77o6
2281D0N02q32N62M83j495J306k28p07J052q57n0J078j138N77l38m92J142r43j05
2300d43R13j099N60P02j147J067n75l37N14l50jM10p78J127o60p71J221p64j4
$$ plain form
2319 -425 263 -634 138 -73 -380 549 -324 -211 504 -716 -19 309 -585 514 -116 -513 383 -386 24
2338 24 512 -598 489 84 -282 761 -244 -389 653 -160 192 174 -688 715 -26 -371 656 -419
2356 -419 302 601 -370 552 398 -336 687 -218 35 643 -294 439 65 -448 538 -52 -106 543 -263 188
2376 188 347 -297 337 -478 -341 587 -705 74 304 -699 381 -194 -680 282 -536 -334 196 -508 170
2395 170 -214 -555 479 -379 -320 394 -341 -43 252 -523 452 -111 -11 263 -504 -63 264 -571 383 40
2415 40 -632 554 -234 93 358 -308 298 167 -59 359 -63 107 680 -200 284 229 -119 517 42 -81
2435 -81 486 -304 298 262 -445 665 -76 -427 508 -242 132 187 -459 383 8 -153 531 -219 35 363 -647
2456 -647 252 275 -442 134 -253 -237 66 -343 140 170 -786 104 -82 -392 221 -332 -327 222 -292 -90 -242 -363
$$ packed form
2319d25O88q97P72k11l07R29q73J13P15j220O97L28q94J099o30l97Q96p69M10
2338B4M88j110J087m05l66J043j005j45J042q13L52j8q62J403p41l45J027j075
2356d19P21K99r71R22j54p34J023r05K53O08r37P33l74n13R86n90n4O49q06M51
2376A88J59o44O34q15J37R28j292P79K30j003J080n75m86R62q18K02N30p04O78
2395A70l84l41J034q58N9P14p35K98K95p75R75n63J00K74p67M41L27q35R54l43
2415D0o72J186p88L27K65o66O06j31k26M18m22J70N73q80M84n5l48O36m75j23
2435h1N67p90O02l6p07J110p41l51R35p50L74N5o46Q42l75j61O84p50K54L28j010
2456f47Q99K3p17N76l87J6L03m09M83L0r56Q90j86l10O13n53NN49n14K02j52j21
$$ plain form
2478 -363 333 -394 -306 32 -122 140 -14 -297 288 118 -383 284 -177 279 -20 -514 580 118 74 317
2498 317 -156 45 556 -363 182 44 -105 84 -4 103 288 -353 -2 268 -87 310 215 -153 341 -113 -60
2519 -60 118 -36 496 24 -165 434 -53 -23 112 -144 -79 -72 -190 77 -111 -117 -81 -118 20 -134 -395 306 122
2542 122 -300 91 -409 -89 -52 -311 120 121 -283 -16 -300 24 192 -542 -304 -133 -162 -141 -115 39 16 -235
2564 -235 27 197 112 128 143 -184 240 315 -337 58 128 145 55 13 91 -18 128 116 154 32 134 173 254 331 88
2589 88 52 -85 -47 84 -116 133 172 202 66 -45 -184 15 218 -21 -137 332 -102 -170 -16 103 -121 -304
2611 -304 163 174 -229 114 -138 -103 -15 -53 -280 55 62 0 -361 -360 -100 -64 -62 190 -361 -148 1 -32 52 157 -136
2636 -136 -36 -254 -56 151 12 246 -8 -133 265 -95 -76 136 -120 -103 -1 166 224 -79 69 231 160
$$ packed form
2478c63O96p27Q8L38j54K62j54k83N85j70n01O67m61M56k99m94J094m62m4K43
2498C17m73K01N11r19N45j38j49J89q8J07J85o41L51K70l55L97r5l68M94m54N3
2519f0J78j54N32m72j89N99m87L0J35k56O5Pj18K67j88oL6l7J38j54k61P01j84
2542A22m22L91n00L20L7k59M31Jm04K67k84L24J68p34K38J71k9K1K6J54k3k51
2564b35K62J70q5J6J5l27M24P5o52L95P0J7r0m2P8j09J46j2L8j22J02L9Q1P7k43
2589H8l6j37L8J31k00K49L9L0j36j11j39J99K03k39j16M69m34o8J54J19k24j83
2611c04M67J1m03L43k52L5Q8l8k27L35Po2l61JK60L6KK52n51K13J49l3Q4J05k93
2636a36J00k18J98K07j39K34k54j25L98l60J9K12k56J7J02J67N8l03J48J62p1
$$ plain form
2657 160 215 225 -10 243 195 73 162 -74 197 72 -37 442 300 -198 177 38 -211 296 -161 14 -13 -32
2679 -32 111 -221 -151 170 -344 45 59 -427 -28 -143 -314 332 -305 -165 -60 -84 408 -105 -363 291 -255
2700 -255 -406 483 -112 -49 -56 -310 418 -33 -156 412 -343 139 130 -654 236 13 -215 407 -281 240 204 -157
2722 -157 -25 -169 -214 370 -470 80 480 -149 -101 -201 -192 462 230 -597 200 -322 99 -59 -271 543 -16
2743 -16 -407 393 -124 118 127 -421 162 116 -385 291 -150 -126 327 -444 234 359 -504 125 -37 6 478 -516
2765 -516 -36 12 -329 121 -218 -241 355 -185 -400 408 -273 58 76 -253 388 -337 31 441 -413 179 57
2786 57 -697 236 40 -231 260 -57 -115 128 -477 381 -42 -247 650 -138 -16 330 -167 185 361 -31 607
2807 607 -67 -51 514 -174 279 401 -506 626 332 -404 542 -165 124 -2 -351 319 -64 -210 396 -143
$$ packed form
2657A60N5J0k35K53m8j22Q9k36K71j25j09M79j42m98L75j39k49N07m57J75k7j9
2679c2J43l32P0L21n14L89J4m86L99j15j71O46o37J40J05k4M92n13k58O54n46
2700b55j51Q89n95O3pk54P28m51j23N68p55M82rp84Q90k23k28O22o88N21l6l61
2722a57J32j44m5N84q40N50M00o29M8j00RO54k32q27P97n22M21j58k12Q14n59
2743a6l91Q00n17K42Rn48N83m6n01O76m41K4M53p71O78J25q63O29j62M3M72r94
2765e16M80M8l41M50l39k3N96n40k15Q08o81L31J8l29O41p25L68M10q54N92j22
2786E7p54R33j96k71M91l17n8K43o05Q58m23k05Q97p88J22L46m97L52J76l92O38
2807F07o74J6N65o88M53J22r07J132k94p36R46p07K89j26l49O70l83j46O06n39
$$ plain form
2827 -143 19 202 -220 131 93 -244 118 -286 -59 235 -429 247 546 -535 203 -59 -422 159 -257 143
2847 143 62 -448 228 -231 -274 376 -418 -185 128 -363 -73 21 -472 451 -203 -90 272 -137 262 127 -490
2868 -490 379 -38 58 525 -342 -18 107 -42 345 -95 -130 516 -242 90 337 -473 71 354 -230 183 -54
2889 -54 18 500 -120 285 23 -19 474 -124 -65 200 -46 -130 222 -392 205 56 -230 254 -304 -9 -114 -202
2911 -202 383 41 -336 298 -119 -238 142 -552 -34 254 -404 44 -290 -350 265 -434 -178 303 -359 -112
2931 -112 -139 -297 52 -311 -25 267 -503 100 51 -368 450 -5 -207 6 -107 174 169 -103 321 53 -34 276
2953 276 6 147 189 -264 199 194 -178 440 -108 77 242 -284 93 98 -32 372 -67 -56 290 -73 117 315
2975 315 -263 336 -95 -340 304 -274 207 -39 -253 120 -35 -232 365 97 -47 22 -115 0 -124 -114 247
$$ packed form
2827a43J62J83m22L51l8l37L62m04K27K94o64O76K99j081P38k62l63N81m16M00
2847A43q1n10O76m59m3O50p94K33L13m91K90R4m93R23o54J13L62m09L99j35o17
2868d90Q69m17R6M67q67L24J25j49L87m40l5O46p58L32K47q10N44K83n84M13k37
2889e4P2M82o20M05k62m2M93n98N9K65k46q4L52o14N97j49k86M84n58K95j05q8
2911b02N85l42l77O34m17j19L80o94N18K88o58M48l34o0O15o99K56M81o62K47
2931a12k7j58L49l63K86K92p70O03m9m19Q18m55k02K13j13K81nk72M24k68q7L10
2953B76k70J41M2m53M63nl72O18n48J85J65n26L77Nj30M04m39J1L46l63J90J98
2975C15n78N99m31k45O44n78M81k46k14L73j55j97N97k68j44O9j37J15j24J0L61
$$ plain form
2996 247 -33 -355 124 -102 -9 149 -69 -94 -35 -318 49 -349 108 -51 -191 73 60 -200 288 -101 -87 386
3018 386 -165 67 -143 -210 286 -11 102 464 -116 24 74 194 219 224 39 271 68 74 109 -221 168 317 91
3041 91 278 26 -15 -7 -57 128 63 121 309 -65 21 136 -243 -123 288 86 -34 -116 -152 2 -57 -250 -175 -103
3065 -103 52 -2 -222 28 -198 78 -110 123 -69 -7 -141 -62 69 -252 40 -205 -37 10 -204 -15 -132
3086 -132 34 49 -150 240 -24 29 9 -14 -264 -48 93 78 50 115 -166 -117 107 -217 241 56 166 -113 -161
3109 -161 102 84 172 11 -9 -9 51 344 34 -73 -40 32 18 141 174 73 150 26 159 69 312 107 -2 -98
3133 -98 -104 77 -98 107 198 21 -47 -161 -50 -143 143 -80 46 -147 -114 -51 -148 75 -51 48 22 -194 -19 21
3157 21 -448 214 -180 -209 -132 79 -67 -70 -76 84 90 -86 -170 -34 -56 275 83 40 114 96 31 88 -132 505 -85
$$ packed form
2996B47k80l22M79k26R3J58k18k5N9k83L67l98M57j59j40K64j3k60M88l89J4M73
3018C86n51K32k10o7M96k97J13L62n80J40N0J20K5Nj85K32k03OL5l30L89J49k26
3041I1J87k52m1Qn0J85o5N8J88l74Q6J15l79J20M11k02j20q2l6J54n9j93P5P2
3065a03J55n4k20K50k26K76j88K33j92O2j34P9J31l21K92k45J68M7k14J89j17
3086a32J66J5j99L90k64N3k0k3k50K16J41j5k8O5k81M9K24l24M58j85J10k79m8
3109a61K63j8Q8j61k0%O0K93l10j07L3P2j4J23L3j01P7j24J33r0K43k05j09r6
3133i8oJ81j75K05R1j77o8j14J11r3K86k23J26j93L3O3r7K23j26R9k6k16J75M0
3157B1m69O62l94k9P7K11j46loJ60Oj76q4J36k2L31j92m3P4j8o5N7k20O37n90
$$ plain form
3182 -85 -37 436 -73 69 275 -13 210 163 -54 185 -91 182 50 164 -40 -136 -19 416 -271 -14 312
3203 312 -10 9 10 -269 123 80 -191 56 -667 90 -152 -431 277 -263 -459 200 -251 -34 101 -291 80
3224 80 25 -210 123 88 -246 205 -12 -91 155 -167 -114 -260 -147 154 -403 12 166 -292 113 184 -56 182
3246 182 -240 252 74 -320 322 191 -129 287 -2 -79 575 62 150 262 -6 301 61 22 381 -248 179
3267 179 336 -86 173 75 -112 396 -50 25 310 -155 446 51 -476 291 -249 -132 321 -109 202 288 -244
3288 -244 218 -158 -135 187 -153 37 60 -477 46 -83 -373 331 -303 12 292 -402 368 -31 -240 151 -263
3309 -263 -311 48 -514 189 86 -642 201 -351 -94 376 -242 40 45 -162 321 -171 -84 426 -178 40 -81
3330 -81 -200 190 -28 -160 250 -105 -81 301 -300 68 31 -233 309 37 -209 338 -383 64 166 -240 456
$$ packed form
3182h5M8M73n09J42K06k88K23m7k17K39k76K73j32J14k04r6J17M35o87K57L26
3203C12l22J9Jk79L92m3k71K47p23P57k42k79P08n40j96O59m51K17J35l92L71
3224H0n5k35L33l5l34M51k17p9K46l22N3j46J13L01n57M15J54m58M05P1k40K38
3246A82m22M92j78l94O42j31l20M16k89p7O54n13Q8J12k68L07k40l9L59o29M27
3267A79J57m22K59r8j87N08m46P5K85m65O01l95n27P67n40J17M53m30L11Q6n32
3288b44M62l76K3L22l40J90K3n37N23j29k90P04o34L15K80o94P70l99k09L91m14
3309b63m8L59n62P03j03p28Q43n52K57M70o18K82Nk07M83m92Q7N10o04K18j21
3330h1j19L90k18j32M10l55K4L82o01L68l7k64N42k72k46N47p21M47J02m06O96
$$ plain form
3351 456 13 -135 382 -331 80 461 -368 317 -30 107 337 -250 -502 307 -302 278 182 -542 261 103
3371 103 3 130 -341 -19 17 -381 87 157 -307 304 -508 -31 265 -483 259 -88 -155 21 -125 16 4
3392 4 -357 21 232 -134 283 -205 89 239 -277 39 259 -103 598 -140 -226 378 -355 72 201 -195 236
3413 236 -36 -73 296 -103 -1 380 -391 261 132 -354 406 -194 1 283 -155 210 372 -50 292 30
3433 30 -270 250 -420 31 293 -370 182 -153 -434 351 -303 -260 228 -327 301 111 -641 431 -49 -338
3453 -338 239 -320 -12 192 -252 135 -140 -332 185 -379 -12 148 -539 180 -122 -258 207 -361 -225 -39
3473 -39 -134 185 216 -221 391 -2 66 362 -177 19 428 -198 260 -93 -127 210 -34 73 177 -105 417 -81
3495 -81 -138 164 77 -39 182 -128 245 208 -278 253 -48 19 393 -221 266 -40 -164 101 -88 -53 33 -377
$$ packed form
3351D56m43j48N17p13M11L81q29O85l47J37K30n87k52Q09o09N80r6p24Q03j58
3371A03j00J27m71L22L6l98M68P0m64O11q12M77K96p48P42l47o7J76j46J41j2
3392Dl61L78K11l66M17m88K94J50n16L16K20l62P01p38q6O04p33M27J29l96M31
3413B36k72l7L69l99J02L81p71O52j29m86P60o00J95K82m38L65J62m22L42k62
3433C0l00N20o70M51K62o63N52l35k81P85o54M3M88n55O28j90p52J072m80k89
3453c38N77n59L08K04m44L87k75j92N17n64L67J60o87P19l02j36M65n68J36J86
3473c9r5L19L1m37O12l93O8K96n39J96M09o26M58l53l4L37k44J07J04k82N22m98
3495h1n7L02q7j16K21l10L73l7m86N31l01O7L74o14M87l06j24K65j89L5Q6m10
$$ plain form
3517 -377 6 148 -266 117 122 -161 151 -257 -61 52 -17 23 34 -47 130 -465 -150 -156 -8 82 17 -321 12
3540 12 -130 -150 43 -115 -24 -78 -216 -90 115 -242 272 7 102 106 -360 264 54 -231 252 11 -126 276
3562 276 -184 -30 96 -98 53 291 12 215 12 95 122 -378 462 77 -257 436 -62 113 18 -210 -61
3583 -61 294 -45 258 27 24 -96 -23 -68 -18 -289 7 307 -26 40 -57 111 -8 -265 -32 -136 -39 197 14
3606 14 -111 -110 -138 74 156 153 -169 -111 10 65 -152 14 -70 -15 122 6 -124 -74 145 -33 35 -258 71 122 -81
3631 -81 260 -34 -66 -43 -169 69 5 -24 80 37 143 95 183 102 56 17 31 19 -8 192 -45 64 -5 28 -42 -11
3657 -11 -216 0 -49 5 -1 156 72 -11 130 -208 57 55 14 -88 64 7 -215 107 10 -62 -18 -109 -24 -295 -52
3682 -52 -114 157 -113 -49 -127 -156 138 -64 -119 -155 -44 285 79 -1 -245 244 -129 98 134 62 -43 -127 -120 16
$$ packed form
3517c77L83J42m14L83Nk83L12m08J96J13o9M0J1q1J77n95L15oJ48R0o5l38L33
3540A2j42k0J93j58R1n4j38J26K05l57N14k65R5Mm66O24k10k85M83k41j37M02
3562B76m60J54J26j94J51K38k79K03k03Q3K7n00Q40l85l34O93m98J75r5k28J49
3583f1L55l39L03k31lj20P3m5N0k71K96L00l33O6r7J68j19k57K33j04R7K36j83
3606A4j25Jk8K12Q2ll22N8J21N5k17J66q4N5J37j16j30N0K19j78O8k93L29N1k03
3631h1L41k94l2K3j26K38o4k9J04m3J06m8Q8q1m6l9J4j2k7K00k37J09o9L3p0L1
3657a1k05K16m9N4oJ57q4q3J41l38K65km1j02J52n7k22L22r7p2M4r1Q5k71K43
3682e2o2K71k70O4p8k9K94k02n5l6J11L29k06q0k44M89l73K27L6p2j05q4PJ36
$$ plain form
3706 16 -73 -202 -125 85 91 84 -110 -12 126 -84 122 95 -227 34 7 98 210 103 237 87 -2 167 -148 -20
3730 -20 116 64 121 -104 -126 345 -125 -102 84 70 -96 82 33 122 4 119 59 -78 63 -324 -417 -139 -209 -10
3754 -10 -67 -27 20 -156 -311 57 7 -259 -37 -120 -24 201 -120 20 36 225 -85 -197 223 -52 -237 41 56
3777 56 -81 246 -104 -117 315 46 117 -6 9 18 193 -147 159 -127 226 152 -286 52 -69 -100 168 -90 -58
3800 -58 82 -171 216 261 47 317 131 80 127 -47 133 -108 -174 142 -122 -195 260 -143 167 95 -39 122
3822 122 168 -371 13 -76 -148 255 -216 -21 93 -427 90 -125 36 229 -256 -15 70 -492 -136 -22 -118 130
3844 130 -30 -98 137 -102 92 47 -283 -76 -251 76 199 -174 32 -126 28 368 -50 7 359 -218 27
3865 27 252 124 244 -65 -173 169 122 -28 -26 -133 278 77 -283 275 9 -13 180 -110 -38 153 -133 268
$$ packed form
3706A6q9j29P7K10Opj94R8J38k10K06k7l22K61k7R1J12j07J34j50q9J69l15J28
3730b0J36n2N7k25k2M71m70K3J86j4j66J78m9Q9j18J15o0j37J41l87r3K78p0J99
3754a0n7M0M7j76j55L68n0k66K22q3R6K25l21J40J6J89l10j12M20k75j85K78J5
3777E6j37L27l50j3M32k69P1j23J5RJ75l40L06k86L53p4m38L38j21l1K68k58L2
3800e8J40k53L87M5k14K70j86n1M7j74J80k41o6L16k64p3M55m03L10p2j34J61
3822A22M6n39L84q9p2M03m71J95J14n20N17k15J61J93m85K41Q5n62L56J14r6K48
3844A30j60o8K35k39J94m5l30K07j75L27J23l73K06j58J54L40m18N7L52n77K45
3865B7K25j28J20l09j08L42m7j50Kj07M11k01l60N58k66k2J93k90P2J91k86M01
$$ plain form
3887 268 -34 75 96 -123 -29 39 -109 98 -23 -69 223 -97 -90 71 -141 351 4 -400 185 -186 -24 133
3909 133 -339 -192 -76 -179 326 74 -261 23 -210 34 -18 -165 291 7 -71 122 -26 134 302 -222 184
3930 184 219 -195 77 68 -6 -4 -356 -28 258 -271 132 192 226 414 -375 88 313 -325 336 3 -31 236 57
3953 57 56 87 -167 -25 -28 -290 317 -70 -48 328 -286 116 -20 -88 354 -171 -26 144 -346 -98 78 -336 -159
3976 -159 -42 -180 88 -217 -151 97 -181 175 90 -136 266 -222 1 41 -332 140 -146 -205 35 -195 -117 128
3998 128 -95 -80 -81 -99 278 -321 -242 373 -67 -89 71 -116 31 7 -40 265 -18 -180 142 -218 342 136 -82
4021 -82 149 -14 -99 189 -109 136 121 -74 183 -148 176 67 -22 19 204 14 100 -108 -124 121 -350 18
4043 18 -23 -207 131 32 -355 30 26 -339 107 -192 -51 173 -55 315 48 40 -23 159 -86 106 -409 5 16
$$ packed form
3887B68l02J09K1k19R4O8j48K07j21m6K92l20PJ61k12M92l47m04N85l71J62J57
3909A33m72J47J16j03N05k52l35K84k33K44n2j47M56k84p8J93j48J60J68n24M06
3930A84L5m14K72rp4Kl52L28K86n29M03O0L4J88p89M63K25o38O61l33l4K67j79
3953E7jL1k54J42lk62O07l87K2L76o14M02j36o8M42n25J45J70m90K48J76m14J77
3976a59J17j38K68l05O6K48k78L56q5k26M02m88K23M0l73M72k86n9K40k30P8K45
3998A28k23J5jj8L77n99P9O15m40k2J60j87J47k4m7L05k83j62L22l60N60k06k18
4021h2K31j63q5K88k98K45j5j95K57l31L24j09q9M1J85j90Q6k08j6K45m71L68
4043A8m1j84L38r9l87L85ml65M46k99J41K24k28L70k67qo3J82k45J92n15M14J1
$$ plain form
4066 16 -268 252 48 -127 83 31 -250 4 -180 157 46 -62 47 -162 -167 -4 -159 270 -13 -77 162 -168
4088 -168 7 20 -23 -124 -142 147 349 -166 -73 210 64 66 151 -119 236 227 -182 -55 2 -53 -20 -99 -17 17 -115
4113 -115 178 -228 44 18 -216 15 57 -203 126 -122 -128 -78 52 -96 -6 -102 154 -70 79 -11 44 -83 136
4136 136 -112 308 87 -77 153 -219 -189 72 -213 -20 146 -103 -53 159 -68 -14 124 -7 11 162 -85
4157 -85 -127 -113 -88 -35 -119 174 223 234 58 -169 121 -15 -23 26 -101 -175 -51 -284 117 -33 -134 126 -16 87
4181 87 23 -159 76 136 -269 95 -7 201 71 56 234 27 -43 -1 -113 81 89 -67 138 -47 -27 143 -132
4204 -132 -166 -117 -35 -186 30 -80 -80 -313 6 -152 -122 0 176 -94 133 -65 -156 136 -212 -17 -111 55 -148
4227 -148 -93 67 32 -440 42 76 131 -1 170 215 90 28 -63 -47 172 100 -37 136 -87 69 -64 11 67 -17
$$ packed form
4066A6k84N20k04j75K10n2k81K54j84L37j11j08J09k09nJ63j55M29k83o4K39l30
4088a68J75J3m3j01j8K89K02n15R3K83j46KQ5k70L55rm09J27N7n5L3p9Q2L4j32
4113a15K93m06K72k6k34K31M2k60L29k48oN0J30j48R0r6K56k24J49r0N5j27K19
4136A36k48M20k21j64K30l72L0K61k85J93J66k49N0K12k27N4J38j31J8J51k47
4157h5m2J4K5N3q4K93M9J1j76k27K90j36qM9j27p4J24k33M01j50j01K60j42J03
4181H7o4j82K35O0m05L64j02K08j30j5J78k07p0M2j12J94Qj56K05j85K0J70k75
4204a32l4M9Q2j51K16j10%k33L19j58L0J22J76k70K27j98r1K92l48J95r4J66k03
4227a48N5J60l5m72M82L4N5j32J71M5j25o2r1J6K19p2j37J73k23J56j33P5N6q4
$$ plain form
4251 -17 -42 246 52 -142 345 -97 169 63 272 55 -96 81 25 89 -23 -22 -193 42 -187 -42 267 -75
4273 -75 85 210 165 42 249 -244 -46 50 29 185 227 66 -52 -168 15 24 -146 -80 117 -31 -27 -245 262
4296 262 25 -29 121 -39 -139 -80 -248 -133 65 -36 222 -239 -95 -29 -236 -159 -25 -96 6 183 -67 245
4318 245 73 28 221 -14 132 74 131 113 122 115 -36 -31 206 177 85 122 -124 -58 105 148 104 11 -70 159 264 -65
4344 -65 79 -248 -52 59 -173 -24 -15 -214 245 74 -252 17 -306 161 -91 -239 -84 -81 -105 -179 -231 -6 42
4367 42 -203 217 39 -242 220 -125 -50 250 -243 362 81 -117 180 -86 -123 284 -122 -114 284 11 -38 -30 -12
4390 -12 108 -103 -129 40 -118 264 -150 82 122 74 79 53 -120 -24 -5 -114 163 42 -57 64 -195 347 122
4413 122 -67 90 -198 175 -78 -90 158 195 -51 434 -195 201 -106 -262 12 278 -53 45 138 -19 69 -190
$$ packed form
4251a7k5K88j94j94M87m42K66j06K09k17j51J77n6O4j12Jj71K35k29J45L09l42
4273g5J60J25m5j23K07m93J98R6k1J56M2j61j18j16J83Rj70O6J97j48Mk18N07
4296B62k37n4J50j60j00N9j68J15J98j01K58m61J44O6k07P7J34p1J02J77k50L12
4318B45j72m5J93k35J46n8N7j8Rpj51NK37k9r2L7k46O6J63M3m4r3q1K29J05l29
4344f5J44l27J96J11k32J49Rj99M59j71l26K69l23M67k52j48J55Lk4p4n2K25M8
4367D2k45M20j78k81M62l45P5L00m93O05k81j98K97k66l7M07m06QL98k73m9QJ8
4390a2J20k11k6J69j58L82m14K32M0m8Nk6j73R6J9j09K77j21r9J21k59N42k25
4413A22j89J57k88L73k53j2K48L7k46M85o29L96l07j56K74K66l31R8R3j57Q8k59
$$ plain form
4435 -190 -140 -69 -85 -130 -107 -62 58 -110 -81 256 -267 -77 99 -292 111 37 -154 -6 -2 61 -25 -154 155 -35
4459 -35 -17 346 -206 -165 236 -82 -70 91 111 91 -159 -28 455 -96 87 85 -90 -131 -65 111 414 15 101 64
4483 64 -25 261 246 -85 319 -113 20 294 -224 105 249 -79 52 236 141 107 98 165 103 -264 -86 -53 -136 81
4507 81 -131 -91 -300 -271 190 50 -281 111 -57 49 164 -87 -129 148 4 136 -151 185 183 -187 238 344
4529 344 -197 320 -73 -11 -84 -197 -89 136 -106 134 57 58 270 -264 42 340 -121 277 -97 -387 -47 -32
4551 -32 144 12 -170 -18 202 -2 349 91 24 142 -83 33 243 -81 -52 90 -134 188 -229 1 225
4572 225 -186 149 183 -155 139 -67 -202 140 -341 151 9 -233 205 -94 -151 -43 57 -7 179 -134 3
4593 3 -172 70 -12 -358 216 25 -198 217 -226 -84 257 58 -2 111 -288 96 -95 61 44 -85 -137 57
$$ packed form
4435a90N0P1j6m5K3M5J20j68K9L37n23J90J76l91M03p4j91J48MO3q6j29L09j90
4459c5J8L63n52M1M01l18J2J61K0k0k50J31M83n51J83kj75m1O6J76L03l99Q6l7
4483F4q9K86j5l31M04m32J33K74n18L29J44l28J31J84r5l4rO7o2l67J78L3q3K17
4507H1k12M0k09K9M61j40l31L92j68J06J15k51m2K77j44J32k87L36kl70M25J06
4529C44n41N17l93O2p3j13J08K25k42K40p7JK12n34L06K98m61L98l74k90L40J5
4551c2J76j32j82J52K20k04L51k58o7J18k25J16K10l24K9J42k24L22m17K30K24
4572B25m11L35L4l38K94k06j35L42m81M92j42k42M38k99n7J08J00o4J86l13J37
4593Cj75K42q2l46N74j91k23M15m43J42L41j99o0J13l99L84j91J56j7j29n2J94
$$ plain form
4615 57 -123 -24 118 -119 132 95 -154 165 -39 -62 -9 60 207 87 -136 75 -310 20 314 -130 108 86
4637 86 -165 204 -2 -170 122 -105 153 176 26 53 -251 46 -222 -315 198 -13 -105 189 129 -9 120 -8
4659 -8 -100 174 -134 -141 -105 -3 -167 99 -38 12 -338 -49 43 -198 190 -48 104 -73 60 -57 -149 -18 17
4682 17 12 271 -48 -174 -111 215 -16 42 352 49 41 -83 -255 -45 -44 -14 219 -15 137 -29 68 58 -71 -64 99
4707 99 -234 -74 64 -115 130 273 -87 -71 -219 170 36 -349 -10 52 -167 -13 57 -45 -126 -85 -19 -236
4729 -236 -51 79 -79 24 -61 43 -136 -213 -185 266 114 -206 106 -101 -34 -42 -199 -40 130 -236 -36 186
4751 186 -53 -324 -284 -99 -184 -9 -67 171 -70 -39 -96 -91 181 87 181 28 -33 -45 -52 28 45 -60 229 44 -82
4776 -82 312 -70 143 152 -148 88 240 -159 110 240 2 -171 121 83 135 -43 -38 229 89 221 21 -144
$$ packed form
4615E7j80R9J42k37K51l7k49L19k04k3N3O9J47j20k23K11l85L30K94m44K38k2
4637H6k51L69k06j68K92k27K58K3j50K7l04K97k68r3N13k11r2K94o0j38J29j28
4659hr2K74l08pL6J02j64K66j37N0l50K89R2k41L88k38J52j77J33j17r2J31L5
4682A7nK59l19j26O3L26k31N8L10l03qj24j72K10JL0K33k34J52j66R7j0j29PJ63
4707I9l33J60J38j79K45J43l60J6j48L89j34l85L39O2k19J54P0j02q1M1O6k17
4729b36J85J30j58J03q5J04j79p7K8M51j52l20L12k07O7qj57J59J70l66K00K22
4751A86k39k71M0J85q5J75n8K38k41L1n7NK72r4R4j53o1j2pQ0J7j05K89j85j26
4776h2L94l82K13Rl00K36J52l99K69J30k38j73K92l8N2j78NK67j40J32k00j65
$$ plain form
4798 -144 -43 -125 -180 207 9 -270 -168 -97 -45 -376 -104 28 201 -66 184 69 -22 -11 30 -18 -175 -62 -61
4821 -61 31 118 97 25 -55 -156 68 -88 -22 -31 78 -5 -88 258 172 -27 -214 -113 -64 -74 201 252 56 37 -112
4846 -112 47 39 77 -227 -109 85 61 272 126 -104 105 -101 55 52 -22 13 85 144 -119 110 28 55 155 455
4870 455 112 -91 199 -15 -7 -13 15 -87 -182 64 -48 -384 -39 -46 -5 273 241 -154 165 -15 -101 -50 -313 28
4894 28 60 242 32 -53 355 26 -208 68 -195 130 -12 -132 32 8 -144 191 19 -150 66 -129 -163 72
4916 72 6 88 141 53 11 -396 -74 116 -171 8 66 -287 -27 -37 143 212 -76 273 111 -83 -47 57 -88
4939 -88 -62 115 -213 210 -40 246 242 -7 -100 11 -149 99 105 -85 167 -25 -80 122 -186 -25 -148 -124 -28
4962 -28 -31 167 87 112 156 204 -258 91 -144 -3 140 -230 250 -46 -92 17 -86 -39 132 -283 265 66 50
$$ packed form
4798a44J01q2n5L87j98k79J02P1N2l31K72J32J73k67K50j15r1J1M1m8j57J13J
4821f1R2Q7k1p2q0j01K24j56O6rJ09q3q3L46q6j99j87J01M9j0K75N1j96j9j49
4846a12J59qL8l04J18J94k4K11j46k30K09k06J56lp4L5P2N9k63K29q2K7J00L00
4870D55l43k03K90k14QoK8j02r5K46j12l36L45pM1K78l2l95L19j80q6N1k63L41
4894B8L2J82k10q5M08l29k34K76k63L25j42j20J64k4j52L35j72j69K16j95l4K35
4916G2o6Q2N3q8m2m07L22J90k87J79N8l53K60j0J80O9k88L49j62j94L6J04j45
4939h8K6J77l28M23k50K86mk49r3J11j60K48Oj90K52j92n5K02l08J61j23K4R6
4962b8lJ98q0K5M4M8m62L49k35J41J43l70M80k96m6J09j03M7J71m15N48j99j6
$$ plain form
4985 50 -115 45 -14 -34 -170 156 70 -7 19 42 -207 36 -130 107 220 -302 152 23 -10 174 -34 -240 18
5008 18 -171 96 324 -23 276 49 57 255 -146 53 -68 -109 307 -128 9 156 60 -204 -15 -202 132 113
5030 113 -142 -127 -150 57 -211 -219 75 -203 -108 -118 -53 -9 -297 -299 219 -72 -73 47 -126 -270 -117 -37 -134 31 -163
5055 -163 256 41 -286 25 -33 56 49 -181 132 -55 -45 92 -187 -96 325 -79 -18 64 -14 93 -242 -204 91
5078 91 2 158 14 69 -1 157 -382 82 26 -183 238 4 15 22 17 -13 219 -9 63 -205 88 31 -45 51 39
5103 39 -446 201 -54 86 123 -310 -59 -140 28 -96 5 -151 136 -5 2 167 -101 -103 -280 -21 -41 -66 10
5126 10 59 -103 165 -154 98 24 -53 13 64 21 -82 -154 245 273 -55 -71 -9 9 -34 28 -371 228 -169 -105 121
5151 121 -171 -95 46 113 -12 -149 -111 -31 13 53 45 -163 133 104 -272 226 -140 -7 202 -84 18 151 52
$$ packed form
4985E0j65J60n9k0j36L26q6p7K6K3k49K43j66K37J13n22M54j29l3J84k08k06K58
5008A8j89K67K28l47K99k27QJ98m01J99j21m1M16m35J37J47r6k64J89j87L34j9
5030A13k55J5k3K07k68qK94k78R5j0O5M4k88kN18k91jJ20j73j44J53Q0r7J65j94
5055a63M19k15l27L11n8Q9pk30L13j87J0J37k79R1M21m04O1Q2p8J07l35L8K95
5078I1q9J56j44N5p0J58n39M64n6k09M21k34J1Pnl0K32k28P2k68K93n7p6R6j2
5103C9m85O47k55J40L7m33K51q1J68j24J01j56K87j41PJ65k68kj77K59k0k5P6
5126A0M9j62K68l19K52p4p7O6N1m3j03p2L99K8l28j6O2J8m3O2l99N99l97O4K26
5151A21k92P6J41O7j25j37L8Q0M4M0qk08K96k9l76M98l66J33K09k86J02J33r9
$$ plain form
5174 52 25 187 -55 166 157 80 185 -63 -12 20 -237 173 -178 208 85 -71 -92 -11 -109 139 -165 193 190 -56
5198 -56 191 -69 -23 20 16 -53 25 -72 -179 -88 -192 90 56 -33 18 -132 218 20 -111 146 -19 64 -35 15 193
5223 193 246 -22 34 170 130 418 143 -176 -132 -58 -24 37 -101 19 110 116 150 39 -127 -110 -2 -67 -148 -61 40
5248 40 39 230 -139 -172 135 -69 -151 0 93 -64 -70 -117 108 -32 -7 70 13 15 -74 81 143 -153 -182 88 59 -139
5274 -139 -244 -132 -126 -53 169 -132 38 75 81 -36 203 25 -78 90 -1 28 -1 -241 -36 46 26 191 133 144
5298 144 171 23 -68 25 -269 58 -79 -104 56 86 -15 -66 117 156 54 -175 148 106 82 5 -249 137 -83
5321 -83 99 -143 49 -108 51 -60 28 46 63 -73 -114 -20 -103 -127 144 -7 11 -26 13 125 -78 -173 -9 1
5345 1 19 -37 -2 -15 -229 -59 88 1 -195 42 7 -87 -169 33 76 38 -243 80 -240 -68 405 83 274 -91
$$ packed form
5174E2k7J62k42K21rp7J05k48N1L2k57M10l51L86j23j56k1Q1r8K48l04L58lk46
5198e6K47k60M6M3mo9P8r7j07R1j04K82l4q9N1j50L50j98j31K57j65Q3r9N0J78
5223A93N3k68N6J36m0K88k75l19M4P4L4O1j38J20R1OL4j11j66J7J08o5q1Q7J01
5248D0jJ91l69l3L07k04q2J51R3j57om7K25j40K5P7n7Kq9J55O2k96k9K70k9j98
5274a39j05J12OP3K22l01J70L7Oj17K39j78j03J68r1K9k9k40K05Q2k0J65n8J1
5298A44K7j48r1R3k94L27j37k5J60L0j01n1J83L9j02k29L23m2k4p7k54L86k20
5321h3J82k42J92j57J59j11Q8J8J7j36m1R4q3k4K71j51J8l7L9J12k03r5J64J0
5345AJ8n6L5j3k14J70J47q7j96K37l5r4q2K02M3l8k81L23l20J72M73l22J91l65
$$ plain form
5369 -91 181 56 -57 -146 165 45 -252 -50 206 -23 -213 -45 -51 34 39 134 -202 99 -14 -152 164 -200 -81
5392 -81 128 -87 -123 -10 54 126 171 141 83 -156 -25 -21 -4 139 70 -30 8 -183 19 -132 69 -164 -381 48
5416 48 72 -225 -94 233 -89 104 -24 -124 34 -132 235 142 -137 -229 161 43 153 256 140 -51 170
5437 170 359 -13 -94 111 -138 69 -135 -3 -20 257 -14 -8 62 5 132 154 -49 184 47 117 287 -143 74
5460 74 88 224 98 161 -1 -53 42 243 -66 -100 133 157 -91 -170 -147 323 271 9 208 30 -100 156 -329
5483 -329 112 31 -90 10 -236 54 -319 -36 148 -146 -148 133 -63 -324 227 -154 79 -4 -40 31 -204 -175
5505 -175 151 37 -130 55 -11 116 -25 -139 28 -97 -185 53 -19 23 16 7 123 -154 -156 -20 -124 -105 167 5
5529 5 191 109 67 268 22 -150 73 232 -25 129 -107 16 11 13 -59 -136 77 -132 -219 36 -92 -55 -27 -33 110
$$ packed form
5369i1K72j25j13q9L11j20k97K02K56k29j90J68oQ5NR5l36L01j13j38L16l64J19
5392h1K09k15l6J13O4P2M5l0n8k39J31MJ7J43o9j00L8j91K02j51K01k33k17M29
5416D8K4k97J31L27l22J93j28j00J58j66L67r3k79r2L90j18J10J03j16j91K21
5437A70J89l72q1K05k49K07k04J32j7K77k71OP0n7J27K2k03K33j37P0J70m30K17
5460G4J4J36j26O3j62n2R5K01l09l4K33K4k48p9K3M70n2k62J99j78j30K56m85
5483c29M41q1j21J00k46K90l73K83J84k94kK81j96k61N51l81K33q3l6P1k35K9
5505a75L26j14j67J85o6J27j41j14J67j25q8K38p2M2prJ16k77kJ36j04J9K72j62
5529EJ86q2m2K01k46j72K23J59k57J54k36J23nKp2p7K13k09q7K55j28L7K8oJ43
$$ plain form
5554 110 101 -19 117 121 -206 51 25 -118 -9 -182 272 -235 -71 42 -11 -38 83 -221 23 -186 -90 -233 -68
5577 -68 -22 24 -93 161 -94 -316 125 -199 0 120 -68 -151 43 -52 38 82 -32 67 -124 127 121 137 121 26
5601 26 -135 82 -39 -238 293 -365 57 -136 56 -41 -28 -91 144 93 -169 142 -120 5 9 74 108 238 6
5624 6 -12 -229 37 114 -127 10 -55 45 1 -131 -54 74 18 108 -357 -66 -33 -133 -44 163 93 141 -175 -129 -60
5649 -60 179 6 104 -44 -71 44 -227 60 -27 -80 54 -7 -204 19 -296 82 -369 -95 26 -116 93 117
5671 117 -177 -111 24 -130 -182 0 -88 62 103 -83 -140 -197 99 -45 -48 75 -246 -27 -20 39 -63 119 -155 118
5695 118 164 -16 267 -96 149 137 202 126 55 333 -17 -166 -111 193 -77 108 118 -219 -56 -244 157 -2
5717 -2 22 68 -28 -84 105 -84 145 89 -161 77 -9 28 239 -123 -34 -15 -262 -128 110 14 51 36 -101 37 57
$$ packed form
5554A10rj20J36Ml27K57k6j43J09j73M54n07J64J13n3k7J21l04K44k09R6j43J65
5577f8M6M6j17K54k55k22M41l24J99J20j88q3J94r5R0M4j14R9j91K51oJ6j6r5
5601B6j61K17j21j99N31o58M22j93J92r7J3o3K35n1k62L11k62J25MO5L4J30k32
5624Fj8k17K66P7k41J37o5J00m4j32P7J28n6R0m65K91L3j00Q9K07p0M8l16M6O9
5649f0K39j73R8j48k7J15k71K87q7n3J34o1j97K23l15L78m51K74J21j42K09K4
5671A17k94O6J35j54n2J82q8J50M1j86n7n7K96j44lJ23l21K19PN9j02J82k74K73
5695A18M6j80K83l63K45j2O5p6p1K78l50j49N5L04k70J85J0l37J63j88M01j59
5717bK4M6r6n6J89j89K29n6k50K38q6L7K11l62Q9J9k47J34K38r6L7j5j37J38K0
$$ plain form
5742 57 -52 139 -207 26 -206 -76 -69 66 52 -104 -228 76 -5 -198 -8 240 35 -28 -138 -41 -42 -29 157
5765 157 -311 -39 53 -11 108 -185 171 -130 44 -5 -106 -81 45 -21 124 309 -75 95 -56 -37 -13 -24 -87
5788 -87 -85 -1 133 -46 203 51 -35 -133 76 226 -360 164 -64 -184 -22 -171 43 42 -131 60 -107 -147 -127
5811 -127 -26 -230 115 -31 89 112 36 8 -38 6 -218 -108 11 -72 -145 -85 -90 -51 177 1 361 222 -132 140
5835 140 93 -68 242 103 -51 117 22 -30 -92 -189 -209 -235 123 -33 0 90 0 -88 -190 -2 75 184 -142 -205
5859 -205 331 -185 -209 -153 60 36 1 37 -27 98 66 -7 -150 18 -52 25 40 -99 -254 95 -30 -63 -46 -120 99
5884 99 96 -57 140 93 19 100 11 17 -27 -67 139 24 -159 334 75 -175 -98 42 -9 97 145 -79 -72 27 188 -175
5910 -175 -99 69 24 167 -211 203 -67 214 124 30 -173 80 201 8 210 43 94 -96 121 82 81 -169 -73
$$ packed form
5742E7j09J91l46K33k32J30PJ35j4j56j24L04q1j93J90K48k05o3j10R7jJ3J86
5765A57m68K72R2o4J19k93L56l01J74m9j01K5J26o6J45J85l84J70j51J9K4j1o3
5788h7KQ4J34j79K49j52q6r8K09J50n86N24k28j20J62j49K14jj73J91j67m0K0
5811a27J01k04L45j46J20K3p6k8m6M4k24J10J19q3p3O0nL9K28j76L60j39l54K72
5835A40m7j61L10j39j54J68r5n2o2r7k0k6L58j56L3R0r0q8j02J88P7J09l26o3
5859b05N36n16k4N6K13k4l5L6o4J25l2p3j43J68p0P7J5j39j55L49j25l3J7p4K19
5884I9lj53J97m7p4Q1q9Om4m0K06j15j83M93k59k50P7J40n1J06M8k24PR9J61l63
5910a75P6J68m5J43l78M14k70K81r0r4k03K53J21j93K02j67N1j90K17l9jk50R6
$$ plain form
5933 -73 200 196 -233 -122 -70 -80 36 154 -13 16 -84 -5 -193 68 -274 259 -82 -268 8 68 181 -223 -42
5956 -42 -88 -49 -163 207 51 178 91 -3 2 31 213 -249 19 103 143 -267 -308 -132 155 86 150 -45 -112 70 51
5981 51 42 -58 -307 29 269 -18 140 325 -59 125 48 -17 -81 -28 252 -93 105 50 114 12 207 -117 -188
6004 -188 133 63 58 -69 -187 137 197 -83 -160 -50 17 159 195 -1 11 100 -47 168 198 100 -35 212 17 -6
6028 -6 42 -78 124 37 -106 -59 4 -151 -234 -134 65 181 -192 4 312 -303 -171 88 213 -45 94 3 -169
6051 -169 55 -60 -170 52 166 288 -156 49 -8 -15 -301 111 -60 144 121 -64 66 35 99 134 87 -72 106
6074 106 257 -114 -19 50 64 341 28 281 107 160 -207 -150 107 209 182 -109 -15 -156 247 11 -17 66 -233
6097 -233 -101 14 -154 88 -39 93 -112 -129 202 5 60 200 159 -236 12 47 -64 53 -135 -138 -84 -243
$$ packed form
5933g3K73mm29J11N2j0J16J18j67K9j00P9j88K61l42N33l41j86K76O0J13m04J81
5956d2m6L9j14L70j56J27q7r4NK9J82m62K68Q4M0m10m1J76K87o9O4j95o7J82j9
5981E1rj00k49L36K40k87J58J85l84J84p7o5o4N3K80l45J98n5O4j02J95l24p1
6004a88L21p0nj27j18L24O0k80p7J10O7J42L6j96J2Q9j47K15L0r8j35K47j95k3
6028fM8j20K02q7j43M7O3j55q3J00J99J16l73J96L08o15J32K59J25k58J39r1j72
6051a69K24j15j10K22J14J22m44K05n7pk86M12j71K04k3j85J30l1O4L5m7j59J78
6074A06J51l71R5O9J4K77l13K53j74N3l67N7K57J02k7k91R4j41M03k36k8Q3k99
6097b33J32J15j68K42j27J32k05j7L31j97N5J40m1l95K48L5j11J17j88lN4j59
$$ plain form
6119 -243 -33 -39 -104 49 -116 -224 12 -236 216 -100 -78 -29 90 142 99 42 115 -5 -44 163 -231 34 -99
6142 -99 -95 -56 -212 -17 -45 -91 -17 18 67 -211 121 -178 72 159 -372 73 -86 186 247 -30 19 7 -232 188
6166 188 -99 29 35 119 -107 -85 -284 -149 237 -41 226 -42 -132 -36 -7 -133 -13 -312 -167 -35 50 286 75
6189 75 121 -47 -150 -68 -193 -25 -39 98 37 70 -114 80 -116 -75 65 -100 73 -218 -106 -22 -9 -109 286
6212 286 -65 -61 99 13 28 -7 47 57 86 -159 268 -61 101 -16 -78 24 -193 -202 -31 -175 -5 -88 -199 191
6236 191 -125 129 -241 104 -157 67 -187 -15 191 -291 -41 161 -23 -67 -158 -43 -19 -192 202 10 17 -162
6258 -162 -142 39 98 185 27 94 -184 -177 -8 247 73 -142 97 -135 -4 362 29 -62 185 -144 -17 64 177
6281 177 180 181 96 -11 101 73 15 -182 -210 -64 89 168 -156 -181 -16 -76 148 -4 -94 25 -84 -37 34 -160 67
$$ packed form
6119b43K10oo5J53j65j08K36k48M52l16K2M9J19N2m3n7P3j20l9K07l94K65j33
6142i9ML9j56J95k8m6P4L5M9k78L32k99K50Q7n31M45j59K72O1k77M9j2k39M20
6166A88k87J28OQ4k26K2j99J35L86k78K67k68r0R6K9j26J20k99J45J32Q5K36k11
6189G5M6j68j03Q2j25J68j4J37o1L3j84J94j96M1J40j65J73k91J12Q4J3j00L95
6212B86l51MJ60q6J5l5N4J0K9k45M27l29J62j17o2J02k17rJ71j44J70q3j11L90
6236A91l16K54l70L45k61K24k54J72K06m82K50K02j84m4r1J15K4j73L94j92Pj79
6258a62K0J81N9Q7j58O7k78PJ69K55j74k15K39k32J31L66l33r1K47l29J27Q1J13
6281A77LJq5j07J12k8n8j97k8J46J53P9l24k5J65o0K24j52r0J19j09M7P1j94K27
$$ plain form
6306 67 157 -100 -131 120 92 2 47 185 153 53 99 -127 -109 -125 -47 -28 16 -261 297 -163 -205 21 190 -98 -42
6331 -42 122 11 181 134 39 -80 -23 -209 -301 131 -45 -122 319 -330 -52 -97 92 -39 -38 -121 -24 -162 111 33
6355 33 -1 -36 23 10 -43 81 53 234 -46 84 3 -72 -75 -295 -79 96 -346 48 138 175 -74 -55 14 66 -23 -6
6381 -6 -105 12 11 -132 -22 -106 129 -140 -88 -39 -112 -47 138 -168 -18 -49 -1 -35 167 -40 100 -11 -292 51
6405 51 316 86 37 -187 -134 -141 -81 -184 -320 -130 -45 -68 -210 48 -108 -86 128 -38 -174 68 43 169 -90
6428 -90 -54 143 221 144 138 -58 -125 -80 -14 -62 172 -24 -126 0 80 -103 38 52 88 -18 80 -29 139 -197 -150
6453 -150 30 -77 37 -90 -236 -6 172 119 -90 153 14 60 -116 85 52 -320 64 -146 -163 155 195 -20
6475 -20 -142 40 -18 -53 89 23 -140 -176 52 -24 48 -23 -3 37 -212 82 59 -145 67 52 -128 168 -50 -29
$$ packed form
6306F7R0k57l1K51k8r0M5J38l2j00M6k26J8j6P8J9M4k77N58m60m2K26J69k88N6
6331d2J64j11J70m7r5j19N7j86r2M32j76p7M41o49K78m5J89j31Jq3R7j38K73p8
6355C3l4l5N9j3n3J24k8J81k80J30q1p5lk20K16J75m42L94R0L7k49J9O9N2q9J7
6381fr9J17jj43J10q4K35k69N2M9p3O5J85l06J50l1M8l4K02k07J40j11k81L43
6405E1K65k30m9k24N3pO0j03j36J90Q5k3j42K58j56K2K14j66j36K42k5J26k59
6428i0L6J97P8p7oj96o7M5O6m8K34j96j02J26Q0j83J41J4L6j06R8j09J68l36M7
6453a50J80j07J14j27j46K30J78n3k09K43j39M6j76K01l3l72L84k10j7L18M0k15
6475b0j22J82n8l5J42o6j63l6K28p6P2p1K0M0k49K94k3k04K12j5j80K96k18K1
$$ plain form
6499 -29 16 14 -47 312 -103 20 22 -162 129 142 89 -44 49 187 -140 -165 0 24 47 4 -176 -184 -59 -76 -51 -85
6525 -85 146 167 89 29 115 -187 -1 133 90 -121 -68 -141 -79 40 70 -3 141 213 -31 87 10 -24 -9 -57 -120 -49
6551 -49 -102 -156 156 -46 -141 152 155 279 21 -134 284 49 -160 144 84 37 -126 -76 36 64 -124 -87 -197 -28
6575 -28 -95 -59 76 -107 167 24 210 200 166 6 30 -9 -124 20 -72 139 192 -71 89 160 -139 -13 -123
6598 -123 229 230 -175 -22 -151 -137 100 91 -168 164 73 -223 -64 89 -66 8 -25 344 22 -175 -23 21 36
6621 36 -161 -114 176 -80 -177 -97 -59 178 -148 88 171 -352 -102 107 -149 370 104 -44 125 -186 12 200
6643 200 45 96 145 47 120 -38 99 107 -71 -54 25 -72 78 224 -124 3 63 -221 -63 -153 104 -77 167 120
6667 120 -2 -29 30 -112 243 -134 -220 40 -123 -49 -67 -143 118 -187 -67 150 -84 102 91 -56 -51 -203 10
$$ packed form
6499b9M5ko1L59m15J23Kj84K91J3n3j33R3J38l27k5J65K4K3m3j80qJ25j7K5l4
6525h5K31K1p8o0Q6l02J86J34m3k11N3p3O2J19L0p3J44P2k44J18p7l4J5m8o3P1
6551d9n3n4L12k02r5K93LJ24k58j55M18k35k09L04o0m7j63N0J12K8j88L7j10J69
6575b8o7L6J35j83K74j43J86j0l4j60K4l9j15J44r2K11N3k63J60P1k99J26j10
6598a23L52Jm05J53j29J4K37rk59L32r1k96J59J53j55P4l3L69l22j97J52M4J5
6621C6j97M7K90k56r7Q0L8K37l26K36Q3n23K50K09k56N19k66j48J69l11J98J88
6643B00j55N1M9r8P3j58J37Qj78J7P9r7J50J46l48J27O0k84J58r0K57j81K44m7
6667A20j22k7N9j42L55l77q6K60j63P4j8p6K61l05J20K17k34J86j1j47Nj52K13
$$ plain form
6690 10 370 140 -142 -144 -124 -29 182 -113 -71 -251 -57 0 43 183 220 -52 22 -9 -182 57 19 106 40 -166 -61
6715 -61 121 -170 134 133 -14 275 90 65 49 -127 180 -149 -158 -90 -112 -27 167 -182 51 -119 -1 21 -41 55
6739 55 35 -62 165 8 91 -87 -29 -110 259 -55 164 -55 -246 172 -14 -314 -6 -113 -48 14 -156 132 -71
6762 -71 25 19 98 -92 132 171 -125 63 -169 124 18 -84 -88 -70 16 80 105 55 -293 -139 -3 -227 80 128 -244
6787 -244 84 -256 84 -377 -70 -203 142 -4 -143 35 97 79 219 -137 -139 -176 -92 -62 -80 61 -39 -63 -220
6810 -220 -199 -256 274 -110 -44 -68 -28 -1 274 -22 96 -59 -165 371 -31 134 -50 -53 90 21 183 -99 -299
6833 -299 313 305 -127 59 -34 -216 149 26 98 149 69 34 -8 -87 186 145 20 -60 137 219 -96 84 82 117 -83
6858 -83 153 -9 85 -82 -43 113 -108 -70 89 -63 -99 -213 1 280 1 129 -138 126 -71 -70 -121 55 -116
$$ packed form
6690A0L60k30k82kK0R5K11k95M2j80J94N7M3J40L7k72P4l1j73K39l8Q7o6k06J05
6715f1J82k91L04jj47K89j85k5j6j76L07l29rO8k2Q5J94l49K33j70J18K2o2R6
6739E5k0r7K27j57Q3j78N8q1L69l14K19k19j91M18j86l00L08j07O5O2j70K88k03
6762g1R6oP9j90K24L9k96J88k32K93j06j02mJ8Q6O4K5n0l48J54J36k24L07M8l72
6787b44L28l40L40m61L07j33L45j46j39J78O2j8J40l56kl7Q4L0j8J41j00k4j57
6810b20K1n7N30l84O6k4M0K7K75k96J18j55j06N36m02J65j84lJ43o9J62k82k00
6833b99O12qm32J86r3j82L65j23P2N1q0l5m2p9K73m1j25q0J97Q2l15J80kL5k00
6858h3K36j62R4j67L9J56k21L8J59j52l6j14K14K79k79J28k67K64j97Jn1J76j71
$$ plain form
6881 -116 18 -82 70 249 150 130 -214 111 -62 347 -18 73 161 -90 -41 -95 9 50 -153 -148 -105 -22 60 181
6905 181 -80 -98 8 -32 80 -76 -151 -92 158 63 59 -36 -173 92 -38 23 269 -152 -154 -94 -53 -77 30 -76 84
6930 84 51 128 -290 184 21 -102 71 13 -65 32 153 -351 -219 -286 33 -190 138 4 -20 164 125 -53 46
6953 46 -97 165 -54 23 61 237 57 -75 115 -141 56 -117 17 -12 110 -193 187 -6 41 35 125 56 172
6976 172 3 138 -69 181 -153 -49 -15 -96 -70 15 -93 90 -63 -151 -253 -23 92 -168 18 19 105 -46 -9
6999 -9 36 -245 20 49 67 -222 482 92 -63 42 130 34 22 1 -165 71 -139 30 5 23 37 79 37 27 162
7024 162 -131 -48 -151 -111 -96 116 -210 160 95 -41 -85 -96 -215 -115 -8 -119 77 -91 -13 47 75 151 67 271
7048 271 -2 130 -142 -133 251 -16 -147 168 -21 -51 53 -3 -267 73 284 175 170 55 -113 -91 140 -58
$$ packed form
6881a16J34j00J52J79r9k0l44L25j73M09l65R1Q8k51M9n4J04M1k03NM3Q3Q2J21
6905A81k61j8J06m0J12j56p5N9K50r5mr5j37K65j30O1K46m21kO0M1k4J07j06J60
6930H4l3P7m18M74j63j23J73n8p8R7J21n04J32o7L19k23L28j34k4J84l9j78R9
6953D6j43K62k19P7L8J76j80j32J90k56J97j73J34k9J22l03L80j93M7oR0o9J16
6976A72j69J35k07K50l34J04L4q1K6Q5j08J83j53q8j02K30J15k60J86JQ6j51L7
6999iM5k81K65K9J8k89P04l90j55J05Q8r6j2k1j66K36k10J69k5J8J4M2m2j0J35
7024A62k93Q3j03M0J5K12l26L70o5j36m4j1j19J00J07j11J96j68P8O0K8P6q4K04
7048B71k73J32k72RL84k67j31L15j89l0J04n6k64L40K11j09nj15j68K2K31j98
$$ plain form
7070 -58 -83 23 25 32 129 113 -5 426 121 -224 10 271 -26 94 -235 -63 166 31 0 9 54 191 62 -279
7094 -279 -163 22 34 21 54 -188 -187 -210 -32 19 -22 133 28 96 -51 -8 57 126 99 -45 -339 11 154 -67
7118 -67 -89 -127 87 200 -61 -53 -51 -14 0 -142 -146 289 -51 156 133 -132 14 -106 3 -35 -293 35 70 -31 19
7143 19 202 -163 -75 -139 161 392 -176 -5 -65 -245 -59 -73 -37 -70 107 24 30 34 -55 291 -39 -111 12 -33 -81
7168 -81 128 47 196 -199 48 125 -138 224 44 -222 -204 226 -34 -43 111 -139 -136 -158 47 85 -55 117 20 -26
7192 -26 10 -212 -33 183 -109 73 -47 -21 -51 -163 4 120 -89 105 -133 26 140 -34 132 2 -197
7213 -197 -65 75 -170 -55 -1 133 -29 -31 53 -71 53 346 112 177 48 50 300 -232 -133 -80 23 -255 97
7236 97 148 14 153 -224 451 77 122 72 -83 -36 399 -81 154 -32 -2 -143 -162 -31 -167 -116 -55 -231 72
$$ packed form
7070e8k5J06KPR7j6j18M31l05l45K34K61k97J20l29J72K29j35l1RM5J37j29l41
7094b79J16J85J2j3L3k42Jk3J78N1m1J55j05O8j47M3O5O9k7j44k94L50J43k21
7118f7k2l8K14J13k61QKL7J4j42mM35l40K07k3k65J46j20J09l8k58L28L5j01N0
7143A9J83l65Q8o4L00K31n68J71o0j80J86j4L6l3J77q3OMq9L46l30p2J23m5m8
7168h1K09q1J49l95K47P7k63L62j80k66J8M30k60rJ54k50Lk2K05L8j40J72r7m6
7192b6L6k22J79K16k92J82j20K6l0j12J67J16k09J94k38J59J14j74J66j30j99
7213a97J32J40k45J15N4J34j62kQ4j24J24K93k34O5j29KK50n32R9N3J03k78L52
7236I7N1j34J39l77O75l74M5n0j55M7M35m80K35j86L0j41j9J31j36N1O1j76L03
$$ plain form
7259 72 76 -164 37 78 63 90 13 -73 52 -82 -132 180 -8 1 23 -235 157 39 20 62 -275 25 73 -99 95
7284 95 -83 -138 144 169 3 -18 263 11 -117 -124 298 210 -342 222 36 71 24 -71 36 -283 92 -57 -66 15
7308 15 42 61 165 185 130 53 51 10 -27 -151 262 60 -60 -220 110 -11 -1 -20 115 -68 -77 18 77 -46 31 -203
7334 -203 -135 -8 123 -28 -39 -43 -142 -163 -6 15 199 11 17 -208 68 -48 -121 -187 71 242 26 26 -207 -100
7358 -100 31 -232 78 -126 -58 -88 -20 146 -111 43 -141 -88 174 -58 215 -69 -80 198 -197 -99 36 -138
7380 -138 -18 222 73 -47 13 -235 125 -127 179 -60 -5 52 -108 104 14 -95 -25 99 0 23 49 -15 -215
7403 -215 89 -85 199 -323 -16 18 -98 82 19 118 208 -82 -50 95 123 -11 91 198 48 -158 -123 31
7425 31 -220 -215 353 1 228 95 -104 153 -19 84 320 -126 -67 26 -29 -82 223 166 117 60 -26 282 93 14
$$ packed form
7259G2Mk40K01M1j5K7p7q6J25j34n0L12j88RK2k58L92j18j9M2l37L00M8j72J94
7284I5j78n5K82K5j66k1K81k52j28pM22q8n52N64j86L5m7r5J07l19L75j49rQ1
7308A5K7J9J04K0n5p7km1l7j24M13k02j20j60L30j21J0j9J35j83rR5N9j23P7k34
7334b03O8J27J31j51j1mr9k1J57K1J84j88Ok25K76j16p3o6K58J71k16%k33J07
7358a00J31k63L10k04O8l0O8J66k57J54j84N3K62k32K73k84j1K78l95R8J35j74
7380a38J20K40j49j20O0k48L60k52L06k39N5N7j60K12r0j09P0J24r9K3K6o4k00
7403b15L04j74K84n22L07L4j16J80o3R9R0k90L2J45K8j34J02J07j50k06L5J54
7425C1k51NN68l52K27j33j99K57j72J03K36m46N9R3n5n3L05n7m9n7q6L08j89p9
$$ plain form
7449 14 -48 -100 -66 159 -54 -106 139 -31 216 -39 225 -101 10 -95 -25 19 27 149 -88 -226 62 49 251
7472 251 425 -235 -101 -90 -55 -28 -66 -32 -109 -63 146 63 11 -104 302 -281 -116 20 -33 39 -5 71 4 27 -18
7497 -18 4 104 129 45 -24 121 -314 189 -144 32 127 -376 -35 100 335 34 -64 -60 -226 -139 206 -281 145
7520 145 -28 -135 2 42 206 150 52 -35 129 -64 126 16 12 106 -50 80 115 -19 104 20 -97 -10 -69 -192
7544 -192 -250 139 51 93 198 3 -155 -95 9 -78 -298 207 132 -127 -173 -91 166 116 -50 -89 5 89 175 -53
7568 -53 145 -130 72 71 -12 20 -33 -218 56 39 -107 -40 -107 -88 -45 -94 -33 -11 74 -3 -62 133 -28 -117 -34 24 64
7595 64 -113 -103 -48 -2 -34 28 53 228 32 -18 -145 -140 -58 -92 65 -51 -126 42 191 114 -69 -14 8 -77 42 -51
7621 -51 115 49 7 -168 -20 -211 393 45 95 111 170 83 4 -91 148 3 -16 -18 100 3 68 -78 96 -188 78
$$ packed form
7449A4o2n2L4K25k13n2K45j70K47k55K64l26J11j05P0M4QJ22k37j38K88j3K02
7472B51J74o60J34J1L5K7l8L4p7M6K09q3n2j15M06n83J65J36n3P2m4P6o7K3m5
7497a8K2J00K5q4o9J45m35N03l33J76R5n03L41J35K35l01r8Mj66Q7L45m87M26
7520A45j73j07J37M0J64n6r8q7J64j93J90j10mR4j56J30L5j34J23q4j17Q7n9j23
7544a92n8L89q8M2J05j95j58O0J04q7k20N05p5k59m6Q2K57n0j66l9R4Q4Q6k28
7568e3J98k75K02jq3L2n3j85K74j7j46O7o7J9M3m9O1K2Q5p7n9J95j61q9Q3N8M0
7595F4j77J0N5M6l2O2K5J75j96n0j27NQ2l4J57j16p5J68J49p7j83N5K2q5J19r3
7621e1J66o6m2j75J48j91O04l48N0J6N9q7p9r5K39j45j9kJ18r7O5j46J74k84K66
$$ plain form
7646 78 27 62 247 24 236 98 -23 -187 -70 34 -151 9 13 484 -86 3 20 -165 -41 59 -29 59 195
7669 195 7 210 -308 83 -12 105 13 15 -188 -91 214 132 -133 136 -20 156 -21 -141 -116 9 162 -163
7691 -163 116 -18 -139 -54 97 -13 81 -78 -79 -188 -118 -20 89 122 -195 23 310 -284 -112 -25 135 215 -85
7714 -85 -364 -57 331 -98 -313 220 65 -49 246 -121 -69 -104 213 43 -185 -70 280 161 10 114 -136
7735 -136 -53 -8 -65 161 -157 -42 -49 -42 223 305 -86 42 17 -81 86 104 120 -232 -54 63 -175 -111 -33 88 134
7760 134 114 -45 -42 81 -29 114 -158 -52 -83 40 -56 161 -36 11 139 75 215 26 10 88 -155 207 -176
7783 -176 -23 -16 221 -117 7 7 113 112 -70 219 48 174 90 -104 27 50 -235 -99 193 108 81 -250 -39
7806 -39 127 -37 2 48 -22 328 252 -206 -83 55 -38 218 3 37 59 96 174 -169 55 -86 -73 -94 -191 201
$$ packed form
7646G8n1L5J85k23K12j38j21j64J17J04j85J60MM71n70Q9J7j85J24J00q8Q8J36
7669A95j88K03n18L91r5J17r2Kk03R7L05q2k65K69j56J76j77j20K5J25J53l25
7691a63K79j34j21Q5J51j10R4j59jj09P0R8J09L3l17K18K87n94J72Q7J60Q0l00
7714h5k79L07L88m29k15N33j55j14K95l67N2l5L17j70k28J15L50j19j51J04k50
7735a36Q3M5n7K26l18J15pPK65Q2l91J28k5r8J67J8J6l52J78J17k38O4P8J21M6
7760A34k0j59LJ23j10J43k72J06l1J23r6K17j97M7J28o4J40j89j6P8k43L62l83
7783a76J53PK37l38J24%J06jj82K89j71J26q4j94J31K3k85J36K92q5k7l31K11
7806c9J66j64L9M6p0L50p6m58J23J38r3K56k15L4K2L7P8l43K24j41J3k1r7L92
$$ plain form
7830 201 168 15 8 -13 -33 -79 5 -159 -2 -80 66 -136 -349 107 106 -143 80 -112 197 -25 -19 -373 -133 4
7854 4 -151 36 20 81 -56 -137 9 -66 -108 -49 0 -68 85 -64 35 -237 -48 -104 -81 113 -80 147 51 -135 44
7879 44 -184 24 17 -3 193 20 96 25 154 24 46 -242 -14 103 -56 -46 -83 -65 59 226 101 -112 -58 -59
7903 -59 -26 -242 -53 154 8 179 -280 90 -66 39 22 115 89 36 -35 76 -24 -129 -5 -82 0 186 -55
7926 -55 44 -54 39 216 84 75 0 41 -300 276 289 -50 -92 -92 34 -115 -81 6 36 -37 74 108 -30 149 -69 -13
7952 -13 -146 -166 -39 -59 20 54 -44 28 141 20 147 -58 35 -138 57 88 -40 -276 80 70 140 203 89 75
7976 75 -18 45 333 -36 58 -135 48 -43 -77 -105 -17 58 -92 151 -180 166 148 51 195 120 -50 -113 110 141 0
8001 0 84 -41 140 -47 69 129 -231 75 -215 16 -155 268 -47 -98 109 7 -27 -203 115 4 184 138
$$ packed form
7830B01l3j53pk1k0m6Q4j64J57p8J46k02k13M56jk49K23j92L09k22Ol54K40J37
7854Dj55J87j6O1j37q1J46p5m2N9M9o8J53j49R9k72J89n6K3J94j93K27r6j86J79
7879D4k28K08pk0J96j73P6p1J29j30K2k88K28J17j59J0l7J8J24J67j25k13N4j
7903e9L3k16J89K07j46J71m59L70j56J05j7R3k6n3p1J11j00j05J24p7Q2J86k41
7926e5R9r8R3J77j32rp5M1l41N76J3l39m2%J26j49L4Q7L0p3J11L4j38J79k18N6
7952a3j33k0J27k0P9L4r8P2J13j21J27k05R3j73J95L1j28k36L56j0P0O3j14j4
7976G5r3O3K88l69R4j93J83r1l4k8Q8P5j50K43l31L46j8r7J44p5j70o3K23L1j41
8001@Q4j25J81j87J16O0l60L06k90K31j71M23l15n1K07j02l4j76L18j11J80m6
$$ plain form
8023 138 179 120 -262 -59 118 210 -76 3 131 54 -102 -79 89 -154 -229 -51 -312 -35 -6 -107 179 -217 -247
8046 -247 -87 -148 -153 74 -19 93 36 -46 -88 28 91 153 124 -35 84 -131 155 58 -85 20 103 39 18 74 149
8071 149 -3 13 191 -42 -17 -197 -101 -61 -34 -266 -35 108 5 96 13 122 86 -42 162 84 -14 271 -199
8094 -199 -144 24 134 -193 -42 -23 101 256 -27 -147 -167 -198 25 -43 -116 -78 -142 92 -94 69 -115 60 96
8117 96 79 4 264 -131 23 -193 -194 132 -216 167 -88 -49 129 -89 -166 45 272 -110 -175 6 91 17 155
8140 155 -236 59 52 -98 -166 61 -130 -1 17 97 121 -77 199 -66 49 39 128 -54 -226 71 -135 33 -82
8163 -82 107 -20 76 -8 -285 97 92 101 -174 -173 73 -14 -66 150 144 57 9 -17 155 -77 -100 -75 -2 23 46 12 19 245
$$ packed form
8023A38M1n9l82K03J77R2k86P9J28p7j56K3J68k43p5J78k61K77K9j01K86l96l0
8046b47J60o1nK27r3J12n7q2m2J16O3O2k9j59J19k15K86r7j43J05Q3o4k1N6P5
8071A49j52J6J78k33K5j80R6M0K7k32K31J43j03R1q3J09l6j28K04p8r8K85m70
8094a99N5J68J10l27J51J9J24J55k83j20k0l1K23o8p3L8o4K34j86J63j84J75L6
8117I6j7p5K60l95J54k16jL26l48L83k55L9J78k18p7K11K27l82o5J81Q5p4J38
8140A55l91K95pj50o8K27j91J29J8Q0K4j98K76k65J15j0Q9j82j72K97k06J68j15
8163h2J89j27R6q4k77L82nRk75JK46q7n2K16oq7m8k6J72k32k3K5P3K5K3l4PK26
8191B45
$$ Imaginary data points
##PAGE= N=2
##DATA TABLE= (X++(I..I)), XYDATA
$$ plain form
0 0 0 0 0 0 0 0 0 0 0 0 0 0 -8 8 -8 8 -9 16 -16 24 -24 32 -40 46 -52 63 -72 81 -95 110 -126 144 -162 184
34 184 -208 234 -264 298 -332 370 -415 460 -511 566 -625 692 -763 842 -928 1023 -1126 1240
52 1240 -1367 1507 -1663 1838 -2037 2265 -2525 2830 -3196 3634 -4175 4866 -5780 7053 -8957
67 -8957 12163 -18961 67674 -116154 -44346 119628 -74888 56342 36881 -48042 46589 10429
79 10429 -1097 32968 -50158 10915 26970 -7244 9084 -17749 -494 11642 -20584 2430
91 2430 -29936 -1409 31943 -32609 3920 -3352 -60707 42973 21555 -59608 9247 3886 -14695
104 -14695 19604 -20812 -15770 5506 -9151 15956 -10081 -39745 18523 20788 -23225 -11378
116 -11378 -2210 -15878 880 15709 -15211 -19961 11906 2248 -6628 807 -19754 -6303 25373
$$ packed form
0@%%%%%%%%%%%%qJ6j6J6j7K5l2M0m8N6p2Q6r8J15j35J53j76K05k36K70l06L46
34A84l92M42m98N62o30P02p85Q75r71J077j191J317j455J605j770J951k149K366
52A240k607K874l170L501l875M302m790N355o026O830p809R041j0646J2833j6010
67h957K1120l1124Q6635j83828P1808J63974j94516J31230j9461q4923R4631l6160
79A0429j1526L4065q3126O1073J6055l4214J6328k6833J7255J2136l2226K3014
91B430l2366K8527L3352o4552L6529p272n7355J03680k1418q1163O8855n361j8581
104a4695L4299m0416N042K1276j4657K5107k6037k9664N8268K265m4013J1847
116a1378R168j3668J6758J4829l0920m750L1867r658q876P435k0561J3451L1676
$$ plain form
129 25373 5420 -6260 1810 353 6211 -2401 -930 16982 -133 6486 24969 -15188 -14742 19444
143 19444 3524 2539 6498 -7972 3613 6375 1892 -10705 -25649 11958 19386 -10576 -4733
156 -4733 -15772 -6728 10415 -14289 76 -4728 -14505 26203 -13489 -25937 21583 -18055 -3076
169 -3076 21688 -27781 4614 10447 -17164 15808 -10997 -15003 15672 -9821 8950 -584 -28715
182 -28715 18995 7600 -17110 3718 -9595 1266 4958 -6034 9567 -13553 -2510 23890
194 23890 -18128 -6397 16138 -7028 13562 8381 -13079 6780 1853 4357 11780 -6099 5056
207 5056 9655 -394 11005 -2029 -12686 11432 13734 -659 550 3118 -1789 275 6417 -3364
221 -3364 -6249 12547 10338 -7213 -4966 1191 1352 3365 2744 93 -2921 1698 11262 -1102 -14263
$$ packed form
129B5373j9953j1680Q070j457N858q612J471J7912j7115O619J8483m0157M46L4186
143A9444j5920r85L959j4470J1585K762m483j2597j4944L7607P428k9962N843
156d733j1039R044J7143k4704J4365m804r777M0708l9692j2448M7520l9638J4979
169c076K4764m9469L2395N833k7611L2972k6805m006L0675k5493J8771r534k8131
182b8715M7710j1395k4710K0828j3313J0861L692j0992J5601k3120J1043K6400
194B3890m2018J1731K2535k3166K0590n181k1460J9859m927K504P423j7879J1155
207E056M599j0049J1399j3034j0657K4118K302j4393J209K568m907K064O142r781
221c364k885J8796k209j7551K247O157J61K013o21k651l014M619R564j2364j3161
$$ plain form
236 -14263 2555 7898 -751 4505 -3944 -8658 7976 2894 -8239 -1545 1268 -1130 -2357 2188
250 2188 -2832 -13062 5108 8620 -13040 -7069 2222 1088 640 -5517 -803 -4636 -4619 11931 -6650
265 -6650 -11520 10979 -3005 -271 8155 -12426 -784 7741 -470 3799 -4364 2442 8069 -7042
279 -7042 3084 1803 -6245 10991 5787 -2607 -577 -1803 6870 1050 -569 6712 -6408 5473
293 5473 14235 -9340 -3736 5178 416 7032 725 -2032 2271 174 5096 -1609 -6264 5941 4654
308 4654 -64 777 -2780 -2529 2214 6768 -2672 -9457 6127 3877 -4906 2994 -3993 -6469 5297
323 5297 1857 -4042 -4875 -1965 3742 -1358 -4206 -3041 -3328 1959 133 -5436 -4706 139 4454 -3507
339 -3507 -5956 923 -3833 577 6675 -5991 -5320 4089 1335 -805 -2301 -421 1511 907 4258
$$ packed form
236a4263J6818N343q649N256q449m714J6634n082j1133O694K813k398j227M545
250B188n020j0230J8170L512k1660N971R291j134m48o157M714l833J7J6550j8581
265f650m870K2499j3984K734Q426k0581J1642Q525q211M269q163O806N627j5111
279g042J0126j281q048J7236n204q394K030j226Q673n820j619P281j3120J1881
293E473Q762k3575N604Q914m762O616o307k757M303k097M922o705m655J2205j287
308D654m718Q41l557K51M743M554r440o785J5584k250q783P900o987k476J1766
323E297l440n899q33K910N707n100k848J165k87N287j826n569P30M845M315p961
339c507k449O879m756M410O098j2666O71R409k754k140j496J880J932o04L351
$$ plain form
354 4258 -1457 -5859 2796 3448 -393 -603 141 1644 534 2590 -584 -7445 4443 7518 -4115
369 -4115 -125 1383 -2316 3668 2719 -2015 -1491 1786 6764 601 -4156 1296 721 1119 3643 -1939
385 -1939 -3852 2521 3507 -3203 -4355 583 -1449 -1584 1662 -4081 -7465 263 2272 -4834 -6284 -2161
401 -2161 -2946 -788 823 -5743 -5856 -160 1703 -1347 -7185 -583 3020 -3666 2075 236 -7438 3859
417 3859 4462 -4013 -901 2 2059 3109 -708 -1183 -2669 3417 5883 -3502 -395 3033 -483 2522
433 2522 1701 732 -199 397 8904 1467 -5517 6640 3472 82 6255 109 -4 5910 4301 1982
449 1982 -1485 1807 5483 1612 2616 -843 -2046 5370 1552 -2191 -1286 -1140 3197 -1088 -2917 2207
465 2207 -5679 -1188 6367 -6341 -3755 3208 -2791 320 675 -3771 -874 514 3141 651 -6263
$$ packed form
354D258n715m402Q655O52l841k10P44J503j110K056l174o861J1888L075j1633
369d115L990J508l699N984r49m734N24L277M978o163m757N452n75L98K524n582
385a939j913O373R86o710j152M938k032j35L246n743l384P728K009p106j450M123
401b161p85K158J611o566j13N696J863l050n838O602L603o686N741j839p674J1297
417C859O03q475L112R03K057J050l817m75j486O086K466r385L107L428l516L005
433B522q21r69r31N96Q507p437o984J2157l168l390O173o146j13N914j609k319
449A982l467L292L676l871J004l459j203P416l818l743R05J46M337m285j829N124
465B207p886M491P555j2708K586O963n999L111L55m446K897J388K627k490o914
$$ plain form
480 -6263 1784 4774 -1736 247 -1092 -1080 3354 1080 -1012 -1827 -153 3119 -1917 -1233 1917 -4177
496 -4177 833 4889 -4962 -1934 3029 -1584 1606 153 -3392 2024 828 2294 1705 -5940 2696
511 2696 6243 -3358 1659 1450 -2698 4396 2079 -1963 -312 -53 3118 -481 -2026 2258 -3710 -281
527 -281 4048 -4521 -2172 729 -392 1675 -4280 -1430 1774 -2981 3453 -1331 -6362 5651 1141
542 1141 -3735 2294 -2011 -409 1838 -873 1480 -3052 -631 4093 -3556 -561 438 -3678 1860
557 1860 -397 -1975 -2626 -4718 5009 -806 -7812 2864 -2667 -2649 4385 -6671 -2477 3940 -3124
572 -3124 1054 -1075 -2410 3489 -2119 627 2825 -4558 2787 2959 -2526 2833 -426 -432 2879 493
588 493 1969 -2585 -654 7893 -2510 -3142 4993 -2128 1368 4133 -3760 1205 1765 208 4022 -2241
$$ packed form
480f263Q047K990o510J983j339J2M434k274k092q15J674L272n036O84L150o094
496d177N010M056r851L028M963m613L190j453l545N416j196J466n89p645Q636
511B696L547r601N017k09m148P094k317m042J651K59L171l599j545M284n968L429
527b81M329q569K349K901j121K067n955K850L204m755O434m784n031J2013m510
542A141m876O029m305J602K247k711K353m532K421M724p649K995R99m116N538
557A860k257j578o51k092R727n815p006J0676n531J8P034j1056M194O417p064
572c124M178k129j335N899n608K746K198p383P345J72n485N359l259oL311k386
588D93J476m554J931Q547j0403o32Q135p121L496K765p893M965N60j557L814o263
$$ plain form
604 -2241 -688 4618 -1650 2362 3004 -4408 2840 4219 -1997 1124 41 -239 2558 107 -54 -2940
620 -2940 -385 5233 -3009 -3930 2131 -1990 -93 252 -3909 -72 -1589 -358 1807 -5562 -314 2329
636 2329 -4066 2055 -866 -5466 3211 843 -1840 -24 -3006 1984 1835 -1646 739 -3056 1315
651 1315 4706 -3600 -687 1056 -833 3064 -1219 -600 1582 -2198 5013 669 -5370 4673 568
666 568 -1048 4478 -3289 -12 4728 -529 2275 -1653 -1343 6083 -836 201 2454 -3213 4146 2992
682 2992 -3075 1332 -713 1961 2511 -3427 1697 -391 -2139 5398 -2803 -3951 4260 -1868 161
697 161 853 -4870 1473 646 -1565 1285 -4907 -178 3927 -3929 -645 374 -3567 2238 685 -3123
713 -3123 -555 -1085 1543 -141 -3413 1353 -764 -789 3113 -3178 -1780 2598 -1283 748 -931 -2728
$$ packed form
604b241J553N306o268M012O42p412P248J379o216L121j083k80K797k451j61k886
620b940K555N618q242r21O061m121J897L45m161L837j517J231K165p369N248K643
636B329o395O121k921m600Q677k368k683J816k982M990j49l481K385l795M371
651A315L391q306K913J743j889L897m283O19K182l780P211m344o039J0043m105
666E68j616N526p767L277M740n257K804l928L10P426o919J037K253n667P359j154
682B992o067M407k045K674N50n938N124k088j748P537q201j148Q211o128K029
697A61O92n723O343q27k211K850o192M729M105p856L284J019l941N805j553l808
713c123K568n30K628j684l272M766k117k5L902o291J398M378l881K031j679j797
$$ plain form
729 -2728 2800 -22 -170 1900 -3962 1833 3864 -2923 983 1191 -1441 3298 473 -394 789 -629
745 -629 3773 306 -2303 2954 -440 672 2999 -2433 648 1893 657 2381 -2515 476 2621
760 2621 -2622 2817 -241 -4081 3860 -98 -2725 1904 -2602 34 1485 -2264 486 -2167 -1357
775 -1357 2714 -3471 -2024 901 -2293 866 -896 -2477 274 -1694 1226 -70 -4333 1523 -184
790 -184 -2063 2348 -2743 -1759 2471 -1792 -51 -377 -1906 1755 -635 -685 1209 -2698 859 2669
806 2669 -2464 -416 799 35 1034 -431 21 -325 184 2505 -188 -1333 1878 464 178 1850 -784
823 -784 364 2094 870 776 -436 868 1746 40 656 603 -942 1346 1976 -1124 -554 928 549 629
841 629 -392 -468 -494 1 1461 -767 -1658 1289 718 -452 451 -864 -267 791 194 -108 -1376 45
$$ packed form
729b728N528k822j48K070n862N795K031o787L906K08k632M739k825q67J183j418
745f29M402l467k609N257l394J112K327n432L081J245j236J724m896K991K145
760B621n243N439l058l840P941l958k627M629m506K636J451l749K750k653Q10
775a357M071o185J447K925l194L159j762j581K751j968K920j296m263N856j707
790a84j879M411n091R84M230m263J741l26j529L661k390n0J894l907L557J810
806B669n133K048J215p64R99j465M52l46N09K321k693j145L211j414k86J672k634
823g84J148J730j224r4j212J304Q78j706O16n3j545K288O30l100N70J482l79Q0
841F29j021p6k6M95J460k228q91K947n71j170R03j315N97J058n97l02j268J421
$$ plain form
859 45 1291 -889 -71 -2 -2040 1133 804 -2230 -913 -411 218 -354 -1466 -170 -1161 -380 845 -1373
877 -1373 -1500 258 51 -250 -476 -264 109 517 1612 -352 -1428 1683 1589 172 637 131 356 1554
895 1554 1525 -136 -509 1593 1582 -60 518 386 627 873 771 572 -762 871 1802 -556 157 340 -1049
914 -1049 1403 836 -1180 -148 602 1190 51 -1500 440 -198 -441 1005 -1718 -956 661 -773 -519
931 -519 -1561 -1295 71 -1933 -238 -616 -3083 94 -98 -2419 -261 -1799 -1140 941 -1301 -1143 -1213
948 -1213 -484 1219 -1510 -990 1206 -870 807 647 -1034 531 170 713 541 -905 1328 352 -589
965 -589 2056 -304 -1015 2000 237 203 526 -764 1964 1424 -425 944 -638 1590 2198 -1542 391
982 391 1411 -455 1372 136 -171 820 -493 1119 595 -1256 1436 -688 -982 2404 -1954 -1570 1549
$$ packed form
859D5J246k180Q18O9k038L173l29l034J317N02O29n72j112J296r91P81J225k218
877a373j27J758k07l01k26K12L73M08J095j964j076L111r4j417M65n06K25J198
895A554k9j661l73K102j1j642N78j32K41K46j02j99j334J633R31k358P13J83j389
914a049K452n67k016J032P50N88j139j551J940o38k43J446k723P62J617j434K54
931e19j042K66J366k004J695l78k467L177j92k321K158j538O59K081k242J58p0
948a213P29J703k729N20K196k076J677j60j681J565l61N43j72j446K233r76r41
965e89K645k360p11L015j763l4L23j290K728n40j849J369j582K228O08l740J933
982C91J020j866J827j236l07R91j313J612n24j851K692k124k94L386m358L84L119
$$ plain form
999 1549 -1101 3 -1055 -2330 1859 -1131 -1841 568 -2749 702 1120 -3428 487 24 -1509 1346
1015 1346 -1609 -622 702 -2113 1771 -276 -2745 1917 -1219 -385 2077 -2847 203 1496 -961
1030 -961 1857 -2020 -668 3253 -2411 265 1608 -2889 2565 603 -2365 2413 -771 207 1737
1045 1737 -1598 1984 389 -1076 3722 -968 -665 2201 -1079 1741 740 -2061 2049 334 765
1060 765 1371 -2717 2311 1935 -2182 2074 -792 -1329 2599 -1718 -484 887 -1639 1499 -721 -1647
1076 -1647 1701 -1802 -128 1590 -2594 -142 296 -1009 1245 -1973 -1168 1487 -1523 961 -603
1091 -603 -3003 2469 -586 -1915 1752 -2087 372 1566 -2525 1219 -565 -1295 2604 -1788 -744
1106 -744 2086 -2520 1307 1372 -2617 1639 155 -2 2195 -1969 749 1859 -1296 2342 -254 -1133
$$ packed form
999A549k650J104j058j275M189k990p10K409l317L451M18m548L915m63j533K855
1015A346k955R87J324k815L884k047k469M662l136Q34K462m924L050J293k457
1030i61K818l877J352L921n664K676J343m497N454j962k968M778l184R78J530
1045A737l335L582j595j465M798m690L03K866l280K820j001k801M110j715M31
1060G65O06m088N028l76m117M256k866n37L928m317J234J371k526L138k220r26
1076a647L348l503J674J718m184K452M38j305K254l218Q05K655l010K484j564
1091f03k400N472l055j329L667l839K459J194m091L744j784p30L899m392J044
1106g44K830m606L827O5l989M256j484j57K197m164K718J110l155L638k596q79
$$ plain form
1122 -1133 3393 -849 -248 1861 -1664 2036 591 -1484 2505 -1366 -26 2871 -2302 1165 1708
1137 1708 -2617 2410 73 -1652 1968 -1191 953 823 -2547 1823 57 -1757 1925 -1940 -153
1152 -153 1501 -2372 774 -369 -1317 1708 -1847 -894 1435 -2467 981 447 -2943 1526 -955 -1586
1168 -1586 1721 -2221 -46 388 -2035 1437 -1111 -1814 1852 -1428 -265 1084 -1935 973 266 -1117
1184 -1117 1430 -1261 -2 1379 -1708 1455 540 -1623 2233 -208 -633 1801 -1219 819 1359 -1107
1200 -1107 1696 -117 -486 2632 -962 179 1959 -1359 1148 848 -1229 1839 -339 -38 1593 -1471
1216 -1471 796 871 -1397 2126 -779 -1050 1781 -1328 109 815 -1880 1428 -269 -1682 1567 -1853
1232 -1853 -304 1772 -2400 520 236 -2037 1299 -875 -1147 1206 -1639 469 200 -2236 1178 -582
$$ packed form
1122a133M526m242O01K109l525L700j445k075L989l871J340K897n173L467N43
1137A708m325N027k337j725L620l159K144j30l370M370j766j814L682l865J787
1152a53J654l873L146j143r48L025l555R53K329l902L448n34l390M469k481o31
1168a586L307l942K175M34k423L472k548p03L666l280J163J349l019K908p07j383
1184a117K547k691J259J381l087L163r15k163L856k441m25K434l020K038N40k466
1200a107K803j813l69L118l594J141J780l318K507l00k077L068k178L01J631l064
1216a471K267P5k268L523k905k71K831l109J437P06k695L308j697j413L249l420
1232a853J549K076m172K920k84k273L336k174k72K353k845K108k69k436L414j760
$$ plain form
1248 -582 -1329 1389 -1964 -112 1020 -1256 850 -835 -833 2068 -1201 142 1291 -1457 1800 850
1264 850 -1445 1697 -381 217 1498 -902 1046 529 -610 1809 -290 -416 1943 -647 790 814
1280 814 -1052 1065 381 -127 1052 -1126 868 1242 -1364 1195 -22 -1078 1795 -387 -520 813
1296 813 -791 551 -264 -1244 889 -634 -630 1129 -1628 -324 580 -1158 503 -643 -1104 702 -944
1313 -944 -271 -200 -1636 555 -211 -1203 530 -1075 -424 1075 -1072 -111 16 -919 1161 -302 -738 1158
1331 1158 -948 376 947 -1106 430 231 -468 924 -498 138 834 -478 840 -86 -945 1508 71
1348 71 -341 918 -671 498 845 -379 713 -146 225 1327 -981 226 983 -805 1122 197 -547
1365 -547 622 -269 234 523 -925 365 67 -355 993 -654 -478 848 -659 -52 -68 -763 595 -418
$$ packed form
1248e82p47K718l353J852J132k276K106j685KK901l269J343J149k748L257r50
1264H50k295L142k078N98J281k400J948n17j139K419k099j26K359k590J437K4
1280H14j866K117o84n08J179k178J994L74k606K559j217j056K873k182j33J333
1296H13j604J342q15r80K133j523MJ759k757J304R04j738J661j146m61J806j646
1313i44O73P1j436K191p66r92J733j605O51J499k147R61J27r35K080j463m36J896
1331A158k106J324N71k053J536j99o99J392j422O36O96j312J318r26q59K453j437
1348G1m12J259j589J169L47j224J092q59L71J102k308J207P57j788J927r25p44
1365e47J169q91N03K89j448J290k98m22J348j647J76J326j507O07j6o95J358j013
$$ plain form
1383 -418 -377 18 -1113 388 439 -1302 220 -295 -788 515 -641 -327 46 -518 307 -395 -804 413
1401 413 -356 -79 196 -1156 -101 269 -398 35 -456 -199 399 -285 -334 16 -477 956 43 -364 460
1420 460 152 325 451 -211 207 492 86 635 -144 -15 613 -114 515 816 -394 349 501 334 219 -243
1440 -243 230 517 -214 350 -69 -257 241 -45 -328 293 -88 115 -183 -332 123 -689 64 175 -897 -348
1460 -348 309 -207 -4 -476 -735 -138 343 -195 -745 -333 251 -249 -754 -304 -366 -230 -14 -566 -139 -239
1480 -239 -65 190 -587 201 156 -540 260 424 -187 -20 236 176 226 172 -86 80 743 289 -181 331 630
1501 630 318 89 325 457 159 475 280 -205 134 379 147 248 146 43 115 280 556 67 -291 552
1521 552 336 -314 -28 -369 -105 443 -560 -115 -9 -57 209 -925 -46 211 -634 101 -35 -569 -157 -455
$$ packed form
1383d18M1L95j131J501N1j741J522n15m93J303j156L14L73n64Q25p02m09J217
1401D13p69K77K75j352J055L70o67M33m91K57N98o84m9L50m93J433r13m07Q24
1420D60l08J73J26o62M18K85m06N49p79J29O28p27O29L01j210P43J52j67j15m62
1440b43M73K87p31N64m19j88M98k86k83O21l81K03k98j49M55q12P53J11j072N49
1460c48O57n16K03m72k59N97M81n38n50M12N84n00n05M50o2J36K16n52M27j00
1480b39J74K55p77P88m5o96Q00J64o11J67K56o0N0n4k58J66O63m54m70N12K99
1501F30l12k29K36J32k98L16j95m85L39K45k32J01j02j03P2J65K76m89l58Q43
1521E52k16o50K86l41K64N48j003M45J06m8K66j134Q79K57q45P35j36n34M12k98
$$ plain form
1541 -455 -604 78 -560 -215 -468 -306 115 -767 -740 634 -329 -544 -141 -463 186 -394 -324 150 -366 340
1561 340 216 -626 320 259 -329 361 33 -60 283 -144 519 264 -183 558 159 373 674 -155 262 983 45
1582 45 566 188 192 590 260 388 305 -239 747 232 -453 947 -82 -458 623 -182 51 211 -95 681
1602 681 -517 -609 484 -468 -45 520 -965 438 194 -438 87 -459 -192 137 -976 184 -121 -939
1620 -939 794 -448 -624 502 -1020 -100 81 -743 457 -642 -328 978 -1030 -129 830 -702 778
1637 778 -160 -1018 945 -249 -28 367 -595 670 460 -653 826 -391 -49 1144 -344 171 536
1654 536 -687 961 71 -318 923 -737 662 862 -990 592 622 -269 1229 -368 -323 763 -743
1671 -743 316 -39 -662 1026 -306 -352 683 -930 233 752 -614 35 -392 -280 1054 -710 -187
$$ packed form
1541d55j49O82o38L45k53J62M21q82K7J374r63k15M03l22O49n80P0M74n16P06
1561C40j24q42R46o1n88O90l28r3L43m27O63k55m47P41l99K14L01q29M17P21r38
1582D5N21l78ML98l30J28q3n44R86n15o85J400j029l76J081q05K33J60l06P76
1602F81j198r2J093r52M23N65j485J403k44o32N25n46K67L29j113J160l05q18
1620i39J733j242j76J126j522R20J81q24J200j099L14J306k008R01R59j532J480
1637G78r38q58J963j194K21L95r62J265k10j113J479j217L42J193j488N15L65
1654E36j223J648q90l89J241j660J399K00j852J582L0q91J498j597M5J086j506
1671g43J059l55o23J688j332m6J035j613J163N19j366O49m27J12J334j764N23
$$ plain form
1688 -187 295 -1177 730 -270 -1311 563 -562 -65 440 -1260 242 96 -916 435 -886 -580
1704 -580 788 -992 -5 191 -992 637 45 -687 474 -852 585 664 -1019 946 -82 -319 1410
1721 1410 -515 -264 922 -432 700 25 -731 1325 43 -197 1166 -961 623 929 -1008 875
1737 875 180 -233 1337 -489 191 511 -686 1395 -49 -806 1237 -161 21 905 -1039 249 646
1754 646 -697 627 -727 -506 1016 -1145 80 158 -1169 814 29 -796 773 -851 -246 574 -1295
1771 -1295 151 -243 -793 973 -865 -700 690 -671 261 215 -969 504 -403 -304 526 -981 632
1788 632 590 -743 821 -84 -294 759 -353 86 538 -590 942 -37 -370 1200 -361 57 896 -524
1806 -524 367 614 -470 650 -19 -380 522 -596 466 569 -794 884 284 -375 837 -341 -100
$$ packed form
1688a87M82j472J907j000j041J874j125M97N05j700J502j46j012J351j321L06
1704e80J368j780R87J96j183J629n92p32J161j326J437P9j683J965j028k37J729
1721A410j925K51J186j354J132o75p56K056j282k40J363k127J584L06j937J883
1737H75o95m13J570j826O80L20j197K081j444p57K043j398J82Q84j944J288L97
1754F46j343J324j354K21J522k161J225P8j327J983p85q25J569j624O05Q20j869
1771a295J446l94n50J766j838J65J390j361R32m6j184J473r07R9Q30j507J613
1788F32m2j333J564r05k10J053j112M39M52j128J532r79l33J570j561M18Q39j420
1806e24Q91K47j084J120o69l61R02j118J062J03j363J678o00o59J212j178K41
$$ plain form
1823 -100 599 -486 541 -46 -864 853 -692 -262 875 -880 242 165 -781 354 -253 -360 421 -764
1841 -764 193 54 -882 495 -257 -947 692 -468 -170 337 -501 186 -234 -649 628 -844 -359 711
1859 711 -954 154 326 -580 339 74 -436 407 -530 333 182 -332 718 -29 -35 782 -202 -65 711 -271
1879 -271 306 46 -91 708 -226 434 505 -589 446 230 -486 427 87 -104 558 -29 321 -30 -209 483
1899 483 -150 -32 448 -388 -231 342 -272 -62 -60 -72 226 -524 -148 193 -463 152 -112 -796 265 -157 -431
1920 -431 -10 -306 26 -101 -473 227 -366 -231 92 -601 -92 132 -596 60 256 -447 -251 -251 291 163 -313
1941 -313 45 273 -69 420 1 -246 251 -336 72 411 26 517 113 154 555 -111 121 586 116 248
1961 248 301 -93 355 378 233 53 188 331 -13 33 332 -108 6 184 136 -36 -128 -13 -89 -287 167 -292
$$ packed form
1823a00O99j085J027n87q18J717j545M30J137j755J122p7r46J135o07j07P81j185
1841g64R57j39r36J377p52o90J639j160K98N07q38O87m20m15J277j472M85J070
1859G11j665J108J72r06R19k65n10Q43r37Q63j51n14J050p47oQ17r84J37P76r82
1879b71N77k60j37P99r34O60P1j094J035k16p16R13l40j91O62n87L50l51j79O92
1899D83o33J18M80q36J57N73o14K10Kj2K98p50L76L41o56O15k64o84J061m22k74
1920d31M21k96L32j27l72P00n93J35L23o93N09K24p28O56J96p03J96%N42j28m76
1941c13L58K28l42M89m19k47M97n87M08L39l85M91m04M1M01o66K32M65m70J32
1961B48N3l94M48K3j45j80J35J43l44M6K99m40J14J78m8j72r2J15p6j98M54m59
$$ plain form
1983 -292 -404 206 -123 -213 -204 -198 187 -364 -335 -85 -261 -282 -362 -323 -65 7 -297 -357 -267 -7 -272 -349 216 -335
2007 -335 -179 -37 -208 19 -136 -92 -120 4 -169 76 -183 484 32 -309 356 35 -62 372 -65 24 228
2028 228 -3 310 140 236 537 -291 369 348 -207 -34 235 320 366 23 290 254 -143 278 -104 -72 665 -185
2050 -185 -151 426 -211 -25 111 -92 221 -141 -210 94 -256 -68 246 -773 53 31 -479 154 -493 -313 110
2071 110 -804 -123 -111 -523 154 -589 -499 461 -412 -172 -32 -326 93 -317 -261 248 -454 -158 339 -416 460
2092 460 71 -313 447 -132 -12 341 -69 110 -35 -91 883 -152 -271 513 -351 330 507 -231 388 152
2112 152 32 418 -302 203 488 -361 459 224 -187 835 -177 259 347 -544 360 27 -253 514 -439 -145
2132 -145 716 -832 -63 113 -473 604 -206 -167 195 -490 72 81 -838 361 -115 -669 511 -500 -433 470
$$ packed form
1983b92j12O10l29r0ROL85n51K9K50j76k1q0L9K58P2l04o0R0K60k65p7N65n51
2007c35J56J42j71K27j55M4k8J24j73K45k59O67m52l41O65l21r7M34m37Q9K04
2028B28k31L13j70R6L01q28O60k1n55J73K69Q5M6l43K67l6l97M21l82L2P37q50
2050a85L4N77o37J86J36k03L13l62o9L04l50J88L14j019Q26k2n10O33o47J80M23
2071A10r14O81J2m12O77p43R0R60q73K40J40k94M19m10N6N09p02K96M97p55Q76
2092D60l89l84P60n79J20L53m10J79j45n6R74j035j19P84q64O81J77p38O19k36
2112A52j20L86p20N05K85q49Q20k35m11J022j012M36Q8q91R04l33k80P67r53K94
2132a45Q61j548P69J76n86J077q10L9L62o85N62Rr19J199m76n54J180j011O7R03
$$ plain form
2152 470 -651 280 -128 -389 426 -638 -198 242 -899 88 304 -541 618 54 26 402 -390 303 496
2171 496 -309 518 -3 -571 730 -390 36 346 -268 226 252 -173 634 -206 55 631 -487 236 483
2190 483 -469 356 27 -313 469 -280 25 471 -218 621 121 -391 686 -586 82 625 -747 296 265
2209 265 -298 510 -434 -364 501 -800 236 95 -819 416 -178 -460 447 -576 40 180 -726 387 -179
2228 -179 -362 432 -536 -208 611 -680 68 -67 -488 272 -287 -257 301 -772 417 174 -692 536 -138
2247 -138 -276 691 -348 237 286 -493 827 -29 -187 887 -207 73 622 -430 226 442 -269 513 33
2266 33 -228 753 -325 199 235 -628 839 20 -417 589 -437 231 581 -521 201 162 10 476 -561
2285 -561 50 341 -663 46 168 -714 452 -271 -292 118 -456 270 -18 -853 356 -415 -678 695 -697
$$ packed form
2152D70j121R31m08k61Q15j064M40M40j141R87K16q45J159n64k8L76p92O93J93
2171D96q05Q27n21n68J301j120M26L10o14M94K6m25Q07q40K61N76j118P23K47
2190D83r52Q25l29l40P82p49L05M46o89Q39n00n12J077j272O68N43j372J043l1
2209B65n63Q08r44P0Q65j301J036j41r14J235n94k82R07j023O16J40r06J113n66
2228a79j83P94r68L28Q19j291P48j35m21P60n59L0N58j073J189k43q66J228o74
2247a38j38R67j039N85M9p79J320q56j58J074j094K80N49j052O56K16p11P82m80
2266C3k61R81j078N24L6q63J467q19m37J006j026O68L50j102P22l9j52M66j037
2285e61O11K91j004P09J22q82J166p23k1M10n74P26k88q35J209p71k63J373j392
$$ plain form
2304 -697 -250 386 -452 316 8 -436 629 -570 94 353 -1087 336 102 -452 218 -304 -5 416 -364
2323 -364 87 237 -298 993 -97 -391 863 -406 124 461 -498 343 4 -248 527 -392 229 674 -469
2342 -469 628 209 -748 917 114 -141 529 -516 448 47 -479 652 4 -111 741 -649 19 431
2360 431 -557 215 92 -405 432 -496 133 444 -927 409 122 -668 338 -266 -306 400 -569 -112 -129 -650
2380 -650 391 -505 -429 360 -611 -20 239 -866 290 251 -666 342 -473 -87 259 -283 458 171 -461
2399 -461 107 77 -3 610 -174 512 617 -195 352 -77 -84 693 -205 119 702 -288 127 275 -288 497 -93
2420 -93 175 383 -162 301 261 -360 579 -102 -593 443 -468 323 189 -623 86 -3 -344 593 -323 -42 485
2441 485 -626 116 -37 -361 162 -199 -96 -68 -641 119 -201 -466 54 -378 -463 384 -683 -223 205 -331
$$ packed form
2304f97M47O36q38P68l08m44J065j199O64K59j440J423k34n54O70n22K99M21p80
2323c64M51J50n35J291j090k94J254j269N30L37r59Q41l39k52P75r19O21M45j143
2342d69J097m19r57J665q03k55O70j045R64m01n26J131o48j15Q52j390O68M12
2360D31r88P72j23m97Q37r28O29L11j371J336k87p90J006o04m0P06r69M57j7n21
2380f50J041q96P6P89r71N91K59j105J156l9r17J008q15L86L46n42P41k87o32
2399d61N68l0q0O13p84O86J05q12N47m29pP77q98L24N83r90M15J48n63P85n90
2420i3K68K08n45M63m0o21R39o81m91J036r11P91j34q12P09q9l41R37r16K81N27
2441D85j111P42j53l24N23l61J03K8n73P60l20k65N20m32q5Q47j067M60M28n36
$$ plain form
2461 -331 143 -258 21 345 -371 -38 190 -452 292 -3 -303 550 44 -149 115 -277 321 -2 -141 641
2481 641 -276 -40 398 -71 325 263 -327 97 171 -110 265 -151 320 534 -325 273 122 -274 342 -188 -116
2502 -116 436 -162 25 -89 -188 488 -221 -13 154 -293 -139 102 -227 46 -48 -421 25 21 -54 70 -473 26
2524 26 62 -255 -72 -145 -107 204 -286 81 102 -418 -163 -15 -62 157 -297 37 255 -87 -28 65 -137 161 -114
2547 -114 -57 52 -46 216 -108 13 335 212 121 161 -78 119 29 -90 84 26 173 4 -9 265 188 -89 234
2570 234 391 246 233 169 201 138 -92 162 44 66 88 -157 -212 312 157 -63 -100 55 -202 -115 256 -148 -78
2593 -78 52 -229 1 -86 -86 -454 -350 62 -27 -79 -119 -280 -258 34 -138 -119 -219 -160 -1 -140 66 -98 -255
2616 -255 62 -97 -351 30 46 -47 -68 -146 145 102 -113 167 -109 150 194 -197 0 170 113 184 236 249 272 -241
$$ packed form
2461c31M74m01K79L24p16L33K28o42P44k95l00Q53n06j93K64l92N98l23j39P82
2481F41r17K36M38m69L96o2n90M24P4k81L75m16M71K14q59N98j51l96O16n30P2
2502a16N52n98J87j14r9O76p09K08J67m47J54K41l29K73r4l73M46mp5J24n43M99
2524B6L6l17J83p3L8L11m90L67K1n20K55J48m7K19m54L34K18l42N9R3k02K98k75
2547a14N7J09r8K62l24J21L22j23r1M0k39J97r0j19J74n8J47j69j3K74p7k77L23
2570B34J57j45j3o4L2o3k30K54j18K2K2k45n5N24j55k20l7J55k57Q7L71m04P0
2593g8J30k81K30q7%l68J04M12q9n2m0j61K2K92j72J9j00N9J59j39K06j64j57
2616b55L17j59k54L81J6r3k1p8K91m3k15K80k76K59M4l91J97J70n7P1N2J3K3n13
$$ plain form
2640 -241 54 488 -230 210 187 48 337 239 22 424 42 277 104 118 380 30 -199 250 -387 195 305
2661 305 -178 -24 -88 25 -106 -110 -46 -14 -573 348 27 -107 21 -118 -7 -195 -390 2 21 -495 153 -105
2683 -105 -123 201 -396 -221 181 -370 191 45 -230 137 -350 -272 -444 -408 156 -40 -579 505 -79 -151 355
2704 355 -172 -44 136 -206 280 80 -371 508 -181 107 327 -208 353 349 -147 513 153 118 297 -92 16
2725 16 5 -490 444 -158 -458 293 -735 78 -744 -72 318 144 -71 552 -877 298 202 -805 467
2744 467 -282 -204 566 -203 -526 221 -638 144 -96 -516 192 -281 -185 266 -551 -118 95 -118 352 -37 -258
2765 -258 158 -257 149 51 -523 367 67 -130 432 52 -246 106 -240 154 56 -432 481 -146 -99 546 -238
2786 -238 282 404 -235 372 334 -57 529 -316 187 530 -618 493 -176 -322 506 -168 -55 214 -334 352
$$ packed form
2640b41K95M34p18M40k3j39K89r8k17M02l82K35j73J4K62l50k29M49o37N82J10
2661C05m83J54o4J13j31mO4L2n59R21l21j34J28j39J11j88j95L92J9n16O48k58
2683a05j8L24n97J75M02n51N61j46k75L67m87P8j72L6N64j96n39J084n84p2N06
2704C55n27J28J80l42M86k00m51Q79o89K88K20n35N61mm96O60l60l5J79l89J08
2725A6j1m95R34o02l00P51j028Q13q22O72L90j74k15O23j429J175r6j007J272
2744D67p49P8P70p69l23P47q59P82k40m20P08m73R6M51q17M33K13k13M70l89k21
2765b58M16m15M06r8n74Q90l00j97N62l80k98L52l46L94r8m88R13o27M7O45p84
2786b38N20J22o39O07l8l91N86q45N03L43j148J111o69j46Q28o74J13K69n48O86
$$ plain form
2806 352 71 -244 416 -445 -165 479 -573 -13 449 -376 222 121 -137 311 -288 -203 130 -665 8 92
2826 92 -579 362 -208 -137 65 -668 8 1 -542 179 -534 -269 414 -370 93 312 -349 111 2 -238 427
2847 427 -59 -193 212 -473 319 -127 -234 618 10 -296 534 -309 -5 134 -252 397 -149 369 594 -412
2867 -412 168 333 -287 490 -37 -292 370 -115 173 209 -161 520 44 -140 676 -210 -178 342 -482 198 128
2888 128 -69 228 -88 106 268 -303 165 40 -569 87 50 -465 486 -403 -22 216 -296 6 -231 -230 415
2909 415 -136 -140 290 -339 -69 -14 -367 73 -318 -337 247 -268 179 186 -257 77 -468 -301 301 -178 159 157 -190
2932 -190 241 -10 59 519 -154 33 163 -201 272 135 -80 476 -94 -246 393 -3 142 387 -188 254
2952 254 216 -47 418 -202 127 136 -8 42 -16 -9 124 -348 -61 83 2 -115 199 -73 414 -134 -294 250 26
$$ packed form
2806C52k81l15O60q61K80O44j052N60M62q25N98j01k58M48n99Q5L33p95O73Q4
2826I2o71R41n70P1K02p33O76pn43P21p13K65O83p84M63K19o61M60j09k40O65
2847D27m86j34M05o85P92m46j07Q52o08l06Q30q43L04J39l86O49n46N18K25j006
2867d12N80J65o20P77n27k55O62m85K88L6l70O81m76j84Q16q86L2N20q24O80p0
2888A28j97K97l16J94J62n71M68j25o09O56l7n15R51q89L81K38n12L02k37JO45
2909D15n51mM30o29K70N5l53M40l91j9N84n15M47Pm43L34n45J67O02m79L37kl47
2932a90M31k51O9M60o73J87J30l64M73j37k15N56n70j52O39l96J45K45n75M42
2952B54l8k63M65o20L29Rj44N0n8PJ33m72K87J44q1j17L14k72M87n48j60N44k24
$$ plain form
2975 26 236 -338 -26 440 -273 -396 181 -288 -201 248 -449 244 55 -181 173 -181 21 147 -335 121 112
2996 112 -267 185 -362 -59 292 -140 416 100 -103 88 -48 151 268 52 -107 8 105 188 -88 -82 83
3017 83 -134 95 219 -7 101 -107 -146 53 10 -64 162 -277 100 241 142 -17 -6 -241 289 -156 -108 -1
3039 -1 -33 182 297 -71 31 -99 -30 217 -104 195 79 39 89 11 -210 57 -293 -118 -260 166 -62 -246
3061 -246 116 -8 -136 -211 26 -155 38 186 0 -112 -86 22 27 -146 188 -255 -133 180 223 52 -8 348
3083 348 -235 -247 137 -65 57 17 87 -146 267 160 -197 0 -33 100 -139 233 -6 -231 89 127 67 40
3105 40 -56 50 -72 286 91 -60 150 241 79 20 225 -174 -157 185 -17 -104 -50 141 -18 -7 -187 -307 -263
3128 -263 -156 -266 -82 -145 26 -91 42 -115 -48 -34 -180 247 -195 19 -140 -235 -116 43 -132 60 99 -181
$$ packed form
2975B6K10n74L12M66p13j23N77m69Q7M49o97O93j89k36L54l54K02J26m82M56r
2996A12l79M52n47L03L51m32N56l16k03J91j36J99J17k16j59J15R7Q3k76OJ65
3017H3k17K29J24k26J08k08l9J99m3p4K26m39L77J41r9j59J1k35N30m45M8J07
3039al2K15J15l68J02j30O9K47l21K99j16m0N0p8k21K67l50J75j42M26k28j84
3061b46L62j24j28p5K37j81J93J48j86j12K6J08Nj73L34m43J22L13M3j71o0L56
3083C48n83j2L84k02J22m0P0k33M13j07l57J97l3J33k39L72k39k25L20L8o0k7
3105D0r6J06j22L58j95j51K10R1j62n9K05l99J7L42k02q7N4J91j59J1j80j20M4
3128b63J07j10J84o3J71j17J33j57O7J4j46M27m42K14j59r5J19J59j75J92L9k80
$$ plain form
3150 -181 12 81 87 40 42 19 0 74 259 -356 -101 245 168 234 180 -113 -66 -88 126 249 -38 -11 -41 -65 311 -13
3176 -13 173 -23 -11 -43 -219 -87 111 222 53 142 78 148 -20 -76 306 -70 3 4 -107 51 72 -419 109 8
3200 8 -185 321 -68 -301 118 -226 -57 -229 -291 104 -281 -19 287 -344 15 105 -341 38 -71 -131 242 -142
3222 -142 -123 160 -368 198 90 -138 361 -20 -35 334 -130 174 -56 -1 188 -236 -240 301 -216 20 277 20
3244 20 334 237 171 338 -371 -14 167 15 135 132 -42 268 -216 -209 499 -208 215 142 -238 187 -145 254 168
3267 168 -349 -35 304 -333 29 182 -55 37 -54 175 32 -283 63 -57 -438 265 -100 -141 89 -303 19
$$ packed form
3150a81J93O9Om7Kk3j9P4J85o15K55L46p7O6n4k93M7k2K14J23k87K7l0k4L76l24
3176a3J86j96J2l2j76J32J98J11j69Q9o4P0j68n6L82l76P3Jj11J58K1m91N28j01
3200Hj93N06l89k33M19l44J69j72o2L95l85K62L06o31L59R0m46L79j09o0L73l84
3222a42J9K83n28N66j08k28M99l81j5L69m64L04k30N5J89m24mN41n17K36K57k57
3244B0L14r7o6J67p09L57J81j52J20lj74L10m84PP08p07M23p3l80M25l32L99q6
3267A68n17L14L39o37L62J53k37R2r1K29j43l15L46j20l81P03l65m1K30l92L22
$$ [...]
8191F9
##END NTUPLES=NMR FID
##END=
