##TITLE=1H_SL82-Dau(f6)
 CDCl3, 8 sc, 
 29.9.2020
##JCAMPDX= 6.0         $$ Bruker NMR JCAMP-DX V2.0
##DATA TYPE= NMR FID
##DATA CLASS= NTUPLES
##ORIGIN= UXNMR, Bruker Analytische Messtechnik GmbH
##OWNER= root
$$ XWIN-NMR		Version 3.5
$$ Tue Sep 29 10:09:08 2020 Russian Standard Time (UT+4h)  she@DPX200
##.OBSERVE FREQUENCY= 200.1315066352
##.OBSERVE NUCLEUS= ^1H
##.DELAY= (6, 6)
##.ACQUISITION MODE= SIMULTANEOUS
##.ACQUISITION SCHEME= undefined
##.AVERAGES= 8
##.DIGITISER RES= 18
##SPECTROMETER/DATA SYSTEM= spect
##.PULSE SEQUENCE= zg30
##.SOLVENT NAME= CDCl3
##.SHIFT REFERENCE= (INTERNAL, CDCl3, 0, 15.7039)
##AUDIT TRAIL= $$ (NUMBER, WHEN, WHO, WHERE, WHAT)
$$ ##TITLE= Audit trail, XWIN-NMR		Version 3.5
$$ ##JCAMPDX= 5.01
$$ ##ORIGIN= Bruker BioSpin GmbH
$$ ##OWNER= she
$$ F:/spectra/data/she/nmr/H-F/1/audita.txt
$$ ##AUDIT TRAIL=  $$ (NUMBER, WHEN, WHO, WHERE, WHAT)
(   1,<2020-09-29 10:08:05.95 +0400>,<she>,<DPX200>,
      <created by zg, POWCHK disabled, PULCHK disabled
       configuration hash MD5:
       00 E9 B6 7A A2 85 ED C7 34 08 36 98 17 FE 4E 26
       data hash MD5: 16K
       99 B6 50 C4 32 57 46 70 33 96 82 6E 5D 24 83 D9>)
$$ ##END=
$$ 
$$ hash MD5
$$ 80 83 B8 A7 55 6E 27 46 47 B1 0F C9 99 FB 30 09
##$RELAX= 
##$RELAX= 
##$RELAX= 
##$RELAX= 
##$RELAX= 
##$RELAX= 
$$ Bruker specific parameters
$$ --------------------------
##$DU= <F:/spectra>
##$EXPNO= 1
##$NAME= <H-F>
##$PROCNO= 1
##$TYPE= <nmr>
##$USER= <she>
##$AMP= (0..31)
100 100 100 100 100 100 100 100 100 100 100 100 100 100 100 100 100 100 
100 100 100 100 100 100 100 100 100 100 100 100 100 100 
##$AQSEQ= 0
##$AQ_mod= 1
##$AUNM= <au_zg>
##$AUTOPOS= <>
##$BF1= 200.13
##$BF2= 200.13
##$BF3= 200.13
##$BF4= 200.13
##$BF5= 200.13
##$BF6= 200.13
##$BF7= 200.13
##$BF8= 200.13
##$BYTORDA= 1
##$CFDGTYP= 0
##$CFRGTYP= 5
##$CHEMSTR= <none>
##$CNST= (0..31)
1 1 145 1 1 1 1 1 1 1 1 1 1 1 1 1 1 1 1 1 1 1 1 1 1 1 1 1 1 1 1 1 
##$CPDPRG= <>
##$CPDPRG1= <>
##$CPDPRG2= <>
##$CPDPRG3= <>
##$CPDPRG4= <mlev>
##$CPDPRG5= <mlev>
##$CPDPRG6= <mlev>
##$CPDPRG7= <mlev>
##$CPDPRG8= <mlev>
##$CPDPRGB= <>
##$CPDPRGT= <>
##$D= (0..31)
0 1.2 0 0 0 0 0 0 0 0.06 0 0.03 0 0 0 0 0.0002 0 0 0 0 0 0 0 0 0 0 0 0 
0 0 0 
##$DATE= 1601359685
##$DBL= (0..7)
120 120 120 120 120 120 120 120 
##$DBP= (0..7)
150 150 150 150 150 150 150 150 
##$DBP07= 0
##$DBPNAM0= <>
##$DBPNAM1= <>
##$DBPNAM2= <>
##$DBPNAM3= <>
##$DBPNAM4= <>
##$DBPNAM5= <>
##$DBPNAM6= <>
##$DBPNAM7= <>
##$DBPOAL= (0..7)
0.5 0.5 0.5 0.5 0.5 0.5 0.5 0.5 
##$DBPOFFS= (0..7)
0 0 0 0 0 0 0 0 
##$DE= 6
##$DECBNUC= <off>
##$DECIM= 32
##$DECNUC= <off>
##$DECSTAT= 4
##$DIGMOD= 1
##$DIGTYP= 9
##$DL= (0..7)
0 120 120 120 120 120 120 120 
##$DP= (0..7)
150 150 150 150 150 150 150 150 
##$DP07= 0
##$DPNAME0= <>
##$DPNAME1= <>
##$DPNAME2= <>
##$DPNAME3= <>
##$DPNAME4= <>
##$DPNAME5= <>
##$DPNAME6= <>
##$DPNAME7= <>
##$DPOAL= (0..7)
0.5 0.5 0.5 0.5 0.5 0.5 0.5 0.5 
##$DPOFFS= (0..7)
0 0 0 0 0 0 0 0 
##$DQDMODE= 0
##$DR= 18
##$DS= 0
##$DSLIST= <SSSSSSSSSSSSSSS>
$$ [...]
##$SUBNAM2= <"">
##$SUBNAM3= <"">
##$SUBNAM4= <"">
##$SUBNAM5= <"">
##$SUBNAM6= <"">
##$SUBNAM7= <"">
##$SUBNAM8= <"">
##$SUBNAM9= <"">
##$SW= 16.880792210976
##$SWIBOX= (0..15)
0 0 2 0 0 0 0 0 0 0 0 0 0 0 0 0 
##$SW_h= 3378.37837837838
##$TD= 16384
##$TD0= 1
##$TE= 0
##$TE2= 300
##$TE3= 300
##$TEG= 300
##$TL= (0..7)
0 120 120 120 120 120 120 120 
##$TP= (0..7)
150 150 150 150 150 150 150 150 
##$TP07= 0
##$TPNAME0= <>
##$TPNAME1= <>
##$TPNAME2= <>
##$TPNAME3= <>
##$TPNAME4= <>
##$TPNAME5= <>
##$TPNAME6= <>
##$TPNAME7= <>
##$TPOAL= (0..7)
0.5 0.5 0.5 0.5 0.5 0.5 0.5 0.5 
##$TPOFFS= (0..7)
0 0 0 0 0 0 0 0 
##$TUNHIN= 0
##$TUNHOUT= 0
##$TUNXOUT= 0
##$USERA1= <user>
##$USERA2= <user>
##$USERA3= <user>
##$USERA4= <user>
##$USERA5= <user>
##$V9= 5
##$VALIST= <valist>
##$VCLIST= <CCCCCCCCCCCCCCC>
##$VD= 0
##$VDLIST= <DDDDDDDDDDDDDDD>
##$VPLIST= <PPPPPPPPPPPPPPP>
##$VTLIST= <TTTTTTTTTTTTTTT>
##$WBST= 1024
##$WBSW= 4
##$XGAIN= (0..3)
0 0 0 0 
##$XL= 0
##$YL= 0
##$YMAX_a= 107776
##$YMIN_a= -96754
##$ZGOPTNS= <>
##$ZL1= 120
##$ZL2= 120
##$ZL3= 120
##$ZL4= 120
##$ABSF1= 10
##$ABSF2= 0
##$ABSG= 5
##$ABSL= 3
##$ALPHA= 0
##$AQORDER= 0
##$ASSFAC= 0
##$ASSFACI= 0
##$ASSFACX= 0
##$ASSWID= 0
##$AUNMP= <proc_1d>
##$AZFE= 0.1
##$AZFW= 0.1
##$BCFW= 1
##$BC_mod= 2
##$BYTORDP= 1
##$COROFFS= 0
##$CY= 11.3945322036743
##$DATMOD= 1
##$DC= 2
##$DFILT= <>
##$DTYPP= 0
##$F1P= 16.9975609425685
##$F2P= -3.02152046262296
##$FCOR= 0.5
##$FTSIZE= 0
##$FT_mod= 4
##$GAMMA= 1
##$GB= 0.15
##$INTBC= 1
##$INTSCL= 1
##$ISEN= 128
##$LB= 0.24
##$LEV0= 0
##$LPBIN= 0
##$MAXI= 10000
##$MC2= 0
##$MEAN= 0
##$ME_mod= 0
##$MI= 1.114404
##$NCOEF= 0
##$NC_proc= 0
##$NLEV= 6
##$NOISF1= 3.799351
##$NOISF2= 2.8
##$NSP= 1
##$NTH_PI= 0
##$NZP= 0
##$OFFSET= 15.70392
##$PC= 1
##$PHC0= -9966.51
##$PHC1= 4.600891
##$PH_mod= 1
##$PKNL= yes
##$PPARMOD= 0
##$PSCAL= 0
##$PSIGN= 0
##$REVERSE= no
##$SF= 200.130013532006
##$SI= 16384
##$SIGF1= 3
##$SIGF2= 2
##$SINO= 400
##$SIOLD= 16384
##$SREGLST= <1H.CDCl3>
##$SSB= 0
##$STSI= 0
##$STSR= 0
##$SW_p= 3612.71676300578
##$SYMM= 0
##$S_DEV= 0
##$TDeff= 0
##$TDoff= 0
##$TI= <>
##$TILT= no
##$TM1= 0
##$TM2= 0
##$TOPLEV= 0
##$USERP1= <user>
##$USERP2= <user>
##$USERP3= <user>
##$USERP4= <user>
##$USERP5= <user>
##$WDW= 1
##$XDIM= 8192
##$YMAX_p= 0
##$YMIN_p= 0
$$ End of Bruker specific parameters
$$ ---------------------------------
##NTUPLES= NMR FID
##VAR_NAME=  TIME,          FID/REAL,        FID/IMAG
##SYMBOL=    X,             R,               I
##VAR_TYPE=  INDEPENDENT,   DEPENDENT,       DEPENDENT
##VAR_FORM=  AFFN,          ASDF,            ASDF
##VAR_DIM=   8192,          8192,            8192
##UNITS=     SECONDS,       ARBITRARY UNITS, ARBITRARY UNITS
##FACTOR=    0.000296,      1,               1
##FIRST=     0,             0,               0
##LAST=      2.424536,      0,               0
##MIN=       0,             -96754,          0
##MAX=       2.424536,      107776,          0
$$ Real data points
##PAGE= N=1
##DATA TABLE= (X++(R..R)), XYDATA
0@%%%%%%%%%%%%%%%pJ5j6J6j6K0k8L2l8M6n3O1p2Q5r5J08j24J43j63J84k08K35
$$ 0 0 0 0 0 0 0 0 0 0 0 0 0 0 0 0 -7 8 -8 8 -8 12 -16 16 -22 24 -29 32 -40 45 -50 58 -66 77 -86 98 -110 125
37A25k64K95l32L69m08M54n04N58o17O82p55Q34r20J013j115J229j354J493j648
$$ 125 -139 156 -176 193 -215 239 -265 293 -324 358 -397 437 -483 530 -585 644 -710 783 -865
56h65J824k023K249k512K821l188L634m189M902n859P215r304J3079l5109J35101
$$ -865 959 -1064 1185 -1327 1494 -1694 1940 -2249 2653 -3206 4009 -5295 7784 -27325 107776
71A07776p2995j10829J16096n1050l8789N7757L317l5418J3177L4379j0163l9311
$$ 107776 34781 -76048 40048 -11002 -49791 7966 11283 -24135 -10958 23421 13258 -26053
83b6053L3803k311k0434L5970j5777k3852M8780m499k2723M51j3185J0958J7719
$$ -26053 7750 5439 -14995 20975 5198 -18654 30126 25627 2904 3355 -9830 1128 18847
96A8847j238r19k4634R791K6180k2898n404P144j0675J6721K338j5574Pl548J5251
$$ 18847 17609 16690 -7944 1847 28027 5129 -275 6869 -3806 12915 15253 -321 -314 -3862 11389
111A1389O03l0336J8611J8933k0563O096k299j7489J9902P709j9278j426P814
$$ 11389 11992 -18344 267 19200 -1363 4733 2434 -15055 4847 12556 -6722 -8148 -334
124c34L899j08m045m322p306P795J4292j1075q306P239m669m18M424n215N66P055
$$ -334 3565 3457 -588 -4910 -12216 -4421 9871 -1204 -9510 -2271 -6940 -7358 -2934 -8149 -7583 -528
140e28K586n352r691P512Q458o258J458k871m113J4402K608j4316l58P432L506
$$ -528 2058 -3294 -12985 -5473 2985 -3273 -1815 -4686 -8799 5603 8211 -6105 -6463 969 4475
155D475P99j364q68l082K811P331p927o668J2760R43r249M632J4l692P019L50
$$ 4475 5274 3910 3042 -40 2771 10102 2175 -4493 8267 9210 -39 4593 4607 915 7934 8284
171H284p512j880L303M251k148k509r65k421N633K800j0579r02J0110n17m456
$$ 8284 772 -1108 2195 6446 4298 1789 824 -1597 4036 6836 -3743 -4645 5465 4948 492
186D92k51r81k281J999L599o001l758J0638M68j0409J960J571k465N489j004n850
$$ 492 241 -740 -3021 -1022 2577 -3424 -7182 3456 3924 -6485 -4525 -2954 -5419 70 -934 -6784
202f784J886J158O83j436j571J775j318K249L382q522J109J0610m049m436K750
$$ -6784 -4898 -3740 -3057 -4493 -6064 -4289 -5607 -3358 24 -8498 -7389 3221 -828 -5264 -2514
217b514k515J408N183j501m200Q29Q022j362p000L897J834m789N330K621o447
$$ -2514 -5029 -3621 1562 61 -4139 -3310 4712 3350 -3650 247 2081 -2708 2622 5243 -1204
232a204K896M264l455m935K170N130m49O36J212p391O35P728n041k031M868l536
$$ -1204 1692 5956 2501 -2434 -264 4866 4417 5053 6265 -1126 -491 7237 2196 165 5033 1497
248A497l45M860j856m930J214N630l014n986N257K990m304J112j828m914M057
$$ 1497 1152 6012 4156 -774 440 6070 3056 -2930 2327 5317 1013 2125 297 -4617 -560
263e60M101k394j977q04J181K07j145o47k397K315L782n180j708M007j750j584
$$ -560 3541 1147 -830 -1634 -453 -246 -1391 -2038 -4435 -2120 1662 -3518 -5226 -1219 -2969 -4553
279d553K948p22k083K763L078m394m175L856J357j469L107l93l853L449K932n144
$$ -4553 -1605 -2327 -4410 -1647 1431 -2963 -7138 -3282 -1925 -3394 -287 -680 -4533 -1084 1848 -3296
295c296j801M712K429j043M57j345l334K826L319l500L26M540r01k079R12l83
$$ -3296 -5097 -385 2044 1001 1458 113 -3221 -395 2924 -576 -250 4290 3389 1310 2222 1839
311A839j822K822J881l814m47M408j51l050Q16l90k319K949L611k955l351K219
$$ 1839 17 2839 4720 906 459 4867 4716 1666 2482 2092 -227 2722 6333 3378 27 2246
327B246N56k592R64P76j608J537J244l524n46L364j115l005N84O02p85J744J429
$$ 2246 2802 210 1174 1950 342 1879 3123 -401 -947 2417 1302 -1703 -1119 -517 -1302 442 1871
344A871m119j793L768k08k754J864P92k105P27J512k719j548L177M16k687J947
$$ 1871 -2248 -4041 -273 -481 -3235 -1371 -579 -2684 -1957 -445 -3164 -4712 -1535 -1119 -3806 -1859
360a859P94j363J434K85k846J026K911o44j617N69O95j129J930J458l114L3L840
$$ -1859 -1065 -2428 -994 -709 -3555 -2529 382 -262 -1879 -1310 -615 -1744 186 1644 -1470 -1437 2403
377B403j191j851J803pp71R46L8j271J317J852j606j684K441J17j567J799L26
$$ 2403 1212 -639 1164 1157 386 1332 1370 99 1416 3268 1662 -22 2419 2536 969 2768 3094
394C094k783L85K862j283k254J968N03j978J788Q61l353K97K860k039k843K994
$$ 3094 311 696 3558 2275 21 1989 2492 514 2302 3163 -190 107 2967 928 -1915 1079
410A079Q45k282P64K07l034N62K653j160j820J754N43k929K39Q22j263Q08J948
$$ 1079 1924 -358 406 613 -2421 -1859 794 -366 -2186 -432 111 -2818 -2579 -1757 -3020 -2212 -264
427b64k468j339K482K23j306Q81m17j392J054K001j149j519K290K27k081J402
$$ -264 -2732 -4071 -1589 -1366 -2672 -1791 -2208 -3600 -2546 -545 -1694 -3213 -923 -696 -2777 -1375
443a375O43j205J896O68j765k22J559Q56j272K51K36q42J955J890l074K38K372
$$ -1375 -732 -1937 -41 627 -1138 -1360 199 1055 -217 34 270 -572 1383 3273 199 437 2809
460B809j685j94J251m18J6Q77O79j447j582K451O25k057J392K43j622J563L02
$$ 2809 1124 930 2181 1763 1779 2656 3335 1888 306 2757 3382 1325 2717 2960 1338 2901 3203
477C203k471l38K202j85j778k75J400j379L58J253l250r77L504m25j822L00o73
$$ 3203 732 394 2596 2411 633 358 1758 379 737 1990 -1260 -2237 1267 842 -980 -680 -1353
494a353q50P33R80j353j006K515n22k876J803J301j416P30J20j937O05J912M04
$$ -1353 -2203 -1470 -490 -1843 -2849 -334 -856 -3732 -1929 -628 -2044 -1314 -1194 -3131 -2526 -614 -210
511b10j633o18J036q9J062J249k428q48K764l71j273J524P2k66J030p85p56P34
$$ -210 -1843 -2461 -1425 -1514 -452 797 -1631 -2479 285 -86 -1359 165 237 -29 1001 216 -540 194
529A94J829k68j992J166J057j132J193K40k453J467K155j110q50L11m3n48J079
$$ 194 2023 1755 -237 929 1986 854 2047 2287 -166 1301 3456 2346 1496 1807 1764 1216 2295
546B295P9j673L28J731j293j268J166j39j151J100o74j071M34J357p78k072L23
$$ 2295 2374 701 1029 2760 1467 199 1365 1226 75 1175 501 -570 -136 1221 443 -1629 -1306
563a306J774j016PK23k176Q20K160j707r34R55j23n93O18j90q35O95J562j658
$$ -1306 468 -548 -541 -318 -2494 -1674 486 -1221 -2155 -1200 -1323 -1916 -1298 -1488 -2323 -1628 -66 -1724
581a724j678K296Q22j909N69Q37j238O85J479j013r65R00R72p15K93J098j678
$$ -1724 -3402 -1106 -284 -2193 -1624 -787 -2025 -1340 139 -874 -1839 -939 33 -682 -389 709 -969
598i69O57J725j532m34J669q9j26L33Lo05O25Q73j071p28J842L20j462Q55j57
$$ -969 -312 1413 -119 -553 1116 1027 901 1234 1237 632 1257 2130 1059 331 2173 2493 1031 1886 1729
617A729j480J887O29j977o4R45j5p10p5K58q74O24J127k144JJ542j185p47O40
$$ 1729 249 2136 2765 788 724 1669 1654 944 869 1127 253 877 2004 -140 -139 1403 218 -529 111
636A11l50l33P35L06j770l29J512k0j496Q23J75j664J275O41j667J84J114m52
$$ 111 -239 -572 163 469 -1301 -1630 -118 -138 -1634 -811 -636 -2300 -1025 -384 -2051 -1867 -753 -1205
654a205p96L31O96n35K57Q56j553j03J943k40r27N37j23n37R61O33p95j04J346
$$ -1205 -2001 -1670 -974 -1509 -1252 -396 -1949 -2052 -109 -349 -1276 -739 -862 -1399 -438 195 -600 -704 642
673F42r4j214P06P41l30L15M73j315N99J511l41p65L11J17k63N08L28p57m96J246
$$ 642 548 -666 40 781 451 766 1239 -76 523 2034 1693 928 1239 1356 1093 1601 1929 1172 676 1922
693A922m84r48Q57J12o44M87k6r21R8J072p76j034Q92N1o26P45m05j443O31J208
$$ 1922 1438 490 1347 1459 815 1302 1276 355 453 1525 749 -285 607 658 32 777 372 -1071 -440 768
713G68j143q18N84M09o47K45j14j066M63J414j009j092J097j1n93N10qo37N77
$$ 768 -375 -1193 -609 -200 -847 -602 -716 -1782 -1319 95 -914 -2006 -909 -920 -1513 -1003 -1011 -1648 -1071
732a071O08r64n24J026K30l19M90J82r96Q67J022p49q87J047L56n55J27N37o39
$$ -1071 -463 -1427 -1951 -925 -695 -1014 -524 -342 -1338 -471 551 -198 -1085 -38 318 -237 -110 427 -212
751b12M47P41l63o88J123O67n76j60J88q55N45J159r62n25P28L27n11K56o4n10
$$ -212 235 976 613 -75 1048 1715 1139 979 1167 312 857 2016 1054 529 1257 1584 1073 1329 1265 755
771G55J70Q40j160l34R28k41o44K93k05n48J117j94r39k90Q82j32r34J80k65m26
$$ 755 925 1765 605 271 1199 958 314 607 402 -146 971 777 -162 -452 430 298 -636 -456 -721 -1147
791a147O94M17p49n64J016k93n64L89J9q08L14N64r70j10J023m4p46L87L61j93
$$ -1147 -453 -36 -785 -1349 -333 -626 -1190 -801 -782 -1590 -1276 -712 -1682 -1792 -769 -813 -1559 -1172 -811 -1004
811a004J64L78p16k01Q86J12l54O28l4n76N12J065j070k27J362m80l78M82N89
$$ -1004 -840 -462 -1178 -1379 -493 -381 -735 -107 -141 -717 -205 860 -210 -437 925 445 67 549 1138
830A138q11N18O76j013O5P47K57p73N41m5o11K36O28o82k31O58k96o75Q06r0m36
$$ 1138 327 845 1521 508 573 1320 1577 804 1345 1300 689 925 1553 871 640 1298 1002 327 1133 1043 607
851F07K67J91r73J68N78p47j49K07r2n85J65L92n48n3O01m97n42L65J8m95L13
$$ 607 874 1065 92 260 838 91 -58 149 57 -528 -363 29 -519 -572 29 -468 -1010 -645 -627 -1122 -809
872h09j42m40M2J053n99n58P36m6n64M07K8n78L58P53n13j72Q27J30l38L30J48
$$ -809 -951 -1391 -1349 -296 -895 -1453 -717 -763 -1327 -920 -892 -1470 -1112 -359 -872 -1044 -217 -87 -425 -95 53
893E3o71M19O72m01l59Q18R2p24L84N12l75K86P14p28l59R27j03o70N38J44p35
$$ 53 -618 -199 473 72 -287 531 623 -101 283 795 420 706 1420 692 333 1260 1157 487 1025 1169 434
914D34M52N08n22m10O59K27q92L01R7j02p6J61o76m39R00j2n77K7J16l15q7O13
$$ 434 886 1394 872 462 1121 1348 456 757 854 752 676 837 161 -278 622 610 33 60 176 -139 -226 387
936C87j024l19P85k02r06P21p9n78N51J28l88m6O45l68p12K17K73k37M52R8o98
$$ 387 -637 -956 -171 -373 -1279 -558 -637 -1215 -664 -536 -924 -970 -325 -693 -1405 -1188 -915 -1152 -700 -602 -1300
957a300K73R15o15J46J65n7j24K26M18p68K77Q67n75n95J052R0m18N84J09m22
$$ -1300 -1027 -112 -727 -581 -416 -473 -597 -371 47 -721 -444 423 -152 -747 305 395 -23 561 670 248
977B48j6N95j32p03N88L50l45L09K97n88Q9N92l58j19L16r8n79L84J26m20l2O39
$$ 248 232 827 695 -8 580 930 585 894 1191 603 692 1284 926 807 1123 1025 446 830 956 536 504 1143
999A143m48n85L24M63o83K95j52o46Q9M83r1p36K5N96q87K04L01l75J3M08o21
$$ 1143 695 110 434 897 214 509 357 -289 -200 283 192 -544 -519 77 -810 -606 -305 -680 -667 -259 -880
1020h80j34K84J12n30j0N51m53Q8M60m25l65P36N2n41N22J55m66L74M09m69j29
$$ -880 -1014 -730 -618 -1148 -1158 -607 -1060 -972 -512 -937 -1302 -566 -514 -1055 -533 -378 -844 -470 -61 -530 -659
1041f59M67J40j21K60K49n61K87L77n01p0P38n9l79O10n8K1n2M60j017L76M11
$$ -659 -192 -52 -173 87 336 -225 62 439 -62 -132 606 547 168 778 720 741 689 1149 132 508 919
1062I19Q8n08K64P7k96J35L89m55l64N73j13m86L5L10l03l73N16k50n36N68O3
$$ 919 1007 499 763 840 544 679 1068 613 249 822 709 223 258 568 265 -108 408 158 -378 190 253
1083B53p34L10J93k74k98N26m68j43J97j52k86K18L14k69k03K99l12j54L68j99
$$ 253 -481 -171 22 -252 -550 -24 -492 -635 -438 -590 -876 -658 -344 -613 -816 -517 -829 -983 -615 -814
1103h14j32J15K52k42R1L00l04j5L79N5n41O83J25n01M83J00j70K5M12l75N0J19
$$ -814 -946 -831 -579 -821 -730 -430 -734 -749 -370 -315 -856 -173 -48 -549 -66 34 -136 -111 301 -74 -24 95
1125I5L95m25L38M56o05K15M84p62J83K99O4j5J22K09p13L14K91j21n61N88k30
$$ 95 490 65 403 859 254 469 953 191 374 673 737 722 844 1053 340 654 945 824 263 851 621
1146F21l87K62Q5m93K35M05n17m86L06K63l35r4L38m82j32M54m40L5L43k23m15
$$ 621 234 496 581 88 323 728 211 -275 31 294 -41 -135 203 -279 -411 43 -397 -362 -19 -242 -657
1167f57L6K36k16m06L94J91p51O71Kj98K11K3k96J09L44j94l48N81P9m90K03L13
$$ -657 -621 -385 -601 -1007 -613 -422 -1173 -502 -500 -698 -487 -464 -760 -651 -307 -501 -849 -268 -189 -679 -476 -163
1189a63l75K35L11l3k80N31J00j93j63M34m10J33O83m47M4L08j0k89K74K2l26
$$ -163 -538 -303 8 -25 -305 226 326 133 -30 404 -6 127 810 363 407 715 705 416 690 712 386
1210C86M64j2m53J48J49j20k17L35k4k00k6M10l98k29M78k32l32L30k34l11J56
$$ 386 850 838 385 533 682 562 345 680 656 456 430 840 442 213 691 459 127 457 223 -88 68
1231F8M8l61q5L45J90p48L81P2o53J09M24m13k64P43k21k29j63L04k78M9K47k3
$$ 68 116 -245 -330 15 205 -543 -162 -90 -743 -634 -210 -623 -887 -144 -365 -594 -757 -453 -731 -682 -435 -458
1253d58m01L36J29k79j35M77k45J99K18j31j02N53o2n10L63J94k61J93L1j38j27
$$ -458 -859 -523 -394 -673 -808 -331 -576 -377 -159 -290 -392 161 99 -411 -48 146 -115 78 109 -29 -156
1274a56O61j78r2L26j99nJ77L6j7n8R9K06m31L61k34Q1J40K25l92k63N56k88l57
$$ -156 505 327 235 561 362 357 534 570 553 495 594 800 369 730 496 577 717 942 550 287 843 555 198
1297A98L60J15o20rK26J68l67K97l91j72L26k46p2r7K45l07k16M92l91j01K23
$$ 198 558 673 53 44 270 438 71 368 -23 -195 131 -115 -187 -284 -39 -346 -562 -70 -461 -562 -339
1318c39M1o56M60M04m29m04M85L7j93k7M0K6j47N37l39M1J24L36l86oR7m0J14
$$ -339 -298 -954 -494 -90 -519 -923 -438 -401 -594 -621 -581 -555 -702 -165 -504 -463 -339 -3 -389 -395 -298 -338 -224
1341b24M35m17J2L65r8j08J54J88l24L33J65k93J29L34p7k05J95P4k48L59J8o44
$$ -224 211 -206 -194 171 73 -35 119 307 -17 316 481 188 317 651 574 369 564 638 390 749 767 123
1363A23K65O8p2L4J7J37m86K24J60l03K7L51m25K8K90k87l04K81p0l30K38J85
$$ 123 388 456 384 418 435 572 86 310 470 167 194 545 120 148 438 151 -153 128 58 -272 -34 151
1385A51m26K4K93k72l72K89j18O8j99K40J5n55N33J02l42k1L03k37J06lj33p3
$$ 151 -275 -251 42 -230 -602 -313 -431 -363 -562 -322 -307 -862 -329 -227 -569 -590 -287 -524 -418 -421 -554 -627
1407f27M85j39j00p0K12K73m14M80j47j82L77m1k47R6K18o2k9J81j12Q2r9M15
$$ -627 -142 -281 -381 -451 -239 34 -380 100 -47 -229 148 107 -140 -44 174 112 83 264 152 234 135 550
1429E50r4nJ79k21j57M24l08R5J4q3jN7K17l31j7j16m5J82m0N3l56K21o8j26L34
$$ 550 456 451 630 409 252 676 368 463 477 394 393 450 667 336 319 203 158 340 300 353 -3 218 150 24 358
1454C58j15m67P6K92j60k92J81K21n34N52m77l05L85J31j20k96K94j32k25M7L44
$$ 358 243 -224 -148 144 -16 -308 -127 94 -440 112 -365 -670 -285 -154 -274 -570 -276 -408 -633 -586 -242
1475b42l85j10O52l74j68R9L07m0j34J86k12j19N27k07R5r2L07j09QJ38k21L4
$$ -242 -627 -737 -85 -459 -627 -528 -221 -261 -395 -209 -421 -540 -13 -220 -125 -217 90 -19 -11 127 -94 -60
1497f0K71Q8q0K29k50j88M75l3k15J98m4jn0P2n9K32j11P0k75J25J24m0k71J36
$$ -60 211 299 219 448 198 10 485 452 237 435 391 390 340 412 353 585 474 544 269 394 518 478 207 343
1521C43j35o2R7J19r1N8R0m64J8K62k28r1J82j60j71rK81l91O7J73j86J25j90
$$ 343 208 146 243 362 271 329 419 -45 -27 235 7 -84 98 -62 -233 -242 39 -352 -285 -112 -298 -173 -363
1544c63o2r0M9K10K6j56P9l5k84L65k62o6L42pj19m4J92R8j91P8J52k44J98K03
$$ -363 -425 -515 -466 -256 -230 -386 -307 -342 -626 -261 -523 -589 -247 -254 -373 -417 -225 -127 -318 -240 -88 -332 -134 69
1568F9j26j44J83M10n44K18M92l20K47O9l55k58M92L2l82L53Ok60Q4M7n3m8K89
$$ 69 -57 -201 -18 392 -152 66 558 238 485 554 199 -59 433 465 83 436 442 182 266 313 260 212 501
1591E01j30j68O1L56l77M3j11L4m1rj45J22o2j9J52k52m4q0K20N5m1k40j0l7k13
$$ 501 371 203 264 620 243 286 175 209 168 159 14 136 74 55 207 -45 -89 -169 51 106 65 -175 -185 -222 -435
1616d35L45j89n4J00j09j08j0J87K55n20j32M50j66OJ31j33q2o8L59j74J27M3
$$ -435 -90 -279 -333 -233 -342 -450 -460 -273 -18 -538 -670 -220 -386 -380 -249 -382 -464 -532 -173 -347 -220 -177
1638a77J10j23J64K0r0J56J58l96P0L50k13K34J10j51l09K97J49Qr6j7l12L63
$$ -177 -67 -190 -26 -6 -96 60 218 -178 -108 242 29 263 373 222 -87 210 359 367 271 254 -58 305
1660C05J09J50l10p9M11l84J11q2J12O2j30j13M4J8L0j98J86k79K4K61j78J06
$$ 305 414 564 254 175 586 202 313 231 343 405 275 162 206 224 254 56 242 -37 -13 248 70 176
1682A76o23L49Q3Q7r7k58J35k5J40j83j95K49l48K39J0j14O8k85L51k84Q1J82
$$ 176 -447 -98 -15 72 -25 -283 -148 -173 -33 -216 -411 -162 -510 -271 -261 -375 -307 -592 -241 -525 -444 -262
1704b62k48M94k44O3k74R8J20J30k09K87n5m16K68M04n7l05L96j65o5K19J57r7
$$ -262 -510 -16 -260 -197 -471 -373 -253 -123 -332 -45 -100 -516 -248 156 99 -206 190 25 -40 179 336 239
1726B39p6O7o7P8J2J52m48M32k17l6J33K69l97Q1K06K1j73N8n3J49k49J10j94
$$ 239 163 230 163 241 253 405 -43 389 172 136 269 538 141 222 428 449 276 334 281 430 181 291 97
1749I7J21K9r8j83K11O2m44L01j91K2n8O0N6q8j28R3R5j25j1O2M9j34l02L26L0
$$ 97 218 247 149 -34 177 239 -205 96 -95 -73 -131 -71 -15 -103 -231 -138 -43 -168 -179 -117 -68 -202 -504 -178 -148
1774a48l05L8P1J11l8L1j20M1K01K9j33J70j91jPJ91N7k0m6j1J40k44L09o6R8
$$ -148 -453 -415 -344 -233 -271 -240 -360 -319 -118 -89 -222 -52 -243 -244 -237 -46 11 -9 -55 -66 74 -170 139 73 171
1799A71j35K26l34K77K95k30k67K30J71j87N6O8j45N22k65j47j77L31r9k08J8
$$ 171 36 262 -72 205 500 270 3 233 404 217 273 341 196 718 453 306 129 460 361 153 171
1820A71j28L12j79o1R2j83J24lk18l4K76j10r7O6o0j98j15L37n8j38j23P0l8k4
$$ 171 43 355 176 115 207 24 148 145 -73 -107 169 59 -38 28 -32 -230 -345 -8 -66 -204 -327 -257 -295 -319
1844c19J26k37J53P5j28M6L9N4j95O7J48k81K21j34K98Q1k01R3k71K82O3r7L71
$$ -319 -193 -430 -277 -202 -330 -284 -245 -191 -386 -319 -171 -452 -231 -365 -67 14 -187 -94 -365 -83 -20 -117 254
1867B54k14N9j46J45l8o3J14J02Jj10K64j39j19K91k42K01K65m01j42M04j87J00
$$ 254 40 99 -47 98 60 -3 111 213 214 104 368 229 110 401 159 360 625 224 82 486 299 399
1889C99l47L31m68J4M39k66K31N7j89l75K62K02j96m8L83k57k72M2K63k98nqr8
$$ 399 52 383 -85 -71 368 102 333 390 201 -174 88 290 94 46 429 172 -100 -58 205 -93 -98 -106 -204
1912b04J9J7j74J42Q4J01j45p9k5P6k5j19M7R7l1j16k73L57q9O3M1o2M35j55o6
$$ -204 -185 -168 -342 -200 -116 -15 -160 -239 -264 -188 -213 -332 -285 -188 -219 -335 -608 -251 -340 -277 -236 -298 137 -18 -84
1937h4L5j3J68r7l39L69j06K79k21n1K28O4J40l02J29R4p3q2j44M66r1j76K63
$$ -84 -49 -62 106 9 -330 39 -67 212 -9 -60 168 232 372 70 199 293 220 138 -6 460 369 193 456
1960D56j84Q1p2O8Mk41R3j01N5K13j53j04J22P0k19j71L01k58j75K61j0j19N5
$$ 456 272 353 281 349 353 112 205 104 159 372 219 115 237 307 88 -83 218 -40 -215 46 36 -83 -28
1983b8j48K96k43P8J3j58J48n5k57Q3J77l66J57J04K69l38k7k3m5K33Q0l7j90
$$ -28 -176 120 -123 -45 -32 -190 -42 -97 -354 -271 -94 -460 -303 -199 70 -268 -295 -318 -363 -130 -50 -87 -277
2006b77L6q6o2J60L11n4k17M43m15j10K98j2K2k2QP5M7k04J77N8R2k40J16J13
$$ -277 -241 -327 -389 -229 82 28 -189 254 -161 -271 27 15 37 15 23 98 145 -59 118 176 268 28 144 257
2030B57k85M01j84q7p5K80q8K3J9O3j40n5R2n3J04j89K62l76K24k22J0M0J35J61
$$ 257 -28 373 189 102 27 307 219 242 261 324 184 129 221 168 272 83 345 -31 193 -29 -19 21 156 317
2054C17k18k52K47q8J7J45j62k45J38J31j45j29j15R3r3K53R3l33rJ84j73J72
$$ 317 99 -153 94 6 23 168 6 -239 -101 30 -115 -244 -359 -266 -359 -106 -13 -346 -355 -171 -344 -172
2076a72m7o1J27j18n2J40k84M38l77J78L41j50k01L78k75j87L58j86J17k0P3J36
$$ -172 -219 -280 -153 -271 -323 -183 -467 -29 -406 -228 113 -37 -238 140 -135 -322 36 -150 -33 -53 20 156
2098A56j57j7Q3k7J72k25J7J66Q0l9N3j41M5n7P2n3L4J61M9l9j32q4r2L39l17
$$ 156 -1 -18 65 38 210 -15 2 168 248 209 262 121 166 109 181 128 162 323 372 333 201 117 25 364 47
2123D7K15k09J24M0l9j53J22j04Q7N5L0n61K16L4N9j14r1j9o2O2oQ3k9O8J07M
$$ 47 262 53 177 217 178 25 147 43 130 185 215 -346 -130 -96 -37 -151 -242 -261 -323 -261 -267 -184 -213 -145 -38 -34
2149c4j18k13P5J41O9M0l03L09p4j12J45k05j8J08J23K59j82Q1k09N0K95j62q3
$$ -34 -152 -365 -290 -149 -80 -40 -343 -34 -108 -220 -75 -280 -298 -190 -67 192 10 91 -118 -68 227 65 -18
2172a8L8p4K23Q5k33J11j03L03j80J62j36J65l31K01n5J24m9j96j10K44P9j69
$$ -18 20 -54 169 254 21 132 29 332 152 314 178 343 12 213 158 282 233 37 -73 171 250 81
2194H1K94k82n1L21k18Q6jm15J18J43j63K0j14K25L5j45q6n0N0L0l69L69p5M9
$$ 81 375 93 42 363 145 231 230 -185 -67 76 -87 -67 -181 44 79 -66 -152 -202 -152 -122 -491 -122 -197 -148
2218a48K31J6k96mJ0j10K43o3j0P2j64j94K8M15m22K92j51j30L51M4l3j43K95
$$ -148 83 99 -197 -201 -191 -301 -58 -121 -131 -59 -223 -417 -389 26 -396 -104 -255 -385 -34 10 -23 -166 129
2241A29o2l13R6j09M73j05o5j47Q9J24k5l1J15k8Q1k10K01r2Q7K24j48K10l58
$$ 129 67 -246 -150 -259 214 109 44 -103 -14 110 85 54 169 141 222 12 213 121 208 432 284 494 136
2264A36P1k34L00k19K45j07K05p5k67J54j01J11k1k71oK36k95L7o3r5N2K94j84
$$ 136 207 -27 273 54 299 192 397 322 55 209 108 219 198 -73 -79 157 -138 -101 -164 -259 -207 87 -97
2287i7j3j09K83m2l28J95k42J29J21j04r3Q8N3J5J6N4lk42L82k87L2P8k7kJ34
$$ -97 -110 -219 64 22 -306 -111 -353 -224 -103 -207 -300 -212 -159 -144 -128 -74 -77 -319 63 -224 -192 -114 -141 -143 -9
2312il86M64k09J93j96N0O0O6k5O9n2M8L6j22J91o7n8L1K10l89K42Q0j44m4N6
$$ -9 -395 69 -140 53 -143 -93 -33 33 8 77 25 73 109 -13 178 111 53 84 294 -95 147 227 83 39 95
2337I5J00P7K48m66K1Q0J01M6n1oj24R2l90L42j62R9%j02R2r7J62l8j03j87J95
$$ 95 195 272 520 54 75 155 256 302 251 245 121 213 -177 165 3 102 102 0 92 -5 157 119 16 -171 24
2362B4j64m2p7NJ88k41K8J84j12l8M9j65l9K65J59l70L35l74J39K1K08n7j75L43
$$ 24 -140 -182 -259 -254 -66 -307 -279 -95 -207 -245 -196 -361 -400 -135 24 -346 -11 -385 -246 -225 -17 -74 -249 94
2386I4j58q8k04M64j49j01J17K20m06K19RRPN8l5j04K07j76J49K2j86R4J23k36
$$ 94 -64 -152 -356 108 -41 -142 -25 195 -211 8 17 26 33 91 56 -48 159 -17 132 154 -32 62 185 -51
2410e1j8j23L05P4RK1K20p0j00m7j0j38K07m53L68j51J95j33j41J73o3o0O9Q7
$$ -51 -69 -192 113 187 196 217 437 367 267 220 210 72 279 -174 194 43 238 105 -36 137 74 14 83 170
2434A70j15P1k96M1J74k02L2p7Q7p5k00J77KK46j82k4O5r4m7K47k02K2K0J86j59
$$ 170 55 126 -170 -129 45 -157 -125 -202 -115 -190 -390 -213 -211 35 -147 -171 -106 -200 -247 0 -202 -180 -160 26 -133
2459a33P7l34K46K90j77j37k1J68j34O0k9P1J16J0q7k6Q6J27k58K38j02J70j37
$$ -133 -56 -390 -144 146 -31 -168 -189 -21 -155 -95 -124 -53 63 73 -14 -40 46 173 -85 153 51 221 84
2482H4j04m1J75L2jrJ54k36K3K43k52k31L26j14K71j97o5J95k82K22m12L52n5
$$ 84 -20 -61 114 146 145 136 290 54 77 320 68 -163 163 49 320 123 58 253 -29 193 -219 133 78
2505G8k18J21Q6j29O2N4j85L43l00k77K65J99l62L75j64O5L2p8j15O9j31j9L04
$$ 78 -140 -19 67 -62 0 54 -131 212 -88 -365 -100 99 -263 112 -52 13 45 -33 -148 -79 -210 -229 75
2528G5m10K16j99J69R4J99j93j07j31K4J3K04k47K42R6j31L0K64j53k97M84J28
$$ 75 -335 -119 -318 -149 -55 144 -49 -156 -287 -263 -250 -46 -293 -51 45 -86 -56 208 55 -242 242 370
2550C70k62k50J77K50k11K38j09r7L2Pk86J72L20K9j99j03L89o48O39l71K0p8
$$ 370 108 -142 35 285 74 312 203 106 138 145 -141 31 351 380 181 78 467 -181 458 87 107 29
2572B9O1q2L17M1j37k79J2J04j57M2K47k21J7J02k7j65o0N5r4J93k66J71N2n3
$$ 29 90 8 325 366 229 -50 -38 66 -91 -49 198 -23 -6 96 69 -96 -156 -101 -195 -2 -268 -97 -45 -98
2596i8k44J95mR2K4j44n3J24K36n12J47J40k28J85p2J63M6k08K96j64J69o3j26
$$ -98 -342 -147 -151 -59 -35 -179 -232 -108 128 -384 -237 -97 -325 -140 -212 -49 -3 -211 85 -79 90 27 -99
2619i9k9M0K7n0J55J69k80l1M58l90K86j83J4L6L1K21j18j68M5K58q2k00K36J51
$$ -99 -128 -88 -61 -111 44 213 -67 -98 360 -30 256 73 87 123 154 375 257 89 134 392 310 110 346 497
2643D97k11l73L33j07m9N8k01M3J63M3k10R9oJ34r9j75j23M36m20k46M00o9m3
$$ 497 286 -87 246 139 90 148 -53 -10 153 196 -14 85 79 213 114 -61 -184 252 -168 -414 -14 -83 -126
2666a26M9j49K66j25k0J28k00Q2k07K60J26k75l2K30j45L7k12L02l42Q1j54M09
$$ -126 -77 -226 40 -85 -105 23 -177 -95 -302 -42 84 -191 -223 7 -138 -101 -313 -11 -353 -272 -426 -17
2688a7j06K12l74L48L6j04Q8j07O9k08K79n1l1q2J56R3j02J97l11m9M47j97J61
$$ -17 -123 89 -285 63 99 -5 83 -24 45 -163 116 65 34 -48 108 201 99 296 -15 -64 383 186 347
2711C47j55p7K47k58j00J04N8n2J62l13J79q7j19j49L69p2P8K01l30J23k25J75
$$ 347 192 115 362 104 4 108 166 114 276 -37 142 55 -64 -213 156 84 162 363 33 156 -69 106
2733A06j6k82L87m03J36k26L71l99q4K97j24K63l65K42j24O9j93L14j15m3r5L20
$$ 106 90 -192 195 -208 -72 -298 73 -326 -410 -113 -237 26 -339 -97 -221 -152 -345 -31 -146 -189 -284 36
2755C6p8L3l55K98k3j77O5j21K67j94K78k6Mr1k4P6K40r0k90P8L64j24n9J3L6
$$ 36 -42 -9 -364 -66 -89 -266 -201 -322 -55 -249 29 3 7 -84 -108 -32 208 118 -172 -94 270 146 87 100 136
2780A36L1K13l46L2m4Q0O8N7K42l76j6J20j7k04J60qmO9j23J28p2R4o3k25L07
$$ 136 167 380 34 66 22 102 170 227 469 93 77 197 180 -24 136 128 124 193 70 198 126 220 157 -68 239
2805B39k50j05K58q1j7M4Jj3j27l7j21J32m0Qn5J3J01q2J0pJ02n5q7l26L51j85
$$ 239 -11 -116 142 61 44 88 89 76 -51 -88 -209 -77 -117 -109 -164 -151 -50 -132 -122 -129 -27 -82 -169 -495 -144 -329
2831c29R8j80K43Q9k7M7j31M5J31Qj04O9Q1P4k79J53q7K41j0j66R8L23m68J77
$$ -329 -231 -411 -168 -79 -106 -59 -190 -145 -14 -6 -110 -41 40 114 -165 -12 -99 142 132 -34 64 387 -81 96
2855I6J55l2r3L4j3J55lq2k9qo6J34j65J31l21l6K75j41j9L10ol15J40m9m0J29
$$ 96 251 219 126 160 147 302 299 217 188 180 114 248 83 214 -107 -143 132 -9 -28 282 276 -39 101 52 12 141
2881A41p2j71P1J37j99r3jK0j08K07J79m04J42J7n9K20l53K53k5j8j80J77M8J04
$$ 141 69 -102 -31 106 -93 -186 -187 -167 -275 -68 111 -293 -151 -134 -193 27 -326 -73 -98 -116 -296 -119 -71 33
2905C3j36j99K31j18K40k81J07K89k35J78l25K08r4lK91k36K56j44j55J51P2k1
$$ 33 -103 -302 -71 -189 51 -230 -123 166 -69 109 -216 -8 -102 -105 186 -50 206 62 -93 58 130 109
2927A09k09M8L25l5j36J97J1j96k3J65j70L1J71l56K63r1l3O0l7q9J52n2j46O4
$$ 109 -100 -52 273 238 102 299 310 114 91 256 86 117 288 -68 195 104 71 131 94 5 157 105 -41 23
2951B3Q4k26j18J31J08J1o8Mj35J17q1K49j10J31o8lj03O7j79J42n5k11Q6J79
$$ 23 107 -119 -237 -106 2 13 -55 -51 -186 -69 -150 99 -11 120 52 49 -54 13 -166 -24 -79 -290 -204 -25
2975b5j11q4J62j17K10l23k26J69K21J13n3p7j13J04R9j9q6J75r9N5J80J8jl13
$$ -25 -136 -220 -58 -175 35 -288 -514 -345 -124 -11 -64 -141 -254 -150 -51 -70 -156 19 -80 -25 155 173 172 -141
2999a41L52l49M5n7N4J77m41N09j52J62J9j69J35j00q7J65j50K64n5Rk64M6K53
$$ -141 211 -138 -93 -150 -96 81 -360 149 -3 159 178 9 144 44 -43 122 -28 236 181 190 -74 -28 225
3022B25k67Q4J82Q6m58mL46k53l8J78J03m9m6j03J14j39K9j12O8o1k3R4j16L7
$$ 225 -42 42 224 310 -148 -152 194 -59 -97 81 184 135 89 -14 100 -39 -10 -122 -54 -115 -138 -44 -160 -123
3046a23k06M09k01j45J34N8m6j29K68k52J64J14j26j36R5J54j12k07J94J23M9
$$ -123 -329 80 -121 -266 -132 -74 -120 -249 19 -233 -69 45 -81 -217 -122 32 -80 -287 -93 30 79
3067G9r7K9k74L63L7l67M5M37k79j35K24j68L35j6k9k86J93k02K74k97J70K15
$$ 79 -18 11 -263 100 137 -230 -185 252 -27 -162 62 -106 229 213 184 -102 91 -111 163 -134 36 251
3089B51k16L3J64q3J8j49J37j09r6K54j68n6J76k52K2K18k02k05j3O4L87j72l0
$$ 251 35 68 232 149 167 18 155 46 -50 204 36 -20 156 -96 -74 144 -58 -263 -276 -212 175 3 -27
3112b7O7n1j30P9j43P9K14n3l11J81lJ06m3j3l6J16j56K9J54m92J32K01KMk56
$$ -27 40 -11 -141 -62 -205 -126 88 35 -276 -95 -98 8 -35 -48 -84 32 -124 -95 59 -433 -301 -100 -98 -94 -350
3137c50K8K99J0k8J15j52J32J9l30J02n5M04o4P2Ol41K33k52L52K8l43Q6P3J8
$$ -350 -322 -23 -13 -41 74 -78 54 73 -257 -155 -210 194 130 202 208 -133 100 -152 200 228 -115 -29 44 62
3161F2RK12l10L25j8k17j50J32LM6r5j65J50K1K23k24j14P3p3J31l8K3q0J54K02
$$ 62 71 283 -27 298 280 63 -87 45 48 94 -1 -166 -16 5 228 4 -110 -37 -110 21 -17 6 -74 80 282
3186B82l88jJ23K9m3j20j59K39pj28%j56J96p6K16m3J4K8j85P2j7J65q8J09j76
$$ 282 -106 -107 16 45 2 -118 -277 -38 -45 -173 -173 -329 -133 -209 7 -36 -22 6 -179 -107 -124 41 -47 62 -114
3211a14J44l3l8J33j84Q1J17lk70M5O8K45M7k59L0J33o6O7q3m2K14j11j19J42
$$ -114 30 -3 -41 92 -92 -11 106 103 -167 -122 -54 191 238 -21 9 142 76 143 60 18 232 121 2 144
3235A44k63J46K34n5k13K17m9k0j06j64L69k80K8J34l14J90J4J40J6l6k52R2j9
$$ 144 -119 27 261 206 -7 210 161 141 35 -129 240 -40 -12 122 -192 -2 12 152 168 132 -120 -28 -47
3258d7j17m7L00j66j02K23k39L30j15l00R1l2L17k31l4K49j11J0L8k05L6Nj06
$$ -47 -164 -211 89 -77 -179 44 -195 135 20 -280 -189 -221 96 -135 -169 80 -31 -21 17 -188 -152 -147 -253
3281b53J77J43k59K08j41O0K8k05J41M8j58L30n4j37J83j23j26L13k76L16p7o3
$$ -253 -76 67 -192 16 -125 -65 -37 -242 -101 -53 -211 119 65 -72 111 -12 -138 175 -101 215 138 75
3303G5K10l42m8L98q6K4j85K63l86J68O4j51R8n4l3Nq1J68m1j57K88o6K9k23K22
$$ 75 285 -57 -105 293 207 231 46 309 -77 91 155 4 102 48 15 20 -61 107 66 -91 197 131 160 -63 159
3328A59p7q5k4k2J7R3j1l3L9o9N3m0r2K13j44N2N3j03m9J9j21R5p4J49k56L59
$$ 159 82 -3 -27 -49 -32 61 50 17 56 -13 40 0 -92 121 -23 29 82 -21 -70 -51 -172 -77 -151 -2 -258 101
3354A01k21K51j79n2j6j40K27j43j0Q1Q5n7J07K3k72K13q4J08mJ7l2M7L8k26J10
$$ 101 -120 131 -48 -100 -116 -256 -29 -172 -182 -101 -16 -73 34 57 -215 -2 -86 22 18 35 3 50 88 -138 -28
3379b8K0R4r3L01k06j71J07Q6l5N1q6J15k82K19j0m03M56k41J89n0P3jJ26l7k33
$$ -28 -8 86 -7 294 88 -83 24 110 75 126 40 155 -127 92 82 -321 135 -106 83 33 106 105 231 194 -39
3404c9j47j23L55j38J86k33j64L60k37q3M80m33R7P7j10K24q2l9k72K24j86KR0
$$ -39 -186 -309 46 -92 94 -139 -303 57 -180 -263 217 -216 -119 -42 -152 72 -10 -49 -321 -97 -283 -281 -191
3427a91J25K4m0j14j4J84L6k02P7N2P8j52p4J50j4N6M7q7K1J59jl6j68K40k71
$$ -191 -66 -42 -82 -196 -210 -26 10 -192 -115 -63 15 -137 -211 -61 -75 -19 28 -59 -38 121 120 84 -84 156 -115
3452a15r0L53k27R6R8J01r6Lq7n0J07K00l54J73j11J73k30J40J22k48Q5O0j42
$$ -115 -205 148 -79 17 115 216 120 123 36 -14 93 293 -61 112 1 174 -56 84 206 -42 43 103 -39
3475c9K51k8j45n0k9l6j26J21j16J71r5K68k2R5j67j67K9j43J41JJ58l46o6M48
$$ -39 212 184 39 -11 -40 -76 -202 -81 -197 -26 -121 147 125 220 53 -114 -85 -228 -87 -86 72 -274 -340 108
3499A08l46J61j01mJ02m2N3n2j16J12j60J19K61J1k50MK66k42J86Q6k24J68k29
$$ 108 -238 -77 -178 -182 -80 -122 -69 -121 -237 -125 -285 -166 95 106 -144 -140 126 -116 70 156 -68 100 -129
3522a29J38L6j1L0j82N9J84k70L13n8j90J39P4K8Q1j04k2R9j47Mr0Q7n0K49m62
$$ -129 9 45 34 64 -118 -59 125 -145 168 110 -80 59 133 161 242 138 116 215 68 72 -18 69 19 268 -194
3547a94K99j20K5m4j27J42j79J03j65J99L2l3q4J32j40j9K59n0P7j77J68p9qN9
$$ -194 105 -15 10 -34 -161 -19 -198 -95 -260 -61 -29 -62 -146 -14 -154 -173 86 36 113 -64 104 25 17 76
3571G6k02M4PP1k27J10K32j75r5Q2%J1J15j54j8L81k26p6K10j68r8L81l45O8M
$$ 76 -126 -82 -75 -4 -231 -121 111 -64 -159 -77 -77 -66 49 -105 -123 258 32 -44 166 -2 -100 281 -64 4 8
3596Hk03K75j82J56%J24j50P1j07o7J64j2J31K8j88J78m3K37j21p6kJ1k89p1M7
$$ 8 -195 80 -102 54 54 178 28 99 -8 -75 89 77 208 236 48 226 183 420 299 223 221 232 -57 -128 -81
3621h1K40j71O8M5J55j55Pp3P1o6n2n3K02k84P7j5K52k49o8Q6q9J32J57k9j09
$$ -81 159 -12 56 101 256 101 108 35 106 40 -12 -65 137 -147 -70 -85 167 -82 -150 -64 -153 -21 136 107 -2
3646bk8j09n3J33Q2P4n4k75Ql7J90k29J71Q7nK4j9J62k00P5RJ92j42k44M06k27
$$ -2 -30 -139 -192 -59 23 97 43 -232 -224 -261 -71 -300 -129 -42 -47 -23 -42 120 -80 -5 4 196 54 -190 216 -11
3672a1L3J93k31J26L2j60p1L34q8l53J56K40k89J75j13J50o1m5J2J9J08j99J45
$$ -11 22 215 -16 110 142 -18 -89 245 157 -196 -40 200 -89 86 -27 123 62 17 29 48 156 -43 102
3695A02j56K68l64J49N3P5l56P0L45r0j14r5J56j5l2j63K30k79K82o3M9k2k8o7
$$ 102 -54 214 -150 -1 52 127 -229 -159 186 96 -18 -113 43 28 -4 -167 63 -216 66 3 52 30 2 -65
3719f5QP2J4k11N07l85P0Lj98r2J17P1j14J30j62K17L03m14N9j97M01J12n10J57
$$ -65 -57 15 29 -182 325 -60 10 13 -185 -277 -160 -89 -203 -73 -235 -18 285 -129 -70 -267 134 246 -264 -107
3743a07j8O1RO3K25q7k01K40j75L38n92L36k2R7mJ0l54L87J0j59K17l48L10k07
$$ -107 -125 -64 -55 8 233 146 -55 185 10 348 -244 92 70 167 163 173 -181 206 216 57 274 -74 236 29
3767B9J4J64j7m3O5l48J44o1J31k32K79j47L2n2k1L29m55J09j24K98j51J75j79
$$ 29 43 207 190 147 212 -136 8 -53 78 -154 125 -22 10 -42 -63 266 -189 -80 -204 94 -57 118 -61
3790f1j78N9n6J33P1J8k43K17j01J33pJ25j54J14l22L57K09n23Q8J39r0k51K70
$$ -61 -239 -180 -236 -103 -32 -14 -257 -40 -141 -8 -15 110 -44 70 -252 105 314 -209 -121 18 -72 -323 -53
3813e3J37j36J10l2O0j14P5j27Q0R6J7j81r7M00k01p0m8K56k2j6l9q8J71j09K8
$$ -53 84 -52 58 26 86 -28 47 -80 0 96 113 -68 -165 235 34 -36 -84 172 150 134 95 7 178 69 97
3838I7J50p8p7P5q0J7r9rJ11p8R8j89j30J79M9Q1Q3q3rk03J17q4J5J98J09k66
$$ 97 247 169 92 167 87 104 5 -4 107 29 127 -62 -192 -13 36 117 200 117 108 -95 22 -62 -47 151 260 -6
3864fj2k56L19p7k34K55j7M2k0o8j46O6N0J66r8J58j58L1n9J37J4j91J1m2J99
$$ -6 -18 -274 45 -32 -266 -11 -28 14 -6 -74 -220 -154 -104 62 -36 122 -36 -5 -64 73 87 -104 -93 -135 64
3889F4j47K07m04N36j85j31k09J38K60j53M2j38L20j01J75k38J13n1J32j71J91
$$ 64 -83 124 -280 256 71 -60 -269 -131 129 -24 18 -120 200 99 274 36 149 98 230 59 250
3910B50j49q4J97j61R9j97J05K27k49k0K6N4K46m21K08k71L2m5J59O7j69J60j07
$$ 250 101 17 214 53 152 -45 60 287 38 18 44 98 344 -77 131 -140 -108 -153 6 73 -96 64 -43
3933d3J25O0l82K41j02J8l0n2J84K22j49l09K37j78Q9k24K14qlj10L39r6N0k57
$$ -43 82 142 -240 1 -101 -83 -113 -165 19 241 92 -217 20 -158 -69 -293 -79 -87 -90 -200 139 43 93 -164
3957a64J42M7J0k18L42k84P7j85Q6J29m4L9J78l86K14N8p9J58m33J38K38m0k8
$$ -164 -22 25 35 -183 159 -125 -48 -233 -147 -18 -62 -23 155 -231 -17 41 -38 120 -313 -175 63 23 -5
3980eK24k38K78l01J29J01k20K40l58p0L6J30J20J18j46k07L57j87J55j77j1J46
$$ -5 219 -19 259 -42 87 188 -32 208 -150 -220 -184 -54 66 184 38 -169 188 1 156 -21 -32 114
4002A14j67J78J47j77J15k30L1J6K2o6k44K44K3j00L7k01J16Q8q9j10K4Q5N2Q2
$$ 114 -53 125 272 95 210 -20 11 27 49 -17 -261 -17 6 -94 -57 -258 -142 -54 -143 -253 -229 -144 -92 -10
4026a0nl8r5R0K0j70K95k70Q4K53l59L00Kq7L3j10j03K69m5j24P9P5p7K43k87
$$ -10 -15 -53 -148 -58 -38 -208 87 -183 -99 154 -205 95 97 10 43 -67 -170 99 54 -70 9 84 7 250 -37
4051c7J83k5m5j68m5J23p0k33N35k86J11M8k09J31L6m6K23k17O5M6j02j41m0L37
$$ -37 146 121 76 -92 -137 -14 -84 -317 218 -68 43 91 -118 13 49 3 226 9 74 120 18 -123 -163 174
4075A74j80R1l19J72O0R4l99M21k57J89Ok43L4j32K81J21j91n0j1J59K02j38n0
$$ 174 -6 85 -234 -62 -2 92 -307 114 -143 46 52 -191 -157 -289 -8 113 -78 -128 -139 20 222 84 34
4098C4j42K5n4L1K36N2k03J15r7j93L45k04j50K28N5N4J46k90k39K73n5J71rm2
$$ 34 -108 -83 -137 -106 130 182 -21 94 -3 -196 149 -55 -205 23 78 132 278 -12 -251 22 -33 138 129 87
4122H7j0r9M8K35k49nl4K37l9J5J36l63n1J74r6j3J09p3O4K7j99K91j4N5l95L86
$$ 87 77 -22 26 261 12 7 -27 210 171 186 322 -41 -92 82 -14 -27 82 9 73 100 -99 192 178 233 -162 224
4148B24j3r3M2j95J0J50L2l34J36j34M74n20K02l7n5J64q5K6j28K11jj34k6J56
$$ 224 211 118 160 -35 -25 125 157 -177 -41 -175 299 -221 -19 -56 -111 53 -32 -6 -134 77 76 -58 -84 72
4172G2k45J90p6l10K01K03R2j24J24j98R8j23J54L0l31J79J23q9j19P3N7m1L15
$$ 72 -173 17 -59 -369 -168 35 127 3 127 -71 27 -96 58 88 -243 -64 59 -30 -149 -76 -19 -60 255
4195B55k72J51rQ5J16j95l28K64k05K40J05k12J70n8k92K41k83K55O1k38K78J17
$$ 255 -17 134 125 210 326 131 -197 67 -138 102 207 -5 165 107 -185 56 -227 28 89 -149 129 246
4217B46k07m2J51J09j00K9j78P6j38j3L75l57J52j05m0Q1k69R5J08J86m08K06
$$ 246 39 -3 148 257 157 186 8 84 -54 -67 308 -49 103 -2 -42 39 -230 -135 -27 159 -249 -43
4239d3M3k12K10j30P5q0RP1L2K61j21m7j89L1J05J2j5q1J03j95K39j16j92M10
$$ -43 0 -212 -2 -132 -57 -137 -128 -57 -25 236 115 68 -121 -90 15 27 12 -69 34 -161 78 -38 -230 180
4263A80j79j02L19k01l32L82j8k7P7o2J27j90K1j91K63n6OM6k74NJ31J17l0L49
$$ 180 1 -101 218 17 -315 67 49 22 99 37 164 -26 -5 -196 67 11 17 63 -211 -206 -75 42 12 361
4287C61m63j44K39K40j33N8j11j10j95L88k48J78J5p3k88K10l6Q0kJ8j9k12L1
$$ 361 -102 -246 -7 233 100 158 47 -63 -258 130 -118 60 75 2 -286 -76 -112 -32 -34 -16 -35 -247 -216
4310b16N8K63p4j46O0J47l55K24j0j2NJ36k50K35J1j58j39J22J6J43j1j99J10
$$ -216 -158 105 31 -115 -55 92 -263 -39 -49 -61 -56 80 -170 65 76 -82 -221 -99 -83 60 49 -150 -40
4333d0m4K85j33Qp1j25L01j77q2j11N5K7M7P8j13L55j65o2j22K00J1l65N0J61
$$ -40 -84 201 68 76 5 -120 181 4 -78 -189 -134 -107 -60 18 -95 260 95 33 -89 111 122 -243 -193 -32
4357c2j46L60l14j0K25j17k3J05j9j29K65J0k44j68Q8K1J58j00J69l10L05m59
$$ -32 -178 182 -132 -142 83 -34 -57 48 29 -100 165 175 -69 -237 -149 -128 30 -70 99 -211 94 -365
4379c65M06Kr2j62J73j43J14k6J81j26n6K12l59j27K68Q7j04J86L6k58rK16K4
$$ -365 41 43 -49 -211 -38 -181 -67 -93 88 -38 -94 118 -241 -368 -100 -13 -117 69 105 -153 -162 54 78
4402G8j30n3N4J1q1R5J24p5j31J72o7J27k05n9Q6oJ9K29l39J40j9O0M4k83L09
$$ 78 -52 -105 -51 -40 -121 -26 98 23 -108 64 -3 124 -81 -140 -54 -60 -41 188 -151 -11 -30 30 74 -209 100
4427A00r1O1k34K92l04K13K4Q9r3p9L45j12l9k12M3j59N9N2J76j65K42p5j48K66
$$ 100 9 70 -164 128 -176 37 61 150 57 -22 323 211 172 -40 3 -156 -97 -45 131 -34 208 133 -15 251
4451B51k78n9J20k62L48k92J67J04J40k88j82J86o8J90L0k76L0j29J80j2J31J77
$$ 251 -27 -86 34 -228 120 -172 -5 99 239 -49 -231 -45 -113 77 107 -169 -139 -268 -88 -100 31 208
4473B08l99L37k23m1m3k35L19K4m6O8q2J15j59K47k54J39L8nJ39J7j80n8j66J80
$$ 208 -191 146 -77 -118 -161 -396 -77 -53 -99 -31 -113 2 -157 90 -164 -25 13 8 147 164 -16 -74 -240 -60
4497f0J83j89K17p0nK41j35j60J39j51J9L6j2q6J66j61K7L9O1j42N1k6L34l73
$$ -60 123 -66 151 81 76 317 182 22 161 10 29 65 53 -33 133 -28 -1 38 99 -43 8 -18 316 -57
4521e7J32No1%K3p5r6L4N2r0k5K85k41K63j76l7l4J79j3j09o9Q0j61J89j46k6
$$ -57 75 80 19 19 42 -33 -129 -95 -43 -133 -158 127 -114 149 -27 -64 -98 81 68 -41 -110 -30 -191 -2 -148 -174
4547a74K51R6k11R5k32P4K78m13M5pK05k15J07J36k3k10J43J09L1m5k7J21j66
$$ -174 77 173 -38 57 -175 -101 177 -236 -191 -198 7 -208 -101 35 12 -198 -55 54 85 40 13 134 -32
4570c2K42k9j40k34j6K38j6J96k73L82l42j30pn0J42K38j69Q6k33K49p1j22J16
$$ -32 210 181 41 -193 -209 29 13 209 -64 318 -24 -154 -161 -211 -69 169 0 86 -147 102 31 -91 25
4593B5q9K98j90O6K03k50N1o6lj47j2J20j53J92M2j56K08p7l09J54L0Mk0j8P9
$$ 25 -64 234 44 110 313 63 114 48 45 -102 -114 6 -147 45 87 -69 139 62 -247 -93 -63 -59 -79 -97 -18
4618a8J10Q9j67Q0k55J31J31l9k27J62rk38K42J59O2j41j71J89n2J43o33M79l46
$$ -18 92 181 14 94 -161 -30 101 62 -165 -3 -12 -250 -8 151 213 72 -99 90 38 181 -452 27 -319
4641c19N53n8k21j01O2O6k52O45j86q7P6l84M74k41M8R5k73K15j58K68r2J07j83
$$ -319 234 176 -45 -146 -84 -18 -270 375 189 102 178 -206 268 27 75 170 -103 112 -46 222 130 237 54
4664E4l8P7R9j91n0j44L64q1j09L0R7k79K29P6n9r3k9J84J9o3k0j50p1l4K5J1
$$ 54 16 93 192 1 -49 -193 171 90 -19 11 108 -171 58 134 75 -18 -47 137 156 93 73 -77 -148 -182 -157 -146
4690a46K06or0p6J53j66L3Mj2K22l58N93n05qJ6r2J04K01n7K73l09j80J60k82
$$ -146 60 54 -36 -112 41 -125 -92 -88 -100 122 -236 357 -148 -156 -140 -232 -128 73 16 289 -20 -200 -40 -322
4714c22L87K05m58K56j73O1J46j15o1o6K41k76K91n8K33l52J3p4L70l69j81L35
$$ -322 65 270 -188 68 -105 -44 102 -13 -74 -140 101 -175 116 58 291 -61 -48 -122 248 -121 -302 33
4736C3P2k28L50j74j55Q9M9MK0j67k58L92p3R3j54j2J75j03R8J13l2k27P3J92
$$ 33 105 -123 227 53 -102 -13 36 40 60 -107 -365 27 -46 47 -107 -119 56 -47 51 164 132 -95 -22 170
4760A70l41J81m1K36k50O2k42L46j19O7J3j64K90p8o6k31Q7nj22j04O16k26q9
$$ 170 -171 10 -31 205 -45 17 -225 121 2 69 82 -82 208 130 64 -167 -80 -85 -207 -311 305 79 -10
4783a0L6j41K39r4K00j51m3J45k34K29k50R2K0J45k53j7m7j48M31j87J32k06n5
$$ -10 26 -115 124 30 230 79 36 181 -53 176 -74 18 38 183 -70 -87 -134 -282 149 -38 94 -112 -167
4806a67K3K01m0j17L02q1L6P0k60k1l8j7J44ol7J0o5Q8J1j46P1l9J63l86K45j77
$$ -167 -144 57 17 -100 202 121 157 227 -33 -54 -92 -109 35 29 -8 2 -63 25 36 -110 -39 -78 85 -301 -56 -233
4832b33L37j96L8J54J5k91KJ73m3l4r1J63m5n8J7J47j29M4P8j33J18J8j55K85
$$ -233 104 -92 -54 100 115 -176 -174 -1 -44 -78 -169 -6 -51 -109 -92 55 -74 -30 48 -85 33 51 -104 181
4856A81j20p6K3K7j37j83L26o1j95K64J95r7p7Nq2K03l98l0J66j0RJ76p8K10m13
$$ 181 61 -15 8 35 -102 -285 41 -20 -215 49 244 147 70 75 -7 196 -202 -232 -66 -76 -67 109 31 241 -172
4881a72L69o5j96Q5O4k29J72k41J52L40q3j43k90K30K2k00L01l7j65L7k0j20L19
$$ -172 197 132 -64 21 85 -144 28 -213 -61 279 196 53 -237 -7 15 -185 116 79 -86 -49 -69 -189 130
4904A30k49J76k89K40J80l65L00j33%q1J26j87r6K64N7l35K50L5j08L39q7l61
$$ 130 -119 57 -232 8 188 -177 123 -10 -10 -91 35 -152 -248 16 73 -262 -12 23 -85 254 167 -194
4926a94K55n2N7L2m2l75K93l7K53m45J38K46J27M1k92k28J57o4K26k20J32K36
$$ -194 61 9 66 98 56 -319 -26 -63 190 -255 -117 129 256 297 5 -223 -66 -130 96 -124 8 244
4948B44l16K51j61r3L8j3J93R5k99J93k20p0L40Oj60j91J22N5J08o4Ol6J73q3
$$ 244 -72 179 18 -75 -37 -50 143 238 -61 132 -88 -158 182 188 28 -163 -41 14 122 58 64 28 201 118
4972A18k42K58j80J46J45k53J83N8m10J02N4R3J67k88Q5j51K30j10k08L6K18j15
$$ 118 -124 134 -46 100 245 -8 175 233 -177 -75 -21 72 239 -49 36 -115 115 5 -203 -167 51 -64
4994f4J93j36N0Qr2J15l71L34l51K87P2L2j03Jk6r1L33k90J48r5j47J63j0N9j65
$$ -64 129 -7 43 51 -41 74 -297 37 -314 -27 45 77 -26 -25 -51 -142 191 -99 49 -46 -193 -30 -40 19 -146
5019a46J21P7j19j93J64J83k37J18R6k9k25J3N9O3K39k46o2K96l01J12n1J45J53
$$ -146 -25 52 -67 -260 -96 87 -150 -32 64 35 -190 -177 -118 -55 184 -62 -124 172 -129 -17 -68 77 230
5042B30k02j46L7K22j10j49Q1p3R4Q4j32r8J5L22p8j51Q8l3J31J99l47q8K92k99
$$ 230 28 -118 -81 141 31 -118 -37 -110 -16 68 -64 -162 -147 175 97 -54 34 1 132 331 -16 -104 188 -111
5066a11J21J87%j04Q7l18J26n9r2K24n2M0J57j44l86K12Q4J19k14L78j06J50m28
$$ -111 10 197 197 93 180 -138 -12 -71 -163 61 9 49 206 62 -324 -112 -28 91 -123 255 149 299 -129
5089a29J84oJ76j91q7M0O9m0O5r1J3K4p2j17J35J21Pj12m7L27o8j22j39J88k44
$$ -129 55 49 225 34 -53 -13 56 16 81 -10 3 27 -45 -162 -27 94 101 -11 -58 269 201 79 -60 128 -116
5114a16J57l8l7J11K3j28j32K37k76K37J09k37Q1K25jk35J43l3j77M7L02l40P5
$$ -116 41 3 -34 77 100 -28 -160 77 -199 38 147 -90 -9 216 215 -20 123 90 -87 -40 262 -78 -3
5137cO4m1K4k32J30j6L1j23J96k20n8K96j02j2N0j91K30j02J99L0k97Q7j57K63
$$ -3 61 20 44 -188 -58 -74 -43 -166 30 -190 -248 48 -54 -66 -16 -207 23 -79 120 150 -147 -60 -217 46
5161D6l8K1j26j31J93K4p1J52J07o0Q9k24J00j11n3m2K28n5q6j05J91j88J55R7
$$ 46 8 29 -97 -228 -35 -11 -82 70 177 117 206 -18 82 -29 -82 -124 104 49 -37 -142 49 -139 16 113
5185A13p2J99j95R4j25k1L9k8L6r7k34K97J61K3k03k35J34rJ9J14n5M3p1k9N7
$$ 113 41 240 45 139 14 -7 32 4 40 -57 -291 6 167 190 -13 -248 -114 -123 -104 10 -45 -2 -73 -102 -45
5210d5J08R4k81K21q6P6m2o4J91k24L02k85R7o2k02K47q3J46n6o8n0K2k4L1j0
$$ -45 63 157 -124 97 11 87 45 -19 172 -52 250 -35 62 0 -202 45 -38 108 52 -16 -66 -44 -68 -37 -47
5235d7K4Q6j30K0J95j18N0j86J39j86L43l46J36p3J1mR3l4J45m2l6N6k33l0M17
$$ -47 -23 63 -67 -47 148 30 80 -106 33 -153 190 -156 -20 -93 -82 -86 7 -27 118 76 40 96 -137 -167 250
5260B50k81m8J29j94J34j8J73o6K9j44R9j15l38K61J18o1k62N02k12p2J07O9m0
$$ 250 -31 -79 50 -144 -10 -28 145 79 108 -36 63 -52 -390 -129 -11 -72 -334 168 -44 -116 -9 60 20
5283B0j29Q0j10K14j80M68k56j77J50k56K98j77J10J8N3p5k79K52j88N8K40P3
$$ 20 -109 -29 -139 75 -105 363 107 -70 80 -176 122 -55 55 73 126 51 -228 24 -164 -106 134 207
5305B07l96K18M7l34L98J89j52ok50K23K9l6j37Q7n3M3J29m39R9M25l44n0R7P6
$$ 207 -189 29 76 -258 140 329 177 171 -79 144 173 137 0 87 34 77 206 -233 -134 291 -53 -103 -6 70
5329G0J49l05M11m67N1J33n8l5r4j72L50NQ2k16JJ52K47o18K85J02k53L24l08
$$ 70 219 -86 325 -142 -91 42 -16 -51 -145 -317 33 38 120 -96 -95 57 304 -314 -29 73 -180 144 -164
5352a64Q5M3o2M3J63l11K31j00M9Q7j04P4n4N5q5J77k34J76M9O8j09j55P6l7N0
$$ -164 -79 -36 -98 -55 108 -203 28 -72 -23 64 -40 34 -20 35 -50 127 -107 69 118 186 77 -78 -2 -39 11
5377A1j91m5P2P3J59k25K27j8k66J56j91L10J6N6J05j29j27nJ0k79J64L07r6k98
$$ 11 -180 -225 -153 -80 79 -146 81 63 -203 -47 -238 72 88 144 249 120 -7 -12 -2 -281 -117 190 94 -204
5401b04J96o7J79n7k64K5Q0j25K42j16M1n7J50R5k60J71L8k20L56l77J59j14j0
$$ -204 -8 -75 104 47 -217 -192 -112 -237 5 -111 -70 -127 23 118 -142 29 67 -153 203 -174 -15 -129 -139
5424a39J51r8K42kl19K38k44J69N9j76J23Q8J54k26j22n1L5K0j67J90J40l1j48
$$ -139 12 -86 156 154 -165 73 -171 -2 57 -119 4 92 246 20 -102 -153 -118 -98 -265 -75 65 34 -114
5447a14j4L27k79K10k91R3k6L17j27r1p0J24j15P0r8J02l1MQ0k79K01l05J31N1
$$ -114 -128 199 -80 130 -161 -68 -94 223 96 5 -65 59 -56 14 -84 18 -13 -9 71 -208 -7 -312 -181 -130
5471a30N6K22j85r4R8j17p4K72J61j55j54K76k69J61M9j29J71J03m62K61j1k95
$$ -130 -74 148 -37 -131 -33 -150 -224 48 209 54 -100 176 -93 68 117 -12 159 262 -200 61 50 -245
5493b45L15k66lJ53nJ81j66J42r3J28J28k55J97j61J09j03j14j5l0Q2LR4R7l85
$$ -245 70 -196 -199 -46 -51 130 -36 106 13 141 269 14 211 50 159 56 -58 -73 -103 -21 -18 76 173 -212
5517b12K03M7n5m5K47l99N7J38k1J60k68J52j56O5j83J41M20j96j44R9j06r1N8
$$ -212 -9 38 -17 -62 185 -214 -157 -19 -40 120 -148 4 -152 -87 -270 -129 291 95 -49 50 -56 -147 -89
5540h9R3L3J33j37k23J28P3j26J66l01L99k63L32m31M07P0j88M0j69l5M5R2j70
$$ -89 4 37 170 33 -190 -62 11 -115 51 -250 149 -114 218 -213 194 264 76 116 -53 -88 -43 49 -121
5563a21J25j77K37j24N7J54r1q9j06J57J95k88M2M1o2J66ql06L50m7k99J29K56
$$ -121 4 -173 64 -60 -3 151 60 -29 -135 22 217 -71 -29 12 -50 116 108 -198 152 105 -194 -65 191
5586A91k63M5n6Q8J67p1J8p0N8j21j10o7K35j16P6j54Q6o8J24J41m25L28k28R5
$$ 191 -72 -27 -83 5 172 101 119 49 107 -14 -124 -191 44 -72 4 -150 -64 -132 -8 133 -292 36 -192 -97
5610i7k52K71P6l9J08j4j95j75P8L39j92K52k17jK7QJ63m9j92j02J76j07J11N0
$$ -97 -349 -78 -2 -41 67 53 -142 -317 -239 100 -92 160 -57 -58 -31 -23 140 91 -101 -203 -27 -134 -23 27
5634B7j13p9L6J52o3r5j08K15O2J3L5lj15l7r7J46o6P7o7R5j06j90J12L26j08
$$ 27 -86 -165 -129 23 -40 -135 -243 -28 34 47 82 79 -36 -73 -170 -24 -90 -13 -80 15 -91 -281 -169 157 49
5659D9k19L03j13Rk00L56k83k6M5J09q2K33l56J13Q8jo7n8j12M15l81M0K54J24
$$ 49 -170 133 20 29 -171 185 -98 -124 -79 30 -52 181 -175 -62 26 25 -42 -100 -212 203 -178 -138 116 240
5683B40j2l14r9L29j67J6q5k3K93j28j9M0j49j2K83k38n5J01j48j49M02m6Ok7
$$ 240 228 -86 -185 144 -23 -7 -92 -115 178 50 31 71 -78 -90 193 -45 -100 1 -147 -296 106 60 66 39
5707C9l16K55j64K36J97j48k26J6N2L17k05qQ8L5j51o0N1k12K88r8q7O1K7J22
$$ 39 -277 -22 -186 50 247 99 -127 -111 -59 258 53 45 133 168 17 -43 8 -204 84 -14 -101 -40 -13 109
5731A09J26l03p5N2m8R5K29j95M2j31M2J50r3p4J3J78k06K15o0p2K54k90J10l6
$$ 109 235 -68 -143 -91 -139 -44 185 -10 32 -99 -57 93 0 -74 -61 117 -89 126 66 -6 248 -42 68 32
5755C2Q4r0j57M3rK17l32J74L3r1R5J02j57J9m0j03J75j03J05n0P5R4q4J43j06
$$ 32 116 26 -131 -88 -97 120 -212 -38 -5 -96 -1 101 -56 -37 -77 -180 -5 -108 -3 -53 22 116 32 175 69
5780F9L9N5k56OK21J31k24k83L10j0lj26k6r5K93j12m8N2L2o3q1P5k45L48j37
$$ 69 108 163 -93 -87 134 265 41 -242 68 58 55 -71 -97 -192 101 -11 -59 -7 25 -38 -119 -44 -289 59 -78
5805g8l42M23r5K4N8K79j80K3j26r3L2J6J06M1pj31P4j6p9oJ77m00K66J07j75
$$ -78 -420 3 -92 -68 -10 269 89 112 -14 -107 -75 -59 47 88 81 -50 24 8 -71 -77 100 -300 -34 73 -102
5830a02kJ49j35jK37k95Q7J90j90K32l03N21l77Q1J60j41j25q0k72K76P8J3k8
$$ -102 -104 45 -90 -91 146 -149 -62 128 -62 170 -133 388 11 92 252 111 -14 -94 -366 -90 -12 1 -27
5853b7k0J46j75l1rJ40K39j59j31O6l6J52j33O8RJ52m17K17r1kj85O5K25j23O2
$$ -27 -47 99 -76 -107 -116 24 263 104 -27 39 3 155 22 90 99 251 -166 51 -40 -42 -227 -162 63 -60 2
5878Bq1r8KJ38j95K96k46J17l6K11K04j86j48M8j58K02p5l5l7l1M96o01L27j07
$$ 2 -79 -177 -175 -37 -232 64 -182 -65 -101 110 314 128 -20 28 -130 72 -3 -38 -75 -106 390 -211 116 9
5902IM9j78j28J69J09m9o1O6J15r6j80L39k96J89l02N0J02K15M9j74n4J16K8m8
$$ 9 58 -120 -248 -79 30 -19 -80 -14 101 5 -175 164 -132 57 -245 -195 -93 122 171 -3 -57 59 87 39
5926C9j59J52J66p1j52n1J32j11O2j5PK00J17m48K45j48r1L29j67J02m6k87J24
$$ 39 -120 32 198 127 -25 -76 56 -55 7 -8 -1 199 316 -132 113 -35 -126 203 36 138 92 -195 -71
5949g1K94Oj36N4p5j0R8kj87Q6j38J0J71k71J86k04K31p5J60J07j97j41L63m76
$$ -71 223 229 93 147 72 62 160 158 -29 57 -81 -71 100 -171 15 -189 42 -33 127 234 37 -104 259 -217
5973b17K76Q9J1j90l1k36K54K3j06J1J52L9M9P7k09J51l54K97P3p5L7M7q8RK0
$$ -217 59 148 159 -31 -62 -298 -44 -21 -127 -116 36 75 124 201 -8 143 -211 86 159 84 121 168 80 89 109
5998A09l1p6Q6k17Q9j42Q5oQ6j52O6J30J74j46n0J21R0l44J36O1lk63J09K67l33
$$ 109 78 2 88 -129 -40 -182 -97 -103 -17 -169 -103 27 201 55 5 126 216 -128 8 69 66 -197 -88 179 -154
6023a54L71K7j97n0J50l66J98j96J43K58k94K62m8l9J99J05m05K9m2J25j82J99
$$ -154 217 244 47 -3 147 -219 -21 -217 -74 184 -110 152 104 65 264 369 -36 -7 -49 76 -106 93
6045I3p5J11k26K04j93m0P9k00L15k71%J44K52j33j65J1r8K20M2j08R3j74M2J91
$$ 93 18 129 -97 107 -86 -126 -47 -247 68 -203 -203 -59 193 60 -105 -94 -192 28 70 -38 55 -119 -77 114
6069A14J4q4k86J03K62k63o3L43k50J28q3j3K3K07j00k47k6J08K13r6J49o5N8
$$ 114 128 44 -242 -139 123 -140 -203 140 -110 18 -65 -78 -55 152 52 -195 -221 -113 100 4 153 88 146
6092A46j29p1J33l1j36J06Q8K8l48N80l85j07l3J83l6N6J98k63n3Q3j35N7R2p7
$$ 146 17 -54 79 48 -88 18 106 134 -214 366 -19 -126 -159 24 -12 44 242 -21 -74 9 -126 -69 23 -54
6116e4r4J01K5p2j2m3o5k8K10J58j8j98L13k19R7o3j88Q6j42R8J6J72J12k69j82
$$ -54 -148 -47 -22 -94 -106 -149 -214 -242 -32 126 108 -90 223 4 101 38 -150 -64 -206 -108 -92 80 192 -77 -259
6141b59L78jk83m6R1N2L8m9J47k0l56K40j15M27k74j37o6J42P4l0K43j59k38L28
$$ -259 119 118 -165 -211 -120 -68 -30 -79 68 48 -308 -68 -183 244 -30 -167 -233 -91 -17 -47 196 37 -201 127
6165A27j16M5p8J24j07J6M6rnOj6q3j8J72l7J3P4l2o3l0n4m3O1l3P1J07k48K48
$$ 127 11 56 -22 102 -5 11 57 48 43 49 33 -50 -68 104 67 80 154 122 59 29 -25 -68 -7 -40 31 138 -110 138
6193A38J9L5j58p6K29j26J74l67P1K07k24K3P4J43k72M4J53j72M1Q5J17k05M9
$$ 138 157 192 34 -42 187 61 235 -132 -61 146 -78 -55 19 162 -110 -66 87 -85 -44 41 158 -47 2
6216Bk5K20j65k71K58k53L03j74J05J00k20j81L14J63M6m33L41k20k4K11k0K2
$$ 2 -23 197 32 -239 19 -234 69 -105 0 100 -120 -301 13 176 222 -211 130 -90 -114 97 77 99
6238I9k07M4K56j78J5J86k82J40J48k22j93J05K62j76J41j97n9j18L53r9L3l0
$$ 99 -108 -64 192 14 29 215 -67 73 221 -1 -194 -89 173 -3 138 -59 -118 -236 117 18 51 21
6260B1P2L0k86J52K64l54Q6K4j32J77j4rR3O2p5J81m53N15j81Nl92J13l1J31k25
$$ 21 93 123 -163 -11 253 -101 -15 9 -123 54 40 31 124 186 111 292 -161 354 173 178 -214 -101 -132 -1 -226
6285b26R1R5Q8J76p8O9m19J35J93j49J28k06j0k51M69j64j9%m9J87Mr7J06J41
$$ -226 -135 -40 48 224 146 215 -204 -69 124 -25 103 -103 -113 -364 105 -59 -78 -78 -127 60 64 -33 73 214
6309B14q9q3k62J64J38L9l41K93k34K35M0j11L69k31P0k70N0k72K32Rj9J61q3
$$ 214 125 42 -220 -56 82 121 -220 73 -161 74 114 3 372 141 211 -59 -9 -281 -49 -40 -59 102 19
6332A9k6k82L12k09j8J28L21q2l16J48n0J53l61L06ok68m7L39k19J84O6j09K5
$$ 19 -7 -289 23 -186 -204 -76 245 163 -153 -5 -55 98 -263 43 37 -231 -278 61 -158 26 92 -17 8
6355HL9N4k62K75n1j78j05J16lL29k74j07J5n7J28L02l26L3n0K00k09M36l70K36
$$ 8 47 101 -161 114 63 -115 -220 -104 -107 222 -52 -159 -144 -201 -73 229 -97 -64 -114 86 -123 313 -57 179
6379A79j20Rlr2k3J28j46J22o3j85K88j92m1K16r3j78N01k29j69K07J62j04n7
$$ 179 59 68 65 -27 -50 78 -68 54 -9 -194 94 -98 -139 77 -16 -194 307 78 -91 116 278 174 117
6402A17K1J23k94P0o1m4n5j26K90k15Q0j4J59j16o2K4R4m9j59L60j83K10j48j7
$$ 117 138 261 -33 37 -24 -68 -123 -249 41 -174 -94 -108 51 -65 -127 -103 -9 -58 -217 143 -40 170 22 5
6426EJ73k6k72Q8q4J53L0k49J01K22k1j46j45P4K64k02Q2r2O6M4J06k07R0K41
$$ 5 178 152 -120 -32 -116 37 67 -182 -81 141 120 -26 -171 -97 167 -35 47 -45 21 65 171 -36 54 295
6450B95o16J85M5j8J02j74P1L0J39n9q8J56r0r4J45Q5j06Q7l1Mj11M7j38K68l15
$$ 295 -321 -136 -91 -109 -7 -181 -110 -80 59 0 -88 68 -22 -116 29 114 8 95 64 68 -43 4 -134 134 -181
6475a81J67m8J65j40N0j80R1J63j70KO5J25r6j9l2P4k88K83k3o6O3Jj41Rk2K29
$$ -181 -14 -62 103 -37 13 -167 -76 87 -83 -81 -16 109 13 -6 -38 36 -252 31 8 -58 5 6 -135 -126 -148 81
6501H1j57R2j00k12M45k88M9J19r5L51k70M5k92m0L11k1p7K06k40M0J60o2J24
$$ 81 -76 16 -84 -296 149 -139 -90 29 -66 285 15 60 -232 -272 39 18 -59 147 -93 -53 107 45 169
6524A69j04K69l13j0O9r0J19p9q0J5K06l36J65j66J63o0N4j91J64J58j77M8J8
$$ 169 65 334 21 11 80 -10 109 30 -50 -35 171 -165 0 -166 -3 -63 -9 -200 -36 122 -55 -7 11
6547A1k00K2K28K39k69p7M51l70j46L46j26m79K78R0J05k20o9K41O0j21J94k92
$$ 11 -189 -167 61 300 31 -46 405 35 -111 235 109 -370 -92 -2 103 -117 -186 55 115 -6 188 -104
6569a04K40l10J73j06J36o8J45k96o4LL70q4l9l08L39Kj36O2k2Q3L6j92J37L16
$$ -104 136 -174 -1 -107 29 -39 106 -190 -254 -251 119 35 -4 -312 27 29 -107 -45 -67 16 52 -140 -3 313
6593C13l31Mo3L45j85J42p1m5k0k38K6l9K75k8M3p4j30R1Ok0j06J82N9j06j94
$$ 313 -18 -14 -77 268 83 225 154 109 89 -149 -123 -162 113 85 128 54 -76 15 21 1 -105 77 136 30 -164
6618a64m5o6L42j54M4o2L30k33j0l0J46n2j35K60p9O5j21l4J14J34m82L85K0j26
$$ -164 -209 -275 67 -87 -43 -105 225 -8 -18 -48 98 46 -89 171 92 157 36 2 116 250 -232 153 173 47
6642D7k68K59j82J05j43K94l16P2J37l02L22l0K45l49K20m35K45K28j20q7j27
$$ 47 -221 38 -144 -39 -182 112 -204 -132 5 -297 25 -5 240 -109 111 -324 -79 149 29 -58 -185
6663a85K95k45K7K58j39j72L9LJ98j09j92K90J3j13j49K48m4K50m29J90j01M1
$$ -185 110 -135 -108 150 11 -161 -122 -119 79 -30 -222 68 81 -32 -181 67 23 273 -156 34 -67 -26
6685b6J67k78J13r8K7J35J78l92P3J68j3Qk14O3J17j15J33k63L64l88K98K0q5
$$ -26 141 -137 -24 -122 -95 40 218 -174 -101 67 54 62 -152 -89 28 -87 46 -217 147 -241 57 77 -8
6708hR4j75L36K9l30P7p3q7L27n7j33Q7J36k49Q7o8K6mj58J87r0N1j77P5o0L44
$$ -8 86 -89 247 276 -54 23 -50 -137 190 133 0 87 223 -26 61 -7 19 15 -143 44 -46 5 -172 -97 -157 187
6734A87l79R2N7N2N6j09qJ83j20J01q2l9j05K47N8j40m5mj55J07K0j49K11K14
$$ 187 -192 -100 -43 9 65 -44 -52 131 11 112 30 -9 -114 133 191 51 6 2 -153 -46 -26 -175 36 250
6758B50k27k57P5K2L47l01R6K32k66n7J33p9J60k35oL36j86O5m9l02K60J21k52
$$ 250 23 -234 -159 -137 210 -91 5 237 -29 -86 47 -32 128 -107 -113 223 37 102 53 -249 11 132 -120
6781a20J07R2R9k38QJ69k44K00K69m46P4j90K31J56k70M9J79j29l1J01k24j58
$$ -120 -13 79 178 -60 -52 117 -127 73 342 -104 -30 -220 11 167 -103 -54 125 -4 -35 66 -158 -316
6803c16K76J01j68L5K38m01K22K12k37K5L7m1P5j51J68j01j02L84m39J30J54J4
$$ -316 -40 61 -107 -72 166 -235 -13 199 -38 -13 24 -17 58 -93 75 -26 -128 256 -183 -53 101 115
6825A15j33M2P0k27J32j1N9J88m09K30or0mK41j38j00k8K7J04j12J92j74Q0j06
$$ 115 -18 24 94 -133 -1 -12 47 235 -174 56 50 -40 -44 197 59 -41 -69 -42 62 -50 142 -32 48 -58
6849e8q7J69l0o6K4j21J81J75k5O7k59M0j61J43M6%j62o8J98j48J37K78m29J34
$$ -58 -145 24 -6 -72 -48 -169 12 187 162 229 -30 10 -151 -8 38 38 -124 -192 6 -142 -5 273 -156 -22
6873b2j35J47j16N1J30n0M5l4j6pL28j95p0k30L19j68O0m65N35Rr1L2j03k04Q7
$$ -22 -157 -10 -126 -75 55 5 50 16 0 -7 321 126 56 -174 145 -23 37 -428 107 116 25 57 -46 -250 -163
6898a63L15k50n6L60j30J26j28k57O7K45Qr9L0L2P4l57J78l74K51J45j0j61M61
$$ -163 152 -98 -154 206 76 202 74 -183 -116 129 137 38 68 100 174 -183 -5 -379 -128 17 7 -154 307
6921C07k55l4K7p9L97k37k60K22j36J55J12m46J18k4J09k12J56R4m25L10J40k6
$$ 307 52 18 45 -34 363 126 -134 88 -48 107 219 -227 -109 -133 -24 -236 -80 14 -411 -101 39 13
6943A3j11N8o3N6R7j88l5M5K25m33L07J26O5k08j18l4M5J75l58K28J28j15l7L80
$$ 13 -98 -40 -103 -47 50 -138 -173 -128 97 -336 -29 97 162 -46 -164 -198 -153 22 -336 -108 20 -95 -132 248
6967B48k77k17K22L0m0J75m5l39J54L02k18M2j58L98l17K95r1j06j7n2K62l68
$$ 248 -29 -246 -24 6 -34 141 96 -243 -89 213 -5 37 -121 277 -40 255 164 58 41 -11 251 -117
6989a17K09j88J50j15k5J36K4k1K5l3J94j01l3k8j78M9K32j05j83J60j59J65L
$$ -117 92 -96 54 -61 -86 50 74 53 78 45 239 138 105 77 -101 -52 180 75 -108 52 -107 58 61
7012F1m3l2Q8k0l6r3l6J47k03J38O5j69K07o8po3J39k40J52Q2k4l5k50j68K92
$$ 61 18 -14 74 54 18 -75 -111 36 -167 -29 36 -133 74 6 -1 -64 75 -165 -13 69 45 10 -240 -408 -116
7037a16k7J18J06J65j95M31n38L34k6k16k01K84j06Ql4oJ49k33K8R9Q8j44J34
$$ -116 -143 -25 81 246 51 482 -56 278 252 36 -165 119 13 21 -13 -19 130 -103 -75 24 112 -32 102
7060A02k36J60J37K7k07q1j13K91O2k8m07K47m1J26K6N6o7j02o3r9MK40qq9L3
$$ 102 -134 26 163 190 -17 -98 -211 80 142 114 -293 -46 -87 39 65 121 54 -48 -111 -210 -206 34 26 -63 -30
7085c0j46K10Q6j4l9J35j8k37RK7j20J34R7j75j0rj0K02j28k8l59K91J43K4J56
$$ -30 -176 34 120 106 67 202 184 -53 -44 -17 -137 -3 94 -81 -91 -100 -110 92 -36 -64 -423 -132 11 35 191
7110A91k58J3K04j53l9J75k04k12L73p9JKj43J72j11J5l14N55j18k75M14j98K1
$$ 191 -67 -54 150 -3 -42 133 -71 -283 90 11 12 14 -129 43 -68 -53 -367 188 70 -205 209 11 32
7133C2J03J0k26Q7K21r7j39n4N5j21J73K7j05J51q9J90j88j52J07K12l96L19K
$$ 32 135 145 -81 6 227 130 -9 -63 -8 -129 44 71 -34 117 28 218 30 -122 -15 197 -199 120 122
7156A22o3M5j8l9K31j10l6q1O4p1jK38k33k3j08K25p1j82L31k63P0lM8P8m6k57
$$ 122 59 104 86 47 278 168 132 51 115 44 43 281 48 25 -83 142 71 -111 220 -43 27 24 72 150 104 -153
7182a53J43J02j8k12J20L9j48q5J25Qn3N5J63l51K95n0J39k89L2Rm3K59r0n8K0
$$ -153 -10 92 74 -138 -18 21 -127 -212 -87 -79 -132 -77 86 -265 30 -20 119 -170 -138 -129 -172 87 -3 -61 -41
7207d1j98J30J62j82J4R4J26n7R0m6o7k7q0K55k53j42L96j10k67K99k30K0k6J84
$$ -41 -239 -109 53 -129 -115 -21 105 48 138 92 25 -2 -82 173 -80 -222 174 64 -203 96 -134 -114 -140 44
7231D4l2k54L10l6l4j97J70j09J42j62J99Q8k22pO8Kn9r2K50O3j17n6J3J96m76
$$ 44 12 -242 68 32 -2 -199 -29 -138 4 -158 41 129 -93 -100 -32 -30 -89 -181 69 132 15 -41 -28 168 -308
7256c08N48l42L15j48J87l09n9J93l61K69j39m4L93j97M8l49M10P3j95O5Qn1K14
$$ -308 240 -102 213 65 252 -57 -116 77 -284 -15 -154 -198 195 -2 46 -303 107 180 -15 50 58 7 221
7279B21j86j58n8K8N64l05P2O9l61K04j0j18J20j3k42L07J12k66J45k76K29J56
$$ 221 35 -123 -181 -153 411 106 178 247 -114 90 80 -38 82 69 -173 134 246 -20 125 -151 78 234
7301B34k12j00L3K46j86J03J7K2j0j66M3J11k68J74k40K56j51K61k90P3J64k23
$$ 234 22 -78 -45 201 15 118 135 157 147 -19 24 135 -133 41 -199 57 -94 167 -123 -50 114 -109
7323a09j74M50m09o5J94n2L49l02J48o0K01l21J12j07oJ66k49J36k43K06j42M91
$$ -109 -283 167 -242 -307 -113 -165 184 -118 30 -30 171 -150 -38 -145 -151 15 -234 -98 -341 -135 -277 214
7345B14l60n9M15k59j3N9r8J80L9M2K37l51R0o5J47j74K0r1q2J49qn3J39l24K64
$$ 214 -146 -205 210 -49 -62 -3 -101 79 118 160 397 46 136 71 218 44 64 -27 -109 40 32 -21 118 -206 58
7370E8j6q0Ok03K91Mq1N8n0Q1J53p5p7o6K2j83N8N1q5J97o0j70K52m2P5qk41K9
$$ 58 42 -38 -32 -235 56 60 -21 37 -13 68 221 146 69 3 25 -158 -100 -49 -134 63 3 -167 85 43 118 110 -131 -102
7398a02j3m1P3N6R7L0j4j95R0K21k72j9J7K11j04L4Pj47K07j97K07p9n2q8M69
$$ -102 -115 -156 -83 -27 70 100 86 -109 -19 202 -70 -89 -72 139 35 69 76 -71 136 -61 146 67 15 -73 396
7423C96l28K26k59j67J61l6L00k38n3r2M0m9K21r8J60k94Q5J20k45K24j81O9J74
$$ 396 68 294 35 -132 29 -7 293 55 2 -90 -50 -99 122 24 184 -110 -25 95 -150 74 -107 -38 136
7446A36j06o6J13j99P3K13k96J22J96k48M1K93j35p7mO6j63K81l39J26r9J53Q1
$$ 136 30 -36 77 -122 -49 164 -132 -10 186 -62 -21 272 137 60 56 122 -41 240 -99 27 -72 81 162
7469A62p9k9j82J22k4p7O1J2K51j34p6R7j84p9j93K97M1J22k42j22N16l76K17
$$ 162 83 54 -128 -6 -30 -107 -46 -34 217 83 7 104 -80 -159 -352 -55 -14 108 -134 -256 260 -116 101
7492A01J17l39L59k50l3P0M9Rl6m5k20j34M80r3j21J47j93L46r6k52J01q3Q5n7
$$ 101 218 -121 238 -12 -45 25 74 83 47 2 -218 -352 128 35 -86 61 -132 214 118 -134 -33 -116 -31 -88
7516h8j7l5J01K49l1k99O9K53j80m7j14K24r1l3K66l53R8J9o4R7p5o8K04J8r5
$$ -88 -105 -140 -39 210 179 -120 -51 202 22 -25 -139 85 -6 -39 227 -126 -28 -9 -73 24 -51 -119 85 103 8
7541HK8LM2K65k86j4K68l15K81k99P0N4L8J06l47N4J28j31L94k04j38K27r8j75
$$ 8 36 39 81 346 60 46 314 -1 280 -19 51 105 143 249 -98 -44 84 -47 347 143 5 232 134 -41
7565d1j58J60LJ95o4L0m00L94j39j14n8R0K58p9j06Q2J49j99N2p1o4K42k36JN5
$$ -41 -199 -39 -36 159 95 125 -275 119 -20 -134 -192 -102 156 77 -29 53 202 3 55 -16 -80 162 -74 -73 -18
7590a8J42k59J31q2J18J14k29J31mp5l35L61j23K7j63J56J84P9j53K73j69k16
$$ -18 124 -135 -4 -86 32 146 -83 48 44 -31 -366 -5 -128 -101 -264 -108 76 155 2 275 106 -110
7612a10o4N1q3R7J78j8N6J39l44O1J78j51L9j75L34j52k26K88q9nj57L6J53J8
$$ -110 -174 -123 -206 -109 69 51 107 246 -98 -37 141 -10 29 -146 188 36 -190 98 9 4 -153 -117 36 54
7636E4O4l9k2j82J47j24J67j96J6K58j94J13J29j64K47l53J05J23j55k23K20j26
$$ 54 118 79 57 -125 22 -102 65 -131 -115 143 -51 62 191 27 274 -79 26 149 -6 -229 -9 -135
7658a35o2J88P1L3l56K73l0K5KL16l91K00q4j46K85j48k8k28KN2L51n3l7k61N
$$ -135 -197 -9 62 95 -261 12 -18 7 9 325 -66 134 50 -96 189 41 13 -215 -213 -161 190 137 100 -161 -156
7683a56K49j94J9Q6k2o3k27L94l21Q5L9K38j63J75j81J92j83q9P9J8j83K27J20
$$ -156 93 -101 -82 4 -18 -81 -308 86 -235 -150 -111 127 -36 139 -42 150 -33 -122 -43 -25 -208 19 139
7706A39J4j94JN0J4K2K06l61j2MK69m29J79j32J94k61L23M5o4q7J80P5l22K9N7
$$ 139 153 -41 -40 10 24 46 252 -109 -121 -117 152 -277 -98 -230 -36 -297 26 71 7 -80 100 175 -147 -118 -61
7731f1L5K0L1l07L88J67m39K48J1j36Q8K2J10l0kn5k35O8K82l15j7J03J9M4L0
$$ -61 -26 -6 25 -282 106 273 -166 82 93 -43 45 67 177 147 145 90 -145 -77 205 -110 -127 -24 -5 39 69
7756F9k16J04O1r9K06P8l92K58j33l6L6L4J25O7k06K2JQ5J46j2k18J31j67J79
$$ 69 -147 -43 18 -81 125 203 -189 69 -64 -100 -64 -30 95 162 -44 -22 -21 64 210 198 -20 111 -56 123
7780A23j48Q3j3p4J44k48J7K98k42J73nj70k8K00m9j65o7p2L34K28l51j26Q1j16
$$ 123 -25 58 45 -29 115 -133 -116 182 -60 113 108 -62 -90 110 61 -104 -171 -243 91 319 -32 -158 -77 -193
7804a93J55J02J53k59N9J34k37q2J63k50J55J06Q9j34K6J41j35J71m1J23k90M7
$$ -193 -38 64 217 -42 17 151 -86 -168 -5 -255 -100 6 95 -39 -13 128 -7 164 123 246 -44 3
7826CL3l19M45o0p5N4mj57m9K62K64k43N1l0r7K5m3l14L25J81k78j2J4J17k98
$$ 3 36 -283 162 102 27 81 77 -80 -129 133 397 154 205 175 78 103 60 -254 71 252 -26 -38 -24 93 -205
7851b05N09j26j16nl0m4o5J4j60K63J33j68K67l30n5j65K47kJ30k34pK68l43M54
$$ -205 304 178 62 57 27 -17 -82 -68 -228 35 168 0 267 -63 -118 -283 -36 -38 92 -142 -149 119 -224 230
7875B30l44P7J45o1Mj49p1K17o9R9P7k46Q9q3j1L16j14o8M6m3j3j21K79k97M3
$$ 230 -114 -37 108 47 51 -98 -169 48 -21 78 155 -91 -2 -85 -96 220 106 38 84 41 28 -93 186 -111 -68
7900f8J90k37P4j90J22K09n1r5M3K1k6n0Q4n6J2J05l4j76K22j98J0j6l1j29K80
$$ -68 122 -115 -41 -231 -109 100 49 -46 -3 18 -8 -58 26 -30 -18 87 53 -123 99 -99 -89 -105 -136 -265 15
7925A5J4k18K13J4j32J5n7J4n7P5K5J38J27k89J65j08ML13m25J32L5k28J51J23
$$ 15 29 -189 24 38 -94 -79 -136 -122 -179 -104 -79 59 186 -103 62 -46 -42 271 -154 -22 13 -215 -64 59
7949E9k92K23N8pj19R9J76j00k7m5j48J24l5r5K94j95L24j92N1k17j44l0Q9j7
$$ 59 -233 -10 48 41 -78 21 197 97 70 25 -123 1 -34 -129 165 -30 294 102 153 -64 -208 -238 -149 -166
7973a66K96k72J63l6K20J08k36J01Kk26J87J48q8j70J56o0k50M3J63p9j4M9k15
$$ -166 130 -142 21 -15 205 313 77 178 180 -46 141 289 201 31 187 127 -123 -80 83 4 -10 39 -176
7996a76K51k15J36k94L78j99R6r6M69k37k26J64j39J1j6K45k04J58l8l4p5m8l25
$$ -176 75 -140 -4 -298 80 -119 -23 -119 350 113 -113 51 -88 -77 -93 152 -52 106 68 34 -41 -89 -414
8019d14L16J9k23M15N7k98K42j21N4O7j43O2j82j04K56n8K4L2j2R4j72K54l17
$$ -414 -98 -79 -302 113 170 -128 114 -7 47 114 -29 33 -149 -253 3 -55 -31 1 -11 83 -89 165 -152
8042a52J97M4nr3O6m7J2Q3j29M2j40J7L29L4k64J93l04K28k95J45J02L8k05J15
$$ -152 45 89 84 -9 57 10 22 105 -24 18 -122 -105 224 258 -6 187 -117 111 -184 -39 63 101 -104 11
8066A1k05N5L06k74J20j4k09J68l4k41N1R5p1L12j18n5K93l03L33j17j05J6J49
$$ 11 -194 -139 167 -107 13 -1 -210 -42 -76 -317 -266 -171 -242 70 -48 -103 190 -113 220 103 -2 14 163
8089A63k87K01j9l7k7n0J95j13j23O0j97K13j32K43K2k9j4q0N2l2M5J52j79J44
$$ 163 -124 77 58 21 -6 -56 139 26 -97 -37 -234 -21 -153 90 112 83 69 -11 41 9 54 206 27 171
8113A71j77l27K42L2K63k47L33k80j91P6J03K6J49j75P3p7L0r2R2l4L3Q2q6J0
$$ 171 -6 -333 -91 -59 204 -43 290 10 -181 -105 -2 24 173 -2 71 -6 24 -68 24 -10 23 105 19 29
8137B9M6o5j34J02k0J17j50m2n6K40m5j42K71J3l83O2J11K23j76K87k30J44j43
$$ 29 75 10 -124 -22 -42 75 -75 -117 -173 67 22 -120 151 164 -219 -157 -46 177 1 288 58 202 59
8160E9k03K88k15J9L0R6l5k05R3K60k06%J02k60J09R3j02l9K63o5k0L6j08j81
$$ 59 -144 144 -71 -52 -22 74 39 -166 -73 187 -19 -19 83 -177 -68 25 -77 -116 147 82 62 98 -10 -191
8184a91J79rj53J79l3jJ90
$$ -191 -12 -21 -174 5 -28 -29 161
8191A61
$$ Imaginary data points
##PAGE= N=2
##DATA TABLE= (X++(I..I)), XYDATA
0@%%%%%%%%%%%%qJ6j6J6j6K4l2L2m0M9n7P2q8J02j18J36j52J75k00K25k57K92
$$ 0 0 0 0 0 0 0 0 0 0 0 0 0 -8 8 -8 8 -8 16 -16 16 -24 25 -32 40 -48 54 -64 72 -80 95 -105 120 -137 155
34A55l31L74m20M71n27N87o54P28q08Q95r91J095j208J332j467J617j782J964
$$ 155 -176 198 -222 249 -278 309 -345 383 -425 470 -521 574 -634 698 -769 848 -934 1030
52A030k164K384k634K916l235L599m019M515n108N829o730P893r455J1679j5117
$$ 1030 -1134 1250 -1384 1532 -1703 1896 -2123 2392 -2716 3113 -3617 4276 -5179 6500 -8617
67h617K1165l4845J21318r41j94834J33750j2034n8038N2619K0472m7180Q164
$$ -8617 12548 -22297 99021 98080 -96754 36996 24962 -33076 19543 40015 -7165 999
79I99K7705o420m8049K8045J5520k7996K1150M174l4394L6503O015l8280J316
$$ 999 28704 22284 -25765 2280 17800 -10196 10954 15128 -19266 17237 23252 -15028 -13712
92a3712O440N237J9935q271r262j2934L288K7116j6785j8878J8587n499M894Q478
$$ -13712 -7272 -2035 17900 9629 367 -12567 -9279 17837 1052 -17826 761 -4738 156 8634
106H634k0077l76O311M591O119k5106Q195K8563k3710o577J1047j5499J4200J4312
$$ 8634 -11443 -11819 -5508 -917 5202 -19904 -11709 16854 -6856 -13433 -2386 -17885 -3685 10627
120A0627k1930k199J3959K716k097n303j693o37O336J3219r681j2535R904J352
$$ 10627 -11303 -13502 457 3173 1076 -4227 -5920 -6557 -221 12998 3317 -9218 686 2038
134B038l266O054k510j508O598Ko157p261O349R980p823l726K746m327R081M049
$$ 2038 -1228 4826 2316 808 7406 7408 1251 -6010 339 10319 2496 -1230 1516 -2811 6270 10319
150A0319j5744j271J1417K484l134k765j549n03J298N133m399p785J0729M484
$$ 10319 -5425 -6696 4721 7205 4071 1306 -243 -746 552 5685 1286 -6499 4230 8714
164H714j1892J915N051n035L824J422q301j328N306K946k816m113O89o94K828
$$ 8714 -3178 -1263 3788 -1247 2577 3999 -4302 -5630 -324 2622 -194 -4307 -3618 -4312 -1484
179a484L175q912j921J1052k14p642OR95p29J419L003k958l793Q840K574j1185
$$ -1484 1691 -7221 -9142 1910 1696 -5946 -5940 -4945 -5674 -4255 -1252 -4210 -8003 837 3411 -7774
195g774J213O568k608K971J039o423K079L808n49o68j377K364M2k67L625n342
$$ -7774 -6561 7 -2601 370 1409 -5014 -2935 873 324 -344 -1721 643 685 418 4043 -1299
211a299j941J0855l033q144M329M73j87M894j508m409J106O037l10q408K258N525
$$ -1299 -3240 7615 4582 -3562 767 1240 1053 5947 4439 30 1136 7173 6863 -1545 713 6238
227F238m904K376L868o664M27N107l823m692L154N405j052l103N19n170r89Q234
$$ 6238 1334 3710 7578 914 1341 6448 2625 -2067 1087 6492 5440 2337 2856 -2314 -3303 4931
243D931l351n410N576j152l285M631j664n191J552M560j659o495M056N193n885
$$ 4931 1580 -3830 1746 594 -2691 1940 276 -4915 -3363 1197 -462 -6957 -2901 2292 -3593
258c593r18J300l403L940M724l847l017Q08J441R04j291m01N1J319L692l721k753
$$ -3593 -4511 -3211 -6614 -2674 2050 -1797 -4814 -4006 -2565 -1661 -2952 -3353 -3302 -1983 1709 -2012 -4765
275d765M268O57k667K848Q52k231J608K441l438l723M333L703k490J249R37l811
$$ -4765 -497 160 -2507 341 1193 -1038 570 3011 -427 -4150 183 3886 1396 2645 3582 -229
291b29J930L288m478j777N359K148l023j285J0k023K013M068l214j782M367q88
$$ -229 1701 4989 511 -1266 4093 6241 3218 1933 1943 -80 1933 6001 2787 1005 5372 4484
307D484m114Q75Q91j876J895J463l242j399M307j72m646N05J047j188J186L111
$$ 4484 370 1245 2136 260 2155 3618 376 -1023 3284 3112 -1534 -1029 18 -1170 16 3127
323C127l609m147K545J831k807L53K105j654L34J495k934j322L680j37l624Q23
$$ 3127 -482 -4629 -2084 -253 -3060 -2707 -602 -2256 -1922 -427 -3361 -4683 -1003 -1140 -4764 -3941
339c941K300o28N77J351l020j832M462J030k887J003J976k182K60J640j606j025
$$ -3941 -1641 -2269 -1692 -341 -3361 -5193 -731 299 -2588 -1585 391 -1791 -1531 109 -1497 -2522
355b522L008J128k580J521J233j829Q09R33k343Q43L016p73k014O58J111p80R12
$$ -2522 486 1614 -966 555 1788 -41 768 1701 -642 201 3217 2444 430 1088 2199 1419 2331
372B331J481k941k73L394n44k874J175J030j416M90K79j397N95J514j658j995
$$ 2331 3812 871 598 3992 3448 574 1749 2779 1363 1853 2132 735 1330 2844 1186 -809
388h09J781M50k000Q27P19k773L4K543j219k626J755J257k257M93J287k585l78
$$ -809 972 1422 -578 249 968 -1805 -1771 772 -447 -3073 -1318 -61 -2318 -1825 -538 -3123 -3501
405c501L136j353l024L008J605k334m10J467j576k12L056n98k222J622J392k484
$$ -3501 -365 -1718 -4742 -1734 -129 -2463 -2873 -1406 -2982 -3194 -138 -736 -2958 -1336 56 -2428
421b428j70K153r26M84K009j850j561K968Q82j896L21N54q83P75K347j096j806
$$ -2428 -2598 -445 -1371 -887 1122 -728 -2289 679 1561 -335 -14 540 -343 432 2779 1683 -123
438a23J654J154k116P99J699j643J032Q22j884n06J937L00j231l28N33k81P49
$$ -123 1531 2685 569 1368 3067 1424 2456 3278 1394 888 2825 3125 1894 1566 2099 1818 2567
455B567J356l124r83K703j197j650J762k32q68M66N0j333j406K079J138k591L71
$$ 2567 3923 799 -184 2519 1322 -328 1434 1202 334 800 850 -483 -1889 190 1328 -1263 -892
472h92J230j803M29J118k497K83J784Q0j679n50K035o64j182J526j868j118L655
$$ -892 338 -1465 -1036 82 -2415 -2132 -348 -268 -1947 -2497 -462 -1126 -2308 -782 -2650 -3768 -113
489a13m4k316L04N81n15Q73Q59q61j067J900P09k823J009K486j498l22J190j668
$$ -113 -157 -2473 -2169 -1588 -2103 -1230 -371 -1232 -2299 -399 310 -2513 -1504 982 -516 -838 352 -1316
507a316P20K207J26k056l15J700K27l4J032j554j698L243J97j884J212N09r00
$$ -1316 -596 1611 1737 -319 -634 1066 1293 1259 2291 737 -961 2282 2479 595 1807 2316 1416
524A416K70k03j059R70J353o83k642J077J620j240j28M68j700O13J925j210j887
$$ 1416 1686 1483 424 1394 2747 2064 -578 499 2119 879 751 1219 -481 132 2057 847 -1040
541a040Q95J30k65N2M67r83l74J583r59j734J408N03j474P64m6j363Q79J213r90
$$ -1040 -145 -15 -280 -228 239 -744 -1118 465 -494 -2228 -820 -317 -1791 -1027 -1073 -2436 -1557 -344 -1334
560a334j471N50J377l79o30P76j292M23K156j423j322J470O88q94P80R9l24K88
$$ -1334 -2805 -2255 -878 -1257 -1887 -1111 -2403 -1980 176 -1247 -2569 -1099 -411 -1305 -525 -426 -750 -462
578d62J394p53j777J904J596j656l7J163j162P07J242j135n47P43J088n23m91
$$ -462 932 179 -1598 306 1902 246 209 1372 210 917 2159 1024 477 1220 2308 1785 1294
595A294Q76q70l37J823j635p76J731J99j144M20l43n16M19L55k85j446J423N59
$$ 1294 2170 1300 963 2786 1151 375 2106 2305 1161 1581 1238 722 1141 1496 1211 -235 1188 1747
613A747k000M11L51j516J341P99k129j22J032P4q71k59M70o62J99P55j158p10
$$ 1747 -253 158 509 -1007 334 1133 -996 -1118 -86 -12 -883 -1142 -672 -1334 -1135 -380 -1538 -2248
631b248J668k57j576J016O6n68P08N34j367m07J720N22j476M26P59j139N94J056
$$ -2248 -580 -837 -2413 -1397 -1331 -1899 -1191 -657 -2024 -2431 -711 -189 -1665 -1239 -480 -1619 -1025 31
649C1j001k88J766l74j001Q40Q26k24n45J041r46p58K360R1j723M97P47n69N94
$$ 31 -970 -1258 508 134 -867 -27 799 575 30 1071 125 -633 1727 1818 95 592 1339 770 1364
668A364O52p18n50R61o5j104N23J150q86k88N25j007J20J244l39j223j13N84k34
$$ 1364 2016 1298 748 1709 1644 540 1063 2213 1327 1039 1564 557 677 1921 1582 359 246 830 596
687E96m0K93q36o23J246k89j522J041J95o19R0j83q59K36J038o10j167M99Q93
$$ 596 556 849 13 -610 636 347 -1175 -134 61 -558 -468 -651 -1510 -1274 -236 -846 -2013 -1514 -621
706f21o99L39r0r67N00J380r72q59P53N50n94j13L49n24O72J196o57j333J752
$$ -621 -1320 -981 -1071 -2038 -1538 -158 -1130 -1989 -1236 -686 -1280 -1393 -1044 -1568 -896 300 -357 -1690 62
725F2J88o65K30K88o08O97R89j065o28J066O90o74L87J34n79J24J516q47r91P18
$$ 62 250 -415 -185 103 -505 192 1181 116 -512 554 1244 570 957 1091 512 636 2152 1305 314 1032
745A032R67p98j81O73p62o4P00k45r68Q15N99j213l40J57k15L10N50o66r63Q12
$$ 1032 1999 1201 1020 1693 931 867 1567 1322 354 1169 1768 555 215 372 157 467 1017 351 -612 200
765B00L02j265K22O86j060J47Q55q37m43P66k10n51J89J84o45N11L76q75l51O54
$$ 200 502 -763 -541 145 -915 -768 87 -750 -1193 -427 -637 -1188 -999 -815 -1460 -949 -573 -1448 -1799 -1145
785a145M01n73J45L02m52M79O68j147k55J275k49j19L48K43m69J99R00p64l39
$$ -1145 -744 -1317 -1172 -870 -1322 -843 -175 -1322 -1577 -302 -551 -670 -322 -79 -548 -349 551 -213 -552
804e52J257K53j058N69L90k48j07M82m21l38P74M38n67n5N68o83K36P45o03o16
$$ -552 705 958 -100 469 859 611 504 986 565 227 1001 1439 872 817 1385 702 938 1683 1080 464
824D64J350o00r02M44M86m67j35N06l49n63Q10J98j494M63L69o41k93O23m97o11
$$ 464 1814 1214 312 756 1242 775 640 1146 797 234 1044 1242 -252 211 580 -61 -354 269 -228 -839
844h39R09k26o51K81K44l65k37O57j198J16P53l88n41K69M36o83K24P43m72k58
$$ -839 70 -156 -807 -526 -282 -647 -884 -227 -1425 -1309 -556 -944 -1485 -1216 -780 -1463 -1239 -496 -968 -1226
864a226M64j96j8L58J89l93L10K52o17K96J052n04m20Q74j28p32M46M53n99M45
$$ -1226 -762 -958 -976 -618 -429 -822 -512 -260 -877 -581 471 -33 -453 421 293 -439 7 460 -139 306
884C06M50l65j79O85J33m77K08K06k66L9O60o13n26P96J44o21M77K37m18o9L87
$$ 306 756 391 212 897 1030 553 761 967 701 740 1400 787 261 1057 1201 580 1057 1294 876 807 1194
905A194o75n09N88L76j103L26N70n86j32L98l44n40K97M5l49l62O31n24n7M29
$$ 1194 519 10 598 974 -129 197 767 181 49 447 103 -437 -140 -95 -444 -806 -175 -699 -756 -327
925c27o43j90P36J58n46J4K89k83q4j06P9l56N14N3n17N55L65n06L05J46k62N
$$ -327 -970 -1160 -424 -266 -812 -798 -509 -792 -876 -982 -903 -1259 -745 -692 -1209 -654 -289 -795 -490 -344 -606 -601
947f01O90O0r85M48N96m73R1R60n37l02R15l50l76M40J60j08J23L00m83K4Q13
$$ -601 89 149 -836 -388 208 -265 -174 786 249 -53 862 512 136 576 736 628 751 1051 568 592 1405
968A405o6o78J97O97p87M32M8o68r8Q75o66q10P79M69p38j22O78q38j17M73m52
$$ 1405 1339 661 858 1555 768 1200 1248 580 482 1357 691 -119 660 1129 391 269 947 109 -8 465 13
989A3m27M50n0n00j01M42k42l09N07k60m30R7P04q55J49M8k34k06O22P1p34L45
$$ 13 -414 36 -14 -514 -615 -173 -415 -724 -217 -477 -907 -810 -106 -961 -812 -764 -998 -1204 -582 -511 -1245 -900
1011i00K13j87J09N10n89j48P73n78l46R06J03l60M4K40L8J36N49k16m90O82k47
$$ -900 -687 -874 -765 -255 -844 -992 -219 -797 -1143 -237 -134 -494 -450 -210 -172 -36 513 297 -193 489 242
1032B42o0N73j07j37mM11m48j31Q04j08n10M79J54p93J60L31j86k66O01J23p44
$$ 242 182 755 648 511 507 918 470 339 1143 1035 525 1004 1158 365 525 856 670 404 1005 1128 384
1053C84j9O44n48j26L75m71k52M29p1n74J20K22l39j17M30k55l37M19k50o12L70
$$ 384 365 1009 461 335 710 239 -13 416 345 -229 -109 113 -226 -343 87 -168 -505 -86 -336 -948 -578
1074e78L18j91k98J95J37m50O1L36m76l12R33j26n65N64k43m6J16m0j41L80K59
$$ -578 -260 -451 -749 -554 -417 -867 -806 -470 -946 -1258 -325 -451 -1016 -452 -695 -741 -625 -665 -806 -426 -167
1095a67r5k77Q31o67n5P18j55m94K59L93J13q8J41k6o2K86J41o27N72L91p37P8
$$ -167 -262 -539 292 -375 -430 288 133 -361 -102 291 404 316 457 431 369 655 796 169 741 1132 395 473
1117D73K25j57K00L79j2p38R5M98l53N0O0m00j13O55m64m16M07j19l66K19M19
$$ 473 698 541 741 1120 1108 370 465 963 610 660 720 320 207 862 398 -18 389 270 -96 123 542
1138E42m84j04J37j62o77M14J51k52j42K66l70O2L92j28n88K52Q3j36j51J81j41
$$ 542 58 -46 91 -71 -748 -334 -183 -435 -577 -311 -681 -619 -227 -355 -943 -691 -608 -744 -895 -714 -855
1159h55qO20n86L4J68N19l51k02L42Q5j17L8K72n74P04o2j79L31J8m8q3L52k8
$$ -855 -863 -243 -829 -795 -627 -108 -459 -661 -319 -234 -351 -313 -41 -615 89 27 -152 179 197 149 66 418 390
1182C90j38M35l4l91J01K79R2l07N04Rm77L19p4l65J11J70k06J40L44l07m26N26
$$ 390 252 687 653 262 363 642 734 427 931 940 463 782 708 343 454 624 418 558 902 595 169 695
1204F95k6j76N6r7k15K8J05l40j72P9L46m36K42Q9m18j66R7k59J7J61N7l46K22
$$ 695 669 493 549 452 237 265 370 30 -142 -63 283 -153 89 178 -240 -406 -309 -568 -551 -390 -333 -679 -457
1227d57k4k91L37p2l17QK52R7k65m3R9LK57J38p3k11L57R4k80J1L58k02Q6K18
$$ -457 -481 -772 -435 -507 -824 -816 -564 -467 -732 -775 -676 -673 -416 -278 -351 -562 -205 -111 -391 -380 -22 -224 -138 80
1251H0M1j24Q2K99l76j01M54k85J41N93l3k72J46j03k81M29J14L2m64M16l46l1
$$ 80 121 -3 79 378 2 -99 355 70 211 804 771 499 645 542 261 690 804 836 372 788 442 411
1273D11L75k35l57L43k91K8k50L99J50k65L97m64j36J80p2m10L63J0l38k77K24
$$ 411 786 551 194 537 246 274 24 423 573 308 705 241 105 285 213 -197 166 176 -162 -439 -215
1294b15rk97K50kk66Q8J31j2m00L64k98j56K12j04J50O3K92m66L0N18k95P6j5
$$ -215 -224 -521 -271 -273 -539 -451 -320 -332 -732 -368 -666 -822 -610 -714 -564 -501 -209 -675 -645 -127 -422 -346 -361
1317c61o5j72J81L26p8n4K02K32o09L49R9K1j17M05r0l05J65L38l92M00J22j3
$$ -361 -426 -598 -417 -91 -169 -223 -21 211 -398 -49 50 71 -46 359 269 -36 129 467 75 475 597 584
1339E84q9J13%k20M48k61k4J65j74k55J36M6j60J38j34Q9m51N08p5n00L11j57
$$ 584 495 608 608 388 836 575 551 716 542 287 423 469 309 447 313 402 -49 459 384 -116 195 38
1361C8J14k33J82k79K11j91J71k86j98K87m52K35K10j04j56L1q9M0j17R6N1M1
$$ 38 152 -81 101 -178 33 -158 13 -273 -471 -184 -636 -401 -191 -295 -451 -420 -509 -469 -586 -490 -439 -398
1383c98K16m88l1N09m3j44q1J18J6k01N77l28n5J88L19m74J66M85k93j01K82o0
$$ -398 -182 -670 -701 -192 -235 -379 -460 -342 -326 -527 50 -278 -333 -145 174 -300 -134 351 58 -43 239 179
1405A79o2K19K3k3o8L31l62l5L65k20j63K92j5J54k92J66k15N4K39m7j11q6L24
$$ 179 117 336 359 336 268 599 237 202 567 347 184 476 461 615 323 489 274 328 567 520 409 323 647
1428F47l24j54J55j87R2p3J28j57n0R3k12k69Lk4K8M76n71J27l63L42k00L69l7
$$ 647 323 169 324 137 229 156 284 127 77 170 -42 -311 -308 -332 -304 172 -399 -272 -635 -293 -493 -124 -161
1451a61j36j3Q2m34j8L23j29k43L19P1l7J68J8m68J55M57j74m1j82M57k31j6J32
$$ -161 -297 -310 -228 -662 -680 -357 -486 -729 -410 -339 -376 -208 -190 -658 -503 -46 -220 -261 -443 14 -217 -233 -101
1474a01q5J04L76N7n11K75R8RP7J35m7j75J54O0j66K44l5j52K13J00p4j48O1J8
$$ -101 -186 -82 294 351 -160 115 213 222 299 434 387 212 366 426 260 504 469 317 530 630 556 408 469 487
1498D87k47k38M36q4j51K02l13K38k16K00m5j96j46K70l33jn4N0N2l4k83K63J48
$$ 487 240 2 438 354 203 405 92 330 114 314 269 73 -73 197 -136 -137 -191 -141 -89 -123 -406 -143 5
1521Ej37j35K5k26mR6K3j63J12J3k8J34l5j10k47K48J92j02L07l10MK6NK03JK08
$$ 5 -132 -267 -242 -468 -472 -376 -353 -516 -404 -391 -419 -285 -320 -430 -677 -429 -237 -339 -32 -342 -338 -312 -307 -104 -103 105
1547A05m26J88J69J16j82k07O41k44K6M43m90j98N33J46m40K2M42l89o8L09K86
$$ 105 -321 -133 36 152 -30 -237 404 160 186 629 139 -59 474 620 180 202 644 255 187 496 782
1568G82m83L75k62j24L9Q1k59K01k2p9m0N7J38l18N0J23m7r1m3j45K3M9j00j57
$$ 782 299 674 412 288 327 408 149 350 328 249 209 266 404 86 136 259 212 121 78 -67 -44 5 -95 -252
1592b52J74j09Jj87O2P7M8P8k10j45J52J38k76N7N5o3k23L96P6l28M18R8j66k06
$$ -252 -78 -187 -186 -373 -311 -234 -186 -108 -318 -463 -311 -173 -449 -392 -337 -400 -623 -227 -151 -479 -61 37 -129 -335
1616c35M5J06J20o6k6k08L05k42M30q2k50R4K14K46j7j14j96N41k03j39J79j46
$$ -335 -290 -184 -64 -130 -156 -364 -59 -301 129 47 -203 -109 105 351 334 220 24 565 362 223 402 256
1638B56K43j25j63j7K63N0j8k54L02k02jK61j62l48p7M65l26l5K18l44P0K61m33
$$ 256 499 374 211 194 457 507 489 235 537 335 334 595 433 85 8 473 147 112 330 -14 56 317 -116
1661a16r3K06J14j82L44m27k47J37K27j74k53J55P9n6j09K13j6k55P9K05l74L38
$$ -116 -209 -3 111 -71 273 -154 -401 -264 -37 -211 -464 -309 -230 -286 -395 -182 -198 -453 -374 -169 -543 -205
1683b05k84J41j36J26J47n3K10j69k8lJ01q5K97p4j03m9J02J30k1J34j5j75J50
$$ -205 -489 -348 -484 -358 -211 -264 -54 -223 -251 -254 -153 -238 59 -15 -118 -167 -65 65 44 178 163 -12 138
1706A38k2j35N3L12j34J20K72j44l68K52k1J3k16K00k3j59M58m22J47M3o4r0o4
$$ 138 116 -19 34 346 212 332 604 460 92 344 323 336 120 320 297 138 596 174 321 364 300 210 146
1729A46K76p4j52K37n29J08q8L2p3k3Q7Ql03K09L00k73j11j41J84k14K81j12q0
$$ 146 422 348 196 433 -96 12 -76 -44 -117 -140 -53 -45 -348 -139 161 -112 -223 -364 -180 -394 -113 -225 -305
1752c05J94k34k14K21j01J79j50N5j87L26n7o4J89L1M9k70M56j4k68M7j0o4O3
$$ -305 -111 -345 -559 -338 -439 -260 -410 -355 -542 -216 -273 -337 -148 -117 -68 -338 118 104 -164 -117 -127 -191 -128
1775a28J93N5j52K03K4k46K11k5M5J84j95M8k6j09M36l47J27P3O2k84J14J7J24
$$ -128 65 120 -32 171 195 -51 160 135 180 364 169 217 191 82 518 171 298 371 433 149 263 280 404
1798D04k12R2M6p3L3P8j25n5Oj31L3j45N2j06L37k05m63M03J01k32j88K68k3k70
$$ 404 192 284 330 257 290 368 243 188 194 63 96 -49 3 -103 234 29 -434 -31 70 -162 -350 -82 -105 -375
1822c75K21J31k08N4r1j96J51j88O0R5M2K3o9P3J97j30m55O21l65O9J40L32k34
$$ -375 -154 -23 -231 -177 -268 -464 -313 -501 -441 -346 -304 -281 -350 -277 -80 -210 -665 -44 -409 -340 -200 132 -102
1845a02K17k20oq5K46j30j02Q5K82j59P3Q5j92L28m5l32J71P6N0K0j51L60j74
$$ -102 115 -105 -111 -196 50 -80 -182 -97 185 26 99 184 -8 320 275 -57 114 190 240 260 109 469 295
1868B95j5k3k20J31K91l47N3L0l8J04k9J67l5l35M58k54k50K09l23J16J45j20
$$ 295 280 257 37 168 459 112 165 195 157 261 232 399 364 29 487 233 -17 192 -131 -15 130 10
1890A0k40M8r8P0K4nr2J76k11J08k63K07m4l87K81o0m8K78N6j8j76J60l1n0K42
$$ 10 -230 -182 -280 -210 -186 -191 -283 -107 -318 -210 -473 -266 -310 -697 -416 -476 -524 -246 -190 -208 -384 -224 -255 -305 -63
1915f3k50K92j53j61M06k58K25o3J36j6M1Q5j93o9K37k35J51N7Q4l22M36P9l25
$$ -63 -313 -21 -174 -335 71 -187 38 -25 111 95 136 221 28 -41 196 -39 112 169 253 -69 367 446 121
1938A21K19j19m0R6o8j09K43N4J4q4k51R7jk9K10k24%p6J67k31O9k0J14m06K94
$$ 121 340 221 181 277 209 100 343 397 411 327 76 173 172 143 353 129 129 53 220 -11 58 38 152 -254 40
1963D0J01j28Oj20j11J86R8k98J46j76P9j34rN9m4J59r4l33K88K84k60J2N6N8
$$ 40 141 13 19 -101 -212 -26 72 -226 -80 -256 -177 -311 -320 -261 -305 -146 -240 -573 -285 -1 -261 -249 -193 -135
1987a35j78P7K09k23m3L83j87O0J26j00O4J03p0j20j83J04J44J11l7R0L7j56l
$$ -135 -313 -236 -27 -250 -293 90 -97 -37 89 -11 53 156 86 -34 -217 -113 31 142 105 195 232 76 73
2010G3j33R4L29K1k62L8J24j66J48O7j64m1K05O3j47j66J22j83K09j68K15k68
$$ 73 -60 34 363 384 122 160 284 118 266 333 169 128 333 396 249 83 205 22 231 63 278 10
2032A0R4k52L47nq1k18J39J20k47Q2j21j88J33L2q6J49N4p9j13K37j67J55k14
$$ 10 104 -148 199 194 113 -105 34 154 -93 -11 -132 -320 -187 -155 -241 -92 -38 -117 -230 7 -160 -5 -219
2055b19k81L59p2P9Jn3k84N79k44Q9j8j34j85L49j1J75j11j39K23l62J95J23j08
$$ -219 -500 -141 -213 -134 -133 -186 -470 109 -135 -46 -64 -198 -383 -34 -45 130 19 -120 103 -259 -64 59 -49
2078d9k4K18K6r9J37M7o8l1k30K6K12lJ20k6j5K59m26nJ85r0K80l01N9j1q0O9
$$ -49 -73 145 171 72 209 256 188 157 -73 -47 165 162 282 256 241 500 74 69 254 164 444 143 202 191 111 180
2104A80j23O6O7j05N0j23k15K88k1O7o4rl6j50P3K7m20J98L06j53%P2j73p5J40
$$ 180 57 123 190 85 135 12 -203 85 64 131 67 58 22 -128 -55 -28 -448 -250 56 -97 -97 -25 -198 -273 -133
2129a33Q4k54k0J18p7J54J97l80J39L8j05R4j16P8J83l8j63K15J22j77K96k44
$$ -133 -49 -303 -323 -205 -282 -128 69 -311 -172 -134 -239 -145 -261 -183 0 -38 -201 14 136 -41 255 11
2151A1j12J20j50J13J38J09l59K70N9k28K82J49j37L7rn9j61J33P1rp5K60k20
$$ 11 -101 19 -131 -18 120 229 -130 140 199 -29 253 402 265 302 293 234 73 206 277 268 193 453 233
2174B33L6J0k99P2J58M4p7P2l42K50k0J82j37j94p3J32j08J85k85J79k18L63k44
$$ 233 269 279 -20 52 210 254 177 249 -93 157 137 319 182 -12 -85 47 -61 124 -161 18 -200 163 -81
2197h1M6m40M09K3l6k80R9n6O0k7J24J31l5l69O5J05P0j15J95J97m79M00j21P2
$$ -81 -35 -475 -66 -43 -79 -359 -260 -316 -256 -283 -159 -28 -63 -432 -367 -262 -192 -307 -112 85 -394 6 -115 -43
2221d3l9k08J52Q7J66J09n16K26jJ15J8K28k33R1J14l45J46J91j06K3K10k08n
$$ -43 -82 -290 -138 -51 115 224 -292 -66 -67 48 66 294 61 152 266 -79 67 258 152 175 385 177 172
2244A72KK02l86K02P4j37J10J12o3k22K31k2l63J72J8P4Q1k04J48k08L4j65R7
$$ 172 174 376 -10 192 266 129 239 351 288 66 297 275 -88 84 102 176 257 53 201 -7 27 -138 -41
2267d1l7n8q0K02l3M7j86m4j10O4j54L19j25K2K7P7J3k71N8M4J50j63J66K85l02
$$ -41 -78 -136 -216 -14 -47 0 -186 -230 -340 -276 -430 -111 -236 -214 -187 -110 -97 -368 -310 -266 -116 -279 -113 172 -130
2292a30RQ1O6l0l1O7j82K1j60M87j44l11K41L60j35l51L46k00Q9J05j79n6K09
$$ -130 -121 -40 26 -4 -35 32 -150 -129 -289 198 54 -257 -16 344 209 -142 204 4 93 198 19 -37 172
2315A72K25j71j84J19k78J37Q7R7J89n17N11k73J31o4o7r2J36p8R7r5j84J22R
$$ 172 397 226 42 161 -117 20 107 204 393 -124 387 114 245 181 114 22 158 80 177 82 -102 20 29
2338B9Q1J05j63q3j81K29J2J2j3j99R7m4j2k1k52L52k34j44L13j27L16l09PO8
$$ 29 110 215 52 -31 -212 17 29 41 28 -171 -74 -118 -130 -151 -403 -51 -285 -429 -116 -243 73 -236 -229 -161
2362a61j74K11n4j07J67n5K0L0N8O4jk63K31J23O0LN4j21p2J28J30k16J79q8q8
$$ -161 -335 -124 -178 -285 -118 -173 -153 -123 -65 -1 -2 -265 -34 89 149 152 206 85 13 141 271 55 234 146 58
2387E8Q8P3j25m1R2J03j11P9K3l04J83k29J00K75j68j75K58O6j64o3k12K56j41
$$ 58 146 219 94 53 145 248 137 216 239 -65 118 -111 -11 264 96 -79 179 245 81 18 -194 62 -79
2410g9J17J53k81K60K8k95j31K22J40l89K66j17j61p1Q4J25j30K86r8J22m67R2
$$ -79 38 191 -90 170 198 -97 -228 -6 134 -255 11 -106 -267 -338 -254 -129 -259 27 -71 51 -416 -324
2432c24K82j4L3j93j65N7J04K72j73KLM2J01k37q4L31p5O7K26l76J69J29k53O5
$$ -324 -42 -56 -23 -216 -381 -324 -220 52 -121 -119 -116 -74 27 -210 -294 37 -38 29 255 -121 48 177 -76 -11
2456a1j24J85NJ10m0j03L1J11N5n5N2l29J64L29l79J73K18l41L98j71j53j59M55
$$ -11 -135 50 55 165 125 22 53 164 219 164 216 -113 51 380 1 174 392 51 449 278 125 -34 421
2479D21l85K23K3k97j16n5J26n4k08lL30j56J91k60O4K41j78j60J27J73Q0l06
$$ 421 36 259 282 -15 -131 -186 -60 -114 -322 -325 5 -151 40 -220 -156 85 -93 -253 -126 47 127 -179
2501a79j58K75k72J89Mj23R1R9pj21K1m1R7M2k53K07P7K9R7k53k0K61l06j68N41
$$ -179 -337 -62 -334 -145 -141 -264 -173 -74 -81 -202 -181 -222 -125 -83 -336 -129 -52 -23 74 -179 -199 62 -244 -412 129
2526A29p5l04L73k73K8K85J8J18j93M3j02J49K1j02O5J10k46q8J02J31j30l7N26
$$ 129 54 -250 123 -150 -122 163 181 299 106 149 47 196 217 115 180 290 44 -44 58 189 59 22 548
2549E48n84P93n71r7L49p5K2k59q5j90R5j1r8j26J31q2M49M9m20q6J84k14K62
$$ 548 -36 757 186 89 438 363 385 126 41 -149 -54 -65 -163 -289 -158 -240 209 258 -162 -248 -64 -278 -16
2572a6j46l2o9o2K56o2j7j78O6R8J22M3j58J97k36J52k9p2K01k04n1K39r4L0K46
$$ -16 -162 -194 -263 -325 -69 -131 -148 -326 -260 -162 -40 3 -155 42 -194 -42 -71 -143 58 -146 -197 42 -52 -22 224
2597B24L3l91N5k61L97K5j13J94l3K26k56k28K02K28j48K91k80Q1J06j35j30K40
$$ 224 257 -134 -79 -340 57 82 -31 163 130 356 100 -128 74 302 154 445 165 246 352 217 87 327
2619C27j63q8J12N7N0j83J62r0P8p4l7j25K15j26k00L52j90j35K20N3j40j95Q9
$$ 327 164 76 188 245 295 112 274 184 262 188 151 26 241 115 -85 267 77 -58 162 215 75 -120 -31
2642c1P8j19J17n9k26N7J62j31Q9Q9j56m0M2j25J86p8J67j19k94M5K20J88k5k47
$$ -31 47 -72 45 -14 -240 -183 -21 -152 -63 26 -130 -170 -128 -253 -67 -145 22 -97 -391 -346 -126 62 37 -210
2666b10o2L53O2l25J40J84J05j95j92R4p5Q3M9k19M57l13o6K36j76J57q3K16P6
$$ -210 -272 81 143 -182 -42 142 247 52 -140 -46 -121 -38 11 -208 249 -64 -130 106 -70 87 4 220 296
2689B96q9K1j41o9n3P6L30k78r2O4m0k55L52j6r9P7k48J06J27q9m1J67R8l09J19
$$ 296 207 228 87 18 -35 41 371 93 1 65 25 -230 122 106 7 84 -164 -58 69 -20 -61 106 204 -105 14
2714A4P5k69J93k30K15K48q0k40j69J52N8k0L8j53J36r5p5l4J17M4l48L10j07
$$ 14 89 -180 13 -217 -2 246 166 -74 -243 -91 -33 -53 -15 -168 -32 -127 -202 -236 -119 -75 -423 -113 -220
2737b20j77M01J2j28J9l3n3L30k84k1PJ88k89N4j9K5K85k54RJ85L2J25j45O2j41
$$ -220 -397 4 16 -112 -93 -126 -179 151 -133 -154 -147 41 -248 -194 -213 -188 97 -157 -148 37 69 194 49 111 -30
2762c0l0K12r4j67J91rJ17l34L67l5q5J88k16L33j95j6K22k86P8R9m42J21R6j82
$$ -30 -60 152 58 -109 82 73 190 -144 223 188 103 291 75 408 213 197 419 133 211 310 -132 -11 85 -97
2786i7J66pm0j90K82O0k79j17J08J53k47M41k18j44R4j29J52L8l66M32j41N76
$$ -97 69 62 22 -168 114 174 -105 -222 -114 39 -208 233 15 -129 -35 -164 -12 26 -340 92 -49 527
2808E27J52q95j3k4J05m0K62k20Q1j32L60l69J31J04k51M7N7K76k01k03L78m3
$$ 527 679 -216 -229 -253 -148 -188 74 -146 -65 -197 163 -206 -75 29 -222 -175 -118 158 -43 -246 132 89
2830H9l22N68L2l31J16L9j23J8j46K08L2J17j42k32K88jP3k71M5O8j3k23O6K64
$$ 89 -233 335 367 36 152 191 68 86 -60 148 180 297 155 -77 211 210 283 12 57 125 112 -111 -45 219
2854B19j67k13J95M6k25K17j50r5j5J32J90M6k48R6q0j4J79k38n3OK33r2L2j43
$$ 219 52 -161 34 80 -145 72 -78 -173 -188 -56 134 180 -68 28 -52 -66 113 -125 -178 -172 61 -31 1 -142
2878a42Q8j27r6J42K2q8J47O6Q9k17J51p9L3L0k22J66p9Q1p8m7J31k4J23K0jJ94
$$ -142 -54 -181 -277 -135 -113 -201 -54 12 101 -116 35 -44 -11 19 -203 -37 -116 -35 -113 -160 -29 -53 70 90 89 283
2904B83k96j32K44M8J32j71K0J4RL6l47J53J96n3J84j61k69M38j53O6j59J41j18
$$ 283 -13 -145 99 147 279 108 128 142 151 187 -160 -7 189 136 320 159 -110 328 175 241 82 223 105
2927A05l52J75K04J2P0k9j63q1r6P9K7K24l2r5q1RJ7j23J75o5k01L70l69J98J93
$$ 105 -247 -72 132 144 214 185 22 -59 -155 -76 -49 175 143 48 -33 -24 -7 -130 45 -20 -221 149 -220 -22 171
2952A71l13J90l03J76j01o6OJ48M1p1jl8J58j91K9QJ0J64k66K82j29Q4l11L07
$$ 171 -142 48 -255 -79 -180 -246 -240 -92 -51 -122 -123 -161 -3 -194 -165 -157 -147 17 -249 33 -96 -12 -323 -16
2976a6j64M7oJ14j82L59J50j97j33J37J21k53K21K8k73K01q4j68L81k39R8j27
$$ -16 -180 -133 -139 -25 -207 152 302 105 -28 109 230 -23 198 226 -47 154 70 -98 283 44 142 15
2998A5N1n2Q1J3n2j52K41J91l81M4J08j04k2Pj03o1J11KM1j96K75l0r6l4O7k46
$$ 15 66 14 95 108 56 -96 145 336 -45 -1 107 3 -19 -12 -115 -176 -65 -63 -22 -218 57 27 -69 -103 -36 -282
3024b82J4M23l32O9k26K29j48L41k99Q2j7K92j38k27k61J07L82o2rKJ41R4j19
$$ -282 -268 155 -177 -108 -334 -105 -253 88 -211 -129 -146 146 8 -219 -480 -373 9 -53 -62 -60 81 175 56
3047E6r0J78q7K10k29j87M5lL4R6j83J97J85j0N9l22K61k30J98J30k52mQ4k2j74
$$ 56 -34 144 57 267 38 -149 -104 -107 -73 23 -160 37 222 212 271 -51 210 -20 178 308 56 52 136 114 -60
3072f0J63k50K37j1N1Q0J2k06j43K05k2jk49K94j79K70R8k38k8j38j64J90p1j43
$$ -60 103 -147 90 79 130 210 222 16 -127 78 56 55 -194 100 -79 191 289 51 23 -115 -279 -89 -160 -303
3096c03j26N17m06J94j4J55l3L4j51r4K42k66J00R4j75k6J22k20K59J31k3MJ6
$$ -303 -429 88 -318 -124 -138 17 -16 18 -133 -227 15 -251 -151 -57 -232 -258 -136 -356 -97 34 11 15 31
3119C1K37m09J16J50j01p1q7J81Q0j38J2o5J39Q0j73K81M4k18N5K20k80Q8k0l82
$$ 31 268 -141 -25 125 24 -47 -134 47 127 -11 1 -64 75 155 -18 263 307 89 144 364 84 172 152 -230
3143b30L15l0K54m05J90N5N5m0j08L4rj60j04K33OK0J11n4k1Nr6m1J67j65M8n3
$$ -230 85 55 309 -96 94 149 204 164 56 90 81 -79 -183 50 56 76 187 133 112 117 21 -20 147 -18 30 -23
3169b3j67P8r6K20j16qk13J74K1J10l8J60l36OO6oJ18J21J89k42m1j26P2l4O0
$$ -23 -190 -112 -208 12 -104 -112 -325 -151 -130 -20 -58 102 -234 -228 -162 -168 -50 71 260 18 -23 -149 -77 -111 -51
3194e1l1j66N60l76R6j51l9Q0J83j08M10q4m3j21N2k33J92n8k9M3l27Q3L17%k11
$$ -51 -82 -248 312 -64 32 -119 -158 -78 105 -3 407 323 280 159 211 -22 170 112 83 126 -201 -118 199 199 -12
3219a2K88l41L62j25j52K60l09j6j61K04L60k07k1k5K9J6j53j4k3P1J10k43J03
$$ -12 276 -65 297 172 20 280 -29 -45 -206 -2 358 151 130 105 134 150 -3 -17 -40 31 141 -102 1
3242Aq6j5j27J28K02o0j2k13J80j88j60L22k11K60k00K39l53N3m3K42P6J46m01
$$ 1 -85 -100 -227 -99 103 43 31 -182 -2 -190 -350 -28 -239 21 -179 60 -293 -240 -283 -41 35 181 -220
3265b20nO4J6K56J5j65j92J42oJ17j06L44l20j7J61k2J92j70l36L15j63J68r3
$$ -220 -225 -161 -145 111 126 -39 -231 -89 -95 22 -84 260 -60 -77 84 62 254 84 -252 63 -100 68 -25
3288b5J32k64K80moJ85k70P9j28L45j68j7O8k48K64j20K4J00j28o0M2L8q1J67
$$ -25 107 -157 123 119 113 298 28 107 -21 324 156 139 207 -41 223 103 127 227 99 39 81 119 38 205
3312B05k09j54L10k20K99l06p9J7K12j84j28K17k31K17n4m2N6L1k10K18j32O1
$$ 205 -4 -158 152 -68 231 -75 -154 -137 75 -109 -237 -20 -251 -34 -88 -130 -74 -43 -253 -35 -167 -106
3334a06k54K11k19L05q3k0O7l6R9r2L20k54J65l8Q5k72k31K40K44lj37P8Pq0l1
$$ -106 -360 -149 -368 -63 -146 -166 -99 -135 -36 -128 192 -62 103 65 150 -122 -353 -113 131 128 -9 69 76 -4 -35
3359c5J06l78M33k49J76M5J27n3m1j35j35K94J1j48K2Pk2j65J80R3K8l2jj65J79
$$ -35 71 -307 126 -123 53 98 225 172 131 -4 -139 155 166 18 40 47 25 -140 40 133 161 129 128 -37 142
3384A42J3k31l0N0k6J12k03K39r5J09q1N3L2j65K26j05j11J78l68K80j78J57p2
$$ 142 155 -76 -106 -56 -82 30 -173 66 -29 80 -1 52 84 -81 145 40 -71 107 -261 19 -159 -2 -74
3407g4kj42M1K33M2j06k40K20N5j41n3o6J16M3j29P4M2O2p1K0j42J16k8K11K7
$$ -74 -76 -218 -177 56 98 -8 -248 -28 27 -114 -167 -233 -117 -74 -203 -129 -87 -25 -96 -76 -218 -102 -130 81 108
3432A08j18%J96M4j54J49k17J69j09K38j70J17j90J01j75j29K70QJ02l0p7K35
$$ 108 -10 -10 186 230 76 225 8 177 68 306 136 253 63 164 -11 -140 130 138 240 210 133 368
3454C68m66L02J71k63k89J37l0j16pK27L3j34O9J16j36j37L65l64J44J19j89M
$$ 368 -98 204 375 112 -177 -40 -70 -186 -193 34 67 -67 2 118 -18 -155 210 -154 -10 109 -80 -76
3476g6j82L1l7J56M8j77K11r7J81k70j79L63j1j73J58j25J49j58J53l9n5J00j0
$$ -76 -258 -227 -264 -108 -60 -237 -26 -123 58 -212 -391 -28 -39 -212 -54 -179 -30 -188 -35 -74 -129 -29 -39
3499c9J30j88J35P4J07j52m2r7o1K40%j0J35j29rj38K64j33R6k02K23j3j55J56
$$ -39 91 -97 38 112 219 67 25 -72 -133 107 107 97 232 103 94 -44 220 87 183 -19 204 191 36 192
3523A92q1j11L0J46l4O9o2p6p6P4O0Pm1k07K00k70J74K5l58J75J28q4j33rK53
$$ 192 111 0 30 176 142 211 149 73 -3 71 131 138 97 -110 90 -180 -6 19 -339 -164 -36 -120 -253 -262 -9
3548ij67q1J49K21m19J50J80p6Q7L5j12j12K29j53J3P3j62J11K71r8l44M2J52
$$ -9 -176 -257 -108 113 -306 -156 24 -52 35 70 -42 -154 75 -78 -65 8 -154 -43 228 130 -214 -172 -20
3571b0j6J71k00J18p9J3M5o7j15K40n1J31j84L8R2l44K12J51q4j5K29j04n9p3
$$ -20 -36 135 -65 53 -26 -13 32 -35 -150 90 39 170 -14 24 116 -228 -16 135 51 36 265 161 102 29
3595B9J0l4J07J17m2j95k1J17q1J37q9J03j33N6k4Q6l02J76K3l74L29n8j57J12
$$ 29 39 5 112 229 187 -8 -29 88 7 144 55 158 25 81 57 143 -159 17 40 -334 -5 -63 -220 -108
3619a08J73j0J43k93j36k34K48J28J6N7p7j41PJ66J03J06k47r8N2L23Jk77K58
$$ -108 65 55 198 -95 -231 -465 -217 -89 -73 -16 -93 -234 -227 -61 42 148 -99 -197 -145 178 179 -98 160
3642A60q8l13M9qK33j24J23l01K17J96k96O7k0J74j39m0J65K43k27j19J17n0k9
$$ 160 72 -241 -192 -200 33 -91 32 -269 -52 144 -152 -85 -105 69 -70 -110 55 298 71 -48 69 19 -10
3665a0Q2L4m9J42o8J13k4o6j89K12o2l6O7J04k97Q4j78J13K65k92j4l7L35j44
$$ -10 72 106 57 199 131 244 220 154 -35 177 115 79 146 250 -47 37 -141 -28 237 -55 -69 -106 229 85
3689H5Rp6j22J20O0j6Kj91K28j11M1N1j53J15j08n4m1J52l0L4N0j25J15n3K1j11
$$ 85 94 18 -104 16 76 60 62 -129 99 -12 29 80 -73 42 -66 -120 -161 -9 -39 -5 45 -80 35 -18 3 -108
3715a08J44l1j20J71m4O0Rq0J20j42j01L86k60O2K34k18R0R7l88J32J42J84j93
$$ -108 36 5 -115 56 12 72 81 1 121 -21 -122 264 4 66 300 82 172 269 -119 13 155 339 146
3738A46j23R8q3M8j16J54m8j76J90Jm6J73l43K32m9j5J05k36J58k43N7K06j67
$$ 146 23 121 38 86 -30 124 76 -100 90 91 45 218 -125 107 58 43 148 -88 70 -173 -116 90 -77
3761g7j72L95k36J32j57q1LL37l0k48Pn7N8PK6J09l65K72N3Qj58M8j16J92j36
$$ -77 -249 146 -90 42 -115 -196 -193 144 114 -134 -127 -184 -126 -119 -93 16 -349 -77 -24 -16 -174 -126 -242 -50 -186
3786a86j22L08j08m8l44L51j46K48J14j66J32J90kl19J12KL9J5p6K39l33J31O8
$$ -186 -308 0 -108 -156 -500 -149 -295 -47 67 -99 33 223 221 -98 14 16 55 70 -6 233 -100 31 99
3809I9r4J67j34J52j9o9k13K21j4j73K67j14L7P1j55l1l4j7k0J09N6p9J43j38
$$ 99 5 172 38 190 171 102 -111 110 96 -77 190 76 113 184 29 -2 -36 -53 -73 36 92 13 156 18
3833A8K8j16J36N9k79k3L17m9j28k6J94p2k26O1j31K23j45k4K94l34j8L54j22
$$ 18 46 -70 66 125 -154 -177 140 91 -37 -63 131 59 -167 -106 -237 -14 -159 -183 111 -223 -241 113 -9
3856in3P4K9k35R6J75j46P5j02M28o80L79j31m0L46m00L68k43K2R4mj7J7j0J92
$$ -9 -62 12 41 -194 -98 77 -69 6 -96 332 -348 31 -100 -140 206 -194 174 -69 -47 47 43 26 43 33 225
3881B25j30k02K61J61l10L1J52k79J08q9K21K87k10L4j87j28J62j04qr1m9J79
$$ 225 95 -107 154 315 5 36 188 -91 17 -72 149 436 226 260 73 -55 107 3 -5 -96 -145 34
3903C4J1l41L45L5l0k74L56L5M5j38j09m2J44%k26j5N8RJ68j37r8O1J3K5j84K45
$$ 34 45 -296 49 84 54 -220 136 171 216 78 -31 -73 71 71 -155 -170 -112 -103 65 -72 -170 -109 -96 -71 -255 -10
3929a0k31j3k08M69k0O3j42J60m33L83kq4J03k01J28J93k76L15m11M08n34M20
$$ -10 -241 -254 -462 7 -13 50 -92 68 -365 18 16 -68 35 -166 -38 155 -121 194 -217 191 -343 77
3951G7J83k83PK17l4l87K94K05Jm8l3k29J92Nk31J32J64r9k42J71j45K50j84J27
$$ 77 260 -23 -16 201 167 -220 74 279 280 232 199 -30 162 167 -64 68 232 133 -109 62 -83 167 -17 110
3975A10k0j49J37k15n2M0K58O1j98L9P5j21p1K42l3m7n9r2pL8K8LP2j89n0J38
$$ 110 90 -59 78 -137 -189 -149 109 170 -28 11 86 -35 -106 136 103 56 -3 -95 -102 -64 -36 -33 39 -150 -200 -62
4001f2N3j13O8K41k54P9L50n62pJ63k1K83j55R0k82K78j23M5k11l4K05p5Q1%p8
$$ -62 -9 -122 -54 187 -67 12 362 -200 -207 -44 -65 218 63 153 -129 149 26 71 -140 -174 31 -44 37 37 -41
4026d1K66l93J48J51j77Q9o4J78j65K74k29k39J3K72J20l73J03j71K30J66j34
$$ -41 225 -168 -20 131 -46 43 -21 157 -8 266 37 -202 -189 83 203 -170 -67 -238 -8 158 24
4047B4J48J79l33m2J01L14l71j34J97j07L01k95n2J06j61L11p3j83J10m1q0J7
$$ 24 172 351 18 -24 77 391 20 -114 83 -24 277 -18 -70 36 -125 186 113 -70 40 -1 -81 -64
4069f4J89n59L39j7j1J76j30J02k00K29r7K9r0P1J4L3J68l10m4J04j27K15J81
$$ -64 125 -434 -95 -112 -123 53 -77 25 -175 54 -43 -14 -104 -33 -19 14 182 -128 -172 -68 -195 20 201
4092B01m29J56p1n4J66J70k73J51l20K60Q5q8J52k24J23r1K21j80k5O0J55p2L3
$$ 201 -228 -72 -143 -197 -31 139 -134 17 -303 -43 42 -46 106 -118 5 -86 135 -45 -70 -10 145 73 106
$$ [...]
8191g4
##END NTUPLES=NMR FID
##END=
