##TITLE=1H_SL82(17.08)-Dparf
 CDCl3, 8 sc, 
 27.8.2020
##JCAMPDX= 6.0         $$ Bruker NMR JCAMP-DX V2.0
##DATA TYPE= NMR FID
##DATA CLASS= NTUPLES
##ORIGIN= UXNMR, Bruker Analytische Messtechnik GmbH
##OWNER= root
$$ XWIN-NMR		Version 3.5
$$ Fri Aug 28 10:40:11 2020 Russian Standard Time (UT+4h)  she@DPX200
##.OBSERVE FREQUENCY= 200.1315066352
##.OBSERVE NUCLEUS= ^1H
##.DELAY= (6, 6)
##.ACQUISITION MODE= SIMULTANEOUS
##.ACQUISITION SCHEME= undefined
##.AVERAGES= 8
##.DIGITISER RES= 18
##SPECTROMETER/DATA SYSTEM= spect
##.PULSE SEQUENCE= zg30
##.SOLVENT NAME= CDCl3
##.SHIFT REFERENCE= (INTERNAL, CDCl3, 0, 15.7039)
##AUDIT TRAIL= $$ (NUMBER, WHEN, WHO, WHERE, WHAT)
$$ ##TITLE= Audit trail, XWIN-NMR		Version 3.5
$$ ##JCAMPDX= 5.01
$$ ##ORIGIN= Bruker BioSpin GmbH
$$ ##OWNER= she
$$ F:/spectra/data/she/nmr/H-F/1/audita.txt
$$ ##AUDIT TRAIL=  $$ (NUMBER, WHEN, WHO, WHERE, WHAT)
(   1,<2020-08-28 10:39:01.76 +0400>,<she>,<DPX200>,
      <created by zg, POWCHK disabled, PULCHK disabled
       configuration hash MD5:
       00 E9 B6 7A A2 85 ED C7 34 08 36 98 17 FE 4E 26
       data hash MD5: 16K
       DA C0 80 4F 0E 41 43 33 1A C3 C8 FA 4E FC 26 76>)
$$ ##END=
$$ 
$$ hash MD5
$$ CD B0 48 3B 7E 85 A6 33 E7 B7 1C 55 38 7A 6B C6
##$RELAX= 
##$RELAX= 
##$RELAX= 
##$RELAX= 
##$RELAX= 
##$RELAX= 
$$ Bruker specific parameters
$$ --------------------------
##$DU= <F:/spectra>
##$EXPNO= 1
##$NAME= <H-F>
##$PROCNO= 1
##$TYPE= <nmr>
##$USER= <she>
##$AMP= (0..31)
100 100 100 100 100 100 100 100 100 100 100 100 100 100 100 100 100 100 
100 100 100 100 100 100 100 100 100 100 100 100 100 100 
##$AQSEQ= 0
##$AQ_mod= 1
##$AUNM= <au_zg>
##$AUTOPOS= <>
##$BF1= 200.13
##$BF2= 200.13
##$BF3= 200.13
##$BF4= 200.13
##$BF5= 200.13
##$BF6= 200.13
##$BF7= 200.13
##$BF8= 200.13
##$BYTORDA= 1
##$CFDGTYP= 0
##$CFRGTYP= 5
##$CHEMSTR= <none>
##$CNST= (0..31)
1 1 145 1 1 1 1 1 1 1 1 1 1 1 1 1 1 1 1 1 1 1 1 1 1 1 1 1 1 1 1 1 
##$CPDPRG= <>
##$CPDPRG1= <>
##$CPDPRG2= <>
##$CPDPRG3= <>
##$CPDPRG4= <mlev>
##$CPDPRG5= <mlev>
##$CPDPRG6= <mlev>
##$CPDPRG7= <mlev>
##$CPDPRG8= <mlev>
##$CPDPRGB= <>
##$CPDPRGT= <>
##$D= (0..31)
0 1.2 0 0 0 0 0 0 0 0.06 0 0.03 0 0 0 0 0.0002 0 0 0 0 0 0 0 0 0 0 0 0 
0 0 0 
##$DATE= 1598596741
##$DBL= (0..7)
120 120 120 120 120 120 120 120 
##$DBP= (0..7)
150 150 150 150 150 150 150 150 
##$DBP07= 0
##$DBPNAM0= <>
##$DBPNAM1= <>
##$DBPNAM2= <>
##$DBPNAM3= <>
##$DBPNAM4= <>
##$DBPNAM5= <>
##$DBPNAM6= <>
##$DBPNAM7= <>
##$DBPOAL= (0..7)
0.5 0.5 0.5 0.5 0.5 0.5 0.5 0.5 
##$DBPOFFS= (0..7)
0 0 0 0 0 0 0 0 
##$DE= 6
##$DECBNUC= <off>
##$DECIM= 32
##$DECNUC= <off>
##$DECSTAT= 4
##$DIGMOD= 1
##$DIGTYP= 9
##$DL= (0..7)
0 120 120 120 120 120 120 120 
##$DP= (0..7)
150 150 150 150 150 150 150 150 
##$DP07= 0
##$DPNAME0= <>
##$DPNAME1= <>
##$DPNAME2= <>
##$DPNAME3= <>
##$DPNAME4= <>
##$DPNAME5= <>
##$DPNAME6= <>
##$DPNAME7= <>
##$DPOAL= (0..7)
0.5 0.5 0.5 0.5 0.5 0.5 0.5 0.5 
##$DPOFFS= (0..7)
0 0 0 0 0 0 0 0 
##$DQDMODE= 0
##$DR= 18
##$DS= 0
$$ [...]
##$SUBNAM2= <"">
##$SUBNAM3= <"">
##$SUBNAM4= <"">
##$SUBNAM5= <"">
##$SUBNAM6= <"">
##$SUBNAM7= <"">
##$SUBNAM8= <"">
##$SUBNAM9= <"">
##$SW= 16.880792210976
##$SWIBOX= (0..15)
0 0 2 0 0 0 0 0 0 0 0 0 0 0 0 0 
##$SW_h= 3378.37837837838
##$TD= 16384
##$TD0= 1
##$TE= 0
##$TE2= 300
##$TE3= 300
##$TEG= 300
##$TL= (0..7)
0 120 120 120 120 120 120 120 
##$TP= (0..7)
150 150 150 150 150 150 150 150 
##$TP07= 0
##$TPNAME0= <>
##$TPNAME1= <>
##$TPNAME2= <>
##$TPNAME3= <>
##$TPNAME4= <>
##$TPNAME5= <>
##$TPNAME6= <>
##$TPNAME7= <>
##$TPOAL= (0..7)
0.5 0.5 0.5 0.5 0.5 0.5 0.5 0.5 
##$TPOFFS= (0..7)
0 0 0 0 0 0 0 0 
##$TUNHIN= 0
##$TUNHOUT= 0
##$TUNXOUT= 0
##$USERA1= <user>
##$USERA2= <user>
##$USERA3= <user>
##$USERA4= <user>
##$USERA5= <user>
##$V9= 5
##$VALIST= <valist>
##$VCLIST= <CCCCCCCCCCCCCCC>
##$VD= 0
##$VDLIST= <DDDDDDDDDDDDDDD>
##$VPLIST= <PPPPPPPPPPPPPPP>
##$VTLIST= <TTTTTTTTTTTTTTT>
##$WBST= 1024
##$WBSW= 4
##$XGAIN= (0..3)
0 0 0 0 
##$XL= 0
##$YL= 0
##$YMAX_a= 308456
##$YMIN_a= -230733
##$ZGOPTNS= <>
##$ZL1= 120
##$ZL2= 120
##$ZL3= 120
##$ZL4= 120
##$ABSF1= 10
##$ABSF2= 0
##$ABSG= 5
##$ABSL= 3
##$ALPHA= 0
##$AQORDER= 0
##$ASSFAC= 0
##$ASSFACI= 0
##$ASSFACX= 0
##$ASSWID= 0
##$AUNMP= <proc_1d>
##$AZFE= 0.1
##$AZFW= 0.1
##$BCFW= 1
##$BC_mod= 2
##$BYTORDP= 1
##$COROFFS= 0
##$CY= 11.3945322036743
##$DATMOD= 1
##$DC= 2
##$DFILT= <>
##$DTYPP= 0
##$F1P= 16.9975609425685
##$F2P= -3.02152046262296
##$FCOR= 0.5
##$FTSIZE= 0
##$FT_mod= 4
##$GAMMA= 1
##$GB= 0.15
##$INTBC= 1
##$INTSCL= 1
##$ISEN= 128
##$LB= 0.24
##$LEV0= 0
##$LPBIN= 0
##$MAXI= 10000
##$MC2= 0
##$MEAN= 0
##$ME_mod= 0
##$MI= 1.114404
##$NCOEF= 0
##$NC_proc= 0
##$NLEV= 6
##$NOISF1= 3.799351
##$NOISF2= 2.8
##$NSP= 1
##$NTH_PI= 0
##$NZP= 0
##$OFFSET= 15.70392
##$PC= 1
##$PHC0= -9980.251
##$PHC1= 21.00092
##$PH_mod= 1
##$PKNL= yes
##$PPARMOD= 0
##$PSCAL= 0
##$PSIGN= 0
##$REVERSE= no
##$SF= 200.130013532006
##$SI= 16384
##$SIGF1= 3
##$SIGF2= 2
##$SINO= 400
##$SIOLD= 16384
##$SREGLST= <1H.CDCl3>
##$SSB= 0
##$STSI= 0
##$STSR= 0
##$SW_p= 3612.71676300578
##$SYMM= 0
##$S_DEV= 0
##$TDeff= 0
##$TDoff= 0
##$TI= <>
##$TILT= no
##$TM1= 0
##$TM2= 0
##$TOPLEV= 0
##$USERP1= <user>
##$USERP2= <user>
##$USERP3= <user>
##$USERP4= <user>
##$USERP5= <user>
##$WDW= 1
##$XDIM= 8192
##$YMAX_p= 0
##$YMIN_p= 0
$$ End of Bruker specific parameters
$$ ---------------------------------
##NTUPLES= NMR FID
##VAR_NAME=  TIME,          FID/REAL,        FID/IMAG
##SYMBOL=    X,             R,               I
##VAR_TYPE=  INDEPENDENT,   DEPENDENT,       DEPENDENT
##VAR_FORM=  AFFN,          ASDF,            ASDF
##VAR_DIM=   8192,          8192,            8192
##UNITS=     SECONDS,       ARBITRARY UNITS, ARBITRARY UNITS
##FACTOR=    0.000296,      1,               1
##FIRST=     0,             0,               0
##LAST=      2.424536,      0,               0
##MIN=       0,             -230733,         0
##MAX=       2.424536,      308456,          0
$$ Real data points
##PAGE= N=1
##DATA TABLE= (X++(R..R)), XYDATA
0 0 0 0 0 0 0 0 0 0 0 0 0 0 6 -8 8 -8 8 -16 16 -17 24 -30 32 -40 48 -56 64 -78 87 -102 118 -134 151 -173
34 -173 197 -222 246 -278 310 -348 388 -435 482 -532 592 -654 723 -798 880 -967 1066 -1174
52 -1174 1293 -1428 1573 -1739 1923 -2134 2375 -2654 2983 -3377 3857 -4457 5231 -6270 7742
67 7742 -9975 13735 -35552 308456 146084 -103348 149177 14608 -147616 -24907 53804
78 53804 -23102 -17135 31165 -8778 -20785 64693 -26076 -60507 52864 -22938 -47979 134549
90 134549 85251 -17557 3132 -98752 -114513 46474 42320 -13172 50559 56854 -19958 -3700
102 -3700 49093 -26285 -63132 38694 28509 -22512 13070 -35497 -51262 44014 7056 -34541
114 -34541 76598 64267 -62246 -21462 30563 -47727 -22920 49136 -32218 -67507 26916 35301
126 35301 -12279 16033 7137 -46938 13967 74444 -11863 -55762 -18170 -45048 -40795 26263
138 26263 31583 29225 31369 -23733 -35710 7137 2183 -2577 23223 -3394 -51494 -16553 45654
151 45654 13492 -32834 -12219 -9368 8646 64140 41923 -2698 -13985 -47932 -39785 6548
163 6548 9038 14594 34466 11863 -18874 1041 28473 9209 1212 6677 -32287 -24194 41409
176 41409 23601 -22614 -6179 -5252 -17261 12818 30195 13843 7590 9510 -3092 -16481 -16751
189 -16751 -18066 -9767 5494 -6465 -2877 28335 18449 2088 7303 -14772 -30013 -9813 -1714
202 -1714 -7791 1607 16416 5906 -13855 -17990 -22650 -11445 22259 30924 18924 5011 -21352
215 -21352 -29467 -19333 -20685 -9510 14173 15914 10287 15461 13906 -2661 -10285 -10770 -23998 -14633
229 -14633 21087 27722 13405 -527 -26579 -31336 -3873 20532 35183 34611 11830 -13385 -22069
242 -22069 -15145 -7988 2615 13533 1096 -6093 14164 17805 8647 9328 -4970 -17816 -2961
255 -2961 13441 11607 -332 -10372 -19912 -19632 6472 27369 21650 13191 -2153 -22316 -17855 -1372
269 -1372 4783 6279 430 -9996 -11262 -7482 -3676 1667 4569 7391 12829 9990 -2312 -12505
283 -12505 -20101 -27685 -20412 2313 17300 20143 16825 1844 -16442 -15926 -7200 -6692 3881 16035
297 16035 7677 2505 -2680 -25113 -26331 -2182 13619 24851 28273 14880 -947 -13618 -18535
310 -18535 -16227 -8366 5316 10533 10203 16178 11156 3422 756 -12154 -14670 334 15166 28358
324 28358 15420 -18074 -23222 -16226 -8845 16894 27815 12437 4070 1181 -6317 -8776 -655 2097
338 2097 -9373 -11671 -4597 -1056 14387 23735 45 -18009 -12759 -2642 10450 11351 -6455 -16132
352 -16132 -11005 -6716 -862 7764 5586 -3735 -4046 -2759 -4176 2837 11517 5604 -11489 -22613 -15297
367 -15297 -279 8602 8115 2980 2571 4382 4325 3352 -8166 -15882 -2474 5734 2539 5257 2018
382 2018 -1173 4990 1085 -6110 -1599 10326 16083 4049 -3486 -705 -6802 -4900 33 -6484 4743
397 4743 21351 13877 2534 -6581 -11607 1610 12551 4322 -8169 -10936 -762 5427 6297 8549
411 8549 -847 -5185 656 -4768 -2747 9263 5329 -2949 -8096 -14089 -4941 10765 9152 -4113
425 -4113 -14934 -12144 5621 21268 14336 -10074 -21341 -16815 -10921 1855 12969 6998 3738
438 3738 3242 -9599 -14567 -1924 5217 1754 -1185 -4784 -1813 12617 10223 -12428 -20105 -10658
452 -10658 2418 20648 22756 3410 -6613 -5252 -8198 -9431 -1863 4723 8910 14616 9415 -5228
466 -5228 -4948 565 -4012 -1414 4836 5187 12790 11138 -6076 -13812 -7647 2933 10122 6866 -291
481 -291 -992 6546 8376 -2367 -9873 -11112 -4440 11204 11096 -2512 -2849 -2448 -8237 -1854 5305 2611
497 2611 2875 920 -11692 -15725 1636 13264 5317 -3436 -11164 -14691 1980 13415 2074 -6467
511 -6467 -6825 -5175 3834 7298 -2380 -9513 -6365 -3859 -2392 8574 13731 4248 -2562 -11566 -18886
526 -18886 -2299 15649 12693 5105 -3355 -9285 -406 6398 -448 -4889 24 4516 7914 11265
540 11265 1990 -8809 -1875 -177 -7847 3770 13902 6039 5758 2581 -12140 -8433 6085 5040
554 5040 537 3813 3418 1347 3269 -2754 -11000 -1604 7303 2442 2654 -627 -9161 499 8464 -3157
570 -3157 -4734 523 -5397 -4063 4750 -216 -3314 3086 -2299 -9729 -2147 3118 1073 1898 -3110
585 -3110 -10917 -1682 9850 3166 -2467 -4776 -13569 -7310 9935 8470 3172 5454 -3035 -11284 -4905
600 -4905 197 2144 6014 4607 -1770 -3393 1980 3901 616 -1861 -4078 -430 9658 8846 3636
615 3636 831 -8912 -9132 1339 3518 6752 11555 5238 -1230 -4262 -4006 170 1565 2180 2080 -949
631 -949 1518 3201 -617 -762 -2715 -2230 3972 2540 1328 2705 -3416 -5227 -2778 -3781 -817 1590
647 1590 1168 1441 -1472 -1298 329 -2515 -1998 -919 -3425 -2239 -2541 -4154 -1103 1568 2758 2308 -1516
664 -1516 -3633 -3120 -2177 948 1534 117 -47 -2808 -4532 -672 1708 2506 2971 -256 -319 3704 4225
681 4225 1615 -3138 -7525 -5152 1636 7105 9124 5847 -12 -3266 -3850 -253 4386 6368 4349
696 4349 -1366 -5230 -2660 1125 4364 5279 -1103 -3378 2657 5899 5330 1870 -4231 -6532 -4370 -159
712 -159 2716 1802 1662 1589 -2914 -4074 1156 4200 2449 -1098 -5233 -7854 -4284 3100 2487 -3591 -1797
729 -1797 1193 -1402 14 229 -3164 381 2926 -947 -4243 -4580 -4123 -1772 876 79 -180 4530
745 4530 5606 -17 -1535 -3211 -5407 -1397 1437 -1890 783 6631 4958 -767 -4932 -4467 2522
760 2522 9108 8290 1964 -3275 -5674 -3004 419 -1210 -768 6700 7740 2162 2502 3412 -1307 -2114
776 -2114 -1098 -5170 -3400 7402 8751 -975 -5883 -4979 -1636 5322 8820 3071 -2258 -2143 -2868 -4183
792 -4183 -3954 -3103 -1613 2429 2407 -1324 1941 4890 -413 -3852 -4299 -6262 -1628 6153 1324 -9472
808 -9472 -7774 52 2146 3583 4747 276 -2236 816 -1803 -6236 -4004 -213 1702 1023 -3628
823 -3628 -1865 5362 4575 389 834 214 -396 3693 1958 -6781 -6153 2131 2168 402 3894 3225 3321 7948
841 7948 3387 -6094 -5099 -20 1983 3219 115 -3194 477 2907 -428 1077 6031 3773 1725
856 1725 2015 -4496 -8028 415 4619 -2998 -6855 -991 4234 6578 6749 435 -5990 -4259 -1509 -1493
872 -1493 -1755 -1462 -434 -1314 -3783 -2805 1010 3438 4385 1194 -3809 -4848 379 3446 -3170 -9334
888 -9334 -5371 86 1698 4601 4786 1006 154 481 -1387 -3311 -3400 -4 1895 -322 -3047 -1636
904 -1636 4136 4294 2 607 3136 2868 3809 1896 -5040 -5598 -200 572 -154 3069 3862 3067 6008
921 6008 3938 -3114 -4392 1566 2878 -624 -1735 -420 -199 -219 -730 387 3665 3809 3023 2808 -2278
938 -2278 -5878 -758 -387 -4742 -4062 -794 2803 4836 2398 -1897 -3563 -1661 262 36 467 -903
954 -903 -3956 -3803 -4350 -4282 1983 4372 2239 2791 -389 -3558 48 828 -4264 -6333 -2419 1758 1670
971 1670 2162 2566 -1439 -2160 2120 2121 2563 3464 567 -2074 -4145 -5186 -1816 2992 4580 3603 2490
988 2490 3256 2125 994 436 -2730 -2323 1591 834 79 1924 82 -1201 1060 2464 1885 2975 4705
1005 4705 1540 -2494 -3410 -4419 -3686 -43 568 1951 4767 2225 -353 -500 -1826 -2152 311 403 -2361
1022 -2361 -2670 -1415 -2404 -1995 472 -79 181 3426 1924 383 425 -2988 -5966 -4937 -3486 -743 3342
1039 3342 3329 -17 -830 402 -685 223 2647 -27 -1773 -71 -1823 -3328 -197 590 -346 1612
1055 1612 3926 4127 3729 3349 -1382 -5070 -3171 -1050 399 2776 2259 555 955 1347 1176 1508 2702
1072 2702 2286 684 -5 -1494 -2908 -1056 -744 -1928 764 3377 4499 4790 1219 -2751 -2591 -2423
1088 -2423 -2664 -1368 -551 -601 591 1050 -1185 -2376 1437 1783 679 1454 -790 -3403 -1515 -2882 -5816
1105 -5816 -2466 1307 1176 2661 3036 -405 -1029 1430 -1532 -4656 -2208 -711 -62 1833 -314 -3553
1121 -3553 -574 2265 2011 2772 3098 192 -149 -538 -3996 -3766 653 1305 1740 2645 -84 1936 6082
1138 6082 1445 -3125 -716 257 261 2108 455 -3159 -1323 2005 547 1911 4706 2205 1304 2901
1154 2901 -3271 -6023 382 1361 -1876 -677 596 282 2716 2626 -1954 -2255 946 931 -345 497 -2579
1171 -2579 -4852 -1037 -69 -3101 -369 3278 3453 1786 -1540 -3986 -2016 -402 -2591 -2751 -351 541
1187 541 692 1683 -945 -2909 268 2635 1062 220 -566 -939 740 99 -5132 -3706 2789 3462 2154
1204 2154 3843 1652 -1277 581 -346 -3742 -943 2372 1495 1522 1150 -2415 -284 5063 1803 -2331
1220 -2331 1499 3349 1295 1370 -1844 -4827 -1750 826 541 2144 3236 1310 1617 977 -3380 -3918
1236 -3918 1204 2126 -732 -948 -2094 -1289 2219 218 -2871 -184 1798 562 1129 -67 -4548 -3494
1252 -3494 -298 -1848 -2085 601 1398 1674 1690 -2358 -3631 1070 1776 -1056 -1485 -777 -1181 -357 171 -1904
1270 -1904 -786 2627 2960 1885 898 -1914 -1330 892 -638 -2017 -133 2234 2166 1078 -657 -1046
1286 -1046 1059 2308 1677 935 966 439 -36 -1007 -2746 -1858 2092 4027 3356 1086 -323 -156 306 -1093
1304 -1093 -2188 -990 1285 1939 899 -547 -1658 -1560 259 332 173 1260 1386 934 -1685 -4371 -4323
1321 -4323 -1123 1294 1137 623 818 553 -274 -795 -2554 -2869 -430 797 -70 -103 -385 -1004 -789 -1082
1339 -1082 -1197 -48 2314 2840 526 -1705 -2166 -1376 -452 -212 -5 955 1634 1697 1189 -493 -948 574
1357 574 440 -49 363 126 240 1354 529 -611 506 1717 1473 1253 1183 12 -151 625 -630 -1411
1375 -1411 329 733 559 1142 644 -137 960 971 -409 -931 -958 -959 -289 -225 -616 14 308 -645 -6 -35 -838
1396 -838 206 428 -1453 -1472 -452 -801 -852 33 -702 -1314 42 351 -690 -34 282 -1175 -697 -193 -1531
1415 -1531 -590 312 -828 120 914 700 485 588 -551 -702 -247 93 338 1000 1629 160 -284 -1 -850
1434 -850 391 1453 412 1478 1529 299 62 -500 -1188 -503 1228 1761 1287 1441 896 -706 -959 -655
1452 -655 -1411 192 2645 1310 353 -62 -1203 -1623 -487 -391 -90 1257 1653 390 -696 -1397 -2257 -1339
1470 -1339 -127 -283 180 1795 452 -1009 -1537 -2208 -2030 164 1248 -110 92 418 -1051 -1447 -915
1487 -915 -1695 -270 2234 984 -506 -312 -358 -709 142 -72 -1040 699 2003 303 -256 438 -733 236
1505 236 1499 6 -516 1482 1132 -184 66 -86 60 2037 1688 -916 -752 553 -42 724 1437 -514
1523 -514 41 1683 171 -1508 -295 -44 496 1729 255 -1072 -123 562 -1247 -1058 -45 -138 1039
1540 1039 1635 -1000 -2495 -783 -717 -695 -32 -188 109 1345 816 -1882 -2425 -923 -361 -4 422 -755
1558 -755 -118 1339 -562 -2122 -935 -11 562 1483 300 -931 -232 946 -571 -1421 -445 10 1545
1575 1545 1969 369 -922 583 1100 -49 -217 -705 -290 1461 1569 -428 -386 1399 929 243 -9 -523
1593 -523 448 2297 1278 -990 -520 -181 -205 676 -305 -856 945 2415 1140 -543 -769 -1441 -804 195
1611 195 -815 -961 1227 1360 -198 -810 -1972 -1475 891 851 -936 -636 235 -609 -789 -1475 -2267 -842
1629 -842 1622 857 -325 -25 -210 -487 -264 -1857 -1943 285 1575 325 -89 -315 -428 635 605 -721
1647 -721 -327 1040 816 171 -538 -749 -12 1485 1056 -56 630 1111 1334 1262 -1 -673 337 725 -435
1666 -435 -553 -200 633 1378 1700 229 -394 708 234 -467 -996 -962 149 1180 779 -777 -960 -173 349
1685 349 270 -6 36 634 617 -590 -2061 -2186 -643 -83 203 353 243 592 423 -526 -1885 -1930 -452 211
1705 211 198 -545 -771 -213 -131 -322 -498 59 655 1350 681 -746 -1188 -874 -524 -301 -143 -86 916 1566
1725 1566 884 -90 -242 529 531 416 -317 -695 118 975 270 498 901 384 1105 853 -607 -83 720 456
1745 456 80 365 -507 -511 144 42 -161 1223 1509 914 516 -625 -1779 -1299 -741 -1019 -39 784 594 325
1765 325 419 -1347 -1373 -20 -97 -340 497 -372 -1108 -1088 -1605 -1716 -290 967 1004 1501 874 -676 -1077 -846
1785 -846 -1849 -1340 243 268 687 1157 44 -498 11 107 -173 651 647 219 -161 -335 -1283 -602 496 535
1805 535 1010 1655 1092 385 287 -249 -205 284 -275 -229 193 355 279 795 718 823 1148 749 102 -202 -556 -851
1827 -851 -505 10 30 208 340 642 -88 68 378 117 409 -110 -860 -1030 -1141 -1191 -1002 -317 670 726 1084
1848 1084 529 -837 -1020 -1174 -1199 -782 -561 -163 356 329 -545 -553 -122 389 788 577 127 -313 -371 -842 -1555
1869 -1555 -963 -194 598 1676 1430 544 1023 849 -368 -794 -420 -601 246 612 491 -148 792 983 494
1888 494 466 457 79 848 771 -1074 -676 -165 -239 -189 206 -8 880 1774 998 -3 -60 -606 -928 -534 -1129 -1126
1910 -1126 657 821 550 139 -391 -797 -168 132 -887 -1046 468 -222 -893 -1416 -1650 -940 489 1162
1928 1162 403 872 421 -421 -720 -1693 -2153 -704 808 658 165 319 54 387 30 -10 -369 882 852
1947 852 233 -665 -1224 -500 618 775 500 506 1134 1446 351 -435 -645 -410 619 654 -316 -88 122 521
1967 521 840 498 842 1119 1135 247 -1044 -1103 -530 -237 287 274 116 441 858 -214 -650 -499 -136 961
1987 961 650 -386 -1622 -1232 -779 -882 -486 363 1061 1572 712 -1404 -1555 -1299 -1177 -248 -240 -118 404 1019
2007 1019 -135 -1272 -1154 -68 948 976 530 -843 -173 -327 -1369 -1160 -308 687 1738 1695 778 10
2025 10 -31 -280 -470 -392 -282 554 1438 381 -506 -420 174 591 914 784 596 525 411 -299 -992 -726 -399
2046 -399 627 1074 363 99 694 670 -84 -913 -700 -336 -5 -236 -905 -656 41 469 369 -286 -75 232
2066 232 337 -254 -786 -1011 -630 -246 -438 -952 -743 112 420 179 132 -379 -21 -87 -457 -935 -1199 -554 358
2087 358 438 263 -33 448 989 440 -276 -376 31 71 -201 -303 -307 138 505 328 151 560 866 734 736 178
2109 178 -590 -95 -51 -205 -543 -161 859 1082 1155 828 289 241 69 -388 -457 -575 -324 433 288 -123 -125 131
2131 131 73 115 -155 94 522 319 -839 -1324 -1150 -934 -318 437 512 681 835 196 -580 -1265 -1338 -1022 -55
2152 -55 75 107 263 -248 -637 -465 -476 -147 648 1046 123 -353 -703 -1426 -813 -290 85 634 1469 1218 517
2173 517 88 -552 -723 -184 429 205 601 442 66 -229 -6 -16 350 1049 645 591 299 -389 -690 -191 -268
2194 -268 -53 963 683 379 739 122 9 -132 46 -21 -4 -124 -341 -469 -330 -172 -97 688 491 164 31
2215 31 -550 -1101 -801 -622 -491 226 38 -459 -407 -380 -385 -59 234 310 347 -272 -867 -958 -415 -547 -66 180 728
2238 728 686 733 123 -197 -583 -304 112 5 163 496 144 -179 -166 -497 345 860 917 578 669 1 -129 -101
2260 -101 -376 -404 414 819 793 825 214 -187 192 49 -329 94 365 219 247 226 -286 -506 269 2 -150 291
2282 291 241 28 292 -477 -1143 -568 -37 -336 -173 105 -179 552 284 -570 -500 -247 -357 206 106 -346 -325
2303 -325 303 -28 -836 -492 116 157 475 330 -470 -156 129 -408 -481 -277 -117 599 856 131 -244 18 261
2324 261 164 11 -42 149 601 426 -357 -100 326 443 390 431 -13 154 540 -77 -160 -413 -18 633 625 153
2346 153 -271 107 337 135 -18 224 176 305 -35 -538 -694 127 343 296 171 -201 -24 65 -118 -887 -896 0
2368 0 352 308 -349 -713 -488 -176 -226 -479 -54 371 234 300 -435 -980 -574 -1 181 -2 719 428 320 -41
2390 -41 -931 -808 202 736 387 315 -48 -153 106 90 -219 11 970 719 674 546 -776 -401 281 -40 275
2411 275 593 602 813 317 -336 -714 -126 387 316 401 1 -82 332 109 -587 -151 142 285 489 -112 -368 -135
2433 -135 -163 -502 -498 -280 -110 -27 216 -696 -617 -6 142 -270 -272 -477 -367 291 -213 -683 -383 -155 88 -88
2455 -88 -207 -134 -434 292 183 -502 -40 287 54 369 -351 -602 242 350 236 196 -9 -11 320 98 -116 -37
2477 -37 447 283 -2 402 124 98 335 -9 -147 339 137 445 222 -84 58 -56 162 71 -403 88 15
2498 15 312 115 -61 -426 -99 94 -246 193 -280 -220 92 150 -322 -580 -297 -160 -439 -222 -40 8 130
2519 130 217 -584 -642 -82 -343 -205 -13 -167 32 193 23 -584 -256 91 19 449 222 -289 104 -161 -291
2540 -291 -234 235 419 434 441 117 -209 30 25 74 561 357 280 389 425 -280 165 467 -27 546 589 349 72
2563 72 273 -196 -407 194 183 89 428 169 -162 -47 135 -335 40 -235 61 200 -251 -524 -398 -119 62
2584 62 -81 239 -142 -67 121 -553 -663 -122 -356 -391 63 -37 -244 -137 -292 -389 -38 133 -144 -209 68 -377
2606 -377 -479 -270 -331 147 510 286 84 -28 -58 -367 -42 -106 -64 292 235 249 -88 193 104 237 418 526
2628 526 208 10 174 -73 -339 239 128 401 661 291 215 266 268 212 118 -106 -75 200 227 -167 -248 72 -144
2651 -144 406 209 18 225 109 -214 -457 -536 -506 -109 -81 -150 -357 87 408 -54 -141 -258 -514 -189 42 -694
2673 -694 -232 21 -65 16 237 -289 -135 229 169 -202 -17 -97 -266 38 -170 -572 95 432 215 416 292
2694 292 -93 447 351 -88 -401 174 -47 35 616 314 256 522 723 -23 63 334 235 258 -231 -525 -10 232
2716 232 225 19 390 280 144 502 69 -637 18 -156 -174 -45 -241 -322 100 339 -20 -200 92 65 74 -346
2738 -346 -445 -555 -172 -157 -278 -273 -87 102 300 -52 -341 54 287 54 -419 -440 -234 -59 -50 -166 -271 167
2760 167 457 43 73 19 -210 197 182 -331 -414 359 330 28 73 -347 275 627 382 30 -37 65 -33 248 246
2783 246 -76 -39 451 318 378 351 122 148 412 -500 -247 99 206 -138 81 -170 -27 157 248 -110 -322 92
2805 92 -271 -116 -71 -676 -447 143 21 -357 -213 -116 -64 -12 -212 -675 -37 -94 -547 -647 -582 -281 33 207
2827 207 -180 -157 218 202 7 -12 -268 -198 354 81 -196 81 283 431 410 342 -205 122 366 -220 -203 45
2849 45 -69 292 290 -1 75 239 414 385 343 168 33 151 96 -83 -163 66 90 43 487 143 373 452 -123 -354
2873 -354 -245 -261 -40 134 -241 -443 -207 458 34 -66 215 -58 -123 28 -632 -553 -127 -398 -226 -128 -16
2894 -16 -144 106 240 16 -298 -65 -108 -380 -91 -453 -470 254 48 -261 301 300 120 472 135 -614 -65 98
2916 98 -239 -249 338 82 308 644 317 31 340 330 -124 152 112 -19 99 -94 -6 342 501 399 450 706
2938 706 -36 -99 39 -283 -330 306 -6 -193 580 13 -113 304 132 -144 -9 85 -141 -224 -242 -435 -537 -62
2960 -62 -175 -63 280 -53 68 49 -166 -200 -60 -207 -258 -132 96 -358 -25 121 -235 137 374 126 -90
2981 -90 128 -175 -121 88 -217 52 506 345 243 276 429 126 58 -16 -100 -25 182 -155 123 154 56 118 446
3004 446 344 362 245 284 -2 -119 -160 -136 -81 293 -95 215 541 147 149 162 -236 -60 254 293 -321 -73 -200
3027 -200 -166 -159 -87 -355 131 349 -57 -289 -368 -416 -358 -115 -125 -203 86 143 -436 -22 -144 -229 291 319 -120 -409
3051 -409 -120 -266 -262 -240 -302 -86 287 247 210 152 -160 -328 96 -19 -199 112 254 35 -146 35 72 251 423
3074 423 114 -11 230 -116 -24 -109 -225 -127 269 635 -139 269 288 46 51 123 -303 -4 381 -56 -195 79
3096 79 -3 -64 128 -88 -209 425 286 -382 -223 -485 -637 7 371 -27 -276 -12 -173 -99 10 -347 -289 100
3118 100 -42 -498 -167 -228 -265 -52 223 -330 200 384 85 -103 -304 -374 -135 30 -53 -254 -109 274 290 219
3140 219 -69 69 362 288 -49 -207 169 47 -115 -150 -182 66 639 434 -23 19 -55 -156 -162 -178 -319 -31 348
3163 348 386 101 48 -203 -23 199 -22 -147 110 105 -101 -494 -436 -343 12 324 -144 62 162 -186 -75 -194
3185 -194 -471 -424 -7 -17 -314 -224 -206 -283 -262 -221 -355 -54 85 -233 -265 -340 -315 -103 132 -96 -33 385 222 -122
3209 -122 143 44 -50 451 175 -78 55 415 -23 89 272 -85 397 547 305 210 101 -64 273 228 -108
3230 -108 22 437 242 12 58 -132 -196 348 380 -51 -93 -17 -68 16 -201 -95 113 288 64 -147 65 -452
3252 -452 -357 -88 -29 -253 -315 181 71 -300 -345 -296 -64 160 38 -409 16 53 -303 -138 -149 -73 195 280 -43
3275 -43 -16 -137 -127 46 -199 -129 -370 241 31 64 -52 100 -271 39 -110 -231 269 172 96 8 112 82 146
3298 146 185 97 265 239 345 21 50 31 -99 -94 64 2 264 239 64 -159 144 144 -182 250 -11 128 84 -83
3322 -83 -171 47 47 -57 209 61 -145 19 47 30 29 118 -287 -383 252 -203 -110 -75 -589 -127 30 -40 -79 -104 48
3347 48 -164 -21 7 118 -86 83 -117 -84 179 -72 -248 161 236 11 286 -57 -115 128 -20 -25 148 69 -10
3370 -10 360 2 309 296 169 72 -103 87 442 356 244 24 -270 73 -68 -64 263 312 68 80 -133 -151 -316
3393 -316 59 -73 106 161 124 -220 -137 -307 -457 126 206 65 152 80 15 -422 -209 -308 -18 98 58 -55 125
3416 125 -76 -145 -301 -33 93 31 -81 4 90 -118 12 -234 86 76 128 209 -36 -136 130 -72 -218 189
3438 189 222 4 196 83 27 -125 81 327 52 281 107 -9 199 157 -183 333 193 238 267 172 49 330
3460 330 323 -76 188 26 136 42 91 -185 -207 425 48 -221 102 23 -140 51 -126 -80 -219 -230 -218 -143 -21
3483 -21 -88 272 252 -151 -355 161 -3 -357 149 -273 -321 66 -176 -199 166 -127 71 -70 136 -349 -194 -49
3505 -49 13 -206 -37 274 114 317 -133 -47 63 -64 131 -61 74 -100 193 131 -56 101 196 137 236 430
3527 430 187 205 245 177 -112 -50 86 243 290 290 -2 -106 191 174 -13 51 -43 -28 101 6 -122 169 93 110 114
3552 114 123 -87 13 21 -190 -386 -194 -82 -250 -23 -117 -69 -82 -226 -239 -43 -250 -161 130 244 32 -197 -8
3575 -8 52 -5 47 96 148 404 -184 -86 -132 57 -349 90 -145 -171 334 244 166 38 306 -20 406 122 -58 23
3599 23 256 27 -33 138 88 203 111 266 -45 23 221 -111 -23 197 -179 33 72 -81 -42 305 373 91 464
3622 464 -270 -163 -47 -298 0 297 -92 98 -53 -37 -262 25 -233 -101 -63 21 -258 -390 85 -285 -205
3643 -205 213 -193 43 360 21 -21 -62 -80 -208 -195 -119 -132 150 199 -160 -150 143 168 170 99 77 107 -58 317 -42
3668 -42 124 31 73 62 27 106 146 365 4 -86 -18 -49 -275 182 -8 110 179 363 283 169 67 313 -16 -58
3692 -58 -168 127 187 -38 39 -108 215 185 446 49 24 -181 -84 -265 33 -26 -299 -136 -87 -214 -26 -138 -176
3715 -176 -209 -6 -410 -31 -16 -236 -490 -29 89 -60 75 148 -180 -76 232 -7 -80 167 -14 87 12 -180
3737 -180 -197 138 172 150 323 260 57 266 227 -14 112 7 -405 4 4 -226 182 221 36 58 245 -86 -196
3760 -196 67 -121 109 201 -2 -94 164 198 83 359 371 -186 -211 -232 -181 17 70 -49 -52 -124 166 -140 23 10
3784 10 -315 -61 -26 -261 -5 -135 -238 -279 -117 -119 57 -62 -151 -52 -8 67 -297 -259 123 89 -16 278 -76 132
3808 132 107 56 -41 172 51 213 92 102 3 21 215 -36 124 130 298 301 -116 -17 245 182 -111 28 2 60 91
3833 91 176 165 131 35 252 -121 34 -20 -31 -36 -253 -475 -385 -25 -134 -38 54 156 57 141 96 -147 -182 -107 -252 -236
3859 -236 178 37 -244 43 42 56 13 6 71 31 -144 -78 144 -71 -51 233 119 118 124 344 -45 154 -112 110 -331
3884 -331 -80 234 -12 156 76 -7 307 39 42 127 -95 83 293 156 -259 136 159 -115 168 230 126 90 51
3907 51 90 -81 -94 -106 -159 95 110 234 46 221 -131 60 22 -203 257 37 -100 -391 -58 189 -162 90
3929 90 7 -130 -126 175 187 119 -96 -224 -135 -423 -262 -89 64 79 -21 115 390 -51 -102 -188 15 -319 -85
3952 -85 111 230 153 -121 85 178 -42 82 154 -129 -192 34 21 85 -114 -45 -186 4 82 -4 121 317 122
3975 122 175 156 -60 -30 61 27 122 22 -5 40 242 222 8 166 16 -197 147 87 -409 -58 -6 -30 53 -133
3999 -133 14 -13 60 -190 -299 -6 -362 -93 261 -121 -254 125 62 45 3 -26 -222 63 117 -188 -504 -85
4021 -85 -40 -155 -82 -134 -233 171 -6 31 -65 -177 -241 -117 -111 -131 -12 153 104 212 49 97 209 168 259 -196 49
4046 49 -9 -96 12 69 181 -163 281 192 157 70 36 52 -15 -49 97 324 204 65 -14 166 43 354 52 22
4070 22 115 191 -214 -195 -31 -147 28 218 235 -86 -122 -52 -79 -34 -18 -101 -185 175 -167 -275 -40 29 -28 110 235
4095 235 52 23 -199 -143 -150 -82 175 242 150 163 -3 265 -111 72 300 197 49 318 14 -159 -12 92 6
4118 6 207 90 -103 246 27 81 187 102 -191 -95 219 -135 60 86 -101 217 361 -96 9 58 -9 -137 -16
4141 -16 -114 -433 53 283 -198 112 132 37 -99 -11 -115 -132 89 -6 -62 339 47 -216 210 -284 -129 111 -233
4164 -233 -43 7 153 -659 8 189 -162 350 14 -152 -288 -83 8 148 -12 157 -154 -50 -163 -49 97
4185 97 7 -71 -1 -29 113 150 13 245 45 99 126 14 169 143 13 177 135 -47 132 157 42 60 205 -75
4209 -75 -170 -15 -113 56 51 90 -34 258 -130 -10 21 86 76 -219 -34 90 -53 86 -115 -382 -157 95 139
4232 139 -129 68 -21 -20 -181 -171 -4 285 -334 -243 37 114 -158 13 -272 -68 -34 188 -27 87 -227 50
4254 50 -142 -159 -68 -193 89 322 82 -7 -143 -116 16 -2 -88 183 -117 85 315 24 129 132 146 -86 150
4277 150 295 -45 47 237 -80 68 245 83 106 137 -41 -64 -86 15 -302 144 296 256 -168 -264 -37 -33 -177
4300 -177 -34 -102 139 -133 -2 55 -260 -12 -65 30 76 153 -83 -212 128 11 -16 -15 226 -117 41 -61 -57 -76
4324 -76 151 -62 -7 39 -17 68 -49 -38 -111 -117 220 79 174 429 43 -2 41 59 -48 70 -95 -1 -60 0 -36 -22
4350 -22 93 69 0 127 213 106 8 48 128 9 5 -38 -169 139 -100 59 10 -66 166 -31 -109 -2 201 13
4374 13 -258 84 -117 -238 -49 -66 108 -47 -215 -122 28 -86 -143 -179 86 -42 -58 106 -51 -286 154 -150
4396 -150 -315 85 -137 -100 -6 -20 -98 -120 5 139 -158 121 -18 -235 106 79 -13 -87 1 211 11 -292 212
4419 212 22 24 -165 90 173 80 -63 124 71 102 102 -74 -71 24 97 9 174 105 -297 108 118 -70 -75 111 49 119
4445 119 134 -46 -81 132 -62 -28 -6 -185 -31 53 -35 -169 138 52 92 -50 -26 -181 -138 265 -34 -42 185 -81
4469 -81 -49 -136 -45 -90 -89 -91 84 -36 134 -173 -1 11 45 18 198 2 132 244 144 112 4 331 230 91
4493 91 284 20 50 198 -186 -87 66 244 -11 100 157 -44 234 -215 328 201 112 -263 -94 -165 -235 -109
4515 -109 262 -3 92 149 -26 -97 -158 128 -9 170 -53 -171 -159 20 65 -61 -40 -269 -154 59 -53 49
4537 49 -135 -189 -37 -348 -143 31 114 -145 31 322 -120 332 -86 -57 117 178 -31 41 -2 8 -9 -79 -79 13
4561 13 5 -84 76 -4 -83 -105 -147 -178 13 -9 79 77 -22 80 177 -57 205 -82 124 136 398 12 -45 8 16 186 145
4588 145 218 139 51 37 40 44 -76 173 -45 -178 -322 -92 4 -186 82 -32 -240 194 107 -4 -147 -123 -357 -44
4612 -44 -261 198 48 -135 -186 -34 -208 30 -57 14 -123 -106 -158 94 -59 -257 316 -42 -138 178 267 -50 -13
4635 -13 -7 -235 26 97 124 46 43 -91 38 188 266 78 102 172 111 154 67 -15 -151 125 226 186 63 -11 -72 206
4661 206 -2 0 97 -120 50 35 91 -186 10 -18 -334 69 223 -204 69 -77 -47 -3 -58 -71 -71 178 14 104
4685 104 -63 0 -165 -35 -165 1 59 55 -103 -53 48 -152 -9 -50 -36 -38 236 -124 -223 193 74 79 119 11
4709 11 -105 209 217 212 -171 -152 101 -25 -134 42 120 92 -74 302 -45 45 -69 114 86 58 -53 -44 129 -6
4733 -6 -130 85 -254 211 28 -138 -34 144 158 81 35 -204 49 234 -20 -78 -1 287 64 39 -29 157 -302
4756 -302 -128 144 2 -117 -234 -69 -119 -100 -205 85 -350 146 7 -65 47 91 -36 60 106 24 39 -144 -15
4779 -15 -50 81 130 -140 55 203 -12 24 -120 -50 81 26 -32 29 129 125 111 -66 131 54 116 103 -48 74 32
4804 32 -65 270 -206 73 175 38 65 -69 -135 41 -70 -58 -42 32 185 48 140 -250 -113 -93 36 -60 -34 61
4828 61 -68 -156 156 165 -117 -186 -42 -90 -211 -113 -50 -197 -231 10 -16 20 85 127 43 11 58 124 65 46 189 62
4854 62 -5 -266 24 -56 -171 181 24 29 55 -136 -76 15 62 204 48 -58 152 245 139 40 117 149 143 75 59 82
4880 82 86 73 101 -82 6 -269 -57 139 68 -20 84 45 -124 -310 5 117 -42 55 -196 -195 -28 216 59 -124
4904 -124 310 -164 -11 72 93 -374 -111 31 -175 13 30 -182 -22 -1 107 -64 -23 118 230 45 42 159
4926 159 -3 149 61 81 2 -82 55 -104 120 12 72 114 108 -104 188 -102 -100 144 89 33 67 -60 -95 412 -184
4951 -184 65 121 -28 199 160 -38 337 -56 -254 109 -122 -39 87 276 49 54 155 -227 51 114 107 -133 -99
4974 -99 -35 -202 89 169 91 -87 44 -6 -22 -35 -66 -96 -67 -113 67 3 17 105 -197 61 -292 -158 282 160 97
4999 97 224 1 -58 11 73 -249 -176 255 76 100 40 -109 -23 41 -103 -10 36 152 -200 71 218 213 50 102 -173
5024 -173 160 -110 -211 247 359 184 -61 115 250 -4 -91 114 83 -79 -58 52 54 -78 192 -28 -427 -132
5046 -132 -250 116 64 -69 74 -16 47 15 4 -342 -25 -6 -157 88 190 -92 -50 -104 -19 111 -188 -118 -56 -84
5070 -84 -165 46 104 60 131 25 -89 -144 56 73 60 86 -10 -31 38 -23 -186 161 303 -96 -133 -43 24 2 189 -195
5096 -195 -13 69 -2 -166 131 208 100 76 298 132 -166 -99 -223 -46 161 -198 -45 274 -140 -146 145 63 38
5119 38 -113 -241 -187 -107 -98 -167 -193 -257 -274 -183 -9 -56 -39 76 -117 -127 -142 -196 -237 206 -164 -74 -21 74 150 48 46
5146 46 -97 35 85 -173 -287 -13 -55 -43 93 95 204 94 -219 -75 -85 33 165 171 76 -174 89 141 -53 -36
5170 -36 228 19 139 123 242 -100 122 108 189 -185 52 -85 -110 13 -108 115 21 -38 49 -8 -116 -143 -112 68
5194 68 33 -144 77 52 -106 28 -37 -271 -138 -191 -23 -113 13 15 184 -13 -194 -138 -79 65 75 94 -41 -36 29
5219 29 -112 173 89 -292 -220 0 -110 40 108 -57 -199 363 13 47 286 -128 -4 -124 -18 -55 -101 77
5241 77 72 70 73 -275 -83 -202 14 -16 89 145 -96 194 38 53 -268 -28 -196 -123 102 -1 56 78 16 -111 -178
5266 -178 -222 18 -33 158 -46 54 211 -144 48 107 228 -102 69 -118 65 -119 20 192 -64 -4 -98 88
5288 88 -85 -269 60 31 96 281 80 94 -103 -21 -61 12 90 -110 -134 108 122 66 92 150 106 -147 131 45 70
5313 70 -51 121 28 50 -124 255 -4 -6 -203 -72 12 19 -1 38 110 -19 -3 156 103 200 435 257 -18 -56 -44
5338 -44 -12 -92 -80 -144 -49 -159 -213 -37 -94 62 -161 -187 -16 29 19 2 -5 -11 -119 -112 193 16 -76 100 92 66 -67
5365 -67 -21 26 -30 -16 -299 -191 59 35 178 -21 208 40 -323 181 136 -113 260 -165 62 -98 -74 72 -13
5388 -13 55 -153 -2 141 92 38 110 298 -112 51 0 -128 -191 181 139 167 54 -6 62 149 -92 -48 170 117 68
5413 68 -43 129 67 -148 -23 84 -76 -98 -14 34 -95 -24 2 -242 -83 83 86 232 159 -1 204 -4 147
5436 147 -21 -180 6 15 -131 -12 -158 -41 -6 30 -25 262 44 182 -119 53 205 -104 -126 216 -54 -186
5458 -186 87 140 29 154 136 -240 134 184 103 125 155 -131 102 226 16 -37 -76 18 74 -82 15 -41 102 -20
5482 -20 -144 8 199 46 -177 -186 -3 246 165 -116 -60 -41 -14 -21 -19 -87 -201 -101 20 -121 79 238 38 54
5506 54 -144 -30 17 78 52 -81 104 -39 35 105 109 7 58 114 -78 44 -6 35 289 -15 15 -52 163 -128 -9
5531 -9 53 203 -20 148 -9 93 21 163 -64 -67 52 -1 63 -190 -131 -122 68 -63 -90 -27 -14 -140 135 -2 -52
5556 -52 -47 3 -218 22 -53 29 -207 -139 -168 -162 -19 -201 -139 85 -64 12 97 -92 12 24 42 -59 -26 -68 -87 -28
5582 -28 -28 15 36 -121 -66 -52 89 18 -134 48 -24 -4 87 42 -113 159 -215 -191 -94 122 -1 68 -112 186 122
5607 122 -19 117 -10 -50 89 94 181 -40 -64 102 -17 26 -106 51 142 280 42 -146 -82 15 81 -18 104 -3
5631 -3 -182 -19 -53 -13 -5 -71 34 -12 21 -158 -146 32 -82 -40 -144 -85 -88 212 11 -80 158 44 -191 -35 -120
5656 -120 113 -148 163 -2 -30 -96 -183 -11 -83 -44 12 -180 110 -50 -165 -123 -17 -46 138 82 -25 99 64
5679 64 59 -20 -24 25 -34 -102 40 95 32 47 -27 261 72 91 128 74 144 56 116 46 -142 -47 -176 194 -51 116 219
5706 219 -191 81 98 106 -101 147 50 -95 -89 129 -54 14 -60 -237 -129 18 47 30 -61 178 78 28 47 -164
5730 -164 128 160 50 101 -24 52 -168 -20 64 22 139 123 -27 78 -175 191 60 -134 -74 -39 -195 57 -2
5753 -2 -97 111 -118 -16 -201 286 -72 -134 -177 55 -53 130 221 -61 75 -27 26 149 -121 49 138 4 47
5776 47 -19 -13 116 3 -101 -71 -66 45 169 -162 56 136 -171 -124 225 -26 -264 88 7 -51 -154 170 101 265
5800 265 -38 -39 0 150 -141 -94 93 -7 98 -211 -32 58 70 138 47 -92 126 175 71 134 82 -18 129 -135
5824 -135 -34 59 122 106 96 173 -5 -111 17 185 59 -89 68 14 122 273 -102 -225 142 -206 -135 102
5846 102 58 120 168 15 98 109 142 41 -90 7 74 179 80 -33 8 -172 -5 -45 46 -156 -190 37 -80 88
5870 88 -38 -74 7 -78 -29 -120 -63 2 -28 191 28 -93 406 66 -91 131 38 -43 -111 9 101 84 155 23 -43
5895 -43 6 4 70 163 49 -249 -66 144 60 15 100 -381 172 107 -17 -23 -157 -88 -177 -90 24 -96 46 -65 -45
5920 -45 0 60 155 -215 -29 -85 -90 252 38 81 -5 219 -84 197 -4 41 -41 -113 101 -231 182 -232 -206 -11
5944 -11 45 38 -60 85 82 -111 57 -46 19 -108 -97 -185 223 -105 39 -18 -34 -20 -87 31 -316 -117 148 89 -70
5969 -70 178 329 -91 146 257 194 79 -182 55 -86 -9 -205 10 132 -105 -169 27 33 66 -31 19 76 36 189
5993 189 270 25 -174 119 -171 7 16 25 134 -28 -242 -24 -27 -113 -55 -6 -100 -335 105 14 57 -233 -135 130 115
6018 115 -186 -178 227 6 121 -187 -248 68 -245 -342 -15 -83 -210 11 -173 -83 -22 -120 86 -60 105 21 -78
6041 -78 207 163 22 -47 -97 145 -86 -106 103 117 -13 -13 14 14 -149 142 139 57 86 136 -64 57 106 335 32 -148
6067 -148 -108 74 39 85 -185 25 -80 32 -103 43 -98 167 111 -33 70 -146 146 90 23 30 51 -242 -27
6090 -27 -264 70 -47 -266 -72 7 97 -155 -149 149 -187 -281 -22 -98 90 20 -255 60 133 12 95 -13 58 36
6114 36 -6 -138 72 169 -117 296 61 -230 13 24 256 -17 118 -33 93 286 82 -190 -45 -8 -148 233
6136 233 178 -81 143 209 106 67 196 46 -135 -55 166 -52 89 26 -132 -9 51 -1 -92 42 -178 140 -63
6159 -63 3 19 95 54 -29 -146 -5 -181 -74 -27 -204 154 42 -123 57 -129 -85 111 -26 150 67 -8 -94 -149
6183 -149 48 -134 -244 152 -12 99 -14 -89 138 -68 214 -152 -82 148 158 -97 62 -140 141 98 -57
6204 -57 120 -124 178 120 -69 -79 -53 101 -44 334 -53 -5 -110 21 -118 -45 226 323 147 82 -41 83 106
6227 106 -32 -267 -272 64 -8 4 -49 233 -70 -187 -74 26 -8 214 16 -149 -118 41 135 -111 26 126 -160
6250 -160 -49 -36 -312 60 167 -281 260 56 49 93 -202 -51 117 337 75 168 -203 167 84 63 59 -268 -137
6273 -137 48 41 66 16 -54 -113 -105 -76 -44 119 55 -116 5 243 -24 63 -125 39 155 -3 -208 96 320 101
6297 101 -15 -85 11 20 74 -60 104 130 -169 -13 298 -78 -100 23 -110 -54 -84 114 -193 -61 82 -271 -104
6320 -104 121 -62 29 -38 22 -187 -328 26 -72 -150 -100 118 -47 275 -73 57 -4 99 178 81 133 -27 56 17
6344 17 73 -105 -79 31 29 220 140 40 50 102 -175 104 47 -45 -117 -93 41 136 -50 -20 154 115 -83 205 6
6369 6 -59 42 141 29 -212 258 236 -130 -67 -18 -70 -88 -86 -37 1 140 -100 96 -103 4 -192 -84 -133 56 109
6394 109 -141 -36 -284 181 145 -292 114 -230 -84 -178 188 194 147 44 191 -157 -152 44 -84 72 -113 52
6416 52 -119 -163 104 63 -427 189 -225 10 -25 110 -60 211 22 -6 -385 -18 -188 112 57 184 -86 55
6438 55 48 208 130 -8 43 2 -16 82 -83 -196 -85 -69 65 -133 -138 -138 33 -78 -201 165 230 -181 41 -83 -207
6463 -207 198 -48 138 115 -71 260 -38 70 -256 55 -126 290 140 -191 20 147 102 -15 211 151 71
6484 71 -7 99 -83 140 -35 -58 65 -128 -16 -25 109 -29 -4 146 -17 -66 240 -25 109 12 129 220 214 94
6508 94 23 15 124 3 -80 83 -170 -185 113 186 56 69 -181 -136 -283 -14 -12 -143 -106 155 171 34 -196 312
6532 312 276 -195 -56 -87 149 41 -86 -132 -126 -54 -70 -15 66 192 108 37 -64 -163 102 -141 47 149 -190 -142
6556 -142 92 178 276 139 -84 104 -4 17 82 89 220 65 -48 -234 90 -249 163 76 198 -2 148 91 0
6579 0 118 74 -113 35 22 -36 153 -94 -174 -48 97 -37 -112 209 59 -215 -38 96 -80 190 -245 19
6601 19 116 -70 -10 -138 44 -152 -48 136 216 33 11 -23 -209 189 133 -75 19 34 -51 -85 -176 -132 -63 -194 151
6626 151 -165 336 -135 -18 90 29 -131 65 76 -17 -43 87 -79 9 38 54 -164 -23 -26 -80 -16 260 54 161
6650 161 147 21 103 -6 -179 -65 -78 -69 83 111 43 196 239 144 71 -48 168 265 47 15 98 -105 -17 41 -50
6675 -50 137 40 -149 255 -151 -128 101 -13 82 -139 -206 -168 -47 -167 -87 11 165 366 74 -195 18 -33 -110
6698 -110 -28 -17 50 -70 22 -41 -36 154 178 45 197 46 45 5 75 101 -266 43 -86 113 -31 267 128 35 -22
6723 -22 -14 -39 133 173 154 141 296 22 167 -38 -41 170 66 112 79 -153 192 118 -48 107 88 -53 120 53 -85
6748 -85 -39 76 102 154 189 -111 44 71 134 -118 -95 212 232 14 67 123 21 -187 34 223 194 -1 83 2 63
6773 63 124 255 46 55 192 -64 -269 22 13 97 89 177 53 -68 -221 -55 0 80 -72 -127 -70 49 136 -7 55
6798 55 -100 -55 -26 8 -126 3 148 61 -27 -93 224 41 104 -31 173 -83 -49 -49 -49 105 40 109 -79 -162 12
6823 12 126 108 149 167 -99 43 -186 -11 185 -267 -116 33 -114 -15 -266 87 -55 21 -16 161 -9 12 127
6846 127 -24 -42 19 -226 -77 266 55 31 -98 -90 -186 -131 -71 -311 88 -412 11 48 -270 129 90 42 91 115
6870 115 48 349 443 92 112 102 -53 98 -16 34 -18 6 79 -8 11 -63 -242 216 -38 -227 -19 -160 50 -86
6894 -86 63 -101 232 -27 15 -51 128 -115 -182 -31 40 198 -16 -187 -174 -98 -7 219 -7 198 -55 -149 -101
6917 -101 147 -22 -69 -184 -86 179 -131 122 -98 -55 -129 0 -20 -57 98 -260 -64 156 -87 -56 -137 0 131
6940 131 -272 2 -56 14 105 -182 161 -75 -202 109 -52 -52 -76 -265 -9 -172 -112 -192 -90 57 -71 -144 150
6963 150 -172 51 -58 42 -144 -59 23 -329 41 -95 114 5 85 -8 127 -4 49 -33 134 260 -143 -147 132
6986 132 -270 181 63 123 -93 -98 60 -51 136 63 -65 169 -169 224 88 7 -106 -196 -34 -249 -123 -146
7008 -146 -150 123 60 -160 155 117 151 -70 175 -58 -296 69 -106 -68 28 -47 35 106 161 -112 30 -225 -53 -14
7032 -14 277 -19 -30 190 81 57 -303 -311 -85 -18 46 -97 206 -120 -28 -148 86 169 198 74 42 -6 152 158 114
7057 114 219 -39 67 -58 69 -120 -171 -20 -2 -55 168 133 257 -38 21 -122 -295 123 13 -213 -90 -16
7079 -16 -39 125 -82 13 184 88 -121 -244 -39 -147 -100 133 -69 42 42 137 281 -214 -81 131 35 316 63
7102 63 -123 101 66 27 198 -160 196 -225 91 -2 -39 -69 -35 -71 -3 -45 138 -102 -35 -64 -79 1 202 -21 -2
7127 -2 -74 -372 -120 112 126 -58 27 269 17 36 -151 -133 34 -142 -30 138 -114 -192 0 114 -189 -202 -55
7150 -55 162 -235 19 85 123 -225 -122 -57 -332 -56 -304 -246 -53 4 122 -69 220 -16 144 237 -55 -154 -221
7173 -221 -60 234 -8 33 150 -89 109 1 192 -174 -30 203 -35 -203 88 -17 -197 26 126 -33
7193 -33 -111 92 -118 -52 -95 89 47 194 -71 36 10 -174 -154 -16 -112 -156 33 78 -14 261 92 189 76 -240
7217 -240 -45 126 -88 -28 -172 -254 -73 0 -243 26 300 -105 50 -59 -44 159 51 -228 208 -320 51
7238 51 -104 120 54 -50 -103 104 153 -58 196 109 -101 41 -49 -56 -18 106 -39 32 -90 -141 150 -122 -18 114
7262 114 -196 124 127 -83 158 -126 239 -72 121 156 89 -90 64 325 123 101 18 -32 -54 -88 115 -169 -195
7285 -195 -84 -117 -57 19 27 -100 200 37 -3 -25 -255 131 64 -70 -96 -114 82 -77 50 -385 66 56 60 -46
7309 -46 -39 179 -150 -88 65 -2 -150 9 -57 70 -98 -35 -56 -126 -177 -10 -1 -235 36 -15 -127 -157 -143 -162 32
7334 32 -163 -79 -201 -111 69 -122 60 -111 -156 -158 82 20 -51 -213 90 121 141 -24 -127 189 123 -60 64 -24
7358 -24 -92 129 -243 -78 -102 -26 -124 -188 105 -17 -7 -130 -173 220 0 -165 107 -45 268 -36 -34 -24 59 80
7382 80 104 107 31 -93 -154 -14 14 44 -88 98 8 -41 9 18 212 115 80 -104 61 -139 -134 43 -137 193 -130 -32
7408 -32 21 -20 -182 35 -53 113 -148 120 16 -53 14 -35 161 -78 45 -17 -131 71 130 -43 92 85 -26 78
7432 78 124 27 -58 191 -363 181 -126 87 -220 -67 103 -57 127 -71 175 -6 76 211 162 28 -164 133
7454 133 238 117 -45 103 215 -17 68 -99 40 -154 75 -248 81 -94 180 64 -139 -122 -46 -63 -276
7475 -276 -136 274 109 117 155 17 -167 5 -149 3 -107 5 22 -95 -38 166 -53 -21 15 -30 -80 36 -103
7498 -103 -175 7 -10 143 -144 -43 71 138 100 -48 11 81 211 -104 -186 -189 -11 67 57 -118 -68 -203 -76 -26
7522 -26 170 -50 115 -88 -367 -22 -188 -80 -187 -95 -70 -152 -156 -134 150 -129 -5 -95 20 154 -66 6 -45
7545 -45 161 -233 -26 -87 -37 -98 -23 -285 -110 41 156 -2 -33 160 -167 -194 -50 118 -17 46 50 -87 131
7568 131 65 -63 50 10 37 -22 82 -150 159 -34 -204 104 -35 244 -198 76 -152 104 22 128 -114 -96
7590 -96 -128 73 -40 13 -122 -90 46 -30 -22 352 -46 -120 -320 -168 -82 122 163 -71 -62 181 36 106 -181 -207 -5
7615 -5 148 97 96 -37 97 40 -104 -173 56 157 -32 -252 -172 138 219 100 -158 113 88 258 155 33 -149
7638 -149 171 203 83 -109 -64 151 131 -10 -197 -15 -178 143 -20 -44 -50 -37 -113 117 -120 178 37 -11 -183
7661 -183 -156 1 -59 253 -32 313 43 -208 48 138 -240 222 176 2 224 159 -122 -22 -45 -78 -64 -119 164
7684 164 31 -75 247 54 111 26 124 -34 -112 -88 33 113 17 94 26 -179 171 -115 56 44 -60 122 -60
7707 -60 -31 -112 89 8 -68 262 -207 125 108 71 57 -78 129 -13 103 -28 -277 -83 53 -93 86 -203 378
7730 378 -3 -194 -205 -13 -70 -197 8 -349 22 186 -102 77 106 -23 114 -92 -113 -138 -192 -162 39 -103
7752 -103 26 68 -25 -159 34 340 84 -2 215 20 129 242 30 -17 140 271 -68 -86 -44 29 144 43
7774 43 -169 197 -76 -10 -60 -20 549 -83 -13 -175 -307 -94 -90 275 -118 13 -31 54 -53 -12 138 57 -124 -36
7798 -36 166 -112 142 9 -73 138 41 -98 -254 48 -43 -111 -202 -28 -6 30 -181 -122 143 -60 148 -27 17
7821 17 126 -82 3 41 -1 -71 42 -111 32 236 144 213 -177 21 -101 35 35 -92 -55 287 -80 231 -127
7844 -127 -77 124 150 283 -15 -128 192 220 -112 8 69 224 -106 163 74 67 -141 128 174 74 99 46 -119
7867 -119 -56 -198 60 -115 -17 -33 -173 174 -19 -39 28 -62 103 -7 -13 -33 86 -14 86 -20 -13 -1 -105 40
7891 40 -65 139 42 -102 -263 -57 -116 2 108 106 -28 -125 282 17 -232 28 150 -305 -61 -4 13 76 -350
7914 -350 -109 202 94 199 -142 -127 217 -137 141 -64 93 -61 -64 -246 137 145 -72 6 39 -89 120 -14
7936 -14 176 -136 218 -110 -85 -128 -11 293 -273 57 -368 185 -131 162 84 -4 -142 174 -237 23 -60 -97
7958 -97 -56 162 -76 28 -1 -91 -6 -28 -24 -204 -94 23 46 -74 -17 -6 276 202 -2 288 12 -200 18 -27
7982 -27 -34 78 107 -162 347 109 -23 131 132 -163 60 -222 -168 148 -241 154 -11 109 -238 -165 -28 344 -126
8005 -126 -25 -33 -48 -130 -56 -24 -52 -220 -155 23 -398 -224 50 296 -115 -285 -112 -50 33 -162 273 -74 171
8028 171 -155 -107 -123 -25 -75 -80 113 -46 59 35 -133 -10 54 -55 -28 -8 272 -25 114 125 -99 -49 -193 127
8052 127 60 -125 325 22 -48 105 7 60 -89 -16 -12 31 -134 -29 162 -237 5 -71 -30 -36 -223 157 -163 79
8076 79 59 -55 -81 -60 112 -36 15 -87 -157 -20 -108 -256 -152 55 -181 96 126 -68 -168 79 -4 110 -95
8099 -95 -44 181 -125 -185 111 -223 -26 -14 -222 291 -37 -146 -205 18 296 4 116 60 -37 -399 49 -270
8121 -270 -57 79 -54 332 -94 -128 44 211 -120 228 57 29 63 351 122 -168 -15 -112 -95 -45 292 56
8143 56 -108 -31 -369 98 -110 -206 171 -17 -24 86 -14 -24 72 -300 -195 116 152 62 -162 -172 219 80 -19 -309
8167 -309 -19 -104 115 -43 -305 -95 81 224 -151 -84 -13 254 -65 -30 -90 -74 257 60 131 -121 -108 -217 -31
8190 -31 110
8191A10
$$ Imaginary data points
##PAGE= N=2
##DATA TABLE= (X++(I..I)), XYDATA
0 0 0 0 0 0 0 0 0 0 0 8 -8 8 -8 16 -16 22 -24 32 -40 48 -56 64 -79 88 -104 120 -144 167 -191 216 -248 282
32 282 -320 365 -410 461 -517 581 -647 724 -805 893 -990 1095 -1212 1339 -1476 1627 -1792
49 -1792 1976 -2175 2397 -2642 2916 -3223 3572 -3965 4421 -4952 5578 -6335 7265 -8445
63 -8445 9989 -12116 15232 -20243 29598 -52948 232727 271506 -230733 40275 20300 -168389
75 -168389 -31994 106918 -2829 -19489 28632 17004 -30787 46263 -100 -64659 47171
86 47171 37426 -46967 98680 68290 -98923 -62716 -60721 -76888 87502 98706 -12350 19991
98 19991 40754 -40763 -39742 22647 -20352 -68280 30204 45055 -40640 -11964 -8708 -39225 47021
111 47021 39792 -35672 38815 48149 -84072 -58664 36669 -23795 -34322 48869 -6229 -59343
123 -59343 37048 59078 -16675 -7921 10063 -33997 1019 59724 -22139 -80017 -10728 3374
135 3374 -5361 54803 53240 9963 4341 -30775 -41173 14909 20627 -4074 11688 -1084 -37452
148 -37452 -3787 54784 21536 -36084 -6265 21484 19419 47303 19006 -44185 -39633 -34011 -18957
161 -18957 35019 35986 15416 22347 1789 -27047 -6697 22901 1986 -19992 -6413 -20847 -19053
174 -19053 38677 25230 -35875 -17037 7625 -5278 14043 27724 325 -14943 -10373 -16860
186 -16860 -24106 -15178 -4527 2203 15246 7809 -347 21856 11755 -18548 -12873 -18011 -27850 -947
200 -947 14462 3566 5071 13862 1518 -18347 -13975 -2441 8137 31206 28151 -2044 -17872
213 -17872 -29852 -26596 -1838 7716 13549 29814 23945 6018 3281 1116 -12708 -17593 -7653 -6116
227 -6116 2408 30409 28116 -2219 -15763 -23002 -15451 18924 36714 28982 11149 -16167 -32863
240 -32863 -26244 -6586 6786 11890 15920 4306 -6744 9714 13606 -4990 -7987 -12376 -19587
253 -19587 -1416 14121 4766 -10788 -16189 -13041 -4110 17595 29463 9543 -10766 -19426 -27289
266 -27289 -14709 7766 10393 3545 -3196 -10886 -8114 1026 5729 8249 7596 5307 3632 -2362 -13843
281 -13843 -19109 -15346 -9314 3524 23641 29175 16524 2468 -11052 -21536 -13072 4634 7790
294 7790 10525 16570 3628 -8517 -7443 -15474 -9922 19443 30392 23266 13264 -6221 -20987
307 -20987 -22143 -15224 -2637 8464 17564 17895 8708 6893 1427 -9917 -9316 -11428 -9185 8816
321 8816 17906 14520 -2598 -30420 -26130 -742 9617 22728 24417 -1238 -15035 -11737 -12500 -11095
335 -11095 -2011 2199 -6734 -8263 4109 8481 11661 13037 -10403 -26273 -9943 5369 10479 6202
349 6202 -11198 -17480 -4146 5078 7653 10449 5249 -5186 -4922 999 558 3415 7906 -478 -14667
364 -14667 -16184 -911 15498 18217 10595 1771 -471 1648 261 -2188 -7445 -10236 4308 14727
378 14727 5889 3410 2713 -2187 2592 2405 -4101 1141 10397 10471 -3149 -12348 -4891 -3938 -3399 5346
394 5346 2330 5846 17217 4579 -12116 -13469 -11197 1971 10953 -1004 -12636 -9623 2947
407 2947 8659 3888 970 -5138 -10617 -2188 -1463 -3893 6524 2013 -10031 -9303 -8018 901 13583
422 13583 6948 -8354 -13127 -4156 11993 18073 3313 -19940 -23194 -5898 6215 13461 17798
435 17798 6247 -3698 -2684 -8625 -9999 4937 12113 4197 -766 -912 1607 9673 6162 -13828
449 -13828 -15298 3959 16654 22463 14680 -8404 -17659 -7977 -2948 -1852 6648 11786 9845 7930
463 7930 1077 -11850 -10007 1477 -31 28 6934 4759 3908 1326 -13271 -16062 -2285 8569 10628
478 10628 3092 -5383 -5206 1007 1839 -8465 -12772 -6076 2101 11746 8385 -8482 -9445 -1976 -4930
493 -4930 -805 6912 1858 -2932 -3492 -9753 -9257 7217 16378 1899 -10054 -9377 -6374 7449 16314
508 16314 777 -10004 -4325 609 6283 7166 -2849 -8470 -1497 5053 5745 10197 11047 -2048 -10093
523 -10093 -9006 -8157 7501 22716 11240 -3505 -7972 -8484 1274 8734 1123 -3927 2305 7209
537 7209 5586 3567 -3973 -12504 -3700 4520 -2085 4042 13680 1210 -5942 -4304 -12524 -7754 9231
552 9231 7409 -2354 -514 420 -3679 -2902 -4331 -9270 -686 9493 1892 -3522 -2767 -8312 -1208 8230
568 8230 -3305 -8479 812 -1419 -2876 5289 1850 -5024 1059 -88 -6969 439 7158 1866 -525
583 -525 -1701 -6118 1618 12071 2972 -7001 -4351 -5239 195 15766 11644 -1615 -1264 -4160 -9965
598 -9965 -449 7976 6448 5816 3291 -2923 -3603 2326 4150 -247 -2084 -769 2200 8696 5827 -4391
614 -4391 -5647 -8211 -6267 6540 8928 4914 5352 -1623 -8685 -7171 -3829 1075 2580 653 189
629 189 -2356 -1519 1119 -2837 -3486 -2128 -2034 2981 2008 -2900 -1836 -4954 -6465 -959 -43 910 3586
646 3586 1125 -46 -1792 -2399 27 -1727 -2249 433 -1317 -1150 1040 -289 2185 4522 3162 980
662 980 -2323 -3172 -526 1283 3018 3253 308 97 -602 -1478 2875 5453 3568 2391 374 -734 2809
679 2809 2159 -1684 -4466 -4698 195 6992 9157 6042 -184 -5366 -5797 -2520 1794 4813 3490 -504
695 -504 -5130 -6169 -1522 3267 3850 2188 -2698 -4889 1473 4158 -315 -4057 -7610 -7084 -1446 2851
711 2851 4001 1429 -983 -1091 -3756 -3899 1431 3464 -831 -4451 -6053 -4807 75 5816 4183 -2771
727 -2771 -2177 2716 156 -572 1263 -1594 -148 2999 -1252 -4012 -1652 680 2980 4767 3318 1768
743 1768 3871 4076 -2491 -4565 -2106 -1980 1838 5528 2053 1907 6087 2831 -3730 -4641 -952 5337
759 5337 8862 3837 -4362 -7621 -5325 -532 3455 2489 1216 5871 5151 -2197 -3527 -1114 -4293 -5080
775 -5080 -1535 -2514 -921 6737 6220 -5243 -9033 -3209 1953 5768 5883 -2102 -8127 -5765 -3365 -3184
791 -3184 -1748 639 1792 3669 2894 -1504 -858 2247 -2600 -6298 -3265 -2075 1020 6339 1633 -7925
807 -7925 -3956 6296 7115 3693 2953 -1362 -4116 -540 -710 -4248 -508 4647 4361 2803 -704 473
823 473 6603 4852 -1336 -1390 -147 -683 1328 731 -5446 -3732 5741 6380 1226 2939 2846 316 2007
840 2007 -1402 -9230 -5748 2416 3562 1748 -613 -3311 52 3349 -140 -1014 3472 576 -4278
855 -4278 -3248 -5569 -7380 954 5855 -2166 -5564 1751 6611 4269 997 -4936 -8948 -5042 434
870 434 495 -395 -172 387 295 -1432 -27 3622 4327 2185 -1595 -5108 -4087 1189 3367 -2008 -6351
887 -6351 -102 6995 6070 5202 3580 -1184 -2758 -1002 -1121 -2146 -922 2464 3690 1045 -1208 1165
903 1165 5452 4607 -917 -986 2355 1200 -197 -1236 -5925 -4875 2749 4276 1583 3268 3760 795
919 795 540 -681 -6301 -5795 1066 2587 -1831 -2668 -500 330 95 -153 655 2755 1644 -1523 -2399
936 -2399 -4943 -7242 -1644 1215 -2868 -1648 2961 4374 3796 -145 -4671 -4082 -799 1201 465 -506
952 -506 -1173 -3361 -2177 600 980 5209 6576 1439 -366 -1325 -3906 -688 1513 -2856 -3514 1902
968 1902 5823 4162 1840 2188 -1224 -1597 3278 2981 787 1126 -1774 -3862 -2916 -1254 2647 6263
984 6263 5377 2392 -208 -304 -909 -2479 -2092 -2833 -1867 2085 1702 -658 1037 18 -1668 618 1839
1001 1839 590 -28 406 -2669 -6032 -4796 -2662 -1027 2911 3259 2018 2665 -415 -3879 -2724 -2307
1017 -2307 -2266 111 341 -2109 -2657 304 -25 84 2481 2131 427 2486 925 -2194 -2029 -3258 -4626
1034 -4626 -821 2452 3919 5489 3788 -380 -1478 406 110 194 2313 166 -2676 -265 -4 -1171
1050 -1171 2106 3763 1766 2552 3747 2333 -213 -1256 -3962 -5228 -1486 2474 2624 3352 1870 -673
1066 -673 -145 651 50 -276 72 -420 -2239 -2742 -2546 -2657 -176 820 -248 1538 3598 1962 98 -3045
1084 -3045 -6306 -4333 -1650 -1025 259 783 627 612 773 -1052 -1855 1273 2344 -837 -1183 -1904 -3876
1101 -3876 -1708 -97 -2064 1060 5453 3616 1865 2246 -1647 -2965 383 -920 -3417 97 2965
1116 2965 2150 2364 738 -1471 1485 4356 2470 1346 1072 -1701 -2544 -1277 -1962 -1489 3505 4026 2099
1133 2099 2404 -10 231 3379 -1054 -5180 -1679 1119 450 946 -200 -3068 -610 3017 1384 422
1149 422 2465 -194 -3215 -1261 -4226 -6341 759 3387 -1598 -673 1645 500 969 731 -3252 -3483
1165 -3483 290 694 -1396 -1091 -2328 -3562 674 2535 -455 986 4336 2495 -968 -3302 -4094 -1359
1181 -1359 1463 -99 -868 2369 2781 1514 1705 -238 -2031 1058 3442 998 -964 -550 -850 431
1197 431 924 -2499 -766 5978 5532 998 1357 -128 -3270 -1131 80 -2352 164 3673 2131 -135
1213 -135 60 -1898 -782 3937 1345 -3876 -441 2372 -663 -2021 -2820 -4192 -334 3132 1719 1356
1229 1356 1762 -889 -1980 -1583 -4151 -3836 1702 2520 -1186 -1840 -1221 -505 2059 470 -2847 14 2318
1246 2318 281 -1098 -1321 -4268 -2789 2171 1225 -219 2362 2713 1233 57 -2147 -2883 1582 2899
1262 2899 -437 -1327 503 456 952 1414 398 1070 3587 3150 228 -935 -2328 -1422 1392 745 -855
1279 -855 1443 3386 1678 -147 -1153 -847 700 2047 840 -769 -920 -985 -1202 -1186 -1502 -233 3097
1296 3097 3526 951 -1434 -2766 -1817 -943 -1642 -2002 -161 1830 1304 -767 -1880 -1955 -986 931 898 -206
1314 -206 397 133 -1435 -3321 -4058 -1990 1751 3731 1869 159 -78 -351 -1099 -1375 -1577 -1178 1059
1331 1059 2423 873 133 -177 -464 113 601 766 1509 2438 1820 -724 -2526 -1871 -46 1416 1702 1418
1349 1418 1652 1797 990 281 -1175 -1504 457 887 -319 340 317 500 773 275 -1028 -89 1177 545
1367 545 -96 -457 -1235 -1308 -392 -996 -1492 228 1041 156 -171 -477 -1180 -362 -216 -1404 -1874 -1143 -665 -95
1387 -95 305 -537 -126 104 -609 -382 115 -704 -307 395 -1215 -1293 330 446 -10 312 304 -597 733 1196
1407 1196 -213 -308 933 -868 -370 953 -192 207 1720 627 585 2049 579 39 335 -308 -378 471
1425 471 1184 1005 851 1136 -283 -595 119 -33 621 1671 596 -176 340 -1026 -1328 -773 -907 -15 1505
1444 1505 1558 115 -491 -883 -1993 -1758 -539 -335 498 1942 390 -1586 -1480 -1908 -1345 -131 349 62
1462 62 877 675 -928 -2182 -1474 -1295 -112 1476 791 47 1029 304 -1722 -1575 -647 -287 1500 1973
1480 1973 387 -214 96 -472 -956 465 317 1044 2537 1179 -821 -211 299 136 775 941 -274 739
1498 739 2209 197 -1081 299 90 219 1911 -29 -941 1133 1021 -933 -347 279 -309 1292 1017
1515 1017 -1767 -1801 847 422 124 694 -871 -1443 665 -602 -2311 -342 682 47 511 -446 -2005
1532 -2005 -1167 202 -1107 -1263 198 573 548 753 -1653 -2972 -362 280 181 524 537 435 849 4 -2314
1551 -2314 -1768 517 1248 1039 912 21 -110 1155 211 -1595 65 1477 1501 1301 253 -1144 -223 1022
1569 1022 1 -629 530 1518 1588 1586 -229 -1459 279 1140 -253 -224 -194 48 1399 1156 -648 -925 1018
1588 1018 495 -690 -459 -554 -95 1443 385 -2211 -1317 370 83 195 -223 -903 486 1332 -400 -2269
1606 -2269 -1786 -1235 -609 117 -293 -656 1329 999 -1327 -1518 -1172 -720 1400 1096 -1253 -975 400 -347
1624 -347 -764 -468 -777 1048 2602 1299 -719 -488 -150 -420 -8 -530 -571 1721 2381 725 -450 98
1642 98 126 675 878 -461 -262 1138 887 -266 -513 -547 584 2024 996 -415 33 633 330 209 -672
1661 -672 -1330 -362 406 -473 -456 434 910 984 765 -774 -1268 -426 -538 -1136 -1008 -423 399 917 -123 -1432
1681 -1432 -1202 -96 182 7 -103 -303 -219 -110 -1272 -2148 -1114 431 1254 1215 365 -217 -35 -307 -1059
1700 -1059 -1337 -661 570 1319 644 -51 -90 231 818 208 -145 592 1068 989 331 -1263 -1138 229 622
1719 622 814 883 838 1486 1555 193 -913 -248 307 76 163 -34 -437 718 1094 163 16 571 35 20 52
1740 52 -1195 -822 506 74 -815 -261 -650 -630 292 253 -165 370 890 -625 -1380 -1394 -2231 -1209 346 -30
1760 -30 218 1252 302 -358 -557 -1535 -1343 188 533 197 310 -328 -1014 -615 -447 -479 1163 2065 1367 530
1780 530 50 -1265 -1528 -264 -427 163 1729 1700 1004 1149 21 -565 198 781 136 737 488 49 -334
1799 -334 -137 -311 162 1180 1178 931 881 107 -908 -831 -511 -845 -79 -117 -253 326 350 173 336 328 134 -142
1821 -142 -492 -1025 -1161 -915 -531 -411 150 131 -16 125 150 -633 -450 -129 -313 -374 -788 -1451 -935 -439 -75
1842 -75 351 768 1392 806 288 -335 -1460 -1319 -380 -209 87 807 662 790 656 -169 -6 517 901 933
1862 933 458 -380 -290 -259 -424 -574 241 1413 1558 1631 923 -150 -235 -238 -553 -990 -54 89 502 1137 226
1883 226 -130 756 796 -125 -150 -83 -738 -23 -187 -1374 -1169 128 162 240 546 29 386 1119 -394 -1460
1903 -1460 -1321 -1255 -1200 -134 -446 -350 1192 1523 -97 -524 -666 -907 -331 227 -800 -571 482 50 -953
1922 -953 -614 -138 337 1706 1767 -288 -51 -255 -1142 -932 -896 -450 782 2061 1412 357 224 567 202
1941 202 290 81 -42 774 896 -311 -736 -513 -26 1276 1310 558 401 744 242 -556 -1238 -869 -4 638
1961 638 392 -206 -445 316 822 366 -132 -85 138 155 -885 -2122 -1456 37 443 429 254 -257 171 67
1981 67 -935 -1159 -298 38 520 -1 -1095 -1745 -604 471 130 408 1014 1086 612 -312 -1963 -1949 -109
2000 -109 153 602 1072 535 593 635 -62 -872 -230 1067 1569 823 -77 -1002 -452 -121 -557 -155 1426 1734
2020 1734 1936 1230 -298 -1224 -897 -533 -354 -265 335 868 1123 205 -968 -295 562 480 471 32 -519 -200
2040 -200 -451 -1022 -1056 -471 235 868 958 -78 -565 -90 -84 -686 -1234 -703 -347 196 -369 -662 -202 408 540
2061 540 352 -357 -559 -100 -28 -440 -1007 -801 -42 568 424 -377 107 1118 943 311 170 -182 -162 -35
2081 -35 -525 -424 -138 756 1150 1046 602 351 572 561 -61 -400 -381 347 455 246 -81 447 565 719 778
2102 778 172 245 146 287 -199 -702 -1076 -546 249 21 -41 273 847 1051 -34 -419 -699 -809 -543 -1039 -697
2123 -697 -230 132 285 164 -293 -465 -268 37 -39 -225 -249 -99 -229 -909 -1184 -407 87 647 817 757 151
2144 151 41 -351 -1235 -1001 -457 121 907 834 202 315 209 -405 -23 236 478 1106 886 -329 -988 -680
2164 -680 -490 -117 1173 1205 1206 1426 456 -644 -613 -892 -447 291 778 364 506 139 -577 -286 51 334 394
2185 394 606 32 -502 -469 -861 -918 -19 264 510 737 494 -398 -239 -396 -696 -550 -186 -316 -94 -153 -591
2206 -591 -465 -77 301 269 486 101 -394 -321 -713 -871 -410 135 319 274 -5 -148 -93 107 145 215 490 394
2228 394 105 -174 -344 -432 69 367 458 758 803 717 -19 -192 -462 -500 161 749 647 533 474 15 -30 21 -122
2251 -122 279 843 782 -86 -128 -515 -770 -194 -17 50 498 772 139 -142 -456 -978 -265 -310 -478 -451 225 255
2273 255 -310 -109 -577 -552 316 114 -307 43 -41 -456 -422 -931 -1134 -41 303 198 10 560 -12 78 -22
2294 -22 -515 -829 233 298 68 313 27 114 326 157 -296 252 621 330 532 267 -343 -27 245 -30 -6
2315 -6 547 409 747 851 211 -542 15 396 313 118 184 330 162 126 -440 -371 537 486 114 204 -560 -227 212
2338 212 -612 -558 21 167 422 259 -433 -807 -114 278 -89 -337 -118 -128 -351 -374 -802 -492 204 474 -7
2359 -7 73 -307 -275 125 -254 -822 -472 213 315 297 -191 -411 -233 241 484 144 516 332 411 -83 -727 -818
2381 -818 207 1035 772 390 493 189 210 -164 -404 -300 874 980 408 395 -143 -349 -16 287 -189 257
2401 257 868 565 -5 -417 -771 -424 242 180 -23 229 33 299 -54 -804 -589 168 498 62 -52 -280
2421 -280 -308 -287 -156 -726 -322 360 41 160 -127 -772 -267 -40 -251 -389 7 278 170 -184 -395 -512 143
2442 143 403 -166 -74 -183 -288 456 391 -250 -177 286 186 33 -17 -125 132 324 68 -164 373 627 252
2463 252 152 151 -215 436 588 63 144 247 -90 156 -31 -77 -20 412 359 -109 -265 -201 -217 428 72 -443 -1
2486 -1 48 5 -146 -206 -440 -92 -61 -195 -306 -316 -36 -128 -208 -336 -437 -383 -4 -76 -356 -196 -188 -248 -233 -329 -299 83
2512 83 181 -288 -11 403 58 104 55 -394 -470 356 60 381 369 39 216 76 100 -486 352 522 255 523
2534 523 254 -126 64 328 -172 128 419 377 365 102 -225 -283 -56 151 247 375 402 -54 226 -32 -349 -37
2556 -37 123 46 187 251 25 -284 -397 -389 -307 106 338 -152 -50 -29 -605 -301 -392 -599 -148 -23 -325 -318 -133
2579 -133 -309 -367 50 8 42 314 -1 -204 -339 -202 -320 165 198 -271 251 -53 -193 83 102 -227 255 190
2601 190 63 -23 66 68 -259 310 319 564 682 486 -175 -237 -223 -6 1 203 -68 166 576 88 -81 -110 225 -76
2625 -76 475 131 -162 -206 -45 -351 -229 -8 38 319 442 43 -147 -290 41 -204 -47 -231 -228 -201 -88 -426
2647 -426 -140 -103 -30 45 -271 -332 -406 92 -353 -487 -177 -26 -150 82 -8 -138 130 186 -135 -145 -224 -367 -2
2670 -2 163 -271 -228 182 345 461 580 51 -194 258 242 -256 -86 91 53 395 276 77 508 695 171 218
2692 218 15 171 124 211 -251 -422 10 290 194 352 176 -166 191 110 -91 -178 162 -94 -48 -266 -591 -211
2714 -211 249 -106 -158 -138 106 -73 10 -570 -852 -223 -136 -178 -118 -132 -71 72 194 -497 -201 204 59 -205 -489
2737 -489 -333 -439 177 183 -25 -144 277 230 167 -195 -293 23 223 230 -177 17 277 236 430 274 176 355 348 231
2761 231 144 -100 -59 315 509 189 -273 469 540 240 -91 171 197 291 438 -375 -325 101 -114 157 144 -187
2783 -187 -55 453 -56 -296 -274 12 -283 -33 -425 -370 41 257 -388 -178 -338 -73 332 109 -439 -368 -250
2804 -250 -366 28 -122 -173 -97 358 -157 -280 54 336 -233 185 15 -385 -16 24 -264 -279 246 299 446 645
2826 645 110 -286 17 43 -208 211 36 -44 293 177 118 247 402 448 266 145 -42 -26 455 -125 -257 52
2848 52 62 189 337 -255 26 90 343 -8 -209 -280 -282 -175 -48 -468 -175 178 24 100 245 -51 -466 -216
2870 -216 -632 -633 -443 -249 -142 71 -197 -331 218 373 142 -181 23 -262 -219 -22 -472 -385 195 37 340
2891 340 325 142 247 65 -222 -170 -75 334 338 -144 261 313 -53 268 341 116 297 285 89 -93 -7 -111 -220
2914 -220 299 9 162 696 573 262 324 39 -336 259 -43 -317 -128 79 -220 164 165 78 222 470 43
2935 43 163 -19 -333 -566 -151 -216 -418 -37 45 -291 224 -70 -287 74 31 -289 -172 3 -539 -92 -244
2956 -244 -375 -177 487 76 121 213 -108 -389 -132 -316 -321 -160 200 -47 258 372 -200 27 600 -213 117
2977 117 432 -157 -37 -147 -151 126 486 353 323 349 205 18 76 228 35 133 -31 -252 98 379 147 0
2999 0 349 -52 94 221 86 -182 -173 -285 -179 -83 -162 -296 170 255 28 14 -69 -68 -239 -282 -231 -202 112 -149 -277
3024 -277 -235 -168 23 -139 276 45 12 -15 -250 -440 -441 -422 -106 149 327 10 204 464 -82 85 263 96
3046 96 407 422 -148 -194 242 211 0 411 338 143 601 474 102 175 -37 -274 -27 404 -22 82 185 11
3068 11 -204 3 -23 80 507 -8 -331 274 133 -137 -169 181 -181 232 391 -179 -247 72 29 -508 -125 -459
3090 -459 -144 0 -194 -288 -193 -253 -17 493 -4 -415 67 -127 -189 -405 -374 8 71 334 -15 -173 220 -108
3112 -108 -203 -191 -268 -340 190 88 -129 -11 94 101 114 414 159 250 410 -221 -509 -489 -32 -83 319 336 43 267
3136 267 304 61 -149 -215 93 388 93 78 31 235 18 287 -11 244 354 438 175 -272 -317 -188 -238 -133
3158 -133 -145 -257 -74 274 -38 -180 -307 -308 -249 -174 122 -298 29 -114 -256 -406 -444 -159 21 334 -81 77
3180 77 -24 -357 -174 -255 -458 -209 194 397 30 -96 37 59 302 467 76 0 300 -246 -298 -39 314 433
3202 433 515 63 155 187 265 72 -281 -99 56 229 446 11 37 151 42 264 120 250 57 109 -122 -282
3224 -282 78 -129 -111 269 39 -104 262 232 -244 -76 -70 -194 -174 72 -93 -247 -54 -230 -80 -107 -46 93
3246 93 108 -82 -418 -139 -209 -126 68 62 58 185 193 -155 -282 -437 17 17 50 164 57 -292 -139 -26 69 -197 125
3271 125 302 391 37 -122 10 -111 -141 -192 -56 347 348 322 6 32 396 355 121 200 235 236 397 45 -63 -198
3295 -198 36 269 363 443 184 -124 160 -61 -175 -98 -134 61 -134 96 56 -106 74 -269 -152 -57 -173 120
3317 120 -28 -280 -165 -291 -210 -396 80 -275 34 272 -234 -182 -47 -229 112 -25 -134 10 125 167 -56
3338 -56 139 63 -190 177 544 -180 35 165 -159 153 167 180 203 328 -187 32 252 88 -179 101 404 12
3360 12 112 332 -39 53 140 -102 416 194 99 163 -150 -10 -42 196 -67 222 315 113 2 -115 -154 -433 164
3383 164 26 -262 36 75 -287 -172 -1 -147 -231 266 67 -58 26 -189 -348 -331 -41 -160 -49 34 46 -45
3405 -45 -277 -377 -309 89 2 110 255 56 -237 15 62 -167 263 -29 20 158 225 -33 198 165 -146 -50 255
3428 255 234 184 158 185 -219 53 196 -75 310 163 -8 164 232 -34 36 227 206 126 143 59 -238 97 -189
3451 -189 10 32 151 309 -104 121 -70 -59 54 -122 -246 -89 30 -120 -122 -40 -310 94 -5 -456 -112 -127
3473 -127 -217 -148 -47 -216 -54 118 -262 12 170 -235 -103 211 71 -186 244 420 -118 226 -30 -189 219
3494 219 240 -23 181 167 -91 256 -4 67 132 448 438 157 115 349 292 132 -64 -13 211 334 16 205 -6
3517 -6 -229 155 275 16 8 263 275 55 7 -15 -106 -61 -58 -399 119 10 0 4 -150 -363 -155 -88 156 -121 3
3542 3 10 86 -167 -253 -154 25 153 -63 250 -83 188 -41 -66 -264 -236 30 231 175 105 -36 121 -254 167 -389
3566 -389 -70 -5 21 197 142 -77 -56 162 -74 -31 328 155 488 8 -40 -217 8 87 32 68 24 -4 335 246
3590 246 -61 -99 309 215 60 33 -287 78 -70 -206 28 302 -143 -38 -132 -56 -106 35 62 -135 -100 52 -200
3613 -200 -130 -79 -32 -145 288 123 -143 -64 -235 -299 -145 -192 -167 -7 209 125 -119 -22 -52 -42 150 -69 -85 45
3637 45 -179 252 -218 -265 58 293 28 131 296 -91 -44 -143 193 -164 -277 277 213 33 427 25 23 295
3659 295 -16 475 -18 440 101 280 -208 97 43 366 370 -116 19 181 61 47 87 -104 35 -171 28 316
3681 316 234 40 -143 -32 -101 40 -105 -156 -102 -109 -30 -121 36 110 -82 -229 178 -202 100 244 -515 -147 -171
3704 -171 -61 -183 1 -26 -6 191 27 -189 158 -42 -145 -67 -94 9 81 114 -206 -42 199 182 -18 223
3726 223 -5 129 327 -29 101 102 68 61 -13 86 223 37 52 5 21 11 -322 71 181 -255 3 343 134 277
3750 277 190 -33 -88 -3 88 -236 209 -241 -163 -16 244 -61 -126 5 -209 -183 182 -153 210 15 -255 -124
3772 -124 -349 -57 -47 107 -69 -224 72 79 -136 -58 170 -37 153 -41 -182 -136 -102 74 -60 288 176 68
3794 68 41 5 75 -52 244 -183 11 231 -38 108 168 38 -179 264 6 34 199 137 87 -282 -107 217 113
3817 113 74 250 -21 288 232 74 35 -48 -38 -15 -76 -157 -243 41 -23 -12 200 68 -234 -74 -443 -324 -141 -24
3841 -24 -95 -297 56 -43 136 -88 -116 -16 55 -413 -266 -96 -134 -404 81 -49 -51 217 -66 25 109 70 -240 -23
3865 -23 -85 -74 118 236 23 132 178 24 199 22 309 64 -114 -32 -121 68 -159 52 39 -61 109 134 15
3888 15 -2 96 87 143 139 83 -288 -97 209 54 71 105 243 136 147 -235 25 154 7 -296 -88 -149 -91 230 -7
3913 -7 -297 15 247 -108 19 -71 -464 -295 -167 -196 -309 24 14 -81 -17 -14 -75 58 103 -232 -85 58 0 95
3937 95 126 -174 -87 108 131 170 113 124 -74 35 -112 -146 4 299 95 314 88 35 414 82 -45 398 240
3960 240 -168 -97 128 -270 66 -302 23 99 -127 231 -114 -88 36 -379 -142 -152 -53 -142 -111 -39 148 300 -90
3983 -90 -223 103 85 -101 47 -190 68 -71 4 -187 -305 47 -112 -253 -86 -28 -153 0 -145 -313 -203
4004 -203 -37 -121 222 359 -188 104 208 -217 -189 -338 -119 55 41 298 13 104 12 -161 260 -21 25 160
4026 160 137 -64 -208 227 -11 -2 -99 212 89 334 97 -65 204 84 149 -28 28 -226 -109 -44 -188 -262 -59
4049 -59 98 -156 -97 -24 -281 191 95 -160 43 -16 -272 -171 24 -21 -74 202 -33 -348 30 -168 -96 -21 -91
4072 -91 -163 9 161 -70 90 116 -55 59 -209 -28 -59 75 -47 297 58 -101 77 12 230 136 286 271
4094 271 -245 -81 245 22 66 181 29 86 238 34 -108 187 139 29 208 147 -51 -176 -91 -174 -59 261
4116 261 -67 110 114 43 -45 -119 -83 -367 128 46 -114 -66 -120 -42 202 -70 19 174 0 -130 -265 199 -9 -281
4140 -281 -181 -258 -10 43 -69 -118 50 80 -43 57 -89 44 112 -13 -249 32 -40 -117 208 20 -190 -119 -103
4163 -103 -135 -4 -53 -118 8 -125 186 70 293 -28 100 73 16 240 1 86 -37 -24 71 86 128 310 -60
4186 -60 301 317 54 -313 -34 -19 -161 30 -21 -191 149 90 260 -124 114 -64 -163 251 -98 -81 -74 -328 -179
4209 -179 -91 -308 41 87 -22 -74 -77 239 -113 -217 -202 -149 -110 -39 -25 36 -111 -24 -204 79 1 -212 -36 90
4233 90 -120 33 190 -288 -103 83 114 -198 241 148 -103 167 275 -54 310 433 35 89 -73 379 109
4254 109 165 -71 54 39 75 11 143 -290 -37 254 84 -183 88 87 20 178 0 -28 216 111 -5 -320 13
4277 13 53 122 105 -35 30 370 154 -314 -186 -147 -196 36 44 -20 -131 -57 71 -312 -151 -74 54 306 -31 -192
4301 -192 -140 -228 -5 -309 165 -349 26 4 -77 54 -31 110 -271 115 -73 -301 87 123 -14 -114 -14 -101
4323 -101 128 -196 20 215 80 122 -188 -16 210 120 166 66 -151 14 -176 -113 113 -22 -5 -1 187 -183
4345 -183 -73 7 -25 -177 1 18 80 216 43 -87 72 -79 -103 -31 -253 -79 -7 -86 -318 -144 -185 -339 -138
4368 -138 119 131 -235 162 -171 -152 96 55 -43 -54 239 51 2 -228 -160 -181 51 -192 -184 156 71 -116 127 -127
4392 -127 -34 405 -111 -12 122 275 -37 51 -10 -230 360 157 60 108 -39 322 -62 451 -54 -134 157 294
4414 294 112 156 -39 -99 116 -17 137 -95 255 -192 -39 98 7 -246 92 -109 24 144 -273 140 56
4435 56 -257 255 -144 -73 -91 -200 -49 -35 116 -255 -173 -148 39 17 -117 -98 -62 -87 -59 19 71 285 7 63 -230
4460 -230 -132 138 120 -86 103 242 53 -36 66 77 -56 81 154 173 -218 -39 -71 90 53 308 116 229 201
4483 201 -12 10 232 20 45 16 -9 269 151 303 -77 -117 63 55 32 254 0 45 214 -113 -67 156 -24
4506 -24 -85 -273 -80 38 17 -86 -12 65 222 -212 311 -38 99 -52 74 -165 -331 -60 -399 -143 223 -44
4528 -44 -54 114 176 -40 -7 -3 -109 -190 -48 -178 1 -11 -253 193 107 28 -357 127 130 46 290 221 16 95 208
4553 208 179 291 172 166 125 25 225 98 141 -153 -98 -14 10 102 281 -38 -159 31 2 34 292 132 13 223
4577 223 -13 -8 -292 45 42 -163 109 -109 -146 164 14 -230 -55 -185 -105 -268 -24 -293 94 154 -174 -99 -131
4600 -131 127 -79 191 -234 -57 -254 99 -110 -95 93 -233 150 -30 61 74 108 -237 -26 103 115 86 57
4622 57 271 71 249 235 86 243 -26 189 -22 128 -65 172 -43 -105 -227 13 200 -40 86 16 -130
4643 -130 111 79 49 86 -12 202 251 18 -427 -258 -3 106 -26 66 29 -1 -232 39 -80 -24 -97 121 152 -72
4667 -72 -386 4 35 -172 10 63 -264 -161 -51 125 -53 117 -138 -37 161 -167 107 -192 4 -82 -57 -112
4689 -112 26 208 -272 -74 -134 127 -74 -89 42 -34 41 217 -68 65 17 41 -171 99 -66 -15 -8 183 0
4712 0 109 -264 166 36 -148 -251 -15 113 3 161 2 19 -15 -125 -140 -185 23 48 -12 20 -218 65 155
4735 155 134 -325 -365 -112 -89 -9 -9 65 136 65 -268 -14 -142 72 181 -77 -172 -127 -176 175 -160 -1 -12 -42 86
4760 86 151 84 109 -247 -68 62 -170 70 211 4 -225 97 8 148 29 62 -2 295 -137 272 83 -208
4782 -208 -16 -138 -129 -17 207 65 82 298 -100 -115 -154 92 -156 210 206 3 20 140 34 -99 204 -212 197
4805 197 -88 46 -359 -319 77 74 -108 -43 -84 -9 -199 -173 -270 33 -223 0 95 -57 -34 229 5 -6 372 -256
4829 -256 -70 74 80 -109 145 -27 -16 -125 -24 -124 135 188 -68 -24 125 181 -278 -43 141 -180 51 69
4851 69 -91 -313 98 -33 -163 209 -217 6 68 64 70 3 33 212 13 -46 -120 235 25 -144 -26 297 -304
4874 -304 60 108 -74 -229 96 161 -164 7 -122 -25 -161 -3 -100 -264 0 -140 -23 83 -67 130 41 -56
4896 -56 -120 -146 -102 -371 281 -199 -11 167 69 -28 -92 34 -85 53 -289 -99 123 96 -49 0 16 86 202 47
4920 47 377 121 70 239 290 3 55 87 166 -84 -41 -188 -5 -143 -37 93 83 -65 76 49 -212 75 8
4943 8 160 25 44 -236 -72 209 14 78 42 -127 40 155 -120 -109 18 -152 21 16 -154 -86 72 44 246
4966 246 118 -98 -197 -386 -57 -227 -203 -173 111 -32 -167 49 227 -42 111 -168 84 -56 5 237 266 -39
4988 -39 17 117 23 105 -18 -131 61 -77 -61 -123 -32 55 -85 235 338 172 21 141 108 95 128 -207 27 3
5012 3 105 96 86 107 -6 71 107 -192 144 85 -178 24 155 -239 -130 -71 22 30 76 -86 -227 72 -60 33 -14
5037 -14 -156 -35 17 1 182 -231 32 -21 -129 44 95 -6 23 -127 28 54 -177 6 47 -166 -216 74 274
5060 274 4 46 -2 155 -99 81 109 -6 12 -23 88 73 27 -38 33 -151 152 151 -187 -343 -20 17 -17 246
5084 246 -79 68 35 315 -35 -175 -62 15 -39 202 -140 -200 11 159 -166 28 -88 224 135 -41 -270 -171
5106 -171 19 -10 -135 314 -186 -124 222 126 -2 -159 -60 -219 -203 -69 -264 -38 -137 9 -160 191 -45 35
5128 35 -11 46 17 -139 128 54 138 153 12 -66 -62 -153 137 4 172 99 48 9 -13 177 -42 -143 180 182 165 75
5154 75 62 243 203 -36 -143 10 4 -116 70 40 -28 25 -19 -99 -50 139 -75 -192 153 -114 60 -40 -65 -81
5178 -81 -200 64 -194 150 73 -51 -126 -19 -263 54 315 69 -139 -195 -107 118 32 -4 -244 5 116 51 -40
5201 -40 80 90 252 59 -46 218 51 -80 66 -9 -66 -227 -174 -66 -129 -43 -232 -284 -207 116 81 189 3
5224 3 165 150 -9 -217 241 52 4 41 226 74 -88 -78 162 40 87 67 53 -23 129 -180 -267 -72 207 -32
5248 -32 175 112 -2 6 158 88 13 -75 -86 31 -221 -60 -45 76 -99 121 -102 -39 -45 -76 31 64 130 -32 93
5273 93 198 309 -65 109 67 -101 -143 7 -25 -286 145 -171 -111 125 72 -106 24 249 46 -123 28 -8
5295 -8 -98 -118 42 15 60 118 -43 259 66 -91 24 -156 12 10 -66 -91 232 -129 61 150 36 -111 -279 87
5319 87 124 -18 44 152 -347 -232 -97 4 -21 145 71 -110 -4 -101 -194 -52 136 -50 0 121 167 215 -166
5342 -166 -60 -27 -10 -101 -328 -65 -22 136 149 43 193 -77 19 -86 42 109 -18 -3 -19 160 -329 18 -108
5365 -108 -72 -89 79 165 25 73 10 -18 -142 4 -171 4 6 -37 163 143 196 -25 103 36 -19 122 9 -217
5389 -217 -170 56 192 -88 -30 158 -80 73 -45 -122 250 98 117 221 -6 19 -228 -250 62 -237 -105 -147
5411 -147 -101 -90 146 9 -41 -14 -21 109 -161 26 -108 -6 -125 41 188 -181 37 -4 -4 -6 -61 -91 213 -187
5435 -187 66 167 -45 66 362 -72 113 -69 95 -67 130 171 -24 258 -76 145 88 210 81 -47 127
5456 127 -95 -100 -17 75 -85 -93 -38 225 -53 -123 -134 57 136 -49 176 -103 127 100 -214 -57 143 93 -138 -76
5480 -76 14 -124 147 144 -81 -91 225 -36 218 -210 -11 -112 95 200 -104 45 38 -271 -14 12 17 151 -10
5503 -10 -116 165 130 1 -8 -79 27 124 61 295 101 119 -40 -206 144 68 -38 -171 239 -173 -61 -98 -113 82
5527 82 -63 -39 138 -311 100 -26 -42 109 -241 -119 31 355 203 -175 64 30 -145 6 -199 -70 -20 17
5549 17 -51 -71 -147 306 -14 -210 76 -73 -33 -257 -70 -303 99 -68 -91 -91 88 145 -236 -42 -271 -159 10
5572 10 -38 -20 -117 -78 -71 -121 41 -304 -6 77 -256 -115 188 -145 -28 373 -34 93 -34 -270 -71 33 -87
5595 -87 -85 -5 207 -194 197 -136 -158 -52 83 -29 -50 -47 47 42 -101 -63 -195 334 55 60 168 -106 -21 7 3 134
5621 134 -67 15 27 40 -23 -89 -131 -157 -177 179 83 86 -35 -40 -139 -107 18 204 215 92 106 -81 -147 163 -65 -172
5647 -172 289 239 167 -31 90 82 137 135 -26 94 64 26 60 47 -107 -24 -143 446 -22 121 83 -170 -148 -179 169
5672 169 88 169 18 -124 135 -112 90 -29 -238 -187 35 153 77 -26 -6 -116 -34 146 -30 -117 138 -66
5694 -66 -86 -124 124 50 24 249 13 48 -237 -314 52 -106 -29 18 -85 -8 153 -52 28 193 211 50 -64 127
5718 127 18 -132 108 -75 -209 -35 58 -121 -142 139 171 92 -150 63 -49 144 -173 0 -33 109 101 92 -33
5741 -33 51 127 66 -126 -88 -21 107 71 -16 11 225 -89 -2 -212 -193 -84 -301 132 -40 15 121 48 -20 37 -182
5766 -182 12 181 -243 21 120 -26 -8 -125 -113 14 -23 -5 151 82 5 100 -150 65 -351 -75 -130 25 132
5789 132 -159 51 134 -19 57 126 98 28 -45 44 241 -9 -123 130 -68 24 -154 11 268 160 -252 92 149
5812 149 38 -7 -57 65 103 258 122 226 -72 280 68 318 180 2 100 -6 -128 -11 -54 19 149 111
5834 111 201 87 -80 58 -132 -228 58 9 28 104 -41 26 49 35 -83 -220 59 156 -102 -294 -60 98 25
5857 25 -90 240 -106 86 97 40 -172 -105 194 50 71 9 154 159 304 -117 14 -107 44 173 -287 -120 105
5880 105 226 71 -19 150 -39 419 -85 -43 -154 -54 -159 159 -73 -284 -130 32 70 -187 -61 -103 -16 81
5902 81 148 43 -94 16 -107 40 45 -31 -44 -155 -42 -112 -1 47 -124 -140 181 152 114 29 50 -122 -148 -178 271
5927 271 -3 -101 41 91 7 20 142 -51 130 -7 -82 110 80 351 124 -272 110 18 -150 171 -22 -140
5949 -140 -67 -137 95 -31 -86 236 122 33 -79 3 50 -53 -44 -136 -125 -52 33 -122 -18 96 18 155 58 -165 -120
5974 -120 -51 41 98 129 2 -36 166 -20 -5 120 -115 198 225 -408 -40 88 114 -39 49 27 120 -220 -65 -46
5998 -46 -56 95 -113 207 -101 -33 126 -145 -58 -63 -144 0 -27 74 -41 9 51 -270 142 -23 -38 153 158 175 94
6023 94 -106 -55 76 53 67 70 -30 43 21 -207 -119 167 -106 -15 14 155 54 -80 -148 214 -85 -231 -24 -82
6047 -82 124 -180 74 14 162 -92 -21 -66 -116 -102 47 -68 157 -110 -21 -134 -51 -350 227 -34 50 -34 53 -43
6071 -43 94 -245 52 69 -18 -71 -181 136 -18 -175 29 99 -35 96 -149 -63 89 -205 -176 93 -25 -174
6093 -174 116 70 -51 -45 -58 188 -121 -125 184 64 252 53 109 -169 -91 -244 261 322 -187 -157 -90 48 -240 -98
6117 -98 37 -300 -147 17 29 157 -121 332 -45 5 -143 -58 134 -6 47 119 146 68 29 188 -84 97 -72
6140 -72 -16 83 12 -127 70 -49 -218 -10 15 -374 33 163 -86 -186 -274 -213 -42 13 132 87 131 -199 -50
6163 -50 28 -128 151 -146 -174 47 -65 35 1 -82 81 -32 12 32 59 252 100 54 -9 22 -100 46 60 3
6187 3 -81 -30 73 170 109 21 23 168 -76 -9 -45 -70 -211 24 -126 -144 21 -55 57 1 -314 -54 -108 -236 51
6212 51 119 57 -152 52 -154 -78 -118 -6 -177 104 -140 -100 -109 52 -109 179 -64 100 43 22 -103 -4 120 -57
6236 -57 -51 -156 -165 138 68 -26 218 20 15 122 -111 -216 24 228 48 107 -114 70 -55 2 -134 -30 220 127
6260 127 37 71 251 52 -117 164 63 68 -7 126 62 -55 -181 18 22 132 -174 68 150 -92 264 63 100
6283 100 206 -109 41 -69 -99 53 74 14 78 151 80 -23 -210 72 -42 -50 61 50 89 6 8 90 -181 1 10
6308 10 42 78 15 -263 241 109 -62 -77 -74 43 55 0 -176 -82 75 126 77 13 111 -7 36 90 -30 196 69
6333 69 -116 -172 -105 56 -80 -7 214 -165 112 79 188 48 38 -108 -126 73 113 -23 69 -101 148 -82 -28
6356 -28 9 12 74 -60 10 -13 -135 73 -104 -38 -55 37 25 -127 -158 -57 101 -17 321 203 298 -27 -149 228
6380 228 -107 -6 -157 -72 -240 -11 -35 -368 314 -63 55 0 -33 -147 15 45 -19 186 79 -157 -50 52
6402 52 4 -35 -37 -173 -211 -79 65 173 164 231 95 26 86 -95 153 91 271 162 149 -35 135 -223 78 35 -172
6427 -172 -59 81 62 -192 18 -84 -54 -111 -16 -123 33 -208 -36 69 54 -159 -15 -123 96 295 19 127
6449 127 39 8 -244 -119 -145 -2 -32 22 -213 198 172 -35 -27 60 143 24 25 -101 -52 -155 124 -7 82 11 -121
6474 -121 232 -108 6 326 189 -276 -41 70 109 -21 99 59 18 61 114 271 97 -115 8 12 -75 315 -64
6497 -64 67 206 -169 -12 -85 41 -29 -149 -142 -255 33 -78 -24 -82 -114 147 33 59 34 139 -26 -168 92
6520 92 -36 -124 -66 -55 -21 -110 -53 -33 42 -58 69 207 -137 -279 292 137 -310 -115 -71 -178 135 -22 -159
6543 -159 -152 17 -120 -164 1 -80 24 -15 -32 82 -22 157 -109 -82 -44 131 242 67 50 73 191 158 267 95
6567 95 -128 -71 162 -194 -3 79 -77 232 -160 -36 -36 -260 -86 -59 8 -105 -36 297 193 -128 -14 -127 90
6590 90 -1 21 3 142 68 167 217 -132 157 -73 -26 -245 -38 -73 161 230 -234 40 -23 -269 -129 -96 -71 86
6614 86 56 -153 -103 128 -22 22 -105 50 249 -2 -172 -20 89 27 -102 -210 -140 -44 125 -98 61 219
6636 219 360 38 35 -68 162 -7 -20 358 -121 141 20 -225 -182 -161 -202 -38 -41 132 -163 -219 82 185 -79
6659 -79 51 209 138 -119 7 40 -247 -56 9 43 -272 -13 77 31 127 -206 -51 38 -8 138 -149 145 -105
6682 -105 10 -173 211 -4 22 403 -256 47 -108 -210 3 29 -153 102 9 30 -57 211 25 -23 191 160
6704 160 -5 179 -38 -45 154 -37 174 -188 -143 -144 -117 49 -36 18 -117 196 -159 -130 124 -4 -109 162 -73
6727 -73 71 -29 58 171 104 101 -91 -81 169 21 -56 33 -88 304 -101 -130 9 39 -69 -121 -103 65 -95 -36
6751 -36 99 19 33 34 -220 118 -21 -91 24 -39 -49 -105 170 -10 169 1 -18 -12 -104 -97 76 -61 86 4 -140
6776 -140 94 -123 138 170 146 253 -25 14 -201 115 -130 74 -18 -141 29 -92 26 -91 127 13 31 247
6798 247 -36 -49 207 15 46 -51 149 -137 -47 8 -40 82 84 -250 248 82 -59 70 -73 -59 142 -184 -134
6821 -134 56 -151 111 141 -25 -193 58 146 215 -65 29 -110 33 114 140 59 -26 5 -156 88 199 86 -160
6844 -160 263 -87 30 -105 90 7 24 17 4 44 123 -221 55 182 186 -164 4 -166 79 -152 -265 -220 52
6867 52 -29 -61 -19 -8 -19 42 97 -221 90 94 -226 -49 187 -100 -30 -30 -14 229 83 -83 -305 24 -148 -132 46
6892 46 95 -80 -37 28 106 200 -331 -82 -43 -39 52 -325 8 -16 -218 -109 43 266 176 -208 -3 -29 46 51 -36 -123
6918 -123 127 110 15 331 29 -27 -41 -25 -39 -8 -144 -78 35 115 125 -121 -60 83 -76 -294 -16 7 114 -12
6942 -12 -166 142 132 -46 -109 -228 62 123 155 144 97 16 46 -143 73 -177 100 8 213 76 -279 36 -63 141
6966 141 49 59 -30 -162 230 197 43 -270 -71 -309 -190 -102 42 25 299 68 -151 79 -84 118 138 -196
6988 -196 -75 25 -138 -236 -50 -59 -63 124 26 81 145 -76 218 30 78 -54 -69 26 -17 -126 50 163 98 -203
7012 -203 0 220 61 -44 -115 255 176 6 3 209 56 157 -200 111 -108 -143 -226 149 82 11 38 -18 63 -156
7036 -156 9 66 -8 128 290 175 -90 -265 69 77 -188 -84 71 119 202 20 -116 1 -10 -93 50 -240 -136
7059 -136 -12 2 -94 158 -62 -3 -72 -54 -121 72 153 89 147 -341 -69 130 98 22 77 89 65 -165 10 -47 25
7084 25 14 -132 7 1 57 -256 106 -129 67 121 31 125 -73 -121 -18 -25 -61 31 129 -125 241 -49 196 -42 143
7109 143 58 -225 -335 -64 -22 11 -29 -3 56 97 34 -223 86 -89 -65 -56 -41 83 -30 -58 -103 -139 -168 -100 69 -27
7135 -27 -105 -73 -359 43 12 -11 22 -101 -101 22 104 -302 -52 201 76 45 -126 33 -23 -6 31 -77 -12 9 164
7160 164 -160 -27 171 -170 37 -174 -334 -31 -7 -116 -45 208 -4 46 -175 203 -16 -166 -59 -273 -11
7181 -11 -67 -147 -61 49 92 -297 32 -37 -181 171 33 132 -286 139 -21 134 -47 -25 -73 -85 210 -79 15 55
7205 55 -151 -90 -46 89 -41 -36 93 129 4 19 50 -146 -40 91 204 68 -32 120 33 -146 170 -38 -81
7228 -81 197 -111 -17 13 -72 -191 92 -65 144 163 -66 63 -202 153 -14 9 23 -113 -5 66 -164 276 216
7251 216 86 -105 -46 -97 -143 -82 -58 -122 -127 98 -221 215 -55 -89 208 149 213 -36 39 -49 -76 155 -309 2 90
7276 90 165 -64 11 -44 93 93 -121 129 136 187 -324 99 165 -237 -55 58 -119 -341 27 44 10 14 201 -90 149
7301 149 60 -72 -75 -32 6 -31 -191 69 124 225 152 -118 80 -235 -13 -116 14 -2 99 -151 -12 5 -15 126
7325 126 230 -331 -135 99 -59 -16 72 147 -255 -81 256 -192 28 55 -107 5 -59 172 -48 66 154 -165
7347 -165 -134 -4 8 10 -169 216 56 110 48 55 160 -197 3 34 -40 68 158 45 250 91 2 100 -184 -188 42
7372 42 -131 248 -175 -78 195 30 -85 -33 -24 -143 -40 113 164 -62 -21 -117 -50 -7 -199 240 -65 270 74
7395 74 28 -119 56 162 -63 -276 53 222 -41 83 195 103 25 -7 -168 -12 -201 112 -68 -72 62 -36 -9
7418 -9 -45 -280 149 -131 119 -78 -103 335 -286 -117 108 -178 19 0 46 87 220 74 13 -82 18 -189 280
7441 280 299 -63 318 126 -5 232 192 245 -26 -274 -185 79 -26 -115 63 -75 43 1 -103 -97 -29 -12 -17 -214
7465 -214 -27 129 133 -203 -83 50 -112 -100 131 82 -88 28 62 24 72 115 37 -127 20 139 -37 -252 41
7488 41 -114 -36 16 23 -274 -86 29 -14 -69 -88 -50 -187 309 -54 -44 -57 94 -22 -55 91 -67 -101 70 -120
7512 -120 -260 23 -97 222 30 -208 261 143 3 -115 148 13 -33 216 -14 -49 105 116 95 -209 157
7533 157 -189 -174 111 -49 -89 107 51 10 74 -73 -19 4 -103 101 -162 117 11 154 97 175 -34 -207 150
7556 150 -192 194 -69 32 -42 -183 214 -62 111 -114 297 32 -271 23 87 82 61 20 79 129 148 -46 -63
7579 -63 266 -68 63 -83 57 70 178 43 -132 -29 -16 76 30 -136 137 28 -85 -77 -227 -216 243 10 -19
7602 -19 204 -249 48 -121 -107 -345 109 107 29 -171 -243 119 117 -148 104 -73 -108 -219 60 11 66 -314 -105 174
7626 174 60 -42 -39 258 -19 66 140 -120 228 -113 -140 -83 -189 66 -183 -75 -289 227 -259 208 215 -263 -57
7649 -57 -201 -118 86 81 -132 -5 161 73 -291 -106 23 -16 121 42 -62 -68 -72 80 201 -30 56 73 -76 79
7673 79 42 -39 55 -171 154 -167 -47 31 34 -57 -32 297 -97 -169 128 -40 157 4 18 -166 24 -21 -268 -78
7697 -78 -82 125 -65 -87 4 -96 -230 25 -85 -89 -206 -166 8 292 -67 61 -25 -111 -19 -38 83 65 99 -102 -43
7722 -43 -171 -228 171 153 -9 58 -23 -160 -151 102 -46 -9 122 23 -105 -98 -116 64 -266 -4 -155 8 -183 -54
7746 -54 61 79 22 -110 -161 22 -11 24 -17 99 72 -98 181 201 -79 28 219 -195 37 164 -114 92 -211
7769 -211 -119 162 -11 -5 -133 -6 239 -33 -246 -191 -38 19 -151 204 -45 -4 -40 44 27 -106 178 -20 6
7792 6 140 -214 44 63 -160 -294 -115 237 -63 90 115 72 38 -170 -28 79 92 -117 -52 161 -53 11 -180
7815 -180 146 74 1 131 33 4 -49 -159 -76 -18 -102 92 -71 92 -1 449 -137 187 36 34 227 -44 -70 21
7839 21 -87 -30 0 137 -154 11 43 -93 -30 -108 100 76 -39 -129 -44 86 49 -93 170 -303 -259 -38 -16 80
7863 80 -36 104 -23 46 -13 -8 -7 -94 -44 -183 78 92 30 -38 123 -181 45 169 -276 215 48 269 -81 -152
7887 -152 -5 -21 137 58 -59 23 -9 -48 -53 27 72 -172 -43 -34 166 73 -36 -40 148 161 20 86 27 -195 119 -201
7913 -201 7 28 79 2 108 -57 -188 -36 84 101 -105 -115 -191 193 -197 -213 -199 23 -126 -229 -127 64 108
7936 108 -174 54 -30 0 -7 26 -59 46 143 76 -116 45 -73 -120 -122 -14 16 125 -54 -6 7 -170 -225 36 -24
7961 -24 -273 292 -94 111 172 -117 47 32 -241 -45 84 108 189 333 102 49 -99 -70 192 -120 98 221
7983 221 2 -123 63 -235 -194 77 195 4 -41 85 72 275 47 -164 -104 -63 -12 83 46 -435 16 33 15
8006 15 -125 87 94 -95 216 226 104 -106 -23 -59 45 -50 196 -138 -241 -88 28 8 193 -69 118 -47 52
8029 52 173 14 69 8 41 212 -132 14 -144 33 62 18 5 253 7 334 157 -329 -153 -176 -191 121 -122
8052 -122 -57 -1 -191 115 24 49 -116 53 -129 14 129 -6 100 120 7 -23 -56 -316 10 -65 -227 196 246
8075 246 -43 113 110 -92 -119 68 96 -72 -122 -54 64 177 -49 -46 -80 -76 -136 84 238 29 -106 229 -162 -186
8099 -186 105 221 -36 -126 108 -48 -29 291 -131 -94 -210 -40 -93 -102 347 206 137 -44 -141 -1 217 -118 223
8122 223 -65 272 -10 97 13 263 190 -165 -114 -243 34 -87 209 -28 115 -55 101 64 79 -57 85 -60
8144 -60 -135 14 -83 55 -93 32 -107 -171 169 142 -80 8 -196 31 -124 41 58 -55 336 -95 37 236
8166 236 -47 198 26 -131 55 29 55 -56 -48 31 -79 -81 202 -87 121 -85 -76 36 62 179 51 -27 -100 -28
8190 -28 -377
8191c77
##END NTUPLES=NMR FID
##END=
