##TITLE=1H_SL78-Dau(f2)
 CDCl3, 8 sc, 
 7.06.2021
##JCAMPDX= 6.0         $$ Bruker NMR JCAMP-DX V2.0
##DATA TYPE= NMR FID
##DATA CLASS= NTUPLES
##ORIGIN= UXNMR, Bruker Analytische Messtechnik GmbH
##OWNER= root
$$ XWIN-NMR		Version 3.5
$$ Mon Jun  7 13:47:03 2021 Russian Standard Time (UT+4h)  she@DPX200
##.OBSERVE FREQUENCY= 200.131506
##.OBSERVE NUCLEUS= ^1H
##.DELAY= (6, 6)
##.ACQUISITION MODE= SIMULTANEOUS
##.ACQUISITION SCHEME= undefined
##.AVERAGES= 8
##.DIGITISER RES= 18
##SPECTROMETER/DATA SYSTEM= spect
##.PULSE SEQUENCE= zg30
##.SOLVENT NAME= CDCl3
##.SHIFT REFERENCE= (INTERNAL, CDCl3, 0, 15.7039)
##AUDIT TRAIL= $$ (NUMBER, WHEN, WHO, WHERE, WHAT)
$$ ##TITLE= Audit trail, XWIN-NMR		Version 3.5
$$ ##JCAMPDX= 5.01
$$ ##ORIGIN= Bruker BioSpin GmbH
$$ ##OWNER= she
$$ F:/spectra/data/she/nmr/H-F/1/audita.txt
$$ ##AUDIT TRAIL=  $$ (NUMBER, WHEN, WHO, WHERE, WHAT)
(   1,<2021-06-07 13:45:35.25 +0400>,<she>,<DPX200>,
      <created by zg, POWCHK disabled, PULCHK disabled
       configuration hash MD5:
       00 E9 B6 7A A2 85 ED C7 34 08 36 98 17 FE 4E 26
       data hash MD5: 16K
       56 71 29 88 A6 FB 94 92 DF C1 43 B4 43 C4 E9 BE>)
$$ ##END=
$$ 
$$ hash MD5
$$ 77 B2 B1 F1 29 57 FD EE 62 CE E1 EC D9 EB 59 CE
##$RELAX= 
##$RELAX= 
##$RELAX= 
##$RELAX= 
##$RELAX= 
##$RELAX= 
$$ Bruker specific parameters
$$ --------------------------
##$DU= <F:/spectra>
##$EXPNO= 1
##$NAME= <H-F>
##$PROCNO= 1
##$TYPE= <nmr>
##$USER= <she>
##$AMP= (0..31)
100 100 100 100 100 100 100 100 100 100 100 100 100 100 100 100 100 100 
100 100 100 100 100 100 100 100 100 100 100 100 100 100 
##$AQSEQ= 0
##$AQ_mod= 1
##$AUNM= <au_zg>
##$AUTOPOS= <>
##$BF1= 200.13
##$BF2= 200.13
##$BF3= 200.13
##$BF4= 200.13
##$BF5= 200.13
##$BF6= 200.13
##$BF7= 200.13
##$BF8= 200.13
##$BYTORDA= 1
##$CFDGTYP= 0
##$CFRGTYP= 5
##$CHEMSTR= <none>
##$CNST= (0..31)
1 1 145 1 1 1 1 1 1 1 1 1 1 1 1 1 1 1 1 1 1 1 1 1 1 1 1 1 1 1 1 1 
##$CPDPRG= <>
##$CPDPRG1= <>
##$CPDPRG2= <>
##$CPDPRG3= <>
##$CPDPRG4= <mlev>
##$CPDPRG5= <mlev>
##$CPDPRG6= <mlev>
##$CPDPRG7= <mlev>
##$CPDPRG8= <mlev>
##$CPDPRGB= <>
##$CPDPRGT= <>
##$D= (0..31)
0 1.2 0 0 0 0 0 0 0 0.06 0 0.03 0 0 0 0 0.0002 0 0 0 0 0 0 0 0 0 0 0 0 
0 0 0 
##$DATE= 1623059134
##$DBL= (0..7)
120 120 120 120 120 120 120 120 
##$DBP= (0..7)
150 150 150 150 150 150 150 150 
##$DBP07= 0
##$DBPNAM0= <>
##$DBPNAM1= <>
##$DBPNAM2= <>
##$DBPNAM3= <>
##$DBPNAM4= <>
##$DBPNAM5= <>
##$DBPNAM6= <>
##$DBPNAM7= <>
##$DBPOAL= (0..7)
0.5 0.5 0.5 0.5 0.5 0.5 0.5 0.5 
##$DBPOFFS= (0..7)
0 0 0 0 0 0 0 0 
##$DE= 6
##$DECBNUC= <off>
##$DECIM= 32
##$DECNUC= <off>
##$DECSTAT= 4
##$DIGMOD= 1
##$DIGTYP= 9
##$DL= (0..7)
0 120 120 120 120 120 120 120 
##$DP= (0..7)
150 150 150 150 150 150 150 150 
##$DP07= 0
##$DPNAME0= <>
##$DPNAME1= <>
##$DPNAME2= <>
##$DPNAME3= <>
##$DPNAME4= <>
##$DPNAME5= <>
##$DPNAME6= <>
##$DPNAME7= <>
##$DPOAL= (0..7)
0.5 0.5 0.5 0.5 0.5 0.5 0.5 0.5 
##$DPOFFS= (0..7)
0 0 0 0 0 0 0 0 
##$DQDMODE= 0
##$DR= 18
##$DS= 0
##$DSLIST= <SSSSSSSSSSSSSSS>
$$ [...]
##$SUBNAM2= <"">
##$SUBNAM3= <"">
##$SUBNAM4= <"">
##$SUBNAM5= <"">
##$SUBNAM6= <"">
##$SUBNAM7= <"">
##$SUBNAM8= <"">
##$SUBNAM9= <"">
##$SW= 20.0188882624521
##$SWIBOX= (0..15)
0 0 2 0 0 0 0 0 0 0 0 0 0 0 0 0 
##$SW_h= 4006.41025641026
##$TD= 16384
##$TD0= 1
##$TE= 0
##$TE2= 300
##$TE3= 300
##$TEG= 300
##$TL= (0..7)
0 120 120 120 120 120 120 120 
##$TP= (0..7)
150 150 150 150 150 150 150 150 
##$TP07= 0
##$TPNAME0= <>
##$TPNAME1= <>
##$TPNAME2= <>
##$TPNAME3= <>
##$TPNAME4= <>
##$TPNAME5= <>
##$TPNAME6= <>
##$TPNAME7= <>
##$TPOAL= (0..7)
0.5 0.5 0.5 0.5 0.5 0.5 0.5 0.5 
##$TPOFFS= (0..7)
0 0 0 0 0 0 0 0 
##$TUNHIN= 0
##$TUNHOUT= 0
##$TUNXOUT= 0
##$USERA1= <user>
##$USERA2= <user>
##$USERA3= <user>
##$USERA4= <user>
##$USERA5= <user>
##$V9= 5
##$VALIST= <valist>
##$VCLIST= <CCCCCCCCCCCCCCC>
##$VD= 0
##$VDLIST= <DDDDDDDDDDDDDDD>
##$VPLIST= <PPPPPPPPPPPPPPP>
##$VTLIST= <TTTTTTTTTTTTTTT>
##$WBST= 1024
##$WBSW= 4
##$XGAIN= (0..3)
0 0 0 0 
##$XL= 0
##$YL= 0
##$YMAX_a= 27545
##$YMIN_a= -16484
##$ZGOPTNS= <>
##$ZL1= 120
##$ZL2= 120
##$ZL3= 120
##$ZL4= 120
##$ABSF1= 10
##$ABSF2= 0
##$ABSG= 5
##$ABSL= 3
##$ALPHA= 0
##$AQORDER= 0
##$ASSFAC= 0
##$ASSFACI= 0
##$ASSFACX= 0
##$ASSWID= 0
##$AUNMP= <proc_1d>
##$AZFE= 0.1
##$AZFW= 0.1
##$BCFW= 1
##$BC_mod= 2
##$BYTORDP= 1
##$COROFFS= 0
##$CY= 11.3945322036743
##$DATMOD= 1
##$DC= 2
##$DFILT= <>
##$DTYPP= 0
##$F1P= 15.9154993809931
##$F2P= -4.1035820241983
##$FCOR= 0.5
##$FTSIZE= 0
##$FT_mod= 4
##$GAMMA= 1
##$GB= 0.15
##$INTBC= 1
##$INTSCL= 1
##$ISEN= 128
##$LB= 0.24
##$LEV0= 0
##$LPBIN= 0
##$MAXI= 10000
##$MC2= 0
##$MEAN= 0
##$ME_mod= 0
##$MI= 1.114404
##$NCOEF= 0
##$NC_proc= 0
##$NLEV= 6
##$NOISF1= 3.799351
##$NOISF2= 2.8
##$NSP= 1
##$NTH_PI= 0
##$NZP= 0
##$OFFSET= 15.70392
##$PC= 1
##$PHC0= -11392.07
##$PHC1= 6.601012
##$PH_mod= 1
##$PKNL= yes
##$PPARMOD= 0
##$PSCAL= 0
##$PSIGN= 0
##$REVERSE= no
##$SF= 200.130013532006
##$SI= 16384
##$SIGF1= 3
##$SIGF2= 2
##$SINO= 400
##$SIOLD= 16384
##$SREGLST= <1H.CDCl3>
##$SSB= 0
##$STSI= 0
##$STSR= 0
##$SW_p= 3612.71676300578
##$SYMM= 0
##$S_DEV= 0
##$TDeff= 0
##$TDoff= 0
##$TI= <>
##$TILT= no
##$TM1= 0
##$TM2= 0
##$TOPLEV= 0
##$USERP1= <user>
##$USERP2= <user>
##$USERP3= <user>
##$USERP4= <user>
##$USERP5= <user>
##$WDW= 1
##$XDIM= 8192
##$YMAX_p= 0
##$YMIN_p= 0
$$ End of Bruker specific parameters
$$ ---------------------------------
##NTUPLES= NMR FID
##VAR_NAME=  TIME,          FID/REAL,        FID/IMAG
##SYMBOL=    X,             R,               I
##VAR_TYPE=  INDEPENDENT,   DEPENDENT,       DEPENDENT
##VAR_FORM=  AFFN,          ASDF,            ASDF
##VAR_DIM=   8192,          8192,            8192
##UNITS=     SECONDS,       ARBITRARY UNITS, ARBITRARY UNITS
##FACTOR=    0.0002496,     1,               1
##FIRST=     0,             0,               0
##LAST=      2.0444736,     0,               0
##MIN=       0,             -16484,          0
##MAX=       2.0444736,     27545,           0
$$ Real data points
##PAGE= N=1
##DATA TABLE= (X++(R..R)), XYDATA
0 0 0 0 0 0 0 0 0 0 0 0 0 0 0 0 0 0 0 0 0 0 0 0 8 -8 8 -8 8 -8 8 -16 16 -16 16 -24 24 -26 32 -33 40 -42 48 -54 58
43 58 -66 72 -80 89 -98 107 -118 129 -144 160 -176 192 -213 237 -262 293 -329 373 -425 489 -573
64 -573 685 -842 1084 -1502 2430 -9318 14659 20160 -15759 -4257 7354 -5836 -9148 2224
78 2224 488 -72 -1178 -4289 -861 4504 -719 -3642 -1502 271 932 1840 -200 -1413 -254 2244
94 2244 2295 737 240 547 -239 383 1289 2501 3573 -196 -3802 2607 6005 -1234 -2536 2923 727
111 727 -1188 2880 2097 -1017 58 -317 -74 3753 2023 -3782 -2520 2747 3138 326 46 1070 -981
128 -981 -2180 1705 3223 -692 -1383 1290 1358 1117 1188 -561 -1161 -621 249 2768 1851 -2248 -648 2640
146 2640 -327 -1952 396 -12 -998 84 298 1360 1255 -3227 -3873 1129 1611 -1319 -179 739 -1765
163 -1765 -2383 160 1570 -252 -2127 -1087 155 -136 533 634 -1448 -1132 872 494 94 350 -1155
180 -1155 -798 1741 1132 -489 393 289 -780 267 1255 445 -341 -243 443 1079 383 -618 -240 515 322
199 322 -206 -78 247 -453 -569 922 1130 -589 -1013 -599 -610 177 620 208 419 -356 -1757 -14 1372
218 1372 -955 -1442 924 542 -740 332 612 -751 -1152 -428 639 883 -406 -907 144 221 -320 49
236 49 219 -631 -1040 180 1211 167 -1199 -313 518 -370 -227 480 -191 -648 -201 136 516 230 -808
255 -808 -235 630 -302 -360 651 -94 -744 332 503 41 135 -200 -293 382 240 -246 228 424 -151 -214 370
276 370 557 -57 -617 8 671 268 -44 146 19 132 212 17 99 -63 -488 285 1032 92 -355 113 -315
297 -315 -383 569 611 -8 -171 -259 90 514 -144 -557 236 319 -313 4 447 -48 -536 -197 448 300 -420 -285
319 -285 208 -161 -331 304 362 -263 -490 -124 242 28 -308 -18 196 -307 -243 353 77 -419 -203 75 130
340 130 107 -163 -132 93 -105 -10 310 -81 -408 -76 125 148 162 -111 -148 145 46 -108 76 37 -112 99 168
363 168 99 80 -179 -227 200 228 -86 2 127 6 -13 111 222 17 -307 -69 393 156 -45 204 69 -233
385 -233 -56 264 294 -4 -279 13 350 -1 -170 258 82 -327 17 340 19 -221 -161 80 211 53 -99
406 -99 34 -96 -293 58 360 -46 -275 -59 113 -28 -195 -13 99 -157 -176 159 44 -185 -137 -40 80 125
428 125 -191 -239 71 -49 -133 208 127 -174 -160 -151 -92 223 -27 -246 119 71 -215 -46 100 -173 -159 68 200
451 200 90 -204 -239 117 64 -145 144 191 -250 -223 195 298 42 -222 -52 233 11 -105 213 152 -230 -94
473 -94 339 272 -68 -199 75 239 -49 -64 277 73 -234 61 249 -3 -83 -23 62 93 -14 47 150 -130 -265
496 -265 159 178 -160 -37 113 -37 9 74 51 32 -56 -130 131 179 -52 -115 53 120 114 -31 -100 12 1 -6 128 56
522 56 -19 -117 -221 12 205 -153 -212 139 8 -245 29 50 -226 -151 28 29 30 -187 -231 152 22 -226 141 243
546 243 -286 -261 216 191 -131 -69 112 90 -117 -82 138 92 -111 -54 177 188 -122 -160 142 139 -155 70 299 -123
570 -123 -259 133 168 -80 18 7 -77 32 -10 -69 91 -29 -126 130 109 -188 -83 60 -21 27 77 -29 -27 14 -51
595 -51 35 82 -25 -26 -22 57 61 -41 -28 30 -39 -58 78 58 -47 -87 -43 50 107 -115 -111 85 -7 -179 42 78 -147 -158
623 -158 6 62 -64 -141 5 64 -77 -74 120 73 -171 -106 105 56 -83 -43 75 76 -107 -10 156 27 -129 81
647 81 160 37 -38 33 9 94 42 33 75 -34 -104 55 117 -18 -18 36 24 -34 -12 46 27 -9 -3 36 47 3 -15 -56 45 110
677 110 35 -16 51 -16 -42 43 52 -53 -28 -11 9 33 -19 -46 53 14 -66 32 39 -47 -116 28 41 -37 -33 -25 -17 -94 -67 53 37
708 37 -80 -87 4 26 -50 -57 13 -5 -119 -61 89 -14 -105 14 52 -22 -4 22 6 -24 -5 -23 45 12 -82 37 77 21 -16
737 -16 22 37 -29 8 61 49 2 -6 13 5 22 -29 -15 -16 27 -10 21 31 3 -29 8 28 -15 -21 -16 -9 70 10 -18 15 51 -22 0 66
771 66 2 6 -12 3 1 15 -4 24 2 -21 5 30 6 -26 2 27 20 -5 -7 -3 -57 -71 12 49 -36 -40 20 -33 -27 -28 -9 10 -40 -41 17
806 17 34 -50 -42 17 -4 -18 12 6 -30 -45 1 10 6 -53 -11 34 27 -25 -4 38 -53 -32 12 9 28 -43 -13 14 40 -16 19 -8 -8 -27
840 -27 -27 14 23 -47 -25 1 21 -13 -11 -5 24 -5 1 18 10 1 -35 66 38 -4 -10 -2 47 32 19 7 25 -26 16 57 42 -18 16 59 -20
875 -20 14 34 34 -2 -76 -3 61 23 -29 14 16 -6 11 22 15 -36 -37 23 36 -77 -30 4 -48 -19 -5 4 2 -42 -39 34 50 -14 -34 -1
909 -1 -10 -6 29 -24 -7 0 16 8 17 -1 -7 20 47 0 -4 9 -23 -27 -8 13 45 -31 -33 -4 5 3 -33 -5 14 3 -44 18 17 -86 -27 35 2
946 2 -49 -17 19 2 -33 8 56 24 -52 10 57 15 -18 12 43 -25 12 63 37 -11 4 64 54 15 3 42 5 -32 19 17 8 -30
978 -30 -15 24 8 -33 -5 -6 -43 -10 25 -24 -39 -33 -16 5 -5 -15 -30 -14 -24 -7 16 -20 -16 14 -1 -6 16 -6 -32 3 29 -14 -13
1011 -13 25 -8 1 4 15 40 -27 -39 41 9 13 -2 23 50 -28 10 38 14 -39 0 44 0 -13 3 17 -18 -28 -14 42 -14 -37 12
1043 12 30 0 -21 41 28 -32 -5 37 31 0 -1 35 55 5 26 17 -2 8 21 45 -25 13 9 14 13 2 -13 -7 -7 8 -2 -26 -11 -7 -39
1078 -39 11 6 -26 -35 -48 -10 -12 13 -27 -16 -18 -30 -3 17 -27 -16 14 16 -20 4 36 -2 -24 4 33 4 -4 22 34 17 24 35 7 -12
1112 -12 -4 35 22 -3 -3 26 32 4 6 26 15 -1 15 28 21 -40 -25 -11 19 -33 20 6 -1 -15 -11 -9 11 -5 24 3 21 -30 -14 -4
1146 -4 2 3 3 -13 2 -12 7 27 24 2 -12 14 -8 10 9 22 22 3 -19 29 4 -6 -13 -7 -3 -2 -10 -3 -23 -18 -37 13 -8 -2 -14 -13 -31 -20
1184 -20 -12 -6 -34 -8 9 14 -8 -36 -7 -4 -21 -10 16 -25 5 25 26 4 -15 11 23 -8 1 26 16 15 9 -6 29 -12 -2 7 -6 -3 12
1219 12 15 -14 -23 -19 -21 -7 17 1 2 -27 -2 -21 -11 -18 -15 -11 17 4 -10 -20 15 9 16 9 -5 12 0 1 -37 2 19 14 9 18 -3 -2 2 11 -5
1258 -5 -17 29 0 -19 -24 26 -2 -19 -21 1 -37 -9 -16 -8 -26 1 17 2 -4 -28 0 -24 5 21 -9 8 -1 -14 -1 17 9 45 -11 -5 3
1293 3 16 14 5 17 21 7 -4 15 2 -1 -24 -2 30 11 -13 -9 3 -26 -20 13 14 -22 7 -18 -13 13 -15 6 -18 1 11 -34 -19 21 -22
1328 -22 -10 -16 -19 -7 -19 3 1 2 -25 11 14 16 20 29 34 -17 17 30 16 -12 15 6 40 24 51 32 -16 5 2 23 -23 -22 -6 -4 -9 17 -7
1365 -7 29 -19 -33 30 20 -44 -33 0 1 -28 -7 -8 16 18 -20 -5 -25 -11 -8 27 -8 -5 7 3 5 45 44 11 5 31 21 -23 7 8 24 3
1401 3 -13 15 17 -5 60 -16 13 2 10 -36 -1 -32 40 -5 -56 -21 -16 -38 -31 17 -5 40 -31 18 -17 -27 21 29 9 12 -22 -5 1 2 12
1436 12 57 20 4 -1 8 -41 -18 -9 -12 2 -7 -17 27 11 -1 30 15 -54 -17 0 -18 -13 9 27 -8 -18 13 -43 -32 -31 -26 7 -5 -17
1470 -17 -41 -21 25 -11 -7 -27 -40 -16 19 -25 5 -10 6 -33 5 37 -27 -22 -6 33 15 27 -9 -25 -27 12 33 55 18 -6 7 -31
1502 -31 -14 -37 11 -35 -25 -20 29 -56 -7 8 -54 -53 -19 3 -29 -36 -36 -7 3 -20 -26 -1 -32 -13 -35 36 -11 -14 -4 12 -5 14 7 -15
1536 -15 30 -12 19 33 0 -3 14 34 -21 5 29 -21 -12 11 -35 13 -15 -34 16 -8 -27 10 17 5 25 22 -30 -20 25 -9 -18 27 26
1569 26 -19 7 4 34 -19 -22 40 6 34 52 4 30 -8 7 53 0 -23 -4 -7 14 -17 17 25 1 11 18 -14 -42 -4 3 -18 -5 2 8
1603 8 -37 -35 -24 12 -25 -52 -4 -8 -40 -13 -19 -11 -26 -25 34 19 34 -19 27 25 11 19 21 0 23 36 17 -13 15 4 -5 -21 28 19 -28 12
1639 12 39 19 -3 48 -16 -17 -26 15 16 15 14 0 -14 -42 19 20 -23 -26 16 -5 32 -4 15 -8 -21 -22 74 2 -43 -36 50 24 -7 13 59
1674 59 -3 -35 14 17 18 -6 -33 23 10 -9 17 -12 14 3 4 4 -7 -25 -19 7 22 -2 -39 -29 -21 11 6 -43 0 -9 -17 -12 -7 -1 1 -20 10
1711 10 32 -4 -20 -15 30 -23 7 27 36 -15 -15 24 -18 20 13 20 -26 35 12 -13 13 8 8 15 26 -28 37 -9 9 24 18 18 -31 1 49
1746 49 13 -27 30 10 9 12 18 -23 10 -19 75 10 20 -16 11 -24 -61 -23 -11 13 -21 39 32 -16 -30 -8 3 -12 3 -5 -17 -28 3
1779 3 4 18 -6 34 17 0 -15 -43 -22 -24 13 -26 -32 6 26 -26 -57 -12 -4 14 -8 15 -22 -16 -7 7 -13 -2 -8 47 26 -19 39 13
1813 13 15 28 24 30 17 10 50 -7 33 15 32 59 -44 -7 17 53 7 10 28 40 15 -13 48 11 11 -11 0 11 12 -6 24 -9 8
1846 8 27 2 -41 3 22 17 8 -39 9 0 -8 -36 -25 26 -21 23 6 -25 -20 -4 8 22 11 -4 -21 4 18 12 -9 37 56 16 -27 -2
1880 -2 20 10 -15 -5 18 -25 -24 -2 1 -31 -42 -5 -30 -4 -15 -2 9 -5 24 15 -4 -4 -14 -7 1 -18 -1 37 15 34 11 14 32 22
1914 22 -9 21 -5 4 25 18 -7 10 24 2 -19 -33 45 14 14 33 28 -4 8 6 5 -46 -5 -6 11 -8 -19 -23 -41 23 25 -40 6 6 -17
1949 -17 -16 -11 13 19 -15 -36 0 40 -9 -21 11 -6 1 -22 40 5 17 12 11 9 -2 3 -40 55 14 3 -21 -2 -5 -18 25 42 9 -75 -40
1984 -40 -17 -29 -5 8 11 8 -37 -15 -33 4 -13 9 -4 25 -3 -9 -14 29 4 -26 36 11 -35 -16 -11 43 33 -19 27 0 17 5 15
2017 15 -18 -18 29 -14 37 -15 3 4 -35 19 -19 -45 19 -14 -72 -28 39 -19 55 7 39 -55 -125 21 31 -43 -9 7 -3 40 -27
2048 -27 38 -20 37 18 -57 -22 -2 -13 32 21 46 25 23 14 40 -8 24 9 95 -28 -23 -27 -8 -25 6 -139 21 -14 14 9 -63
2079 -63 2 -5 -27 -36 -55 -54 -32 -19 -23 7 -18 0 -31 -25 -34 -118 -24 -29 -14 93 8 -39 17 -32 6 -57 15 15 3 -27 -16 6 -41 -27
2113 -27 54 -2 9 25 5 10 -12 25 -20 44 -55 30 7 12 -24 19 74 13 21 19 -22 62 -63 22 34 -6 5 -47 -26 -7 7 16
2145 16 6 49 18 36 -5 -30 18 10 -55 21 33 41 -30 -50 -21 -5 -39 11 5 -8 35 -6 -38 -7 16 -18 -15 0 -18 -73 -18 -25 10
2178 10 19 5 -11 0 20 -37 -15 17 1 26 14 9 -24 -31 -27 13 24 6 -17 66 28 0 -1 24 0 27 24 -9 34 1 -4 -13 18 5
2212 5 18 -11 3 -2 24 -33 27 68 -8 28 -44 -13 -24 -20 -6 17 9 -39 16 -8 -39 -4 -3 7 -54 6 3 -1 -16 11 4 -14 -24 -14
2246 -14 58 -3 15 6 -30 18 3 -2 -25 -4 -10 21 22 27 16 19 27 -23 31 -6 -7 0 20 14 21 -3 12 -27 -42 12 -13 52 51 25 15 -43
2282 -43 1 -23 -3 38 5 -50 -18 -44 -3 -15 30 -11 2 15 37 12 -10 22 7 23 -7 36 18 0 -25 -31 13 -2 29 -31 -43
2313 -43 6 -8 -4 -25 1 -41 1 -9 36 -7 -52 29 27 -73 -20 -16 -34 30 -15 36 -13 -40 11 -4 -24 -5 3 30 -5 0 0 38 -33
2346 -33 31 31 -12 8 4 13 -4 -3 25 18 7 -24 -12 7 -2 35 -32 0 32 2 -3 45 -60 -14 24 15 -34 -55 11 -51 0 1 28 21 -14
2381 -14 -35 8 62 1 -28 17 22 12 22 42 21 -33 14 -10 12 -11 7 36 -20 8 29 4 18 17 11 -34 -20 25 53 5 7 -17
2413 -17 1 2 24 -19 -3 -10 15 13 2 17 -7 15 -15 12 33 -27 -8 -24 62 50 13 36 -20 8 24 55 -14 5 7 15 4 7 1 20
2447 20 17 -6 10 -12 -2 -15 -30 19 48 -33 1 -35 -26 -9 5 -14 4 10 21 -28 -14 32 -7 -26 -2 -36 3 31 -15 47 9 -13
2479 -13 -8 32 3 -42 20 -6 -17 56 24 14 20 -17 8 9 29 -3 31 16 -8 -18 -6 -1 -44 23 10 -10 50 -25 33 2 -10 10
2511 10 -11 -28 21 -2 4 23 34 39 -40 5 6 -6 -14 -11 -11 -19 58 10 38 24 40 9 -24 40 -2 -12 11 -15 34 -16 -8 12 60 -13
2545 -13 -17 -33 -2 -14 -27 -15 6 -28 12 -33 25 -32 -37 14 -7 -21 -28 -4 6 -42 9 10 -6 42 -38 -5 -11 5 -14 49 25 -24 0
2578 0 8 38 -4 38 18 60 15 66 46 28 -16 20 -13 -26 49 -10 8 40 66 -17 22 -65 12 31 -18 -15 0 -26 -13 14 -13 -14
2610 -14 21 -4 -15 -33 -8 3 -36 -4 -52 -21 -41 41 38 -21 33 23 -23 44 -61 14 46 90 10 -55 8 130 4 -6 6
2639 6 0 -52 7 0 -60 -14 14 39 -26 32 -60 -37 17 14 25 -24 40 37 39 10 -76 -43 85 -26 -4 -38 -53 21 -44 -3 -31 0
2671 0 36 61 11 6 30 -26 18 97 0 30 -5 70 36 15 -14 13 119 -35 12 14 25 -31 51 5 -75 -3 27 41 25 5 28
2702 28 -35 -14 -7 2 75 -25 16 6 -37 16 -19 -5 -70 -16 -12 47 -12 -37 -30 -32 14 2 -38 34 82 15 0 -13 24 -3 -14 -27
2734 -27 8 -16 -54 -41 -12 60 17 30 -28 -11 -24 -22 3 8 62 -27 23 -48 32 -30 -6 25 4 9 9 2 26 -16 -39 -28 15 36 -74
2767 -74 -49 -11 -35 3 22 -8 3 6 -24 22 30 35 18 38 -16 4 -7 -4 11 -13 -15 20 -42 -20 5 33 4 -14 -19 -4 -5 18 31 -2
2801 -2 -11 -7 2 -28 1 -30 -21 10 -35 4 28 -28 11 40 28 9 27 -7 -16 -23 -24 -29 1 -7 2 -21 -10 18 38 20 27 -1 44 8 -17 22
2837 22 -58 -30 11 -36 20 -31 -31 -18 -40 3 45 -5 -11 4 -20 44 33 -10 -50 -33 15 41 23 51 10 -22 41 22 -16 -16 -4 21
2869 21 -5 92 14 11 -11 -19 -17 -16 6 -2 -5 19 26 -30 2 7 -10 -63 -28 -20 -73 -11 -6 -4 8 -13 64 -31 -18 2 12 -36 -32 10 -15 -23 -12
2906 -12 24 -10 -6 -31 14 18 12 30 -11 28 -19 -9 -10 58 22 -10 23 25 -16 16 17 3 35 -17 6 -19 33 -12 21 20 -8 9 -9 1
2940 1 38 -47 27 10 -30 -2 -52 -7 -5 -35 0 -14 26 5 15 24 -44 3 -12 6 -23 16 6 42 5 37 1 26 30 11 49 -4
2972 -4 -25 43 -18 20 -8 2 29 -51 -10 -10 30 -3 38 -70 -43 42 19 6 11 -1 -47 -52 8 14 0 -10 16 5 8 26 -25 -12 15
3005 15 -2 1 29 39 12 16 -13 60 33 21 -33 67 50 -40 -12 -9 -43 39 15 -30 -8 -59 6 -34 -2 21 -38 -31 14 2 -12 6
3037 6 -31 -38 33 -54 -27 -2 24 23 0 13 -28 -9 9 -36 -36 29 -27 15 -23 -6 14 1 41 40 27 16 -50 -24 31 -14 -64 -2 -39
3070 -39 -11 -10 9 -11 11 20 -4 -19 -18 30 -15 -1 -20 -27 -6 -4 -32 10 25 -15 18 15 -13 6 13 2 -6 -6 3 -8 29 27 24 1 27 32 62
3107 62 28 -16 17 -39 -51 6 35 -14 -14 27 -12 31 -4 -30 22 -8 6 28 6 -14 37 -2 1 -33 10 -9 -15 -28 -33 7 -17 5
3139 5 -4 -17 7 -15 -16 -3 -12 14 -18 -4 -8 -21 -18 -20 -10 -28 -16 5 29 0 4 6 -12 17 44 -3 -6 -15 -30 -15 28 -6 -2 44 41 9 -38
3176 -38 11 13 13 -33 -4 -40 20 29 -11 -34 0 -20 -20 13 3 31 -22 19 33 -6 24 5 9 -22 20 -6 -4 15 5 -5 -25 22 66
3209 66 20 -39 22 2 9 -11 -1 6 -10 26 -10 3 18 -10 20 16 9 -19 -2 -26 56 9 -4 -37 -22 9 14 0 -11 -1 6 27 36 -15
3243 -15 4 -15 -2 -36 -10 19 -11 -2 -5 24 36 13 -62 -28 -5 16 22 2 -17 -21 22 -27 -6 -21 40 10 -15 17 31 44 -3 -17
3275 -17 -1 -38 20 17 25 -34 3 -18 -4 25 -14 55 7 -69 -17 -37 -22 20 -45 39 -22 -22 33 1 -32 -3 3 -14 -19 -18 15 -10 20
3308 20 12 -46 15 -13 43 -3 1 -22 -6 6 -28 7 -29 7 -71 -15 13 -32 -5 31 -32 -14 -14 -55 -50 -7 -3 -44 -36 -14 10 14 2 14
3342 14 3 -34 -23 -11 16 -23 2 29 24 -23 29 8 -15 -12 18 5 12 -29 -10 -24 -57 -47 -1 -1 -15 -14 -11 -30 45 -21 11 1 -25
3375 -25 5 -23 -64 -54 -4 -33 26 -18 -25 -13 -8 -54 -9 -1 -13 7 -41 -14 -9 8 13 13 22 -7 -12 32 -6 -29 31 31 21 12 -33 -31 -53 11
3411 11 -33 -24 -1 5 -20 -10 -25 -5 37 -18 -36 12 -27 -20 -16 7 19 -6 0 -4 -12 -4 -1 28 10 25 18 8 19 10 -33 33 3 -5 -15 -3
3447 -3 44 34 9 3 2 21 -22 15 -27 -6 -9 -7 7 3 -4 0 -5 -8 -48 15 1 -24 -6 -10 7 -5 2 40 69 62 11 -11 -2 -1 -3 18 19 11 11 36
3487 36 11 2 47 -8 -2 52 -19 6 -8 -5 19 10 20 -19 -8 -2 -8 -4 6 11 30 -26 -17 -55 10 -59 -16 27 15 -28 -18 12 21 14 -37 -1
3523 -1 23 -20 18 -10 -10 -8 -22 27 6 5 4 36 12 21 5 -24 -5 31 24 -5 -4 -9 -1 -2 -2 10 13 -18 -5 -29 -4 2 -9 -52 -31 7 0 -25
3561 -25 12 1 1 -8 9 12 -13 20 1 14 11 -8 -21 -13 -27 24 -1 0 49 6 -42 -16 11 9 10 13 17 32 19 14 27 26 39 -1 -22 -19 -14
3598 -14 -36 13 -9 33 11 7 -5 10 -72 29 13 22 5 0 -21 34 -15 41 9 12 -15 -7 13 -12 -29 23 12 -12 13 37 -20 -33
3630 -33 13 -12 0 21 17 -6 1 18 21 -10 28 -9 -18 21 -29 1 19 -10 -6 13 8 -5 -6 -15 -46 -20 -32 11 -31 -22 -10 19 18 -9 -3 -30
3666 -30 -22 -17 -20 -29 27 27 28 31 -23 -19 16 -12 26 4 17 -4 10 -29 16 -19 -5 27 -7 0 -5 -4 -2 -27 9 25 -4 7 -23 -2 13 -49
3702 -49 19 -34 -2 -14 -15 -3 -47 -25 18 -12 -14 -27 46 -13 -61 -35 23 2 6 -4 5 -29 28 28 -13 -7 -51 41 17 8 45 0 5 28
3736 28 -5 -8 -10 9 -14 -7 -9 36 23 14 -16 -35 32 -19 -9 -14 2 10 -34 6 5 24 -22 -4 -6 -28 20 -29 -2 -52 9 31 -7 -41 3
3771 3 24 -16 28 20 11 27 9 -4 -4 -12 9 4 9 14 12 -4 -12 -3 -2 -14 -7 -8 -3 5 -5 8 -16 -4 -25 18 -15 -8 -11 -56 1 -1 -35 43 -23 -5
3811 -5 -8 -22 -18 0 8 -6 42 -3 3 -29 -19 41 24 -7 -6 15 -7 6 -21 22 -14 -44 -6 -10 -55 7 -10 -26 -32 -59 -26 -19 27 -33 -29
3846 -29 -10 40 -20 -2 -32 46 18 29 4 -13 27 -6 41 49 -28 -13 23 -14 21 -5 -21 -19 38 0 16 1 34 -33 16 -13 8
3877 8 -11 -31 -18 -9 -52 -31 -8 0 2 1 27 6 -7 -36 -24 -7 -5 -51 -7 -61 -42 34 -23 -19 14 -11 5 13 19 -3 -30 -37 26 30 14 -11
3913 -11 4 0 -12 25 49 -43 70 5 -2 -17 -24 -17 19 11 24 34 -9 -6 15 -1 -20 -20 12 -18 -4 31 32 -6 -40 -25 -23 -30 -12 -5 -19
3948 -19 -30 -5 -35 -3 15 -7 17 -9 -19 -10 55 -10 17 12 26 -2 45 -2 -8 -15 -11 10 -2 -16 12 7 22 -2 -19 -18 -14 12 12 10 -29
3983 -29 -26 9 -15 -5 -10 -24 -9 -2 13 -4 -42 -4 29 17 -12 -20 2 -8 -20 -19 -31 20 6 -9 36 27 7 11 -6 27 2 17 4 8
4017 8 -23 10 -12 19 4 26 -13 15 -6 8 5 -2 -5 31 29 21 -25 -9 -5 -47 22 -31 -38 1 -6 -2 1 21 5 -5 13 -8 24 20 -10 -28
4053 -28 3 29 -8 35 9 18 -1 -9 36 -11 -5 -5 21 0 22 -45 -13 13 47 19 3 -17 9 -4 -14 -12 -61 -18 -45 8 10 -17 -47
4086 -47 -33 -16 -16 5 -5 -34 -14 -2 -16 -12 -20 2 21 1 0 -15 -4 26 36 -8 9 10 11 28 -35 -1 15 -3 -33 -10 -42 29 21 3
4120 3 15 -11 -35 7 -25 8 -8 -31 -10 -40 9 -17 -53 28 5 -41 22 38 -18 -10 -30 49 29 -14 23 -4 -12 -13 -14 -42 23 8 -15
4153 -15 19 4 -23 1 -10 -10 4 -1 -7 13 -31 -17 9 -9 -15 -29 -5 -4 -8 3 7 -14 4 -21 25 23 10 0 -35 -12 -12 -40 -33 -16 -36
4188 -36 22 35 7 -33 23 -39 2 2 6 5 9 1 -9 -35 -4 7 0 -16 15 4 -15 -10 -25 14 6 18 30 -13 -4 -18 2 19 -16 14 4
4223 4 12 8 -20 -25 -9 0 -10 -18 -1 -31 -5 3 -59 18 -10 -18 -6 -25 14 10 -3 5 14 5 26 3 9 7 12 16 0 6 0 6 -21 8 20 -6 14 6
4263 6 3 -22 15 2 12 20 -18 -7 -12 13 -9 -13 -9 -13 -25 1 22 -11 8 3 -15 -19 13 -10 41 0 -6 -26 -7 -20 4 -9 22 14 -9 18
4299 18 18 -16 32 27 19 -5 -8 -3 -13 11 -7 -4 -9 10 -1 10 3 -27 -4 -9 -19 7 -23 7 -30 -5 -14 2 9 12 -25 2 18 18 -4 6 10
4336 10 0 0 -3 2 -23 -12 -15 27 30 -1 -1 7 0 -13 27 -8 11 -7 21 -44 -3 -26 -34 -18 -19 1 -8 -1 -10 -12 -6 0 -23 -5 -20 -13 -11 -37 5
4375 5 -14 -25 -12 -5 5 28 18 -1 10 1 -4 4 -20 -8 7 -12 18 10 -9 9 1 -26 -6 -8 9 21 3 -9 -7 -14 -4 -17 -10 14 3 -12
4411 -12 -22 -11 20 14 9 -9 7 -13 -16 -2 -31 10 -11 2 14 10 8 -16 9 -3 2 0 -2 -15 -16 -18 39 -10 -11 -2 -19 -11 18 6 -6 20 8
4448 8 -24 6 -11 -12 32 7 -6 2 -4 14 -8 -17 10 8 15 -1 -14 -18 -3 -6 -7 11 -13 -8 7 0 6 31 7 -4 -1 -5 -13 -1 6 1 12 6 3 17
4488 17 0 20 -14 3 -1 -1 -9 1 -14 6 5 -7 2 13 12 -8 1 -25 12 3 3 -16 -32 -1 -18 -20 -6 -38 -3 -6 -9 -8 -22 9 -13 0 -6
4525 -6 10 28 8 -14 21 -37 0 -27 4 1 -13 6 -4 7 10 1 -17 6 24 -10 14 23 1 -5 28 19 -7 6 -8 3 -14 -29 0 8
4559 8 -7 -1 -7 9 -14 2 -2 -4 4 -2 -7 -16 -26 -1 -9 -7 1 -10 0 -20 -11 11 -11 1 8 8 30 -1 1 6 7 -1 -1 13 3 -4 7 19 11 -13 22
4600 22 5 9 3 -9 28 -13 0 -13 6 -2 -14 -2 9 -21 -9 -32 -12 -17 -11 23 10 7 8 30 25 -2 25 0 -1 27 4 1 8 2 15 -14
4636 -14 19 11 -13 -9 4 18 -2 -6 -12 1 -10 -11 -10 0 -19 7 7 2 10 -21 12 -8 -16 -30 1 -19 -19 -11 -28 -4 -13 -22 -5 13 0 -28 -13
4673 -13 8 -13 17 40 -4 15 16 -3 16 -1 -7 -15 0 -5 15 9 23 -6 -23 -4 -17 -13 0 -45 7 -3 14 7 16 -6 -21 -7 2 -13 -5
4708 -5 2 -4 -11 16 0 29 12 12 -11 -12 -1 33 8 -21 0 -8 -22 -8 1 24 12 14 29 31 6 2 15 -12 -1 1 23 12 2 16 6 -1 -16
4745 -16 3 -12 9 -1 15 1 5 -14 4 15 -5 -15 -7 1 -20 -2 36 -12 9 -9 23 22 22 7 -10 -7 9 27 6 -3 5 28 10 -8
4779 -8 16 9 8 27 0 1 24 20 -2 19 15 14 -15 8 -6 -6 17 7 -11 14 -11 -21 -27 -11 -15 3 -4 3 -26 0 -14 42 -8 -14 10 32 21
4816 21 18 13 7 9 19 10 9 25 -6 7 -19 30 19 13 4 8 -26 -4 -24 -5 14 1 -36 -14 -9 -2 -19 -4 -8 8 -8 2 1 17 -5 -32 -15
4853 -15 -24 4 5 1 -14 9 -2 1 3 -17 2 -3 -4 15 -6 1 20 0 10 1 -2 -14 1 42 5 16 4 6 26 17 -21 -11 -3 -16 -18 4 9 -13
4891 -13 -3 -11 -19 -9 9 -23 10 1 -9 -16 -16 -3 -1 -19 16 -8 13 -2 -16 -5 -3 15 12 37 -24 3 -1 18 7 23 -8 13 16 6 -11
4926 -11 -13 -26 1 0 17 -5 10 -36 -1 -8 -9 2 -3 -4 13 -2 -12 8 9 28 11 -11 -19 5 -2 12 2 13 5 33 10 20 -6 -28 4
4961 4 16 11 14 -3 -8 35 12 -38 -7 37 39 0 9 -9 -27 9 4 -6 -5 -2 5 -10 -2 13 4 -4 5 -18 -5 -9 -21 -12 -16 -9 0 -7 -7 -4 -2 2 25 -17
5003 -17 -7 18 -4 -7 -10 -14 -8 -12 34 0 18 -11 -15 -3 -39 21 0 -31 -3 11 -11 16 19 9 -12 16 -22 -7 -17 -11 -23 9 -6 15
5037 15 -21 -21 -23 -13 -22 -15 -16 6 -11 -23 30 7 -2 12 0 -44 11 21 -20 -17 11 -13 18 -2 10 -34 29 -5 8 8 8 1 60 36 -18
5072 -18 -8 5 -14 24 5 13 16 -17 13 28 22 -10 -31 -29 -12 -11 8 2 -8 -17 14 -9 -19 -22 -6 -7 30 23 15 -3 8 16 9 16 14 -22 -22 19
5110 19 35 -15 10 10 0 12 -2 -4 5 4 -18 48 -30 4 -40 -27 -5 7 -13 -27 4 23 1 4 -9 0 -26 4 27 -33 9 12 2 14
5144 14 -12 7 -9 5 8 14 -28 7 28 13 64 -9 19 6 2 -1 -31 40 27 14 10 24 10 -14 2 26 12 7 14 8 5 -16 -15 -2 -25
5179 -25 14 13 -21 -5 -22 -16 10 -19 29 16 37 11 6 -7 1 9 -1 25 11 -33 13 -20 65 -43 -17 38 27 -21 21 -40 -20 2
5211 2 23 46 24 -19 0 -5 2 -36 3 19 -17 -14 5 -5 27 12 44 -41 -25 -2 -34 -10 -53 -14 -18 -63 0 -1 -7 -4 -10 -3 -21 -12 18 -25
5247 -25 52 14 40 4 -22 71 10 8 -10 48 38 -23 20 11 25 -26 -43 -4 -18 -22 -22 -43 -5 -46 -5 62 25 -1 -46 16 -48 4
5279 4 34 12 -6 35 -19 6 10 -13 28 -22 -20 15 -14 7 -24 -1 -3 22 -12 -19 6 -18 25 0 55 3 3 -1 23 -1 -1 -15 11 28
5313 28 -29 -3 1 -34 -22 -9 0 6 11 -15 -13 -7 11 -2 -33 -13 11 -4 11 -26 19 -21 -21 -20 -4 -6 -35 28 -4 44 8 -2 -22 56 4
5348 4 26 24 14 -2 -1 -3 18 -5 -22 -21 23 17 29 -7 -7 3 11 16 14 -23 -38 -25 -15 -21 1 7 22 -23 -24 -28 -17 -34 17 14 20 -10 12 1
5386 1 -13 7 11 16 20 27 38 18 -14 -19 -1 -3 -12 24 5 1 26 -28 -6 40 11 -26 5 -25 19 18 -24 -22 -23 -17 -29 -15 3 5 -9 5 -40
5423 -40 -13 -7 -1 -16 -12 -7 7 8 -36 6 16 -33 -3 12 31 26 31 -5 26 -31 -1 64 -19 -24 -13 -62 -37 8 45 25 13 -55 46 49
5457 49 13 35 -60 18 45 62 -73 -24 -19 -6 -14 6 9 20 -39 21 29 11 -5 13 -64 46 36 7 11 -50 70 -8 15 9 60 64
5489 64 19 30 20 31 57 3 36 -4 -25 39 -4 17 6 -14 -36 23 -3 -16 30 -2 42 61 -46 85 -25 -20 -27 -2 47 -21
5519 -21 -49 2 28 -66 52 16 70 18 -64 37 8 -62 17 29 32 -8 -41 -14 23 -10 77 41 29 4 -11 36 -44 -8 -34 22
5549 22 -2 -49 23 -14 19 39 24 32 -63 -26 17 -16 34 -15 -9 -55 -49 -26 -76 8 -6 -56 8 -54 4 16 70 -1 -67 -11 -135
5580 -135 -105 -81 14 24 44 75 11 47 -17 104 -28 6 -78 -21 100 -61 60 -38 -22 -53 54 35 -30 101 4 44
5606 44 66 -38 -41 -65 133 -46 2 -108 9 54 -4 63 -63 16 78 -81 132 -62 37 22 57 -9 29 -100 -9 -17
5632 -17 -2 37 63 -69 -95 8 -135 -100 25 -73 -110 -76 -50 -109 51 23 -96 -123 -5 -27 8 131 58 -10 -10 -70 -147
5659 -147 5 22 -49 -49 -39 58 -100 34 24 -58 182 34 -6 12 35 -76 19 29 -66 -18 -24 -75 12 -19 -154 -3 -27
5686 -27 22 67 -103 -108 196 48 -102 -73 49 -15 -44 101 -14 -28 -42 43 2 56 -59 -62 10 -104 -148 184 31 43
5712 43 14 48 -34 -71 11 -55 73 -160 -82 30 48 115 61 -95 -70 -48 -33 27 -89 192 -103 15 85 41 -119 66
5738 66 37 167 78 -115 46 -34 -73 109 -52 97 -97 -196 109 -22 15 112 42 13 -107 -160 -6 34 -107 -62
5762 -62 52 -83 20 -5 208 -66 -101 -51 -67 5 96 -93 209 104 47 -11 76 14 -41 -24 79 -31 42 8 -47
5787 -47 33 1 33 -63 -27 -52 -9 -26 -21 -29 -25 -25 21 -62 18 -13 3 -41 19 56 10 24 12 11 9 35 19 -3 -15 -8 42 0 5 -12
5821 -12 -48 37 11 -14 49 -7 35 -17 -48 14 7 1 18 -32 -27 28 -35 -28 -22 -9 -20 -3 37 -8 -9 28 -6 -15 -35 -11 4 -23 -18 -7
5855 -7 4 -20 7 -18 -30 13 -25 35 32 -9 -31 -12 -13 -12 -18 -21 -8 2 35 -1 14 7 -24 -10 -33 -15 20 9 18 -6 5 -58 34 21
5889 21 -47 15 30 -13 -28 51 -19 5 14 -17 34 109 -39 26 -22 -7 49 -5 12 9 -26 35 17 -22 46 31 15 48 68 31 -40
5920 -40 9 -8 49 28 18 1 22 -16 0 31 -72 -38 -18 45 5 -49 -46 -18 -20 25 -39 5 -8 -14 -8 19 -9 -2 23 17 46 -17 -22
5953 -22 -29 -14 4 62 89 1 17 0 19 29 -7 14 23 -8 -33 6 24 -12 10 -15 17 64 6 -15 42 -27 -12 -23 -20 -12 -50 5
5985 5 14 -31 -26 -26 -39 -9 -59 5 -25 -22 -16 -41 -35 -18 10 1 -24 4 -8 -21 -39 38 -35 -52 -57 44 15 16 -5 14 -2 31 -14 -6 4
6020 4 -61 -44 -33 -32 -61 36 -24 28 10 45 -30 -19 -26 -57 -68 -31 39 21 -37 -3 -2 17 -50 -2 -33 -14 9 -16 28 -30 -8 -14 -2
6053 -2 17 -28 -15 23 -4 3 13 82 28 -16 -4 15 31 -35 33 -5 11 -22 42 -5 -23 18 -6 22 1 0 -9 1 -13 -11 -38 -11 15
6086 15 -32 -9 -12 -30 -5 -59 -5 -26 -2 8 -7 0 53 -2 15 -8 -10 29 -8 43 18 18 6 18 51 -27 12 -3 34 80 14 -61
6118 -61 55 29 84 24 -74 -2 38 -123 45 -57 38 -32 -145 -8 125 19 -24 90 118 29 39 -62 -93 -78 -86 75
6144 75 90 6 140 52 -162 -51 -164 121 -115 -35 -44 -26 18 53 25 -154 26 -37 -36 -166 1 166 109 -155 -73
6169 -73 -34 13 -15 -95 -13 81 30 36 -34 -59 -42 39 -10 -58 65 -54 -55 -2 66 17 -53 11 -73 -2 -85 38 133 65 12 -2
6199 -2 33 -33 26 -1 -29 -94 36 -65 30 26 22 -27 60 -44 10 58 46 -46 50 -29 -37 -68 -38 -5 -29 -96 37 13 12 93 85
6230 85 26 -79 -57 -47 -79 39 66 80 31 -12 26 -39 -41 80 28 -61 -78 -42 84 -95 20 24 11 -32 10 73 -81 58
6258 58 13 -95 -42 -64 18 -13 -2 23 9 -3 -54 -8 25 18 0 -81 -6 42 -36 25 -4 -27 -13 48 -48 -11 -32 -14 -43 -59
6288 -59 35 54 -25 -28 -14 15 18 -25 -19 28 46 -45 -22 -38 -73 14 66 -88 112 110 -54 -10 -45 -13 -10 -39 88 -5 52 -7 43
6319 43 -35 48 -15 -83 20 -1 53 47 -35 -25 -19 -16 -2 -44 -40 -21 -1 29 4 -29 30 22 51 7 47 88 -50 -4 -38 -50 -32 -8
6351 -8 -1 -6 43 5 61 2 5 -68 31 40 3 1 77 -9 -31 15 -28 17 -48 -45 -58 -18 -34 23 -3 -49 -54 -33 -26 34 5 47 43 -20 -30
6386 -30 -22 -9 -14 -12 -4 -38 -59 -68 -40 -74 19 29 15 18 -47 28 9 27 12 -15 5 -4 -24 7 1 -3 -64 -28 -35 -15 -14 -17 32 0 7 7 -61
6423 -61 76 -38 -35 9 -43 -29 1 42 -50 7 -13 -13 -57 -19 -12 -11 39 8 -1 14 15 -42 29 14 28 -9 -45 -19 -19 -19 -17 18 -5 -30
6457 -30 4 -8 -1 -29 21 -40 13 26 -19 -5 4 13 20 -8 -17 55 42 -13 -7 4 19 -16 23 -10 54 -7 -27 -32 15 18 11 7 -3 -8 -16 -31
6493 -31 28 -7 21 -12 28 6 -9 14 -23 -13 69 35 -17 23 -44 -36 -33 -36 15 11 0 -28 45 -12 -15 16 19 -46 -47 -5 9 -14 -13 32
6527 32 42 28 -25 -43 -24 4 -39 30 21 0 52 -21 1 3 35 -25 32 -7 6 17 -11 38 -23 4 0 11 23 17 28 7 20 -35
6559 -35 12 14 7 -3 9 3 -21 -36 -24 10 -30 5 36 18 47 35 20 24 -15 -13 4 -13 -23 14 -17 -32 59 -29 4 0 -10 9 20
6592 20 -15 -38 -27 -58 -39 3 -11 -19 26 -6 15 -51 -26 10 38 39 0 60 -1 -24 -1 14 -33 -39 -24 7 -3 -6 20 -27 -17 51
6624 51 55 -35 10 -5 29 21 28 7 21 -4 -9 -9 -48 55 -7 -16 21 -10 -7 1 -3 8 12 23 23 -7 13 -35 4 -18 1 -22 13 6 28 -13
6660 -13 10 3 -6 40 80 -44 24 39 10 13 -79 -1 34 9 1 39 10 50 27 15 38 21 18 84 -55 -48 11 115 -6 22 14 -6
6692 -6 -14 19 -72 -2 -25 -32 -5 116 23 -43 91 -34 -46 -30 -67 -16 -17 -23 -3 -47 -22 12 -31 -3 -12 -30 0 -11 -22 35 -12 -31
6724 -31 -9 -10 42 14 -35 -65 1 -28 20 60 -14 33 5 -20 -92 -44 57 -47 19 21 -2 19 18 -13 25 20 -34 -32 2 -90 45
6755 45 -41 33 -40 -74 -21 39 -21 -42 18 44 -68 14 -123 -73 27 -41 48 -20 0 0 45 5 -40 11 -48 71 -17 -5 -12
6784 -12 8 -3 -15 -3 -26 13 50 -27 35 -5 -17 -8 -7 -79 8 72 -14 -6 -57 -25 97 -97 -20 -16 34 15 7 -60 103 86 -93
6815 -93 52 41 73 -76 1 -45 50 41 -76 61 17 30 -4 5 44 -39 18 -65 0 24 3 54 -16 -22 -46 -42 3 -98 -105 -66
6845 -66 21 25 4 2 18 6 -26 60 -73 53 -16 11 -67 -31 31 10 9 28 -9 -18 -25 55 20 -22 -28 2 31 8 -15 -15 8 61 -32
6878 -32 16 26 -36 0 18 18 25 45 -29 10 4 -39 40 -2 -25 6 10 -46 -43 29 30 13 -4 17 19 10 11 -7 -36 -14 14 9 -14 -8 46 -12
6914 -12 8 49 -8 -26 -7 5 15 19 19 -28 -14 26 26 9 -1 30 16 17 -1 -8 19 1 10 4 -9 -13 3 2 6 19 -10 -15 22 11 -30 17
6950 17 4 -18 0 9 -1 -6 -34 14 20 9 2 -9 -10 0 20 8 -9 1 14 -6 -20 -3 8 22 23 27 8 15 2 -8 7 -17 -8 -7 -9 -2
6986 -2 -4 7 -31 -22 -20 -29 23 -13 18 -1 -11 6 9 16 13 8 -11 -3 5 -7 8 19 -1 -6 11 32 -3 7 -12 0 6 47 7 -7 11 8 -10
7023 -10 -22 -13 -4 -7 -4 9 -6 3 1 29 -14 3 -32 -18 -9 -11 -4 9 -8 -20 -16 -4 15 -20 12 -17 1 27 -8 -25 8 15 -2 -16 9 28
7059 28 19 15 6 27 3 -3 42 -9 19 21 14 -6 21 -13 11 -8 -1 1 -10 -31 -14 3 15 -27 14 -9 -1 20 5 -15 9 -19 -27 2 0 -16
7095 -16 2 -11 2 -20 -12 -17 -1 -14 -9 9 -16 24 10 19 -15 25 -2 9 -3 -10 10 5 13 14 -13 -16 -22 -16 14 -13 -3 -29 -34 -11 11 0
7131 0 9 -6 17 1 -10 5 -3 -11 -26 0 17 4 -26 -9 -6 -7 -7 -6 -3 -6 4 -34 14 33 -6 25 -8 -1 -16 41 23 -15 14 -20 -4 -4
7167 -4 1 -19 2 10 -2 4 -20 -16 -12 -11 12 -28 -16 -16 -26 -21 -18 -13 -19 4 -22 0 -10 -14 -6 -7 -1 -20 1 -12 2 -10 -6 10 -12 -9 -17 -8 2 -2 -23
7208 -23 -7 14 -21 2 4 -15 -10 -9 -25 5 1 -3 -12 -31 -34 -15 4 -18 -38 -18 -3 -19 -11 -13 -8 -38 -21 -5 20 -16 -18 -35 -17 -4 -11 22
7244 22 -9 -16 41 -7 31 -18 -16 29 -3 -6 10 -1 -12 -2 -40 -18 8 10 18 4 -16 3 1 -22 5 -28 -57 -7 10 -10 -16 -48 -30 -9
7278 -9 -28 -12 -24 5 24 -16 8 -13 0 -32 -8 26 4 -24 -23 -27 17 24 15 2 -8 -17 -23 7 11 10 0 -13 -14 1 18 -24 12 -19 21
7313 21 -1 14 21 -5 -5 -6 -28 -4 -26 -25 -14 4 11 -19 6 -8 -5 -3 20 -1 -3 -9 -15 -7 -20 -13 4 12 3 -1 9 -22 13 -16 -4 21 -15 -17
7351 -17 -1 -2 10 14 -2 6 -1 14 -5 -15 -11 8 -16 -23 -15 -7 -32 6 1 -30 -9 -12 4 -10 -3 -3 13 -12 7 -1 -14 -4 -8 -20 -5 -38 -15
7388 -15 4 18 -23 -17 4 10 -12 -13 -6 22 -18 -7 -20 -6 -21 23 2 4 -20 11 9 -8 -8 -10 -20 -12 -4 -33 3 -16 21 -29 -9 -41 3
7423 3 -11 -20 1 5 -11 -1 3 -8 -5 -16 -5 6 27 -15 5 -14 -3 -2 15 32 11 -7 -5 -13 7 -7 -9 -13 -8 13 -9 -17 27 12 6 0 -2 -15
7461 -15 7 -3 5 -10 -14 -42 -11 -14 -32 -8 -3 -32 11 14 -15 23 -12 -12 -3 -11 -18 -2 10 -11 0 -16 8 16 -4 39 -23 10 11 3 -10 4
7497 4 -11 -24 10 19 -1 -11 15 -29 -7 16 -12 -18 -22 -4 -27 -12 -3 5 3 19 17 9 -8 12 11 -21 -16 -16 3 -13 16 -13 -12 -24 6 21 -6
7534 -6 -24 7 26 -29 23 17 12 -10 11 9 -9 -14 -20 -17 -7 -9 -23 -14 1 -18 1 -8 -13 -10 -15 22 -2 16 -25 -15 5 -8 2 -29 23 -21 -7
7571 -7 7 10 -21 -10 -18 2 -2 -3 4 3 8 -26 -26 14 -13 20 5 -10 23 15 -13 -18 13 -8 5 -19 -12 -22 -12 -15 13 0 -4 -20 -18 -3 -26 -9
7609 -9 -1 -23 -13 8 -6 -7 0 -29 -19 -2 -7 -13 -10 4 -2 31 -7 -2 16 13 -3 -40 5 32 -12 9 -16 12 -35 -20 -21 17 8 4 -10 -14 -3
7646 -3 4 -2 -16 -3 2 -11 9 -1 16 -45 -6 -4 -11 -25 13 -12 -10 -23 -8 29 -12 8 12 8 13 -18 -17 1 3 -10 -4 22 -6 -12 -6 -8 8 25
7684 25 42 7 -1 -12 -8 5 -20 5 -12 -26 10 7 0 19 22 -12 -17 -6 -19 -2 -20 -5 -25 3 6 -9 7 -10 -9 9 -7 -2 28 5 -12
7719 -12 -11 -11 -2 0 18 0 30 8 9 10 7 3 -4 8 33 5 13 16 -17 13 19 -19 -14 3 -16 0 -10 11 -28 10 -8 -10 -26 3 -5 -11 -15 -51 4
7758 4 -16 8 11 -3 17 -14 26 -28 -20 -2 -16 7 -9 9 -11 -10 -4 10 33 3 -7 4 -11 14 17 29 9 -2 0 -12 -13 14 -26 -3
7792 -3 -16 -2 11 -6 13 -13 18 -7 -27 -11 -12 -14 8 3 -7 1 2 25 1 -8 -9 -19 -1 -3 17 24 -9 2 -16 -7 -11 6 14 5 26 4 11 -5
7830 -5 -4 2 -6 -8 10 -22 7 -19 3 -18 15 4 -22 -13 -1 -5 -42 -12 -18 9 -28 0 -12 -24 -2 -1 33 -10 -10 7 5 -1 -21 14 0 -6 24
7867 24 28 -6 -2 8 6 41 24 -14 -4 -1 15 -22 18 12 -32 -7 -7 -20 8 7 -7 10 13 -3 14 -5 -18 -4 -10 2 -34 -4 -11 -25 -21 -7
7903 -7 -16 11 -20 -28 12 -5 -10 -15 17 -2 -18 -23 8 -2 16 -1 -1 23 15 -8 3 -6 -13 0 -4 12 -32 7 -21 -22 -3 25 -18 -11 -11 16 -15
7940 -15 -11 -3 -30 -3 -10 29 4 -2 -18 -4 -17 -1 -7 10 7 -8 -13 -8 0 -5 -7 4 -5 0 -18 14 -23 0 16 -20 -14 -2 3 -17 1 -18 -40 -14
7978 -14 16 13 8 -10 -6 5 35 -7 -17 15 -30 -9 20 -11 2 -1 -19 -27 5 -8 -48 -54 2 -11 -13 -6 -12 30 -13 -32 -9 -32 -15 -7 -23
8013 -23 -6 9 -58 -22 11 -5 -26 4 -8 6 3 13 32 18 -3 14 -4 -24 6 -10 13 -33 -3 -17 -31 13 12 -9 2 -14 -61
8044 -61 -38 -16 -36 -31 26 -10 11 -10 -33 24 -50 39 -40 -6 28 -1 -10 -2 -9 -29 27 -13 -1 -13 1 40 -6 -14 -90 2 66 -19 -18
8077 -18 32 -36 -29 74 -62 0 48 7 -4 -54 -22 17 9 24 -65 -16 58 -33 45 -19 -8 5 -41 -14 -1 -30 1 -47 43 -39
8107 -39 -3 79 -52 -31 32 3 -70 -8 -72 -59 20 25 28 17 -10 30 -14 105 19 -91 52 44 7 12 8 -5 -70 19 98 27 -83
8138 -83 12 -102 113 42 -12 97 -59 -6 -23 28 8 -20 50 -1 -6 -24 -42 5 -53 10 -24 -133 58 41 12 -29 -75 -38
8166 -38 41 55 -22 -51 -48 78 12 -82 -31 89 9 50 -35 45 82 -32 -11 -3 35 -19 -21 -17 40 -55 -69
8191f9
$$ Imaginary data points
##PAGE= N=2
##DATA TABLE= (X++(I..I)), XYDATA
0 0 0 0 0 0 0 0 0 0 0 0 0 0 0 0 0 0 0 0 0 0 0 3 -8 8 -8 8 -8 8 -8 16 -16 16 -18 24 -24 29 -32 34 -40 43 -48 56 -60
43 -60 66 -74 82 -90 99 -109 121 -132 146 -162 178 -196 218 -242 271 -303 341 -387 445 -521 616
64 616 -752 949 -1276 1897 -3494 16114 27545 -16484 -7705 10658 -1145 -7195 6127 4569
78 4569 690 -176 -2000 567 5135 -706 -3814 -554 1533 1349 1207 -1347 -1604 8 1489 1217 -608
95 -608 -1848 -387 -157 -144 1042 1653 1059 -1386 -3499 1460 5140 -1544 -4307 2217 1999 -1768 1442
112 1442 1968 -2122 -1095 514 -7 1989 923 -4147 -2577 3338 2960 -1356 -2072 -266 -1185 -2160 1186
129 1186 2611 -1555 -2599 820 1025 -387 -372 -1383 -1582 31 824 1889 1112 -2551 -1426 2556 180
146 180 -2313 651 1207 -398 664 1067 688 481 -2466 -2731 2486 3170 -1003 -795 886 -1138 -1749
163 -1749 927 1835 -458 -2239 -829 914 273 -105 22 -1485 -1341 854 500 -791 -380 -937 -899 1374
181 1374 861 -1426 -605 180 -765 -35 1074 26 -830 -289 384 755 19 -832 -278 586 358 -300 -162
200 -162 265 -120 -365 798 863 -959 -1311 -87 179 470 774 -9 -286 -505 -1354 -18 1536 -500 -1495
219 -1495 960 986 -893 -160 525 -745 -924 237 993 830 -460 -909 344 645 -138 23 348 -311
237 -311 -465 599 1303 151 -1162 -179 1011 107 -244 636 99 -547 169 530 432 131 -658 -231 828
256 828 48 -448 574 194 -668 288 718 -125 -170 -78 -219 323 373 -260 83 398 -153 -264 329 427 -155
277 -155 -562 90 760 209 -298 -23 47 -35 122 -53 -83 11 -253 235 857 -132 -797 -95 -39 -378 495 515
299 515 -366 -497 -219 -9 318 -201 -672 103 387 -363 -226 281 -178 -599 -167 408 199 -526 -388 282
319 282 54 -313 222 313 -336 -467 38 309 62 -244 -17 264 -132 -179 370 139 -406 -94 325 221 56
340 56 -111 -116 194 56 2 254 -13 -346 50 339 186 50 -102 -167 144 118 -145 61 103 -96 110 190 -7
363 -7 -49 -160 -153 211 268 -98 -89 113 38 -29 45 118 -70 -279 -21 398 139 -228 9 34 -236 -74 287 188 -133
388 -133 -326 -46 342 0 -308 88 74 -356 -40 317 -35 -340 -157 79 148 -60 -285 -105 -71 -230 49
409 49 280 -150 -388 -96 116 -14 -196 -76 84 -135 -153 148 60 -214 -122 60 59 79 -162 -186 162 142 -97
432 -97 185 197 -187 -126 58 111 256 158 -124 83 198 -134 -22 235 -4 -36 196 256 50 -163 -141 201 207 -82
456 -82 132 192 -197 -178 318 283 -41 -246 -15 288 78 -162 117 184 -197 -99 317 194 -169 -217 104 278 -17
479 -17 -142 176 57 -269 17 264 -27 -183 -35 25 57 -58 -75 64 -155 -311 54 175 -258 -194 67 -83
501 -83 -129 -21 -69 -119 -125 -167 41 97 -173 -200 7 68 -17 -123 -154 -16 59 0 119 53 -45 -94 -50 86 270 -19
527 -19 -151 213 179 -141 81 211 -143 -46 193 124 28 -96 -155 182 170 -157 17 205 -227 -275 255 248 -163 -117
551 -117 120 86 -156 -74 149 65 -102 -22 166 123 -146 -183 124 172 -159 -40 237 -115 -269 139 235 -123 -81
574 -81 52 -68 7 11 -70 59 -26 -135 63 91 -234 -161 86 -12 -60 5 -104 -88 -23 -66 -16 16 -70 -96 -27 16 24 -50
602 -50 -54 55 -5 -45 98 82 -47 -32 55 123 124 -36 -54 159 94 -80 99 202 -62 -59 168 155 -46 -71 29 143
628 143 -19 -32 114 102 -174 -100 165 98 -98 -77 58 60 -100 -57 111 -22 -166 36 161 -71 -112 -1 37 40
652 40 4 -29 38 -20 -81 45 121 -25 -41 42 17 -37 -13 25 8 -39 -31 50 13 -50 -58 -63 -25 37 -27 -94 -41 -57 -115 4 49
683 49 -115 -90 -49 -21 -14 -18 -68 -11 1 -65 -3 51 -42 -68 3 86 0 -21 17 23 -19 14 72 65 -77 -45 76 47 24 -10 38
714 38 48 -40 -36 107 23 -102 -18 101 11 -41 14 15 -27 -12 -43 10 26 -84 -21 58 -27 -64 17 17 5 -9 53 0 -52 -39
744 -39 13 9 34 6 16 8 1 5 -2 19 -31 -23 10 15 -22 -17 -41 -14 26 29 -66 -15 -5 -47 -30 50 14 -45 -33 -25 4 -9 -3 3 0 -40 -28
781 -28 8 -44 -59 -14 5 -4 -36 -16 28 -7 -68 26 64 -27 -35 24 35 2 1 26 20 22 -38 53 19 -60 -38 57 46 -13 9 26 14
814 14 -17 37 50 5 -24 -7 36 25 -16 -6 33 -14 -4 43 28 13 -5 -8 13 23 9 0 -35 -14 4 24 28 22 -10 -19 32 30 14 4
848 4 16 -15 32 29 23 43 -19 -18 27 25 -35 -15 10 21 4 -37 42 21 -32 -31 43 46 -54 -35 30 -5 -20 -4 32 -27 -59 -6 32 -4
882 -4 -86 -21 5 -48 -19 -2 5 -53 -57 22 24 -43 -29 41 19 8 23 29 -1 8 6 31 43 6 -23 6 24 -22 8 31 -20 -13 7 0 8 18
918 18 -8 1 42 -1 -28 6 27 18 8 34 54 -40 -1 23 41 13 -44 -11 -5 -4 -12 19 33 -57 -22 76 34 -24 -1 29 1 7 -19 21
952 21 -12 -41 -7 44 -3 -62 17 35 -41 -1 -4 8 -65 -72 5 -21 -48 -42 11 -24 -30 -6 11 -50 -48 -11 26 -2 -11 -8 -4 7 -6 36 13
987 13 -12 0 -5 43 26 11 -16 21 20 6 28 4 13 24 11 25 13 27 -31 5 51 1 10 -5 -17 2 23 41 26 -23 -23 33 50
1020 50 -24 -5 4 8 -9 8 20 18 -46 -8 47 -15 -23 1 26 -33 -32 3 32 -25 -17 32 24 -14 -24 18 0 -35 -11 6 -4 -35 -25 -22
1054 -22 -15 -35 -32 -6 1 -18 3 16 -53 -33 9 -11 -9 -40 5 -36 -18 6 -8 -12 -13 -8 17 21 -1 15 6 7 2 -3 -7 -9 -4 14 31 41 59 0
1092 0 0 13 -6 32 25 -11 -3 -21 32 12 26 -5 0 0 1 7 -16 -5 10 -17 21 27 -18 20 31 12 -33 -27 21 4 -4 1 -2 15 -22 1 16
1129 16 18 2 -20 25 -11 -10 0 19 9 -9 0 15 8 8 16 13 -11 23 -22 3 10 5 15 -27 0 -20 -6 24 6 -20 -29 -20 -1 -1 -25 -16 3
1166 3 -12 -17 35 -15 2 -16 -7 4 -18 -6 47 11 2 -7 9 5 -13 8 0 3 -1 20 2 -11 4 35 -10 26 -26 30 25 5 37 20 7
1201 7 -10 2 -8 -26 -22 1 -23 -9 -14 -5 -9 -19 -12 -3 -24 -50 -21 3 -1 12 29 1 1 8 8 -10 20 -4 14 21 -2 19 26 42 9 -9 -17
1238 -17 3 -1 -15 -6 17 -16 4 11 -2 20 -15 17 -33 14 -18 -13 8 6 -23 25 -18 -18 0 -7 23 -9 -33 -23 -10 -1 -29 0 5 2 -40
1273 -40 25 -6 -8 0 14 -4 -5 14 0 12 -24 12 18 -4 1 19 25 1 -6 3 2 -8 -29 1 -5 -11 15 10 -3 -10 -6 8 -24 18 -21 -14 -15 -23 8
1312 8 -4 4 9 5 -26 11 -21 -2 32 15 -16 -12 -10 -12 6 5 -22 37 -16 8 19 -5 -1 -6 -7 3 0 -13 37 2 21 -5 -14 3 -2 -4 0 -3 -17
1351 -17 -17 -9 -32 57 -18 20 -25 -12 6 9 5 -46 28 -13 8 11 -10 -2 -5 -5 -15 26 5 1 -2 -1 7 37 25 4 2 12 25 -30 21 -8 -6
1388 -6 21 2 7 -16 10 14 -36 -8 -35 2 -49 -42 -5 -23 -11 -23 -8 -33 -11 -22 -27 16 -26 -9 26 48 -26 -6 21 -16 19 13 12 -22
1422 -22 22 8 31 32 -45 1 29 55 -15 35 26 -50 -35 15 39 -7 -33 20 -5 -26 9 24 23 -33 9 -40 -33 -41 -13 14 -8 -28 -16
1455 -16 37 -27 -13 -11 28 -45 -6 -2 -2 28 0 14 2 -5 -4 1 -3 16 -8 40 17 -6 66 -40 -37 12 -36 -35 21 18 -32 -21 -2 32 32
1490 32 -56 3 -39 -30 -2 -20 -10 -22 -39 -22 -49 -10 -2 -10 -12 -49 17 28 -15 -14 -48 5 12 19 0 40 -2 -18 15 17 -23 18 1 19
1524 19 7 -16 4 -10 -7 5 26 -10 -34 58 0 15 -27 6 -21 -6 -6 -7 20 -16 -18 -17 -12 -22 24 -19 21 -12 22 -2 -15 -26 -27 -2
1558 -2 -16 -4 18 17 -23 -18 -1 15 -7 7 -9 -3 26 18 -21 -25 -4 -14 -3 -21 15 -17 -24 -19 22 -16 -43 2 16 -10 1 -7 -13 -27 -18 3
1594 3 -18 -83 -50 -9 12 -4 -24 -17 -24 -11 -1 -5 -5 -34 16 31 -16 9 22 36 -4 12 34 10 2 43 31 2 65 -16 16 -3 -49
1627 -49 15 4 -23 -44 23 21 -14 23 20 -18 -49 -25 -41 -33 23 -14 20 0 16 -47 -27 -10 13 -14 -37 -8 29 7 -49 17 40 31
1659 31 -57 9 49 -22 -2 27 -17 -42 -42 10 8 -5 -17 4 17 -17 -5 9 16 -33 -36 50 18 -21 37 9 -35 5 -61 -38 8 -50
1691 -50 -13 -5 -21 -55 2 11 -17 23 -5 41 22 15 20 24 23 12 -4 11 46 11 -3 50 17 35 -12 35 26 22 3 4 21 -24 -13 -2 35
1726 35 -52 -39 -2 -27 2 -31 -2 6 -29 12 -11 -27 -32 -19 -24 4 -10 -10 10 -34 -24 10 -7 -15 21 -1 -29 -8 -27 7 74 -21 -4
1759 -4 25 -3 -1 18 13 -55 -3 9 48 -9 27 8 -34 6 -10 3 9 3 4 -2 -16 -20 18 31 -16 -31 -8 31 15 -32 -1 40 15 -27
1793 -27 29 -12 -16 28 0 9 -5 14 16 44 19 -11 7 10 7 35 17 29 21 20 -16 -15 13 -32 15 -38 13 -13 -28 -3 11 -22 -24 -45 38
1828 38 -49 12 18 7 -54 -18 -8 -39 -53 26 27 -8 -27 -7 5 -21 -8 7 12 -49 -14 3 -25 -18 -14 -41 25 -9 6 -16 45 -3 17
1861 17 -16 -1 -39 -37 -11 6 9 41 13 -9 29 -3 -35 32 -1 -8 -6 -1 5 -37 8 -6 2 4 47 -27 -3 30 34 5 2 24 -7 23 11
1896 11 14 24 -4 9 -1 31 35 -15 -11 27 7 10 11 20 12 -39 35 2 -43 -11 -20 -4 -20 7 -54 21 0 19 10 18 19 -3 -2 3 -24 24 -11
1933 -11 11 4 38 -3 -16 -52 -6 -23 -17 -12 -28 -2 27 16 11 41 -26 -13 -20 -15 9 18 -11 10 -18 -6 10 -5 3 38 21 -21 -16 30 10
1968 10 33 13 2 -16 0 -7 19 -33 -10 -11 20 -1 -25 17 3 11 -11 -1 -19 7 34 50 -4 -16 8 21 -43 -36 10 -2 -7 36 32
2001 32 22 1 46 45 2 12 16 6 -7 23 -14 -27 2 24 -34 26 2 45 66 2 -6 -66 -45 -17 -39 -20 -47 32 24 -27 55 -11
2033 -11 -38 -30 -19 32 1 -16 -29 -34 4 -41 -4 0 -35 -48 18 -9 6 -10 -28 10 -18 -31 -20 3 -16 0 6 0 -28 29 6 16 -1
2066 -1 -13 2 -31 -53 -21 4 29 18 21 46 -41 35 -4 -19 53 19 38 -41 56 -68 -52 22 54 -38 19 45 4 9 -9 -17 2 18
2098 18 37 -28 -19 -34 -19 -14 50 -11 -12 61 -35 26 -23 -28 27 54 -58 -17 -37 0 -3 -5 -1 8 -39 -26 8 -68 -12 5 -3 14 -4 3 2
2133 2 -46 -27 55 -21 -44 -3 -32 -31 17 37 -15 -21 13 -12 38 3 14 23 28 -30 -45 3 -9 -6 -25 -19 -7 -18 17 -36 -6 4 -17 -1
2167 -1 3 -37 -19 -6 10 -17 6 6 -11 5 -21 -16 8 49 27 8 -8 -27 30 25 -17 -6 12 6 -17 -3 -10 34 23 28 10 10 10 -1 -8 -3
2203 -3 8 23 -36 7 -18 -26 -14 -20 3 13 -12 5 24 -7 -9 -7 -3 -19 26 1 23 -1 -14 7 56 -27 7 -7 67 -33 -57 23 -9
2236 -9 -4 43 10 -18 -12 -14 20 39 46 17 28 -39 -7 9 4 -6 33 -13 41 -16 12 28 0 -7 -5 39 -4 8 -26 -12 -35 7 75 -1
2270 -1 28 71 -40 39 -50 20 -8 33 -15 -16 36 -14 23 52 9 -14 76 48 50 14 20 29 -7 21 11 8 -23 21 -31 -16 -42 -34 -30 -39
2304 -39 29 14 45 -56 4 19 -10 -30 -19 18 -35 -6 18 13 -45 -10 -5 12 11 14 1 14 -35 7 -26 -9 -6 -15 -22 10 -38 -27 -16
2337 -16 6 -16 -4 -23 7 8 39 -34 -29 -8 -3 -9 2 15 -9 -27 -25 35 -8 0 8 -39 -40 -36 12 -16 -14 -25 1 -11 -24 29 54 30 -17
2372 -17 40 17 72 -15 11 47 -25 2 15 23 -12 41 -5 11 7 21 6 14 -24 -23 34 23 -34 -38 9 39 22 21 3 -2 13 1 33 -30
2406 -30 -6 -29 10 -3 -5 -4 22 2 8 -12 -17 32 16 -9 19 31 -8 -21 32 74 -14 27 4 -20 22 36 -8 -26 24 -6 9 7 -19
2439 -19 41 -31 18 6 26 -27 9 -26 7 -6 2 -48 35 -13 -6 4 5 17 -26 -45 4 -6 2 -7 -21 25 -9 -9 18 14 -22 23 58 49
2473 49 20 28 12 2 -13 -12 24 -43 63 2 12 38 37 -39 24 -4 9 22 -30 -4 -15 -20 9 16 18 6 -26 31 10 -45 -1 -7 44
2506 44 -6 5 0 -6 -27 23 -7 23 -32 -42 27 5 -35 21 36 37 39 16 17 -45 11 42 26 69 28 5 3 -7 23 3 -39 41 -12
2539 -12 8 -10 13 7 27 23 -30 8 -47 -11 20 -33 -12 3 -47 -5 1 -14 17 -7 -61 -3 33 23 54 23 58 41 29 -8 20 28
2571 28 -20 -44 39 10 46 -1 58 4 -15 44 6 3 -24 -10 5 -10 -15 -14 30 -6 -39 38 7 -8 6 -62 -52 -59 -33 48 9 -38
2603 -38 -35 -63 -102 24 -17 20 28 25 19 43 -18 -6 -43 42 -30 56 18 31 -43 4 -57 -3 5 -35 20 -61 -20 -94 31 -9 0 -41
2635 -41 -24 -25 72 -24 -9 6 -32 16 9 -31 -3 46 -3 -32 7 -14 -30 24 38 -24 -31 -6 35 -15 -5 38 36 0 31 85 21 31
2667 31 63 56 -15 69 -46 -69 -30 12 -25 -44 -35 -21 -66 -24 -23 -5 -27 12 26 -8 -38 -77 35 -25 -5 -92 -85 11 10 -44 -33 -30
2699 -30 31 -20 61 3 -40 -52 -36 0 -21 45 56 24 6 25 -24 35 28 21 -32 45 -35 71 -24 3 13 78 -15 -38 12 -25 40
2730 40 -41 -20 44 29 -61 12 19 1 -53 4 -13 32 -10 -10 53 11 -30 -13 25 21 61 23 65 -20 -29 25 14 4 11 -12 43 -13 26
2763 26 0 6 -33 27 -51 -18 -27 -13 2 -23 -3 31 -11 5 28 -9 17 20 8 -37 -19 1 25 26 10 19 31 12 -13 45 8 -4 -16
2796 -16 -15 35 8 34 21 13 -20 16 27 27 41 18 35 10 4 -36 -26 -38 -27 7 1 12 0 52 -27 34 15 53 -47 -20 -6 -17
2828 -17 -34 -18 21 52 -33 10 12 16 -20 -56 -38 5 41 91 18 -35 -5 17 -14 -20 -4 14 -5 -10 8 19 -41 32 56 17 -21 -6
2860 -6 41 -5 57 13 15 -8 -9 -9 37 -16 32 -16 -25 9 -16 21 -21 4 -29 -14 18 -5 0 -33 -26 -14 34 45 -13 29 -48 0 -14 -3
2894 -3 -3 -9 8 -4 -1 41 30 7 8 19 46 -27 16 4 13 13 20 29 -4 -9 -12 -27 -32 0 16 31 -2 -6 9 -22 21 -17 0 11 -25 -15 -29
2931 -29 -6 12 3 0 3 -6 18 -8 1 48 1 1 3 -4 -9 38 1 -21 -10 30 -1 19 14 37 25 -39 18 -31 33 13 2 -6 -16 -5 11 -2
2967 -2 9 7 -6 -34 -10 -7 23 -20 -36 43 -23 9 34 19 -2 16 8 2 -38 5 70 14 11 -29 45 -20 -30 -30 21 34 -5 19 48 39
3001 39 -4 16 5 4 27 -4 0 -22 52 17 16 6 -1 -29 1 1 -5 2 -9 6 45 4 2 -18 -66 26 -48 37 44 -6 0 9 -10 -16 28 15
3037 15 -13 7 12 39 8 8 -28 0 13 12 40 47 9 11 -26 15 -1 -29 2 -32 -18 13 -10 -23 18 -35 -31 0 -25 -16 24 -22 1 -7
3071 -7 0 -4 1 -8 24 3 -2 -21 3 2 13 -20 -14 -24 -17 -7 10 12 15 12 28 23 32 -11 16 18 -3 -1 -6 -8 13 17 -31 22 2 -29 15 -14 31 1
3111 1 33 -16 10 -53 -24 -3 -22 -7 -18 -17 -27 1 -16 33 -20 8 7 34 7 7 45 -27 7 -22 46 -11 -23 12 4 -12 29 60 22
3144 22 -7 5 1 12 18 -1 -2 -18 -20 -17 47 -29 8 40 -37 23 -24 -16 -20 -26 -1 -18 -25 -2 -9 -3 -7 -6 -38 -7 -3 28 -21 -10 -13 15 17 17 -3
3183 -3 -26 2 0 0 33 26 18 -16 10 -5 5 14 -3 16 -17 -2 9 41 -35 -17 2 16 -13 -8 17 -5 3 -3 -6 12 -30 -12 -15 -36 3 39
3219 39 -24 0 23 -7 -24 62 -35 -30 27 28 5 -18 1 2 6 27 44 39 -33 34 5 40 -36 63 15 -16 -22 10 29 -2 -12 -14 16 -22
3253 -22 36 -16 -21 -21 -16 -11 27 -51 -30 -16 -25 25 -6 -11 -24 -1 14 -50 1 -64 11 -4 5 -16 30 -29 -10 61 -19 -14 -6 39 38 -22 -13 51
3289 51 41 -19 34 21 -36 29 33 13 -23 -3 -4 -11 -31 -15 10 -9 -4 -18 -30 14 2 -17 43 57 1 -16 -1 5 -52 17 0 -12 17
3322 17 4 15 -12 -1 -23 2 19 -28 -7 26 -24 44 -10 -14 -5 13 -9 -3 1 10 14 -30 20 45 30 -30 29 41 -19 11 -43 4 -14
3355 -14 -26 21 -29 -3 1 -5 5 8 -62 -9 -24 -13 -4 -2 -57 9 30 -48 9 35 19 9 28 -38 9 -23 15 20 31 -10 55 18 1
3388 1 -2 -11 31 75 20 -15 -19 -29 3 0 -15 5 24 -4 16 -49 43 16 -10 -25 2 -29 0 -55 30 -26 -29 21 -15 19 -11 -15 -5 -23
3422 -23 29 54 8 -19 -18 16 -17 17 13 -18 -23 7 16 -5 44 -5 -17 -12 -4 -17 1 -7 -25 -4 4 -45 -59 -37 -56 -23 -27 -12 20 9 -10
3457 -10 -7 4 42 -9 -9 -36 -5 19 -53 -22 18 8 49 -12 -17 21 -26 20 50 -42 -8 -15 -25 12 10 15 27 5 -35 -25 -17 5 8 7 12
3492 12 -40 27 0 19 10 -42 -70 -32 -20 6 -31 -23 -1 -34 -18 -8 -1 -11 -2 32 -15 2 -3 -9 21 -21 -33 -5 53 31 21 4 5 41
3526 41 1 9 -1 2 -7 15 29 -17 31 -21 -9 57 -25 -34 -3 9 14 -31 -56 12 -28 24 0 1 -26 34 -19 19 -5 -13 9 -55 -20 4
3560 4 33 -31 -30 4 0 -29 -31 17 36 12 6 51 27 -3 -12 -9 -1 4 -23 42 -25 15 -4 -15 7 14 -33 0 -57 -9 19 -18 -11 -3 -36 -21
3596 -21 -14 -11 21 -4 -10 -38 -50 -11 16 0 -2 -5 11 11 20 -26 -20 -13 -9 -15 -14 -9 9 -10 13 17 43 37 -1 25 3 -15 -4 -10 9 -44 -19 -42
3634 -42 -12 -6 -25 -34 17 -7 5 -40 14 -55 -14 -8 -2 -25 13 -52 6 17 -2 27 -20 -6 11 5 5 -34 27 28 30 14 3 38 29 26 -39
3669 -39 10 5 -19 10 20 -3 12 -12 -34 17 22 -24 3 -22 17 7 0 -23 10 1 5 -16 -42 21 -26 22 -4 23 30 -2 4 10 0 -12
3703 -12 -7 5 -35 16 29 47 34 -16 36 5 4 21 11 11 -5 -6 -16 19 4 40 -48 -26 -35 -5 22 -57 -8 -19 4 -42 -2 9 -13
3736 -13 19 5 9 4 13 -19 -28 -5 -17 2 -1 -8 -7 10 9 40 12 11 2 -16 28 18 5 11 12 9 -19 -4 64 26 -7 5 33 10 3 -18 -9 22
3774 22 15 -13 0 2 4 1 -21 -11 -9 -3 -4 17 -31 39 2 -23 -16 21 14 -17 -3 20 39 22 45 -43 -2 -30 -6 47 26 -3 24 7 53
3809 53 11 -29 28 -59 -26 -5 17 2 -24 -50 -16 18 27 11 -43 4 1 -27 -8 31 -10 -41 16 11 3 4 -16 18 17 5 -53 4 63
3842 63 22 -26 23 -16 19 -63 43 87 -36 -10 3 -11 31 -3 39 17 40 37 -25 28 3 28 -6 23 -43 8 -4 -45 -57 24
3872 24 -1 -31 17 7 4 1 -31 -14 -30 -55 0 -15 23 -18 -5 -24 -2 44 -8 -42 -14 43 52 33 9 19 -1 36 31 21 26 7 48
3905 48 -3 2 -5 9 -4 7 23 45 32 -15 19 3 7 8 16 -55 8 -16 -10 -14 -19 15 -10 -21 15 -6 22 10 3 -16 -25 41 31 -20 2
3940 2 -7 16 2 4 27 6 36 5 -25 1 7 -22 28 33 53 -8 2 -1 15 -35 -37 6 3 -16 -18 8 4 -27 -3 -38 -17 11 16 -24 5 4
3976 4 -24 -7 8 23 -26 -28 15 -5 -5 0 13 -6 21 11 -13 4 1 7 2 1 -17 11 21 -8 12 30 15 -21 7 19 -9 37 -13 -52
4010 -52 12 -24 -18 20 14 -12 -20 -28 -8 -20 -17 14 -30 1 14 -1 -3 15 -2 -12 1 -4 -12 -16 -25 -3 13 13 -14 -10 30 -44 27 -1 27 39
4046 39 19 11 26 13 -31 11 -7 -51 -11 17 -1 -4 -12 11 -13 1 3 -16 -35 -22 15 7 -49 9 7 -6 -14 -30 -51 1 3 -21 -22 1 3
4081 3 4 -40 21 -5 22 -9 32 16 1 25 35 14 21 17 -3 18 4 14 37 21 13 -3 -22 28 5 -17 -11 9 -12 -19 18 -42 9 9
4115 9 3 -82 3 -14 -20 -25 -8 26 11 -28 -57 10 -1 64 8 18 7 20 -42 43 5 6 8 12 -10 14 0 1 0 -39 22 21 4 -21 14
4150 14 -1 -20 21 -4 -14 -4 10 11 18 -30 -56 -8 -27 22 -8 -38 -37 -29 2 10 5 19 -46 15 -17 -2 -5 16 -19 -17 -39 -35 -14 -11 2
4185 2 24 11 7 -53 -35 8 6 -22 -19 3 20 44 16 33 -2 5 -5 -18 -32 1 -43 -1 -13 -5 -6 0 -10 -28 -2 18 -5 3 -8 24 -9
4220 -9 -10 -6 -7 -17 35 46 -52 -10 13 9 -3 28 16 18 13 20 -7 -6 7 3 10 7 -7 -15 -33 4 5 0 3 7 -5 -1 -17 -7 -15 -30 -16 -14 3 -21
4260 -21 -9 -29 -50 -10 -1 5 -17 -17 -7 2 3 -44 -4 15 2 35 10 16 4 32 -2 14 9 34 18 1 22 6 -1 16 5 -8 5 -14
4294 -14 19 2 -3 8 15 2 6 -19 -2 -28 3 -3 -25 16 -11 -5 -8 4 7 2 7 23 6 -20 6 -22 18 8 15 3 3 -9 4 22 -8 3
4330 3 26 -13 25 18 -9 -30 4 4 5 12 -1 5 2 0 -18 -20 -7 5 -19 -16 6 -18 4 -4 -24 20 0 10 -14 -13 13 -13 2 -5 -15 22 3
4367 3 -12 -31 16 -5 23 12 -6 8 0 7 11 2 8 -13 2 2 -20 -4 15 1 -15 3 -5 20 4 8 -5 4 14 -14 5 -8 -41 1 -3 -3
4403 -3 -23 -20 -28 1 -21 -2 -4 5 14 -14 -3 1 2 -14 -10 11 4 20 3 17 0 14 0 10 10 5 0 6 2 3 1 12 20 -21 -14 12 15 14 -17 5 4
4444 4 -12 -15 1 -1 -16 -37 -38 -22 -26 -7 -10 -2 -2 3 22 -4 3 -11 4 -9 -32 -7 15 1 -2 23 4 4 -13 -5 32 15 9 6 9 -1 19 13 34
4483 34 -8 -4 -14 -3 19 -10 -16 -2 19 -12 -14 -29 -7 -12 -21 -19 -23 -6 0 -6 -25 -27 -1 -5 1 -16 -18 -2 19 29 14 29 12 -10 26 20 4
4520 4 34 7 10 6 2 12 20 -4 -4 -6 14 9 18 9 34 -13 0 -2 -21 -5 -11 -11 -20 -18 15 4 -17 -11 -10 -13 6 -22 -1 -17 -26 12 -4 -1 -15 24
4560 24 -3 8 -24 -7 7 10 2 32 19 12 20 7 18 -2 0 0 -9 -14 -12 8 -21 -17 2 12 -19 4 -26 4 -21 13 -15 -14 -7 -37 -16 -9 -12
4597 -12 -5 -1 -8 -31 -24 -21 -11 23 2 -18 -7 20 11 -5 35 17 -1 14 9 -1 13 17 -2 10 11 18 24 11 16 -6 -19 -11 -2 -4 -12 -19 1 -8 -30
4636 -30 -1 -25 -3 -10 -16 -29 5 -18 9 -17 -13 -29 -12 15 15 18 -14 11 0 11 -9 -15 -27 5 1 -11 23 2 -1 -2 -18 -2 9 -3 -11
4671 -11 4 9 28 16 15 0 -8 4 -2 14 -5 -20 -29 -5 4 15 1 -11 6 1 -21 -12 2 -18 -7 8 4 -18 -1 -21 -13 30 -8 3 -6 4
4707 4 -2 21 -12 -4 28 22 6 19 23 7 -23 -2 4 22 -2 0 -5 -37 34 -2 -21 -10 -3 4 -11 -6 -10 -11 -14 0 -20 4 10 -18 -2 -5 -22 -2
4745 -2 -8 17 -15 3 6 -1 -1 31 9 -10 6 52 3 5 9 -21 29 6 30 -15 22 3 0 1 31 -4 -8 -10 8 -5 -5 -14 -28 -6 -15 -29 -1
4782 -1 8 6 -16 -19 5 -7 3 -7 18 32 5 -8 3 14 -8 12 13 -3 -6 -1 4 16 3 13 13 21 21 5 0 31 9 -19 2 20 22 21 23 11
4820 11 -15 11 -18 2 -4 -12 21 -24 -32 -48 8 -17 11 -25 -8 -7 6 13 -5 15 -1 -10 -5 0 -9 -5 -4 1 9 31 -6 -1 30 -21 0 13 20 9
4858 9 3 20 20 -3 14 31 -8 -25 7 3 -4 -8 24 5 19 -16 -5 0 -12 -2 -10 -28 11 -4 -17 -18 -17 15 10 -25 -8 9 -2 10 -9 -7
4894 -7 3 5 -5 4 -24 -6 5 -1 6 3 17 -18 21 1 -24 13 -9 -12 -6 -6 -1 13 -9 -5 -24 3 6 10 -23 -15 -2 -8 -7 -9 4 -33 -42 -10 -23
4933 -23 -19 -9 -2 5 -27 -20 -17 12 3 4 1 6 -6 1 11 16 7 2 18 -10 6 -8 -29 -6 -21 32 -13 6 -29 -15 3 -20 -17 3 -9 -1 -11 4
4971 4 -25 -21 -5 -6 -16 -3 -7 11 -19 -18 -9 -2 -42 -1 3 -6 5 0 5 -21 18 -3 -16 0 16 -9 -11 20 8 37 -19 1 10 29 17 4 -23
5008 -23 -15 6 -8 -4 -10 13 -8 -22 1 12 -21 -9 -5 -27 -17 5 20 -28 -48 6 -5 -5 0 8 14 -17 -4 -18 -19 -17 15 8 13 11 1 -28 -29
5045 -29 -23 -22 -4 8 9 -5 34 30 29 -9 18 18 -13 -22 -20 11 -9 -14 10 -5 -5 -14 2 -9 17 -11 -36 -12 -1 -25 -10 2 13 14 -12 -12 9
5082 9 4 23 0 14 -5 -8 6 4 -8 2 32 -8 -13 2 9 14 50 7 15 8 21 -13 7 -15 -4 16 5 4 -9 -7 7 11 -13 -32 -8 -1 -4
5119 -4 -20 -4 12 -23 -9 18 -12 8 -10 5 -20 11 0 1 -9 -30 8 25 30 17 19 20 11 -1 20 36 -4 1 -10 3 -20 29 -3 26
5153 26 40 11 -5 -4 -7 1 26 -45 11 6 -45 -53 -2 -26 -33 -23 -10 2 -28 -28 21 -36 -14 7 3 26 5 2 0 14 5 6 15 2 11 26 11
5190 11 58 -1 -11 16 -15 25 -9 -14 -16 19 -50 -14 20 -24 -12 -2 -27 12 -34 -8 48 -20 -17 -25 11 5 0 -11 61 -13 -8 12 -7 19
5224 19 6 31 -9 3 -6 35 -1 -12 -2 9 37 17 56 14 47 -4 16 -20 21 -13 25 11 -60 -29 30 -53 -9 10 -9 -9 4
5255 4 51 -51 0 -10 -22 -46 13 39 -2 33 -51 -8 -52 3 23 -14 -27 30 -9 0 0 -33 14 -32 -4 26 -26 -1 42 69 -3
5286 -3 32 43 -52 10 0 37 -40 6 36 -18 -16 -22 45 14 -13 19 20 7 -27 -8 2 5 -12 -33 8 17 26 23 -26 -22 -1 18 -7 7 -3
5321 -3 -7 4 -4 -11 -5 -26 -11 18 0 18 -5 -20 9 14 -6 16 -23 0 -11 -10 0 7 4 -37 -2 6 -9 -12 16 -55 -11 6 10 7 -26 14 2
5358 2 -33 10 -30 -22 -5 -5 -32 8 -31 -25 7 1 3 -6 36 -34 2 14 3 15 -11 4 0 6 3 -23 -12 -12 9 -9 12 -20 12 -25 -17 -6
5394 -6 -43 -24 -21 -15 18 11 21 8 5 -32 8 -10 -2 -3 -33 -44 -26 -9 13 -17 20 -17 -26 13 -17 -14 33 -26 2 -18 46 14 4 21 -10
5429 -10 32 19 -6 -22 -13 14 -8 -4 -25 -26 62 38 -9 -18 -65 -19 -43 -23 3 -8 45 17 -49 -24 -13 55 -66 -54 15 -19 54 25
5461 25 53 -56 -34 -36 13 7 32 -7 23 22 55 -48 -33 -10 65 22 28 -64 -28 27 3 -1 14 -4 -30 25 24 -40 7 -26 -60 44
5493 44 -19 -25 -10 26 8 -8 -71 -39 -39 -4 -17 -63 -41 -85 15 23 -27 49 -41 -47 45 -30 27 -104 57 -5 -21 119 -9 118
5523 118 -47 -23 8 -22 50 -1 -16 27 9 -29 72 18 -33 -52 32 33 54 -51 1 8 28 -29 -54 -61 1 -22 -59 -16 15 13
5553 13 -49 19 31 20 -21 54 -22 11 49 -38 76 33 -31 -16 -14 -46 17 22 67 37 85 62 50 0 77 70 -78 -9 -65 19 -7
5584 -7 -19 -80 -25 -32 -45 152 -62 -39 -14 13 -1 45 -54 -72 -6 -31 88 48 38 -24 -13 -51 -25 2 36 -37 -70 -30 13 23
5614 23 35 17 -31 -30 105 -124 51 29 73 0 15 23 30 57 -34 -83 -107 26 -9 -90 45 -29 17 -13 75 -30 25 50 60
5643 60 76 -6 -74 -109 -75 -14 -41 -78 95 18 -122 -62 -34 -29 22 -24 6 -75 -63 -14 93 30 -74 -131 -66 -51 -66 31 -82
5672 -82 6 -20 -135 75 -120 97 -59 -43 8 -49 -27 -66 42 -56 -7 -27 8 47 40 -144 2 -37 -78 -58 10 20 -93
5699 -93 -47 23 -142 -19 56 80 -52 23 -68 171 70 119 45 37 2 41 69 58 2 -71 9 38 48 151 74 -5 23 -36
5727 -36 45 23 -48 109 110 89 -202 -136 71 58 45 -227 -43 -228 -51 135 66 94 -36 44 232 20 60 -164 100
5752 100 13 -93 -125 243 26 -11 -42 21 41 -24 23 -26 -103 11 81 78 -22 -81 91 -45 100 -76 -13 -46 -19 -81
5778 -81 -32 104 17 -60 37 -84 -3 -51 2 6 -6 26 -15 9 -9 11 28 -2 15 12 3 16 -33 9 23 -17 -50 -16 19 12 7 55
5810 55 3 -4 20 8 10 27 16 -24 44 51 -12 -38 2 -10 -11 -22 -21 14 -3 -11 16 -41 -38 -46 15 26 -31 -1 -14 -2 11 -19 -23 4 34
5845 34 29 30 11 34 -15 -6 -26 -16 4 36 -12 22 48 8 7 18 8 -2 3 -21 -21 4 -35 -17 37 -9 46 26 -8 3 -22 -17 -9 3
5879 3 13 -9 31 9 -2 -23 -97 -39 -32 6 -9 5 -46 -3 -4 1 10 10 -35 21 -39 -25 6 13 -19 3 -24 37 41 -28 62 -56 -10 -33
5913 -33 -5 18 30 9 38 5 3 -27 -15 -46 -25 -19 44 -26 37 -1 -19 -29 -8 -37 -9 -52 -5 -8 22 3 17 -25 8 -25 -40 14
5945 14 33 -11 21 21 -20 19 -13 62 18 -63 27 -27 11 -6 16 17 -22 4 2 7 -12 6 -25 -18 2 -54 -88 28 42 -46 46 -45
5977 -45 -13 -3 -14 -21 -8 -31 -20 -17 -4 17 2 7 19 -3 -37 40 -6 -2 14 37 -11 1 -22 2 5 -5 30 -12 6 17 11 43 31
6010 31 -2 -1 -1 1 -13 -18 26 -6 -15 19 -3 5 -6 -30 -4 0 -34 39 -19 27 -21 19 -37 7 -4 -15 -25 -5 -26 -27 50 -7 -12 19 7
6045 7 21 57 6 30 9 5 -36 45 -20 23 16 -10 34 -27 -32 1 -58 13 24 25 -33 7 8 -4 19 16 -27 -43 17 -22 2 -21 13 1
6079 1 -25 -16 -39 8 -11 -17 14 53 3 26 16 10 -19 0 7 19 42 23 35 -5 27 39 -18 14 -1 26 11 -13 -17 5 38 -23 23
6112 23 15 -70 -20 41 -54 18 -21 -35 7 -3 -53 198 -190 -5 113 -11 109 139 -127 -167 24 -34 -62 -8 14 148
6138 148 56 -130 -22 -115 14 58 -14 -142 143 116 68 62 -15 35 54 0 149 140 -4 75 -66 46 161 -43 -145
6163 -145 54 -95 -118 104 58 -20 21 23 169 55 49 -48 24 -119 -65 19 -74 -23 66 -22 85 84 111 170 -57 39 -119
6190 -119 14 55 -61 1 100 45 27 3 -19 -27 30 106 22 110 58 43 -67 -14 43 -47 12 -67 62 3 -55 14 -20 10
6218 10 53 29 -25 -114 -70 -25 -16 -43 -10 -31 95 -1 55 55 3 0 9 15 32 -59 40 78 -9 77 -58 49 -54 60 1 30
6248 30 2 105 54 63 -14 -74 84 -3 -78 -64 -23 47 26 112 -58 11 -17 66 -26 19 58 13 16 22 -45 12 -44 4 -11 -22
6278 -22 9 -24 41 0 11 -43 51 17 -72 14 41 71 -28 10 31 -21 35 39 -57 14 35 41 -22 48 -36 -67 28 11 -36 9 -37
6309 -37 -74 -45 -21 27 -18 -20 -37 57 31 -6 19 1 15 -24 4 42 33 21 5 5 -52 26 -6 -5 6 -39 28 -32 -30 -35 24 15 32 -15
6343 -15 -34 44 -54 24 -69 -8 0 17 -6 -45 -38 -26 13 15 -54 -37 27 -18 -28 29 -57 32 -8 -96 -18 34 29 -50 -37 34 9 -61
6375 -61 15 -2 17 -12 12 131 -28 -26 -19 -5 33 22 54 15 -7 15 -18 -23 28 -21 42 5 -29 33 -38 -21 3 -57 -6 5 -23
6406 -23 -30 -3 20 -8 8 32 -46 -39 24 67 -35 -52 20 -16 -8 39 -8 6 42 0 -55 -10 -33 -54 -18 -28 -36 14 -5 -24 -3 -3
6438 -3 -42 24 -60 -13 28 -34 -26 7 22 29 -36 -6 1 -6 -15 2 -36 -7 -4 -31 -1 -21 19 18 -8 13 3 -10 8 -21 -6 -3 -3 -7 1 -16
6474 -16 7 -2 -15 -47 24 19 -24 16 -12 -41 -6 -8 -33 -32 -4 -9 5 14 -18 6 6 -17 -41 -25 5 -6 -55 -23 -5 -17 -6 -10 15 -7
6508 -7 13 27 10 -23 -4 -24 22 -1 24 33 -86 2 -25 25 25 24 -26 -4 47 -16 15 -12 4 -15 10 -38 28 42 33 36 1 -22 -9
6541 -9 -5 2 -12 -15 -22 -1 -28 -25 -7 -22 1 -6 -1 7 9 -19 5 -11 -38 -27 -25 36 20 12 0 -10 9 1 19 39 1 32 19 3 -15 16 9
6578 9 27 6 -17 -33 22 -43 -15 -2 19 0 -10 44 3 -46 -41 25 -8 -23 -15 9 -24 43 -15 -15 23 -28 6 -3 0 14 48 45 -19 -14
6612 -14 -8 29 6 12 3 -33 48 53 1 67 39 52 2 -1 20 34 9 -5 -1 29 -7 6 28 12 -25 -88 -3 26 -37 -60 14 -41 -23
6645 -23 -33 -25 11 -14 -22 -59 12 22 14 -11 30 -70 22 -27 14 -45 -9 0 -44 91 -13 -18 26 -23 42 40 16 33 -77 -59 -37
6676 -37 -42 7 -47 -61 -31 -15 -8 15 16 35 -52 7 -39 12 -74 38 -26 -15 -5 -30 -49 -49 32 -27 -10 10 25 50 15 21 42 18
6708 18 -26 6 -52 -34 50 -56 16 12 50 -11 75 60 -11 8 27 37 -37 -13 -74 -22 17 37 14 1 5 -39 10 40 -69 25
6738 25 36 17 -18 -37 18 -50 3 -22 -52 22 -70 -47 3 56 11 23 23 -10 -5 -17 30 -55 62 -23 -55 12 2 19 -40 16 -20
6769 -20 -43 -26 -23 -14 -58 45 52 -62 -55 74 -33 -22 27 89 -57 -20 -29 -8 -126 -61 -10 -43 -71 40 -92 -94 34 79 43
6798 43 -14 4 4 22 -37 3 -32 23 52 6 17 89 46 65 -60 18 11 16 69 3 34 -67 -23 26 -10 -52 -103 13 -95 -22
6828 -22 39 -25 -13 -26 3 10 -34 67 57 -5 5 -64 -12 -3 13 54 -6 7 41 38 66 -13 -57 32 50 -12 -4 5 -41 14 47 49 37
6861 37 41 -35 -33 45 -2 -12 67 59 -10 10 -20 -29 -41 -15 61 -33 -61 -31 -5 -10 1 -17 -14 -33 20 6 -15 -32 12 -11 -30 47 -8
6894 -8 44 59 26 -1 -8 -40 6 44 -7 39 12 -13 39 26 6 -10 17 15 13 39 -2 18 -5 -30 5 9 7 -20 5 24 8 13 -12 -25
6928 -25 -13 -8 8 -7 -12 -1 -10 0 -19 -33 3 2 -16 6 24 8 1 -1 3 -7 5 -6 -25 13 9 1 2 7 20 -8 -10 -7 9 20 9 -16 19
6965 19 16 -4 -28 5 9 -4 -6 -18 -10 -4 22 -15 4 -11 -21 -13 -25 19 21 -1 -12 -11 5 22 17 -13 -10 2 22 -3 -2 22 11 7 -24 -4
7001 -4 26 28 30 5 -10 -1 -12 6 16 46 -6 18 20 -3 -6 -3 -7 24 -9 -7 7 -5 -3 12 6 7 -4 -10 14 8 -7 -11 23 -3 11 -2 16 -23
7039 -23 13 34 5 1 -4 11 -11 11 10 10 9 0 -19 26 24 17 36 -16 37 -16 17 -9 25 -2 -2 -7 -8 -4 -1 10 -21 4 -17 -7 5 6 -19
7076 -19 2 -13 -6 19 3 4 13 7 -3 9 4 14 16 8 28 48 -12 19 6 5 -2 4 9 -1 7 18 18 -9 13 2 -17 -10 5 -1 -5 -20 0 -14
7114 -14 17 -26 25 -4 -15 -19 -1 0 12 7 1 -10 -21 -9 -12 12 -19 -2 -4 20 44 18 -3 24 11 -9 -5 8 -18 1 -4 20 33 15
7148 15 1 12 0 12 -14 10 -9 11 13 -2 12 11 5 2 -3 23 2 12 1 -22 -11 -6 -11 -3 2 -22 15 -1 17 8 20 -20 -17 -1 21 -20
7184 -20 -7 -2 23 -3 14 12 -13 5 13 -12 44 33 29 -6 -5 9 -10 -21 -12 25 -2 6 -10 -1 3 -6 -14 -3 7 -22 -27 -18 0 18 -28 -5 -10
7221 -10 11 7 13 -5 -12 17 -16 -24 2 -1 -4 -3 9 21 11 14 9 20 20 32 20 -2 19 -6 -4 -8 -7 12 28 -11 13 -49 8 -10 -37 -45 -1
7258 -1 -16 -25 27 -13 -38 -7 7 -19 1 -13 -15 -21 20 11 -8 26 28 -25 15 -15 -4 16 -3 -21 20 6 -18 21 -1 4 5 19 20 -14 12
7293 12 1 -11 12 -2 13 -9 -2 -9 -39 -23 -1 -13 3 -25 -19 -9 -29 -20 -9 -10 -9 1 8 -1 -35 9 -7 -16 -5 -12 -11 -14 10 -4 -11 5 14
7330 14 -3 18 21 -1 13 28 20 13 12 33 -13 8 22 -5 12 12 9 -12 -17 -10 -28 -6 3 12 15 3 24 -4 -18 -6 7 -17 7 0 -13 -16 14
7367 14 -1 25 -2 -23 9 18 26 -4 -16 -18 3 15 18 9 3 11 -8 30 29 -15 -1 -2 3 19 4 -15 -11 6 -19 -18 1 -16 -15 -4 -10 -8 -16 -13 -22
7406 -22 -11 -3 1 -26 -10 2 9 -17 -13 11 6 -13 -8 22 8 4 -4 -1 -7 8 9 20 -4 9 18 -6 -1 4 30 -5 -2 -3 -3 -20 12 8 -16 -16 1 -6
7446 -6 13 -14 -10 -16 2 -2 4 -11 -4 8 -24 -18 -5 3 -2 -20 -17 22 12 -11 3 -5 -29 8 7 -5 10 9 9 -3 -11 23 -39 24 1 0 21 28 9
7485 9 -1 20 -4 24 -19 15 -17 -29 -19 -13 -20 -27 -13 -4 -3 -18 -19 -20 -4 -13 -15 20 1 -13 12 -3 4 -10 -27 13 8 -9 2 14 20 -9 4
7522 4 -13 10 5 -7 24 -15 6 17 38 21 -19 12 6 21 10 -17 5 11 -12 18 14 -2 -34 -1 -28 -20 26 -3 -2 5 -11 -4 9 6 2 -4
7558 -4 15 -20 0 -15 -2 -6 8 -3 7 -1 20 -15 4 30 9 -26 -2 -10 11 22 3 42 2 -7 -9 -4 31 11 12 3 -15 -18 -35 -39 -21 -5
7594 -5 -12 -8 14 -15 -4 -10 10 11 -16 -14 -8 4 -3 -2 -3 0 -22 -19 -10 -10 -8 20 25 21 -12 9 -10 3 18 4 2 -7 4 0 22 -10 10 -24 0 27
7634 27 14 -10 -45 -14 -22 10 -6 9 1 -5 -8 -16 -16 20 -10 4 12 -5 -4 25 11 9 41 -19 -13 6 8 -6 35 7 22 8 5 26 2 0 -4
7671 -4 7 4 -5 -6 -2 41 -26 -15 7 -48 13 -30 6 -8 8 -23 -24 0 5 -8 -8 2 -1 22 -18 -12 -22 -23 4 9 -3 -7 16 25 -11 22 2
7708 2 -3 -6 25 1 16 -4 23 -4 15 -9 4 11 -9 12 16 33 -13 17 -1 -26 -2 15 6 -14 13 -16 -1 8 -18 -20 -1 -38 -12 0
7742 0 -10 11 -2 -26 -25 1 1 5 11 24 -26 14 24 2 4 14 -2 22 13 -20 -14 -1 3 1 -15 -1 18 8 17 -10 -5 14 15 -2 -9 2 -1 2
7780 2 -12 -3 -8 5 11 -23 -27 -27 5 -34 -25 7 -9 19 2 -20 -17 -2 -27 -4 0 -19 9 12 2 9 -20 8 42 1 3 14 36 19 -7 15
7816 15 9 -11 27 24 -16 -23 8 -15 -25 -31 -13 0 -14 6 21 -17 -32 3 8 -15 -10 0 17 6 -1 0 6 0 10 -3 15 -3 -18 34 -6
7851 -6 17 -12 -3 -1 -4 22 1 23 -5 15 10 7 -23 -15 9 -25 -15 -26 -23 -26 -10 5 -5 9 -4 -12 -9 -5 -31 -20 -1 -14 -8 -3 -26 13 33
7888 33 -10 -12 -2 -12 -7 9 -8 -10 12 13 9 23 -16 23 -15 -3 1 14 8 8 -31 34 15 -26 10 -22 -13 7 -17 5 7 22 23 -9 -2 11
7924 11 -18 -16 -24 -16 2 -12 -34 8 -8 -8 14 14 -24 5 -38 -19 -3 -2 -2 16 -18 1 14 -4 4 5 9 -15 12 2 6 6 15 -8 -18 -10 13
7961 13 -6 20 31 24 -8 -8 -39 6 17 0 12 -2 -31 -20 -17 -13 -12 -1 8 3 9 14 -9 2 -1 -9 11 15 -7 25 -3 37 1 39 2 -4 24
7998 24 17 14 3 28 -25 31 36 28 38 21 -26 -6 32 5 25 -36 -18 -1 0 -13 -7 22 -40 -26 42 14 -14 20 -6 2 -19 17 -17 -4
8032 -4 7 -30 36 0 26 -3 7 16 20 -48 4 7 -31 -8 -50 0 31 33 -1 -3 69 17 21 -30 45 17 -13 11 -21 39 18 -25 -3 -11
8066 -11 -8 9 -16 -50 -3 -27 -7 -53 -27 37 20 -43 -20 -22 -26 -4 -9 6 -32 10 22 -11 20 12 66 10 -1 24 -3 19 -42 7 -3
8099 -3 -69 13 0 5 22 -23 -16 -18 -45 -63 -106 -9 -6 78 -36 -30 47 -14 15 -20 29 -62 -59 -18 -33 12 44 48 9 18 -71 22 11 -31
8133 -31 14 26 30 -18 3 34 -12 -15 -94 -7 110 42 -7 -19 -23 -28 44 -90 -35 -71 3 38 54 0 37 48 46 33 3 68 -36
8164 -36 -22 -107 -11 -68 -111 31 37 -58 -48 -91 -63 -102 -78 12 42 52 -26 12 -34 -66 -7 21 -69 19 13 -16 144
8191A44
##END NTUPLES=NMR FID
##END=
