##TITLE=1H_SL78-Dau(f2)
 CDCl3, 8 sc, 
 4.06.2021
##JCAMPDX= 6.0         $$ Bruker NMR JCAMP-DX V2.0
##DATA TYPE= NMR FID
##DATA CLASS= NTUPLES
##ORIGIN= UXNMR, Bruker Analytische Messtechnik GmbH
##OWNER= root
$$ XWIN-NMR		Version 3.5
$$ Fri Jun  4 11:10:11 2021 Russian Standard Time (UT+4h)  she@DPX200
##.OBSERVE FREQUENCY= 200.131506
##.OBSERVE NUCLEUS= ^1H
##.DELAY= (6, 6)
##.ACQUISITION MODE= SIMULTANEOUS
##.ACQUISITION SCHEME= undefined
##.AVERAGES= 8
##.DIGITISER RES= 18
##SPECTROMETER/DATA SYSTEM= spect
##.PULSE SEQUENCE= zg30
##.SOLVENT NAME= CDCl3
##.SHIFT REFERENCE= (INTERNAL, CDCl3, 0, 15.7039)
##AUDIT TRAIL= $$ (NUMBER, WHEN, WHO, WHERE, WHAT)
$$ ##TITLE= Audit trail, XWIN-NMR		Version 3.5
$$ ##JCAMPDX= 5.01
$$ ##ORIGIN= Bruker BioSpin GmbH
$$ ##OWNER= she
$$ F:/spectra/data/she/nmr/H-F/1/audita.txt
$$ ##AUDIT TRAIL=  $$ (NUMBER, WHEN, WHO, WHERE, WHAT)
(   1,<2021-06-04 11:08:57.95 +0400>,<she>,<DPX200>,
      <created by zg, POWCHK disabled, PULCHK disabled
       configuration hash MD5:
       00 E9 B6 7A A2 85 ED C7 34 08 36 98 17 FE 4E 26
       data hash MD5: 16K
       B5 84 A5 02 35 11 E4 4E 00 05 D6 A3 28 CA F4 26>)
$$ ##END=
$$ 
$$ hash MD5
$$ 2E 05 F7 C9 BA 87 5D 03 E2 BC 25 4D C4 23 5D DB
##$RELAX= 
##$RELAX= 
##$RELAX= 
##$RELAX= 
##$RELAX= 
##$RELAX= 
$$ Bruker specific parameters
$$ --------------------------
##$DU= <F:/spectra>
##$EXPNO= 1
##$NAME= <H-F>
##$PROCNO= 1
##$TYPE= <nmr>
##$USER= <she>
##$AMP= (0..31)
100 100 100 100 100 100 100 100 100 100 100 100 100 100 100 100 100 100 
100 100 100 100 100 100 100 100 100 100 100 100 100 100 
##$AQSEQ= 0
##$AQ_mod= 1
##$AUNM= <au_zg>
##$AUTOPOS= <>
##$BF1= 200.13
##$BF2= 200.13
##$BF3= 200.13
##$BF4= 200.13
##$BF5= 200.13
##$BF6= 200.13
##$BF7= 200.13
##$BF8= 200.13
##$BYTORDA= 1
##$CFDGTYP= 0
##$CFRGTYP= 5
##$CHEMSTR= <none>
##$CNST= (0..31)
1 1 145 1 1 1 1 1 1 1 1 1 1 1 1 1 1 1 1 1 1 1 1 1 1 1 1 1 1 1 1 1 
##$CPDPRG= <>
##$CPDPRG1= <>
##$CPDPRG2= <>
##$CPDPRG3= <>
##$CPDPRG4= <mlev>
##$CPDPRG5= <mlev>
##$CPDPRG6= <mlev>
##$CPDPRG7= <mlev>
##$CPDPRG8= <mlev>
##$CPDPRGB= <>
##$CPDPRGT= <>
##$D= (0..31)
0 1.2 0 0 0 0 0 0 0 0.06 0 0.03 0 0 0 0 0.0002 0 0 0 0 0 0 0 0 0 0 0 0 
0 0 0 
##$DATE= 1622790537
##$DBL= (0..7)
120 120 120 120 120 120 120 120 
##$DBP= (0..7)
150 150 150 150 150 150 150 150 
##$DBP07= 0
##$DBPNAM0= <>
##$DBPNAM1= <>
##$DBPNAM2= <>
##$DBPNAM3= <>
##$DBPNAM4= <>
##$DBPNAM5= <>
##$DBPNAM6= <>
##$DBPNAM7= <>
##$DBPOAL= (0..7)
0.5 0.5 0.5 0.5 0.5 0.5 0.5 0.5 
##$DBPOFFS= (0..7)
0 0 0 0 0 0 0 0 
##$DE= 6
##$DECBNUC= <off>
##$DECIM= 32
##$DECNUC= <off>
##$DECSTAT= 4
##$DIGMOD= 1
##$DIGTYP= 9
##$DL= (0..7)
0 120 120 120 120 120 120 120 
##$DP= (0..7)
150 150 150 150 150 150 150 150 
##$DP07= 0
##$DPNAME0= <>
##$DPNAME1= <>
##$DPNAME2= <>
##$DPNAME3= <>
##$DPNAME4= <>
##$DPNAME5= <>
##$DPNAME6= <>
##$DPNAME7= <>
##$DPOAL= (0..7)
0.5 0.5 0.5 0.5 0.5 0.5 0.5 0.5 
##$DPOFFS= (0..7)
0 0 0 0 0 0 0 0 
##$DQDMODE= 0
##$DR= 18
##$DS= 0
##$DSLIST= <SSSSSSSSSSSSSSS>
$$ [...]
##$SUBNAM2= <"">
##$SUBNAM3= <"">
##$SUBNAM4= <"">
##$SUBNAM5= <"">
##$SUBNAM6= <"">
##$SUBNAM7= <"">
##$SUBNAM8= <"">
##$SUBNAM9= <"">
##$SW= 20.0188882624521
##$SWIBOX= (0..15)
0 0 2 0 0 0 0 0 0 0 0 0 0 0 0 0 
##$SW_h= 4006.41025641026
##$TD= 16384
##$TD0= 1
##$TE= 0
##$TE2= 300
##$TE3= 300
##$TEG= 300
##$TL= (0..7)
0 120 120 120 120 120 120 120 
##$TP= (0..7)
150 150 150 150 150 150 150 150 
##$TP07= 0
##$TPNAME0= <>
##$TPNAME1= <>
##$TPNAME2= <>
##$TPNAME3= <>
##$TPNAME4= <>
##$TPNAME5= <>
##$TPNAME6= <>
##$TPNAME7= <>
##$TPOAL= (0..7)
0.5 0.5 0.5 0.5 0.5 0.5 0.5 0.5 
##$TPOFFS= (0..7)
0 0 0 0 0 0 0 0 
##$TUNHIN= 0
##$TUNHOUT= 0
##$TUNXOUT= 0
##$USERA1= <user>
##$USERA2= <user>
##$USERA3= <user>
##$USERA4= <user>
##$USERA5= <user>
##$V9= 5
##$VALIST= <valist>
##$VCLIST= <CCCCCCCCCCCCCCC>
##$VD= 0
##$VDLIST= <DDDDDDDDDDDDDDD>
##$VPLIST= <PPPPPPPPPPPPPPP>
##$VTLIST= <TTTTTTTTTTTTTTT>
##$WBST= 1024
##$WBSW= 4
##$XGAIN= (0..3)
0 0 0 0 
##$XL= 0
##$YL= 0
##$YMAX_a= 296223
##$YMIN_a= -221930
##$ZGOPTNS= <>
##$ZL1= 120
##$ZL2= 120
##$ZL3= 120
##$ZL4= 120
##$ABSF1= 10
##$ABSF2= 0
##$ABSG= 5
##$ABSL= 3
##$ALPHA= 0
##$AQORDER= 0
##$ASSFAC= 0
##$ASSFACI= 0
##$ASSFACX= 0
##$ASSWID= 0
##$AUNMP= <proc_1d>
##$AZFE= 0.1
##$AZFW= 0.1
##$BCFW= 1
##$BC_mod= 2
##$BYTORDP= 1
##$COROFFS= 0
##$CY= 11.3945322036743
##$DATMOD= 1
##$DC= 2
##$DFILT= <>
##$DTYPP= 0
##$F1P= 15.9154993809931
##$F2P= -4.1035820241983
##$FCOR= 0.5
##$FTSIZE= 0
##$FT_mod= 4
##$GAMMA= 1
##$GB= 0.15
##$INTBC= 1
##$INTSCL= 1
##$ISEN= 128
##$LB= 0.24
##$LEV0= 0
##$LPBIN= 0
##$MAXI= 10000
##$MC2= 0
##$MEAN= 0
##$ME_mod= 0
##$MI= 1.114404
##$NCOEF= 0
##$NC_proc= 0
##$NLEV= 6
##$NOISF1= 3.799351
##$NOISF2= 2.8
##$NSP= 1
##$NTH_PI= 0
##$NZP= 0
##$OFFSET= 15.70392
##$PC= 1
##$PHC0= -11131.76
##$PHC1= 25.20099
##$PH_mod= 1
##$PKNL= yes
##$PPARMOD= 0
##$PSCAL= 0
##$PSIGN= 0
##$REVERSE= no
##$SF= 200.130013532006
##$SI= 16384
##$SIGF1= 3
##$SIGF2= 2
##$SINO= 400
##$SIOLD= 16384
##$SREGLST= <1H.CDCl3>
##$SSB= 0
##$STSI= 0
##$STSR= 0
##$SW_p= 3612.71676300578
##$SYMM= 0
##$S_DEV= 0
##$TDeff= 0
##$TDoff= 0
##$TI= <>
##$TILT= no
##$TM1= 0
##$TM2= 0
##$TOPLEV= 0
##$USERP1= <user>
##$USERP2= <user>
##$USERP3= <user>
##$USERP4= <user>
##$USERP5= <user>
##$WDW= 1
##$XDIM= 8192
##$YMAX_p= 0
##$YMIN_p= 0
$$ End of Bruker specific parameters
$$ ---------------------------------
##NTUPLES= NMR FID
##VAR_NAME=  TIME,          FID/REAL,        FID/IMAG
##SYMBOL=    X,             R,               I
##VAR_TYPE=  INDEPENDENT,   DEPENDENT,       DEPENDENT
##VAR_FORM=  AFFN,          ASDF,            ASDF
##VAR_DIM=   8192,          8192,            8192
##UNITS=     SECONDS,       ARBITRARY UNITS, ARBITRARY UNITS
##FACTOR=    0.0002496,     1,               1
##FIRST=     0,             0,               0
##LAST=      2.0444736,     0,               0
##MIN=       0,             -221930,         0
##MAX=       2.0444736,     296223,          0
$$ Real data points
##PAGE= N=1
##DATA TABLE= (X++(R..R)), XYDATA
0@%%%%%%%%%%%Qj6J6j6J9k7L2m0M8n6P2q7J02j19J36j54J78k08K40k72L10l53
33a87L98m50N07n69O38p14P95q84R83j091J209j337J477j630J797j981K183k403
51a259K647k918L220l557L935m369M866n441O123o939P938r195J0830j3056J6272
66I097k1346L0547n2310J93428J36807m47108N6440J99118j06534p9510J31104
77D9733Q79m1202j3205j8202K3532M9133n3354l6083K9309K3438j448k45k1960
90i675n225J1329J6539L467j7368j6467J3371M030j442J0822Q105j671k1184k9207
104c4576M0702M8952n7651m1792O0696R532m1201K6232J3811l9524J928J7559
116D668n235J9780j596n2383J860N8683Q933m0848j2183J5684n411j4140K7860
$$ plain form
0 0 0 0 0 0 0 0 0 0 0 0 0 8 -8 8 -8 11 -16 16 -24 24 -32 40 -47 55 -64 72 -82 96 -112 128 -144 166 -187
33 -187 211 -239 268 -301 337 -377 418 -466 517 -574 635 -702 775 -855 942 -1039 1144 -1259
51 -1259 1388 -1530 1690 -1867 2068 -2301 2565 -2876 3247 -3692 4246 -4949 5881 -7175 9097
66 9097 -12249 18298 -34012 159416 296223 -150885 -94445 104673 -1861 -81371 49733
77 49733 50612 9410 -3795 -21997 1535 50668 -2686 -38769 -9460 13978 12530 12285 -9675
90 -9675 -14900 -3571 12968 16435 -933 -17400 -4029 1 -1441 9381 17486 15815 -5369 -34576
104 -34576 6126 55078 -2573 -44365 16331 25863 -15338 10894 24705 -14819 -12891 4668
116 4668 -567 19213 17617 -34766 -32906 25777 34710 -6138 -18321 -2637 -8048 -22188 5672
129E672K2613l5714j8722L0086Q153j2748l12r594n288J3377Q962J2159j639l6511
143a9506M56M1438j4789l0364K4628J0658j7243R204O665m575J681k9170j4802
156c5719N0340K0764m1085n300J9490j8016j2540K4739J6344j8802k2848Q109
168a4524K0920k739m937L226j5357m232K3746J269j4528L460n875l109K4894J355
182A3569k5515M088J0309j0505N831J4334r023j0403L748O924N955o229j2066
195h983L917J1712j610o846p1M651l377l807J1527N294j9506r131J2016M525L731
210D042N520p652m731j681j2104J1415K3408k0543j7735K7830O717k3535N182
223c867J0632j4804n222J2880J1306J589j5747r679J4645O939j0406Q98N632q172
$$ plain form
129 5672 28285 -7429 -26151 3935 12088 -660 -972 -10566 -15854 -2477 6485 18644 17005 -19506
143 -19506 -19050 22388 7599 -22765 1863 12521 -4722 4482 11147 6572 8253 -20917 -35719
156 -35719 14621 35385 -5700 -11000 8490 -9526 -22066 2673 19017 215 -22633 -14524
168 -14524 6396 3657 -1280 1946 -13411 -17643 6103 7372 -7156 -3696 -9571 -12680 12214 13569
182 13569 -11946 -7858 2451 -8054 -2223 12111 3088 -7315 -3567 3357 9312 3083 -8983
195 -8983 -5066 6646 5036 -1810 -1881 2770 -607 -4414 7113 12407 -7099 -16230 -4214 311 4042
210 4042 9562 1910 -2821 -4502 -16606 -5191 18217 -2326 -20061 7769 14486 -9049 -3867
223 -3867 6765 -8039 -13261 -381 10925 12514 -3233 -12912 1733 8672 -1734 -836 4796 -3376
237c376m271J2917J1774j1912j9623Q648J7785q789o823J0719m435r854P655O327
251F742j51l143j1852K901J6673r330q991J4636l130j4083J3214P725j2360j195
265b344J158k494Q486J533r490M485N107q636k115Q852K519r026o404R429J0766
280A1826p712q679M284P63m58K400l166o39J261m290P631J0540j5339j1672J1543
295a707L39l936J3819J99j5265j133M651L268N607r091p400J3340M950j2935K061
310c233Q116p939o855Q294R938m791j2527K227J1147l556o257J0453L0j0790j664
325g407Q590N060n530n299M906M818q383J13J0361n845r097P748O105k436k789
340I15l869J705N215l079l41M397o291n237R696L917m123k053l810P83O189k580
$$ plain form
237 -3376 -7647 5270 17044 5132 -14491 -5843 11942 3153 -3670 7049 2614 -7240 415 6742
251 6742 6591 3448 -8404 -5503 11170 1840 -7151 7485 4355 -9728 3486 11211 -1149 -2344
265 -2344 -1186 -3680 4806 6339 -3151 1334 6441 -2195 -4310 4542 7061 -1965 -8369 1060 11826
280 11826 4114 -4565 -281 482 24 2424 -742 -1381 -120 -4410 3221 13761 -1578 -13250 -1707
295 -1707 -1368 -5304 8515 8714 -6551 -7684 -3033 235 5842 -3249 -10649 2691 7641 -5294 -3233
310 -3233 4883 -3056 -9911 -1617 8321 3530 -8997 -6770 4377 821 -5436 5017 5047 -5743 -7407
325 -7407 1183 6243 713 -4586 320 5138 -3245 -3132 7229 1384 -7713 35 6140 3704 915
340 915 -2954 -1249 3966 887 546 4943 -1348 -6585 3111 7028 2905 852 -2958 -2175 4014 1434
356A434m193M834m42k897M041P31m416p08k012K211P439k592p376L284K641l010
372a031K71J958q37l290k115P233N280q450m754O412j708m301O389M507m758o056
388e250l47P839L379r513j203Q775m807n422R339K524j0246j643O595L363j279
403B104n930r91M551j257j111O724p55q993J11P168P31m727o84M320q2m420K514
420g27M465m888k743M452J805n92j933l582L142N659m090j321M801m188m503N204
436I61K156L81J106n030r89O147k529m545N052J118m385K402L749k455m543j657
452c061L588M962l674l007M814l094n366O054M940n586m659Q40O195J114o484
467b424J10N738m061m254O845K438o634k992L918M581j596n465K935L400n404
$$ plain form
356 1434 -2759 2075 1633 -1264 2777 3508 -908 -1616 -3628 -1417 6022 3430 -3946 -662 1979 -1031
372 -1031 -760 1198 361 -2929 -5044 2189 7469 -981 -5735 677 -1031 -5332 1057 5564 806 -5250
388 -5250 -5597 2242 5621 -3892 -5095 3680 -1127 -6549 2790 5314 -4932 -6575 20 3383 2104
403 2104 -3826 -4817 -266 -1523 -2634 4090 3335 -5658 -5547 1621 2352 -2375 -3059 1261 1179 -3241 -727
420 -727 3738 -1150 -3893 559 2364 1772 -161 -3743 -601 5058 968 -353 4448 260 -4243 961
436 961 3117 3498 4604 -426 -1415 4732 2203 -2342 2710 3828 -557 1845 5594 3139 -1404 -3061
452 -3061 527 5489 1815 -1192 3622 528 -4838 1216 6156 570 -4089 -3249 2946 4060 -2424
467 -2424 -2314 3424 -637 -4891 1954 4392 -2242 -5234 -1316 3265 1669 -3796 -861 2539 -2865
482b865j495P826j015o123J451L099j47p88k144J353J145l740J610N860m491m396
498d860M639J235l603J650O03j560M91p74J193K706k751l534L301K679j537j699
514a821j092K016K193j100m0J201j970j313J152J490L118j633m846K875M902n575
530d43j084N377k518k852M350Q10k817p39j536K666L881m723k308N678k662o268
546e188O366N183o635l619M573J685l724n91K396J879l137j547L134J433l826
561a618k588L819L758l697k932N362p61o255L467O272m747l182L268K39p55J068
577G18j333M06J583k946O34L672m078k524M956J002k975O56Q8j775J358N65m97
594d90J135n85j942J088J317J11j720k04J391L46j049J278P59k191o03J975O81
$$ plain form
482 -2865 -4360 3466 2451 -3672 -2221 878 731 -57 -2201 -848 297 -3443 -1833 4027 -464 -4860
498 -4860 -221 1014 -2589 -939 -336 -1896 -1405 -2179 -986 1720 -1031 -4565 -1264 1415 -122 -1821
514 -1821 -2913 -897 1296 196 156 1357 -613 -1926 -774 716 3834 2201 -2645 230 5132 -443
530 -443 -1527 3850 1332 -1520 2830 3640 823 84 -1452 1214 5095 372 -1936 3742 1080 -5188
546 -5188 1178 6361 -274 -3893 680 2365 -1359 -1950 446 2325 -812 -2359 775 2208 -1618
561 -1618 -4206 -387 3371 -326 -3258 2104 1343 -4912 -1445 4827 80 -3102 166 405 -350 718
577 718 -615 -209 1374 -1572 -938 2734 -1344 -3868 1088 2090 -885 -229 -141 -1916 -558 7 -490
594 -490 645 60 -1882 -794 523 634 -1086 -1290 101 447 -602 676 1435 -756 -1359 616 1297
611A297O65j214k611K681K768l911j30M146k615l209M025K420l653j788J328K037
627B236k21k404J289K404m548j971N436J504m329j750K964P56k359j412L551K74
643A420m430J131M347k033m029J653K341L1j018r16Q23K47j937J169L495k237
659E7k965K281J445j961J11Q60L38p77p34J198Q48j929n39Q69Q27J006q07j934
677a806L72J396j236J148K057k597k008K408P72l19k27j272P94J646j627n56K958
694A903j794k406L064K309k415j851J245J224m67j016K191N36l053q15L355Q50
710B860k259j414J598J557k372o51L648n56n192J777M798k240l173J484R48l22
726D91l81q19J609m7k981R06L361j750k680J876J013j728Q98J363j254j614M36
$$ plain form
611 1297 1962 748 -1863 818 3586 -325 -455 3691 1076 -2133 1892 4312 659 -1129 199 2236
627 2236 2015 -389 900 3304 -1244 -3215 2221 3725 -604 -2354 610 1366 -993 -2405 1146 1420
643 1420 -3010 -1879 2468 435 -3594 -1941 400 431 -587 -1503 -680 -433 -2370 -1201 2294 57
659 57 -2908 -627 818 -1143 -1032 -172 166 -611 -1345 -147 701 -1228 -1767 -898 -71 935 128 -1806
677 -1806 -1434 -38 -1274 -126 1931 -666 -2674 -266 506 187 -40 -1312 -518 1128 -499 -1055 1903
694 1903 109 -2297 767 3076 661 -1190 55 1279 812 -204 1987 2523 -530 -1345 2010 2860
710 2860 601 -813 785 2342 -30 -681 2967 2411 -2781 -1004 3794 1554 -1619 -135 813 491
726 491 110 -709 900 853 -2128 -1222 2139 389 -2291 -415 598 -1130 -232 1131 -123 -1737 -1301
743a301J500P43j520k71M38n02R75qr47Q04j6j327J716Q58k062m86J349l48R65
762E60n6k240Q29J772j910j02K857j428k507J565J565r19n44J61P70j65j085Q59
780a8J558j904j573K359J819j665j857R75J636j650r37L697K5m476Q75L559j165
797A258j751N80Q88j40r50p36K565N6l709J512L628k546k456K363M71j890Q91
814C4J524p44r51j113J330J528j645j029J583j34j091Q52L65p22o64K56J048j00
832C27n48q43N10j88P18K40n94Q3l55n52R72J208j319r32N00P94K30o02o78Q87
852a42j85p97O39R15p90j875J497J527n71p56Q06l15l75m14R12R79j884j058K783
871H96K45j772l5J890r77j547J290K260j315k617P15K274p47j173Q7R78o20o26
$$ plain form
743 -1301 199 942 -578 -849 -411 -913 62 54 -893 -89 -105 -1432 284 1142 -920 -1406 -57 -405 560
762 560 504 -1736 -907 865 -1045 -1147 1710 282 -2225 -660 905 -14 -558 -397 373 208 -877 -18
780 -18 1540 -364 -1937 422 2241 576 -1281 -306 1330 -320 -1257 2440 2465 -2011 -1136 2423 1258
797 1258 -493 87 975 835 -115 -851 1714 1770 -1939 -427 3201 655 -1801 562 1033 -857 34
814 34 1558 814 -137 -1250 80 1608 -37 -1066 517 383 -708 144 509 -213 -877 -621 427 327
832 327 -221 -1064 -554 -742 -24 216 -378 -295 -650 -1202 -230 978 -341 -1273 -773 21 251 -351 -1029 -142
852 -142 -327 -1124 -485 430 -360 -2235 -738 789 218 -538 268 -47 -422 -836 76 1055 -829 -1887 896
871 896 1141 -631 -666 1224 247 -1300 -10 2250 935 -1682 -967 1307 560 -613 -526 452 -168 -794
889g94J383P33j504j150J897J273j961m43J194m37l71O30L82k18o53p73J124J030
907A342j629m28J883j614n30J430R6j423L50l0O27O20m01j382P12O45k09k17k24
926c82p07J91m27J390J006j164q91M87R45l60q69K51J203j335m53J855N65k090
944g85m98K171l87n17K32J63k10n56k5J932j53k603O44K128j016j180J595K4j322
963c63k65J316O34j186j149P74J165r51k82J193p50o80K05R96N9j063m30R22L39
982D84r26R22oj178L33J039k60k42l46m60M89K74j17K70k74p17O94O56r52J33
1002a84J78q09O19J100j108p38M55O13k10K9kJ39p57m64J182R62j078j116R56
1021b33N25q73j92R46K45j545LK102l36j800L57J168r0q05O15M53m69p51M05J712
$$ plain form
889 -794 589 1322 -182 -1332 565 1838 -123 -566 628 191 -180 450 832 614 -39 -812 312 1342
907 1342 -287 -715 1168 -446 -976 454 550 -873 -523 -553 74 694 293 -1089 -377 268 59 -158 -382
926 -382 -1089 -898 -1325 65 1071 -93 -984 -497 448 88 -781 -530 673 -662 -1115 740 1305 -785
944 -785 -1283 888 501 -16 216 379 169 -387 -412 1520 1367 -1236 -592 1536 520 -660 935 959 -363
963 -363 -628 688 1322 136 -1013 -239 926 -25 -307 886 136 -544 -339 657 716 -347 -777 145 484
982 484 -442 480 474 -704 -371 668 408 166 -180 -640 -151 123 6 276 2 -715 -21 635 -317 -184
1002 -184 -6 -815 -196 904 -204 -942 -487 126 -84 -55 -57 82 -675 -1139 43 1005 -73 -1189 -233
1021 -233 292 -581 -773 173 418 -1127 -1124 978 642 -1158 -801 367 277 -528 87 540 71 -680 -275 1437
1041A437j198j395J167J222j594J98J091m25j190L88Q23J57p50m06O31P00r59
1058a03K1Q56q52p48Q68J021q36o44K46N02n42L75M29l80n15K88N02j74Pl81k09
1079b69M21L40l38K98j59n72N00Mr7K66M9j313J033J083j131l99M67P3n61L08
1099CO17j21q37k59R02K42r38j86P73k35o98O08M93n77p81K59J402n49j079N83
1119c78O39r46j9R85j69o24k79J018L19o73o58J072j03l58K67M76n21p27M06N67
1139B94O5m85k01M42j68l3K66J74p75j10P18n1L07j89n34j07O72j18rl5k95J56
1161a6J73p4J02m22m9N74K87m18l54K15J36j44p6N14L05j121j41P63L08q55K12
1182h1N02o25n88Q98L55l58o89L53O47q1q00L45O90r79j25R70J21j092q3O12K76
$$ plain form
1041 1437 239 -1156 11 1233 -361 -163 928 503 -687 -299 524 681 -69 -475 156 856 -103
1058 -103 -82 774 -78 -826 42 1063 227 -417 -171 331 -211 164 593 213 -302 -14 488 314 321 -60 -269
1079 -269 152 492 154 452 293 -279 221 225 128 394 443 -870 163 1246 115 -284 183 256 -305 3
1099 3 620 499 -338 -597 305 547 -391 -577 196 -39 -737 -129 364 -213 -994 -735 667 118 -961 -378
1119 -378 261 -685 -704 281 112 -512 -791 227 546 -127 -785 287 184 -174 93 569 48 -679 -273 294
1139 294 359 -126 -327 115 -53 -86 180 354 -421 -531 187 136 443 254 -280 -387 285 167 158 123 -172 -16
1161 -16 157 83 185 -237 -286 288 575 157 -197 18 154 10 -66 448 753 -368 -509 254 562 -293 -81
1182 -81 421 -204 -792 106 461 103 -586 -233 414 333 -467 -122 568 -411 -536 434 555 -537 -620 -8 268
1203B68o45k01O31K37r07L58O30m11l22q6M28M46q51L92Q7r6k71Q49o0q65K76
1224a13K10L57j80j49l31Q2L40J26J66k86m00K46M4j7J71K33n03j27M59R4n11
1245h9K70J42n43l29O99K48k72l56M15J84l91j69L85n1n28K69O38q0o66k18J071
1266F29k08r24P42Q3q33K42M65n1o63J93K92M24n60k12M23K05q41r2J321j86j328
1287h79K17R97k84l31J24J72m38qJ86O27l16o04J67N46l44k18L27R5n28J78O99
1308C85l57k85L25Ok19L57J76m34L4PJ46j8M31n44m9o1J64K74p9n25L05L14l75
1331b2J14J37k30r5j96Q18k37n92L52L48j27m69M13R1k17m51M48M87j06o88J14
1352a08M18m80K5L72l53j83l9O50n4n46j36K17K71n03L26L58k02o35N17M46l62
$$ plain form
1203 268 -377 -578 53 290 -617 -259 371 -40 -362 -448 -20 426 -425 -33 54 -42 -313 536 476 -389 -113
1224 -113 97 454 274 125 -206 -124 216 342 508 222 -178 68 112 95 266 499 -4 -131 328 422 -89
1245 -89 181 323 -220 -549 150 398 126 -230 185 369 -22 -191 194 143 -385 -116 522 442 -224 -442 629
1266 629 421 -503 239 322 -511 -269 196 145 -518 -325 -33 391 -169 -381 42 247 -594 -686 635 449 -879
1287 -879 -662 335 51 -280 -156 16 -422 -430 -244 383 67 -537 -370 176 -168 -386 -59 36 -492 -314 385
1308 385 28 -257 68 74 -145 212 388 -46 -12 -5 141 123 554 10 -39 -100 64 338 259 -266 39 353 -22
1331 -22 92 229 -1 -96 -292 526 289 -303 49 397 270 -199 214 305 88 -363 85 572 466 -222 -108
1352 -108 310 -170 -145 227 -126 -309 -348 302 248 -298 -434 -217 54 -449 -123 235 33 -602 -85 361 -1
1373ak59J74K62m88K18J08j63L4k69K76L28j91k51q5K93k61K04J34l30R6J70R1
1395I0kJ12k94M4o2M46k58j36J67j50K40k07L3p3K2M8J0M68o78K62K79o0o08P59
1419D52L9n35k60R07j22l05j85J55N08o08o6K20L48m68j57M21Nm43j7N26k53m71
1441c09L36K69l27n26O09J91k65K8o6K4q0q0P9K08l16j41M54j04k03J66mk65L93
1464G1O7k66J11m8k37L6K45j92K93l94L43K3J91o05L5L2N12k49K54j2l83k89O45
1487A83K08n79j7L65l22m4L00J44M7m21L5M38m59P5J05K02m12l53L61P66p83n2
1509b13M37n8R0j15J54j00j91k07Q76l52m33J1O16k26m52J90L27j85k44J73J37
1530B35J9p79L38K50k84M0J74J16k95L16R8p2l15Q3K03k07j33K08N0j36K2J17
$$ plain form
1373 -1 -260 -86 176 -312 -94 14 -149 -115 -384 -108 220 29 -222 -307 -14 -275 -71 63 -267 -171 -1 90
1395 90 88 200 -94 -50 -112 334 76 -60 107 -43 197 -10 23 -50 -28 20 30 498 -180 82 361 301 -307 452
1419 452 491 -44 -304 603 481 176 -9 146 654 46 -20 200 548 80 -77 344 349 -94 -111 415 162 -309
1441 -309 27 296 -31 -557 52 243 -22 6 -60 -36 -116 -196 -117 91 -225 -366 88 -16 -219 -53 -57 -322 71
1464 71 138 -128 -17 -65 -302 -266 -21 -213 80 -314 29 52 243 -362 -327 -295 217 -32 222 210 -173 -462 183
1487 183 391 -188 -205 160 -162 -206 94 238 285 -136 -101 337 -122 -47 58 260 -152 -505 -144 622 -161 -213
1509 -213 224 166 256 141 295 195 4 -203 673 321 -112 -101 515 289 -163 27 354 169 -75 98 235
1530 235 254 -525 -187 63 -221 -181 -7 109 -186 130 228 156 -159 -76 127 -80 -213 -5 45 -91 -69 48
1552D8k35J60j72n1R3l2K97j90m7j24L54J43o55L24K91m40J20L04l71Q8N0K84
1574B39k68K6k5J77P6k99l65Q41k10n10K91N99o47J02N45p90K89J10M05m77l39
1595b30o97J473L64q05l4J15Kk96J58k24M47m23QM52J55l39m10K90j84M17K69
1616E08J52o74m55R20p58R42m62l05lK45Q00k61q82J0M00k24n8k90Q69j57p2m40
1638a95k35O53q6ok74k1M49o42J83J41L26k58l52K22M09m78J44j09J99j21m3q8
1660a82L08k91R8N9j64J23R8N05k62j80M2k6k01p2K34K20m77m18O62K39m14J19
1682B0l46O07l10K74m83J41K15l39L54M04l89k41M89l78l04P6P10p10m7O13k56
1703A00L40k51k37L05L3m39j00K98J2O8j70M6o61N84L07p95L75K69l54M4j60Q53
$$ plain form
1552 48 -187 -27 -199 -250 -157 -189 108 -82 -129 -253 101 244 -411 -87 204 -236 -116 188 -183 -95 -45 239
1574 239 -29 -3 -28 149 225 -74 -439 402 192 -318 -27 572 -75 27 572 -218 71 181 586 109 -230
1595 -230 -927 546 910 105 71 186 188 -108 50 -174 273 -150 -142 310 465 126 -284 6 -178 239 508
1616 508 660 -14 -469 451 -307 635 173 -132 -135 110 910 649 -233 -223 177 -47 -105 -395 474 317 245 -195
1638 -195 -430 223 137 131 -143 -164 285 -357 -174 -33 293 35 -317 -95 314 -164 -20 -129 70 -51 -94 -182
1660 -182 126 -165 -67 -8 -172 -49 49 554 292 112 154 128 -73 -145 89 309 -168 -586 76 315 -99 20
1682 20 -326 281 -29 245 -238 -97 118 -221 133 537 148 -93 396 18 -286 -210 500 -210 -257 356 100
1703 100 440 189 -48 257 290 -149 -249 49 61 129 -41 5 -656 -72 235 -560 -185 84 -270 -226 -386 467
1725D67n88j75N30n0k09o60L52L68L31k82M30m87L71l50j59Q02j125P06l06J95
1745A61p61R21j34j57r87J080k7l21O57m80J6Q50l24r18K68j40j024R50Q24o76
1765b22j53O17m14q4O98l18n03K97J051j42j209O22k71R0q11J405j278l52J772
1784G95n30M41j43j170J17O96N13kr01Pm3R07j26l45l67L72k96J30o4J15k32j76
1806c02M04M8n9Q4k76J002j200O68n08n4R8n1l64J32J4K5j03O67P5o8q1k54k63
1829c66J77j69J74j2J2K89l74K46P31j300N89L10j059J027n80M08q5K2L84L4j60
1850B98m19j5P49J9q27J23k92Q26mj452J473l01n70K90O68n3n88M51m36j64J60
1871f4M62m98L26k0N10r22o31Q60j04M18L37J59r12n28K32L72O14j018L49j02
$$ plain form
1725 467 -121 -296 234 184 -25 -685 -333 35 366 84 514 27 398 48 -111 691 -434 272 -34 161
1745 161 -600 321 187 30 -957 123 96 -225 432 -48 -32 818 494 -424 -156 -296 -1320 -370 454 -222
1765 -222 -375 242 -172 -256 442 124 -379 -82 969 827 -382 240 -31 59 -752 653 -625 -977 795
1784 795 265 706 563 -607 -490 206 719 717 -184 -177 -220 687 561 216 -151 221 -75 55 -9 106 -126 -302
1806 -302 102 150 91 175 -101 901 -299 369 -139 -193 -95 -146 -510 -378 -364 -339 -442 225 300 232 151 -103 -366
1829 -366 -189 -358 -184 -196 -184 105 -269 -23 708 -592 -3 307 -752 275 -305 103 18 40 424 458 298
1850 298 -121 -136 613 632 -195 -72 -364 462 458 -994 479 178 -392 -102 566 513 -75 376 -60 -224 -64
1871 -64 398 -100 226 206 716 -206 -837 23 -81 337 674 833 -79 -607 -375 -3 611 -407 -58 -160
1891a60K07K4m08M02L25k05N4o35N43l81N02m69M39P24j826P66K50P0m88q6N40
1912A88k51k9n03M51j65K11P70Kj049K95L26p07M70R6o95J033j82k26o93J047
1932C89p29L84p89Q49L38p56R69k91p68L45j02M92J09j4q59K92K70N9k34l48O91
1953B97K97K74j080j60P18k48L7K12l34K93l20j33k81n3K7Q74p84N33l52r8L29
1974D8j47J65J93m43L92l23N18l52n2m38O00M7l06k42M70Nk03m67N47r4m5j56
1996b83J29K85M35r50J70K92k19M66n71J32j74J18K34N6p08J43R69l7j96r08M14
2017b03J18M13M16j470J261o52O30m91K76m40O37J45J31r79M5P1j3L96N5m0l25
2038a9N5J98j56j62l61K74M72L36l67k18k66L22j58J72J28n24K89J03O55r53L0
$$ plain form
1891 -160 47 71 -337 65 390 185 239 -396 147 -234 268 -201 238 962 -864 -98 152 222 -266 -352 188
1912 188 -63 -92 -595 -144 -309 -98 672 674 -375 -80 246 -461 9 105 -590 443 261 35 -658 389
1932 389 -340 44 -745 104 442 -314 655 364 -404 -59 -161 331 440 426 -433 -141 129 188 -46 -394 297
1953 297 594 868 -212 -372 346 98 135 347 13 306 -14 -147 -428 -481 -454 420 -364 169 -183 -281 48
1974 48 -99 66 259 -184 208 -115 403 51 -1 -439 161 208 -98 -340 130 135 -68 -535 12 -82 -127 -283
1996 -283 -154 131 566 -384 -214 78 -141 325 -246 -114 -288 -170 64 120 -588 -445 524 487 291 -617 -203
2017 -203 -85 328 744 -726 535 -117 513 22 298 -142 495 640 771 -208 -163 -92 -105 291 346 306 -19
2038 -19 36 234 78 -84 -445 -171 301 637 270 52 -214 108 -50 122 250 -274 15 118 773 -180 -150
2059a50Q17j92k39L49n65M0J56j15l7k26M72l99l56N3J67L50K77k45O4K04m87
2080f2M14k60j00k71K58l29N08m00O08P9m56Mj91J89p26M28N14k51m15M34L8O1
2102G4l03N31p8k01j13j5l93N23m9Q0P8j98L65k67j57J02j25L57m10J82M5N8Q3
2125A69k48J31k4j63K12l36L28j83L72j08k49J87J05k69R0j16P8j72J75K7L8j34
2147i0R3J31l05L2K0K96p8j75r1L00m0j95L58pj92l07K90q7n5j14L47m6k09J0
2171a14J4J97p7j25J58k03J53j96K71k11K76j70J44k27K4j97J22K00J38l03r0
2192b16K08J24k74L30j37k2J07R7j84L3j45j58L57l47L51k10K22J01j70R8J54
2213C19n03J75L65k99m0k96K30L66m30L47m1k76j9J72k63N1L45l5o74R2K93K53
$$ plain form
2059 -150 667 475 236 585 20 60 216 101 64 -162 310 -89 -445 -392 -225 125 402 157 221 425 -62
2080 -62 352 92 -8 -279 -21 -350 158 -242 366 445 -11 -7 -198 -9 -735 -307 207 -44 -459 -25 13 74
2102 74 -229 302 224 23 -90 -105 -498 25 -24 56 134 -64 301 34 -123 -21 -146 211 -199 -17 28 86 169
2125 169 -79 52 28 -135 77 -259 69 -114 258 150 -99 88 193 -76 14 -102 -24 -196 -21 6 44 -90
2147 -90 3 134 -171 -139 -119 177 99 -76 -167 133 93 -102 256 249 57 -250 40 -47 -102 -216 131 85 -124 -114
2171 -114 -100 97 20 -105 53 -150 3 -193 78 -133 143 -27 117 -110 -86 -283 -161 39 177 -126 -216
2192 -216 -8 116 -158 172 35 13 120 217 33 66 -79 -237 120 -227 124 -86 136 237 67 165 319
2213 319 -184 -9 356 57 17 -279 -49 317 -113 234 193 -83 -102 70 -193 -142 203 168 -506 -414 -121 132
2235A32L42l43k69N06j76l30L94k10j20K19k66K79m68O8M33k08J56K68m18j38
2255a49KJ44j6J86k43J4j30K8l1J14K03k91N7L54n72m8J06j68K03M2Q9J25j59
2278a40N82m54K84j78q3J20j90r6k64L32Q2J24L14n50N96m54O3K16q11Q2Q07k06
2300A76k17J31P8o63J90J78K57j14J56M9o38L41N6J06k66N78l23m18L43M78j028
2321e50L89K5j84M92M5Q1k99M15k06J16o81p4J60j1lO54k25r3j94k24R68p95M18
2344B24j38K91n21m9J30j7j75N07p38J18Q6J95j7r2k04M64p62M70K4Rq0J62M83
2367C70m61J45l1J19j32l36K56m8J0L28k96J06J82l26J51J25o7l18Q8PJ76j36
2389h8L02l11J20k85M64j45J1L0j0q5k7J57k25J16K12j23j09o4ML22m50L6R1K8
$$ plain form
2235 132 474 131 -138 368 192 -138 256 46 -74 145 -121 158 -310 -242 191 -17 139 407 -11 -149
2255 -149 -147 -3 -19 167 -76 -62 -192 -164 -195 -81 122 -169 -112 242 -330 -378 -272 -440 -237 -195 -106 19 -140
2278 -140 442 -12 272 94 11 131 -59 -155 -419 -87 -5 119 433 -117 479 25 88 304 -507 -425 382 176
2300 176 -41 90 168 -495 -305 -127 130 16 172 221 -417 -76 -20 86 -180 398 75 -343 0 478 -550
2321 -550 -161 -136 -320 172 217 298 -1 414 208 324 -357 -431 -271 -282 -285 369 144 51 -143 -367 601 -194 224
2344 224 86 377 -144 -193 -63 -80 -255 252 -486 -368 -282 -87 -104 -196 -400 64 -698 -228 -204 -195 -275 -113 370
2367 370 -91 54 23 142 10 -326 -70 -118 -108 220 -76 30 212 -114 37 162 95 -223 -135 -128 48 -88
2389 -88 214 -97 23 -262 202 57 68 98 88 3 -24 133 -92 24 236 113 4 -60 -56 266 -184 -148 -57 -29
2413b9J06J05j21k7j46K64l97J22M5J75n7J21q4j84K36r0j81K43j07n6j02j33
2435b97K64J89n9j6J4M7l14J70K8J49j11J92k84P0m7J72l00J87j45m1N1n8K29
2458I0n7j39r5K33j35K11l26J61J6j32J75O7pr1J72m4o9j34L65r0m76K81L20k53
2482D3k1K0J7k20L25n8M3j20oP6Q8m65K43j6J90j58P9l46L03r0k9M1J75l8k23
2507a47Q9L3J79l4K9k72Q1O5O8j71l3M86n26K08p4P4Lk29J03jJ16J69l30j57N12
2532B41l06P8J10q7j94J19j08J91L1k08J30M1j99K51j7q2j0j24J76J26j86l6J65
2555A02k62J48J71K2j08l3j43l5L40Op9j06j16L05P5m81k3K93J47l43O4r2R7L2
2579a9J92k86K25n5J29M6j44j29k41J87K37k77L73j74oj5J83l55O2L56q9m50J89
$$ plain form
2413 -29 77 182 61 34 -112 152 -245 -123 -78 97 40 161 77 -107 129 39 -142 101 -6 -62 -164 -297
2435 -297 -33 156 97 81 95 142 -172 -2 26 175 64 256 -28 42 -5 167 -133 54 -91 -132 -81 -139 90
2458 90 33 -106 -201 32 -103 108 -218 -57 -41 -173 2 69 62 -29 143 99 30 -104 261 171 -305 -24 296 43
2482 43 22 42 59 -161 164 106 149 29 23 99 187 -278 -35 -51 139 -19 60 -286 17 -73 -102 -61 114 76 -147
2507 -147 -58 -25 154 120 149 -123 -42 23 91 -80 -113 373 -153 55 -19 55 58 -171 -68 -69 47 216 -114 -271 241
2532 241 -65 13 123 36 -158 -39 -147 44 75 -133 -3 38 -161 90 73 -9 -19 -143 33 159 -27 -63 102
2555 102 -160 -12 159 181 73 40 -103 -138 202 208 129 23 -93 212 287 -194 -217 76 223 -120 -56 -148 -51 -19
2579 -19 173 -113 112 57 186 232 88 -41 -282 -95 142 -135 238 64 58 43 226 -129 -67 289 200 -250 -61
2602f1O9J79k07j4Q5P9j69r6o1J89J16k12L91Nj85p7k5j38O2l5O2R9O6l17K59
2627F4l3J08k09O9R4L6l21L76j81k13m6K3J43Q4J37k53L44r8q0M3o1m2R6J0j28
2652c8J3J36m7j74LJ34j09J47L4k46K22K9P1j21J7l9l3l9l1K01m6J1M1k31K5J9
2678e1l0J36q3J7J95r7l2qJ04j40P7R0j29o1j66K1J75J93j64P2k03L2K08k44J40
2703E2jl50L60j52LJ39j41K55r9k31K20J23j15J11k5q0k21l6k01N13k04K43r8
2726F5L34m65K11J35o53K90K50j65m3O6k5J02j98J54J32l98M3K59L8q7k94L03
2748E4m49L64k6O49p93L48L37l03k10j91k42M36j86N26K22n39K84n78K86p3p6
2769a60l32N70q7j22M58k00k19M03j45p7M12J76r08J03M01n43o52J514j030J58
$$ plain form
2602 -61 8 187 -20 -34 51 130 -39 -135 -196 -7 109 -103 288 293 108 31 6 -132 -70 -105 -43 56 122 -195 64
2627 64 31 139 -70 -1 93 129 -192 184 3 -210 -256 -233 -90 -6 131 -122 222 124 44 87 26 -16 80 90 -38
2652 -38 -25 111 64 -110 -107 27 -82 65 99 -147 75 104 175 54 71 32 -1 -40 -71 130 84 95 136 -95 -70 -51
2678 -51 -81 55 -28 -11 184 87 55 47 151 11 88 178 49 -12 -178 -157 18 211 47 119 -84 -52 156 -88 52
2703 52 51 -299 61 -91 -88 51 -90 165 66 -165 55 178 63 174 149 69 -152 -188 -389 124 -80 163 65
2726 65 399 -66 145 280 -373 -83 167 2 -41 25 0 102 -96 58 190 -208 -165 94 132 45 -249 54
2748 54 -395 -31 -57 592 -201 147 484 181 -29 -220 -462 -26 -212 314 536 -3 281 -297 -11 -84 -160
2769 -160 -492 78 -9 -131 327 127 -92 311 166 89 501 677 -231 -128 273 -270 -922 592 -438 -280
2789b80M32R30j318m24Q52p55L15k5M34m45N10J91q42L17j72J96K77l74K60R3
2809A72M5m82K59J20m0j30k77M41l30K77k56K76kj29O6p7P7k86K77K8J9l1j95
2832a78j05M19N3j87J3N4j70L41m77L32k73J30R9k51j8J67m1j23p1L90q8o6j94
2855b44R1l0J88l5R1j3j11l0J77j19K99m55J61L16l45j01P51k86m10L63n04N50
2877C04m20Mj61mN32m52L93l15J20K48j88R2m80L78L08k35N5k48L18n53J66J18
2899b0K12k01k12J86j40J86Pj56Q6M0k4K17l76O3J04mj22J13O1j06R3j52J77k55
2923b23N0M49n66L32k69K43o3o3l2K13j89J09j22O2L6K25k18J2J87j91j2J42j21
2946iPj17J54l5J9M5j34j61N49l61j39M07k18K1k38K58p7K45k98M3n0L26k58K71
$$ plain form
2789 -280 152 1082 -236 -660 192 -563 -248 -273 161 -284 226 417 -425 -108 -280 -84 193 -181 79 172
2809 172 217 -265 -6 114 74 -56 -333 108 -222 55 -201 75 73 -56 10 -67 10 -276 1 29 48 17 -178
2832 -178 -283 136 189 2 15 69 -101 240 -237 95 -178 -48 51 -200 -218 -51 -92 -215 -286 104 16 -50 -244
2855 -244 -153 -183 5 -30 61 48 -63 -93 84 -35 264 -191 -30 286 -59 -160 591 305 -105 258 -246 304
2877 304 -116 -112 -273 -277 255 -197 196 -119 1 249 61 153 -327 51 359 124 179 -69 249 -304 -138 -20
2899 -20 192 -9 -221 -35 -175 11 18 -138 -52 -12 -36 181 -195 -132 -28 -32 -154 -41 20 -86 7 -145 32 -223
2923 -223 -173 276 -290 42 -227 16 -47 -110 -142 71 -118 -9 -131 -69 -33 192 -26 -14 173 -18 -30 112 -9
2946 -9 -2 -119 35 0 19 64 -70 -231 318 -43 -182 225 7 28 -210 48 -29 216 -82 -39 -89 237 -21 250
2970B50q9J0l32K7J63J09J57k47l1o7Q6l9MM8N9j04Kr0l96L74Q9n4L06j67j1J18
2996A75j06n0M0n3k00J11K61K7j2j31k9m1J00k17K51Pm22L46p2j95K10j92R4J00
3020Bq3K25M5Ql25Q5K87l49J57J77k67m6P5m5m6J78m2p7K37l52n6J01Rj7J33P5
3046H9L8J53m04R1Oj59J36J32N0J6k6l80K57P9k10L0J25nj60K23q5r9K72r4k6
3071D9j1J91l01l7J95k9Pj67K69j40j88J73J2k80M62k68J85k79j9K15j34J45m6
3094Dj08J78j96J49j3j32L03l09O9k1lM1P2n0RN5K7k09K74m01L23k65N9K81k40
3119a03j8o1K05J6j24J24k25J75m5J4k42LL04k70L37o6K74j78m22K0M45j71j99
3142b07K38j43L17l43J10J44m26J84M5L6j20K3k18L22q8J4qQ7R8J09l45N6J70
$$ plain form
2970 250 161 171 -161 -134 29 138 295 48 17 -50 36 -3 1 49 108 4 6 -84 -480 -106 -17 -71 235 68 57 175
2996 175 69 19 59 6 -194 -83 178 205 193 62 33 -8 92 -125 126 133 -289 57 -15 -210 0 -192 -98 2
3020 2 -81 144 189 197 -128 -43 244 -105 52 229 -38 -84 -9 -54 -100 78 36 -41 196 -156 -212 -111 -102 -119 14 89
3046 89 127 280 -124 -33 -27 -186 -50 82 132 148 122 -258 -1 78 -132 -102 23 18 -142 81 -4 -103 169 75 49
3071 49 38 229 -72 -109 86 57 64 -103 166 26 -162 11 23 -257 205 -63 122 -157 -176 39 -95 50 4
3094 4 -104 74 -122 27 14 -118 185 -124 -55 -76 -79 -38 34 -16 -7 48 75 -134 140 -261 62 -203 -144 137 -103
3119 -103 -121 -182 23 39 -85 39 -186 -11 -56 -42 -284 -281 23 -247 90 24 298 120 -302 -282 163 -8 -207
3142 -207 31 -112 205 -138 -28 116 -310 -126 -81 -45 -165 -142 -360 -38 -126 -112 -120 -33 65 174 -171 -115 55
3165E5k29M62k41J37Lj20k18J13J47j94k1L64j07N4l28k51O34j92J93q91L58M54
3187A82r2p9J05j83K31Lk89R8O7m2K1J32m04K52l1K77m35K86r9kJ16J1k13K75
3211A87o2j81J76j65J32k05O2n2m8L53l22O2L07m14M22l13N7K73j98k54J30p7
3233a30K53k05R0o2n3r2k90M74k28M41n77M35k75M52k12O8j45j2L37J28p54O6
3255b91P24p61L64l19K49l15J62L51l91N64j60K73o5p99J224l97j94o65J109m3
3275F20o03n37q5L45J33K28K95o24N49m12k86K08M04n9k97J32j59k28K52L2L4
3296e8L09n07K04l33N63o06k05k88J007j95J18p8q21L81K4J000p69L47k72L44
3316A65j53K00k36Jm5K34l05K70k58K73l93K47l5j1J63j65J26n4j31J67j16Q4
$$ plain form
3165 55 -174 288 47 184 187 67 -151 -38 109 -85 -106 258 151 205 -123 -374 260 68 261 -630 -272 182
3187 182 90 11 116 -67 164 167 -122 -24 43 1 22 154 -250 2 -29 248 -187 99 0 -2 114 125 -88 187
3211 187 125 -56 120 -45 87 -118 -56 -108 -156 197 -125 -63 244 -170 252 -61 -4 269 71 -183 -53 -130
3233 -130 123 -82 8 -54 -107 -199 -489 -15 -243 198 -379 56 -219 233 21 89 -56 -68 269 397 -357 -291
3255 -291 433 -328 36 -283 -34 -349 -187 164 -227 337 177 450 385 -414 810 413 219 -446 663 620
3275 620 17 -520 -605 -260 -127 101 396 -228 321 -91 -377 -169 235 176 -121 11 -148 -376 -124 -92 -58
3296 -58 251 -256 -52 -385 178 -428 -633 -921 86 -109 9 -69 -890 -509 -485 515 -254 93 -179 165
3316 165 12 212 -24 -23 -68 166 -139 131 -127 146 -247 0 -35 -46 117 -48 78 24 -107 60 -56 28
3338B8J5m5j99M41l37M7J30j33J39N4j31o9l4qr8J95L38l17j20k5J33KRj27j81
3363b93L94r3m3r1PJ44J6k57K42J75j06K23k13k48K26l51J91j08J64k10L64j60
3385b7k90N05l27J44M8k01K00k44K45j29K2J15r2J81j81N7J6J52k55k5K65j08
3407G1kJ00j30j00K2O5Q8l55K7N47k30j5l4q5J00j7Q8l17J99Q5p0k81M3K13J66
3432A78j66J16Q4k17J34j16L30l07n7K05o3j80K01p9j65K26j90P3m2Qm8k9N4K67
3456B17k71k39K53L0J25J4j18Q5k1k42K33o9J38j22j14J7K79k97K7P2k2J13j08
3479b0j64K38k01K08L1j72r5N4m2J40J09j49J26m06K75J82m7j14K93k54j20L65
3501B37k93j0K67k24M7k54K52p8q8q1P0L90j09j31J13K2l67J78P7J39j73L0jJ3
$$ plain form
3338 28 43 -2 -201 240 -97 -50 80 -53 86 140 9 -60 -94 -102 -200 -5 333 16 -104 -129 4 6 15 -112 -293
3363 -293 101 8 -35 -126 -119 25 41 -216 26 201 95 318 105 -143 83 -268 -77 -185 -21 -231 133 -27
3385 -27 -317 188 -139 5 53 -148 52 -192 53 -76 -54 61 -31 150 -31 26 42 194 -61 -86 179 71
3407 71 69 169 39 -61 -39 26 114 -241 -214 333 103 88 54 -31 69 52 140 -177 22 107 37 -244 -201 12 178
3432 178 12 128 212 -5 129 13 343 36 -21 184 121 -59 142 63 -102 124 -66 7 -35 -27 -75 -104 -50 217
3456 217 -54 -293 -40 -10 115 129 11 96 75 -167 66 -3 135 13 -101 -84 195 -102 -75 -3 -25 88 -20
3479 -20 -184 54 -147 61 92 -80 -175 -121 -163 -23 86 -63 63 -343 -68 114 67 -47 246 -8 -128 237
3501 237 -56 -66 201 -23 24 -230 22 -56 -144 -225 -155 235 126 -5 108 130 -237 -59 18 157 -16 14 13 26
3525B6M1J63k05L80j13k06J6Q2j58k13J06J11m4o0J64m7Nr2J15o1M7j91J24k79
3549b89K88J53j60p7o4J16j14R0J83k3n6j36moj56L49l6k41L34k52J89O8j86q2
3573a12J61j92L6L9Rl3O4Mj11J07q5J11O9k73K93K5q3m3k2P8l0J05k35K20J60
3598B62k01k2k29L17j31K4Kl1J05k33J61J47L9k26K68n67K24J73k06N7Q2l44M78
3621A49j23k69L01J2r3q4O1L44j19k38j02N8j6J47j01J70n0J31q7j09j14K25k60
3644a67L06k67K54K83n91nK26O9jj19j11K78j6l74M87m25K21j00O1k25J92j2J41
3667A05Jj72J61r2J0l66N12l7J13J0k72K1j66N3k6L44p0m6r8j85L05P9j61L11
3691C34l92P0J79r5j56L00j36lj35K12r7n3J70l59M10k09q4K17J4m27M4K36j80
$$ plain form
3525 26 67 230 25 405 292 86 102 184 26 -187 -81 30 -14 -74 90 43 48 -44 71 10 57 -134 -10 -289
3549 -289 -1 152 -8 -85 -149 -33 -147 -57 126 103 47 -89 -93 -99 -255 94 58 -183 151 -101 88 156 -30 -112
3573 -112 49 -143 -107 -68 -59 -92 -28 -24 -135 -28 -113 -2 67 -206 87 112 29 -14 -36 42 12 117 -118 102 262
3598 262 61 39 -190 127 -4 20 22 -9 96 -137 24 171 210 -16 252 -315 -91 82 -124 -67 15 -329 149
3621 149 26 -243 58 70 -23 -107 -46 298 179 -59 -161 -103 -119 28 -73 97 47 178 91 -18 -132 93 -167
3644 -167 139 -128 126 409 -182 -187 39 108 107 -12 -123 155 139 -235 252 -173 48 -52 9 -216 -24 -36 105
3667 105 106 -66 95 3 13 -353 159 122 235 245 -27 -6 -172 -119 -145 199 129 83 -15 -200 105 184 23 334
3691 334 -58 12 191 96 -60 240 104 101 -34 178 81 28 198 -161 249 40 -44 173 187 -240 -196 40 -140
3714a40J7M4o9J98PJ21On41K78N1j43L40k50K61kq5o56M53k87K92K04J00l53L99
3738B45N56r60N02p11L62j17N72p27J12k42L82j91j79L41M53k28j9n45P03n01
3758a92K73L94l9m41N92p91j09L63l26J96k89J93J87N93l77o39M24L1p6j32J53
3779a2j6l50O31j91j31K78k74q1O8K69j57O2k3K14m51K30K7m48K18K63l04M29
3801B51l20RK4q4J80K19l01K88m1l81M26j86K42l23j24K21k16R6n0K8M1J59l08
3824a50J35O3j14o6K16K87k61J87m74J34j61N0O23j021p6N99n64M78K38O3j75
3845A1K18m61Q84j064N03P34r82j84K16J25L8k45K70L6k4L15k53m7J6m9N1n7n2
3868aJ86K04l51n9M2k1n0r4K20j01J51J06j69K6j40Q0k36K26O9J09k16O6m2%R
$$ plain form
3714 -140 -123 -79 -148 50 57 178 184 -357 -79 -28 -171 169 -81 180 178 93 -563 -110 -397 -105 99 199 -154 245
3738 245 801 -159 343 -368 -6 -123 449 -278 -166 -408 -26 -217 -396 -55 398 170 151 -394 309 -192
3758 -192 81 475 436 -5 587 -204 -313 50 -276 -80 -369 -176 11 604 227 -412 12 43 -33 -165 -12
3779 -12 -28 -378 253 62 -69 209 -65 -146 -78 191 34 96 73 287 -164 66 93 -355 -137 126 -178 251
3801 251 -69 -60 -36 -120 60 279 -22 266 225 -156 270 84 326 3 -121 100 -116 -20 -70 -42 -1 158 -150
3824 -150 -15 48 -66 -132 84 371 110 297 -177 -43 -204 -154 469 -552 -628 -29 -593 -115 123 186 11
3845 11 229 -232 652 -412 91 825 -157 -341 -125 0 38 -207 63 99 75 390 137 90 106 57 108 51 -1
3868 -1 185 389 38 -21 21 0 -50 -144 76 -25 126 232 63 89 -51 29 -207 19 88 197 -19 47 5 5 14
3893A4l3J25j40R6M4j24j94K22l07R5M71k70q4K35q0j38K56m44K68J5k42N8K97
3916A40j36l1K8N1j8k33L52l44J13M9K44l10N9K63j7k91M0m7n2J96p3J37k23j54
3940b57M88l95J95M7j25J46q4J07mn7K14m72K68m9J6J94n0k23K37m3j20O9r9l05
3964c02L09k16Q9K76k41J72j59P2j09K91j21J40k45k88M91j70k7K01k49J32K01
3985B47j59K7M0l44LL34j35N4ko8n4J20K42l79l06O43j40l14R4r0J40M7j41K11
4009G0k1r6J64j19K36n11N6J60J66j07J41j80l8j39p5L78j25K7j73J52K26j58
4031C4J41j55L9P0p9j3J1n7R3j16r9K6m2j9J7J46o7j7M73n12m0N34o45N39j25
4056A37p3J54l25R3M3J10l24M6J59J17PR6k57j82N9M71k18j47j8j9j2K20n6j35
$$ plain form
3893 14 -19 106 -34 62 106 -18 -212 10 -297 -202 269 -1 -85 150 70 -68 188 -256 12 27 -215 -157 140
3916 140 4 -27 1 52 34 -199 153 -191 -78 -29 215 -95 -36 227 210 -81 -41 -88 -140 56 -17 120 -103 -257
3940 -257 231 -164 31 78 -47 99 15 122 118 61 275 -197 71 22 38 232 182 -41 196 153 33 102 3 -302
3964 -302 7 -209 -120 156 -85 87 -72 0 -109 182 61 201 -44 -332 159 -11 -38 163 -86 46 247
3985 247 88 115 155 -189 -186 148 13 67 65 -3 -57 63 305 -74 -380 263 123 -191 -97 -187 -47 0 -141 70
4009 70 49 -47 117 -2 234 -277 -221 -61 105 -2 139 -41 -79 -218 -293 85 -40 -13 -186 -34 192 34
4031 34 175 20 59 129 50 37 48 -9 84 -32 -131 -105 -147 -166 -149 -3 -70 -87 386 -126 -166 368 -277 262 137
4056 137 64 218 -107 -14 29 139 -185 -139 20 137 144 240 -17 -199 -140 331 113 -34 -52 -71 -83 137 81 -54
4080e4J80r0r3J83o6j97J41J77o4r7k19J59j41k7J55N5m8K11k59K29l56J97n7
4103h1MJ70k38Q2Q2j32J8p8J64j97N1J61k14K60j98J4K19r6r1M89l49Kk07p9K07
4128c7J38k80L26j1j71J13k93J38J25j30K37k61O0K7pJ49o6J1j59j16L07q3L3
4151E0j25m6J13M0R2l1j86N2Q8j74J08J44p9j81Q5pJ55j4j43J13O5j87R7K31j67
4176I3k57J61ml08L16k02K24J72m65N01l45J18q0J82J9j29q0J26JK9k9j91M93
4199C45j53J04j41k4j37k30L39k39J9j31K94r5j40J18k1j86L93j56j08J86n9N8
4221C6k38N1K01j60K0K65j42k71K33J11k28L4J21J69k05K06j34p4j2k8p9K50m2
4244H4n1j65K62j44J45J8j80J06j17N6O4k23K93J60l03N0j12l9R8L30l32j93M35
$$ plain form
4080 -54 126 36 -57 126 60 -137 4 181 117 20 -199 -40 -181 -208 -53 2 -46 165 -94 135 -221 -24 -81
4103 -81 -77 93 -145 -63 19 -113 -95 -173 -9 -206 -155 6 -208 52 -146 -132 87 -9 -100 389 40 42 -165 -244 -37
4128 -37 101 -179 147 136 -35 78 -215 -77 48 -82 155 -106 -46 -19 -26 123 57 68 -91 -207 100 17 50
4151 50 -75 -121 -8 32 124 93 -93 -41 47 -127 -19 125 46 -135 -50 -57 98 84 -59 54 119 -68 29 260 93
4176 93 -164 -3 -7 -315 1 -201 23 195 -270 231 -114 4 -76 106 125 -4 -84 42 43 72 43 -148 345
4199 345 192 296 155 131 -6 -236 103 -136 -117 -248 46 -49 -189 -71 -92 -278 115 -41 -149 37 -22 36
4221 36 -202 -151 50 -110 -90 175 33 -238 -5 106 -122 -88 33 202 -3 203 69 -5 -17 -45 -124 126 84
4244 84 33 -132 130 -14 131 149 -31 75 -42 14 78 -145 148 308 5 55 -57 -96 2 332 0 -193 242
4267B42j28k49l1o6L48l42K38l9K02l02N5L7l0L6k03k3N20k59M6k83K36n4J15
4290F6nl62N7K58k61L05k9l93L17K99l01k80M86l35K77j83K12j04l5Q6J59k8l67
4313a61J29l5P0k87j04L90J33j15j66K80nj15j88J71j38K44n4J71j04j75M01j95
4335A47m5Q7k10k8l0o5R5P7j46L50j37j86K16m5o95o4M21J16J84K24p77K28L70
4358H7J69M19m06p76N12j9n75N4O88K40j170Q98l5J24k39l01J38M19l51J83k80
4379b21N2PM53m55L11j68j64J58J5P9l44J9J33j75K08J92j11K3j23J09J7J57k39
4402f7o5K08q4P3pm8J61o2k85rL87k86l9K01j0n4L1O4j8l62J41J42J3j67m4J62
4428b4J3k03J36M2J29k9J08l0j03R2m16L16l8j43K38j80p0M65k83k23K84j19K1
$$ plain form
4267 242 114 -135 -166 -232 116 -226 12 -27 175 -127 -72 -35 -65 -29 -232 -255 265 6 52 -231 5 -49 66
4290 66 61 -301 -244 14 -247 58 29 -364 -47 252 -49 -329 157 -178 99 -84 128 24 -11 75 234 206 -161
4313 -161 -32 -67 3 -284 -388 2 135 20 -146 134 129 14 -174 -3 -141 103 49 220 116 -59 342 147
4335 147 102 189 -21 -49 -79 -144 -49 28 -118 232 95 -91 125 80 -615 -679 -258 -142 42 266 -511 -283 87
4358 87 256 675 269 -507 5 -14 -589 -535 153 393 -777 121 86 210 -29 -330 -192 227 -124 59 -221
4379 -221 -169 -162 291 -164 147 -21 -185 -27 -12 67 -277 -258 -125 -300 -92 100 -11 12 -111 -2 15 172 -67
4402 -67 -132 76 -8 65 58 10 171 109 -176 -185 202 -84 -123 78 68 14 45 109 91 -271 -130 12 25 -142 -186 -24
4428 -24 -11 -214 -78 -36 93 64 172 142 39 131 -285 31 -7 -150 88 -92 -162 303 20 -203 81 -38 -17
4451a7K13r2j12N8j10M5P5%k74J89n4Qk4l6K53K5j30K24l80J32J04J1k54M44j54
4476A44j06p6M4J4ql4l46K70K1p8J21O7J20k31n7m0n9K58k14J9K15j24j20K69
4500F9p9o7J57J32j67O1j78L50j28l27K50j59K08j98j3J59j49K08j43Q3m7J30
4522A52n23N37l30N74j119M69P78n28K69r73P52k67N62l73k38l91O86j36J32j14
4542h1O26n61n5K25n0j27j85K42k0j91K96qj39J31k13K50o3j37j4L08l37L72k92
4565b3R5k17K96J08J03m06P6j37LK42k22L03L8m79L88k61J52m8k36K23j03R7K4
4588A6Q4l4ql1J42m18L49r0l1J24J5r0j29M3L30k67K67k75K55j75nl84N90l65
4612h7Q6K5J9p8j5K11l44K25k02Q0J16j03N7n2K16k17L8R6r7o1r2K19J93l8j78
$$ plain form
4451 -17 196 104 -8 50 -60 -15 60 60 -214 -25 -79 -71 -95 -131 122 147 17 241 -139 -7 97 108 -146 298 144
4476 144 38 -38 6 20 12 -22 -368 -98 -77 -155 -34 33 153 -78 -135 -175 -234 24 -190 -171 44 -80 -200 69
4500 69 -10 -77 80 212 45 106 -72 278 150 -177 73 -86 122 -76 -89 70 -79 129 -14 69 22 152
4522 152 -371 166 -164 410 -709 -240 538 10 279 -694 58 -209 353 -20 -258 -649 37 -99 33 -81
4542 -81 545 -16 -71 154 104 -23 -208 34 14 -177 119 111 -28 103 -110 140 77 -60 -74 234 -103 269 -23
4565 -23 72 -145 151 259 362 -44 32 -105 -102 140 -82 221 259 -220 168 -93 59 11 -225 -2 -105 -8 16
4588 16 100 66 58 27 169 -249 100 10 -21 103 118 28 -101 -58 272 5 272 -3 252 77 72 -312 278 -87
4612 -87 -1 24 43 -35 -50 161 -183 42 -160 -80 36 -67 -10 -62 154 -63 -25 71 -26 -87 -179 40 233 195 17
4637A7K29m52J65M3j23n4L72o4m37K39j45K53k30j6J51J71m42K14J27L4O3k4N
4660I6k08J3j6J38j98j17K63p3P4J25j40j9n3Q7j80K95k16J74L94n10k9J78q5
4683gM2Rj8N0l01J03j01L59p5kk85L2K01P5L3j08J54q4O0j88J30k1j42P4J16Q8
4709A94k72J96O5j60j19j71L78k50J89k0l4k35J76K90m70M00Q9m37L53m0k91K50
4731H1j30k7l3kJ24J82l53n0L01m9p3L1lj88j09M06q3ml1m2K1l7k07K90j64K47
4757I8M3l50O5L51Rk91Mj42K59j50K32J12j63Rp7J31j57j4j30J63j72J29L52n25
4781b14L74j53Q6k46k89L20J71j68pq7K34M8J9n7n8J12n0j56L32j48j21J1K6j5
4805c6J65p3k24L86k26j30K43O7l61J94m0j46M20j16k99K20Lj0k33J63N3K54k46
$$ plain form
4637 17 246 -206 -41 2 -121 -175 197 133 -304 -65 -210 43 -187 -203 -52 119 -323 -109 18 52 115 91 96
4660 96 -112 -99 -115 23 -175 -292 -29 -102 -28 97 -43 -62 -115 -28 -208 87 -129 45 439 -71 -100 78 -7
4683 -7 35 44 26 76 -225 -122 -223 136 61 59 -226 -194 7 82 115 7 161 77 137 -51 79 58 -84 -10 106 194
4709 194 -78 118 183 23 -96 -267 111 -139 50 30 -4 -239 -63 227 -243 157 246 -191 162 122 -169 81
4731 81 -49 -76 -109 -111 13 195 -158 -208 93 44 -29 2 -1 -189 -298 108 25 21 -10 -52 -31 -68 -275 15 -149 98
4757 98 141 -209 -144 207 216 -75 -71 -213 46 -104 128 240 77 86 9 140 -17 -31 -161 2 -170 -41 311 -214
4781 -214 160 7 93 -153 -442 -122 49 -119 -126 -213 21 69 88 31 -27 85 35 -121 211 63 -58 -47 -21 -36
4805 -36 129 56 -168 218 -8 -138 105 172 -189 5 -35 -181 239 123 -176 44 47 37 -196 -33 20 274 28
4828B8R8k16j43K23j5PJ3j43L13l86K68k4J29j98J08j16J98j64j26m9L72k35J54
4851I6n8k1j49K74k47J63p3j03j76L57ol0l01M38n9k71L21k87j76M87q4p0L0k26
4875a71J13j16J97L02l10J30j11j06NK39j08O8j21q9O1j07J80J84k84Q9k62L67
4897A50j03n8J09o6r9r8K4J70p3J20J06j58K2L6k00j89K39J53k21l0j37J64J98
4920E9k7N2m57M66j62R1m9J5j64M72k37j4J06K6k27j2l2L29l11J58k68K0K31K77
4944C42l44J5k00J19L8J1L3o8j20J43p7J37o9l66N42l67K00R4k9j46M5K65O7k32
4968C3j62J80O9l24qM2j60L68J32j69K39l04rM1k51K49N8rJ46j70K26j52r7J87
4992A55j19J15%k40J05Q6j41j08K54mj0j74j1q9L32R3k67J07nj62j70J45j8K35
$$ plain form
4828 28 126 -90 -233 -10 -25 -18 -5 -148 165 -221 47 23 152 -46 62 -54 144 -20 -146 -195 177 -58 96
4851 96 38 17 -132 142 -105 58 -15 -118 -294 63 57 27 -274 164 105 -166 155 -132 -308 179 95 25 55 -171
4875 -171 -58 -174 23 325 15 145 34 -72 -67 172 64 132 11 -78 -17 -124 56 240 -44 45 -217 150
4897 150 47 -11 98 32 -67 -165 -141 29 -44 76 182 24 46 82 -118 -307 -68 85 -136 -166 -303 -139 59
4920 59 32 84 -373 93 -69 22 -27 -12 -176 296 59 45 151 177 -50 -62 -94 235 -76 82 -186 -166 65 342
4944 342 -2 13 -187 -68 -30 -19 14 -54 -174 -31 -108 29 -40 -406 136 -231 -31 63 34 -112 -67 198 265 33
4968 33 -129 51 120 -204 -212 -170 -330 38 170 1 240 -64 -73 -32 -283 -34 24 15 161 -9 217 65 -32 155
4992 155 36 151 151 -89 16 102 -39 -147 107 103 93 -81 -92 -181 151 244 -23 84 79 -83 -253 -108 -126 109
5016A09p2R1j90L6j38Q7Q6L8p8p5PK09j99nj70K33M6l14J67K31j9k04j74L48j
5041D9L12k44P3m01J05K59J26l20PJ39j36K72m12L47k20k26N8L82p2k66l1J46
5063e3P7k15J80j82L68J13ql95N4K7J15j72J7k4J94j04j78K7j23J05k8K16j55
5086a44n0K42P5K67m45K5k6J20K6L0k03o1K93j02j70j18L01l36M05k22m5J81j8
5109B5R5k98J69O73j048N76P8j03R1o23L48j46l99P54J39n82K91J47l55K18l39
5130b89M2m09N11J14J42k3j43J00j20J84O0K44n17N64o17K70k35J17k59k03M37
5151c0L58J36o15K62m20M55m32K24j55M30l00O59r04Q82m46L92r98N56l04K1L9
5172a90m24K07M76p78J350q54L42ll00l1k06O14l3k92L14N20l34m6p81O00J69
$$ plain form
5016 109 37 128 -62 -26 -164 -77 9 47 -31 -106 -99 110 -89 -94 -264 -31 15 -299 -132 99 80 -124 -298 50 49
5041 49 361 117 190 -211 -106 153 279 -41 -34 105 -31 241 -171 176 -44 -270 -212 170 98 -168 -199 -53
5063 -53 24 -191 -11 -193 175 288 280 -115 -61 -34 81 -91 -74 -98 96 -8 -186 -159 -282 -177 -205 11 -144
5086 -144 -194 48 123 390 -55 -30 -56 64 90 120 -83 -144 149 47 -123 -241 60 -276 129 -93 -138 43 25
5109 25 120 -178 -9 664 -384 192 270 167 258 -365 -17 -163 -562 192 331 -251 40 187 -168 50 -289
5130 -289 -247 -656 -145 -31 111 88 -55 45 -75 109 169 413 -104 460 -157 113 -122 -5 -264 -467 -30
5151 -30 328 464 -151 111 -309 146 -286 -62 -217 213 -87 572 -332 550 104 496 -502 54 -250 -229 -190
5172 -190 -614 -407 69 -709 641 -213 129 126 -174 -205 -411 203 170 -122 192 712 378 332 -449 151 320
5193C20m30k57R68k06m5j023O10m54N09M5N99k73q91Q30q42P02l39M53L45m79
5213A42m03J61j77K41l50M19m44O83o52mP83q0j46K50q47Q73k67k07lj54J35n9
5235a06K01Kk30l0K42j18J23Nl23K02j8p7R4k56M23N2l91J89j23J28P9R5k29L31
5259B65m42K08o9r5j35N3L5K97J84l30j72J47k44K05L2k8N74l17q9j48k72j1M22
5282G0m12J48L68j60M53o26M39j82J12K66n83J58l15N08k33m15J03L60J20n78
5302c99K92K05n6J63j10p5p6j78K56r2j34J29J15KJ26k74R4j33K31n0j05k1J76
5325H6l6m3j03L39l8l92J18J10j65Q6j58M2L57j83k58K86j88L32k63K95k18J03
5347A09j41m2K51k66R9jp1m4L93j97L94m37k01K86k69K94j0k17n3K00P1l4j47
$$ plain form
5193 320 -110 -367 601 395 350 -673 -63 -517 -8 37 636 363 -528 302 -540 162 -177 276 621 142
5213 142 -261 -100 -277 -36 -386 33 -411 272 -380 -384 399 319 173 423 -424 449 182 -25 -28 -182 -47 -106
5235 -106 95 97 -133 -163 79 -39 84 89 -234 -32 -50 -127 -33 -289 134 186 -205 -16 -139 -11 68 163 -66 265
5259 265 -177 31 -38 -133 -268 -215 -180 117 301 -29 -201 -54 -298 -93 -61 -89 485 168 79 -69 -341 -352 70
5282 70 -342 -194 174 14 467 -159 280 98 210 476 -107 51 -264 244 11 -404 -301 59 179 -399
5302 -399 -107 98 42 205 95 20 -56 -234 22 -70 -204 -75 40 42 168 -106 -12 -145 86 36 -69 -90 86
5325 86 50 7 -96 243 205 -187 -69 41 -124 -38 -196 -154 203 20 -238 48 -140 192 -71 224 6 109
5347 109 -32 -74 177 -89 10 9 -62 -106 287 90 484 47 -154 132 -137 157 147 -70 -123 77 148 114 -33
5370c3J33R3j53l4N3k08Q0k6J66q3j59K0J53J17o9l25N3L10m5r9J54m4j77j65
5394b88K16J21j07K29n89L56K23l1j18r8P3j72P1R4R2rJ57k19R0j01k2K90j38
5417A20n3J31j46j48n8J79k6MJ53Ln16J86J06l1K09j0k52O4j35M35l39J5J75q8
5441b2%q4J87j36L4O1K3k3j33P6K9j5n3j63J11J07k58K39J12kk00L4Q4%K8j35
5467i9n8J38j9QM8k00J52L6j9M4r6K06q5r8R2J09J78m67J94q7R0o2k36M42n52
5492c41L02J46m2j21J17j4J20k90J25j07l6K5k02L01R6l30K47K46l10q7K56J39
5514B40k11l4K2O8j60J87r8j26J62J12q3j04N6j3Q4j19R8j40J92R2j0m16P3M5
5538h3r9J39J22k0o1P2j79K38j50j08J65J59j24O1j45j74J77O6J69n43L16P7p6
$$ plain form
5370 -33 100 193 40 6 59 -149 -69 -95 71 -12 -171 -151 2 119 50 -275 -222 88 43 -56 98 54 -123 -288
5394 -288 -72 49 -58 171 -418 -62 161 130 12 -86 -13 -185 -114 -20 72 63 220 1 91 -10 -32 258 120
5417 120 67 198 52 -96 -154 25 -1 3 156 159 -357 -171 -65 -96 113 103 -149 -85 -220 215 -124 -109 66 -22
5441 -22 -22 -106 81 -55 -21 40 63 40 -93 -17 12 -3 -56 -219 -108 -1 -259 -20 92 90 -110 -76 8 8 36 -99
5467 -99 -157 -19 -38 -30 18 -182 -30 6 -13 31 -65 141 56 -42 50 159 337 -130 64 -23 67 5 -231 211 -341
5492 -341 -39 107 65 -56 61 47 167 -123 2 -105 -141 -116 -318 -17 79 -251 -4 242 -68 -155 101 240
5514 240 29 -5 17 85 -75 112 14 -112 50 162 79 -25 31 18 102 -17 81 -59 133 225 215 -201 -128 -83
5538 -83 -182 -43 79 59 -2 70 -109 129 -21 -129 36 195 71 132 -13 -187 -10 56 225 -318 -2 75 -1
5561aj73K19q7n9o8L78l67M11o89M07l6K8M3l37K35l69N05j19j46r2M90r9M14
5584D88p78R3j39J67L25J79q22R30Mq26J818j398O44r28j21N33m48L39q4N5j57
5605a26K74j61j87K52j54J80R7k24J72Q9P0j71l10K28J22Q2j31k72M5K76k95L18
5627A74j67k05J21k91K68J21j49J54k65L11k9k27K76j47N6K9r6M3j18M4K4J23
5649E0K22m03M72k60l03J52l2j81L86R6l88o3M74l13M2J40j18K49k53j43L37k92
5671a29K09k30K21L4k67L11p0p0k8j12J50r1L6R9k32K04n9M6q8L8L4J40j17J46
5695A75k03j02r6K07L25j77j41O2k59J42J86m4J40k12J31j92J52j43j63K63j81
5716a30l8J54J20k0k27j6M5q9K02n0j18O2L79k03m8j99o7l7N89m35l2K18J89j46
$$ plain form
5561 -1 -174 45 -42 -101 -169 209 -158 253 -436 -29 -65 -37 6 -331 -96 -465 40 -79 -225 -317 173 74 488
5584 488 -290 -197 -336 -169 156 335 -487 443 447 -379 1439 41 685 -243 -364 169 -279 60 -24 31 -126
5605 -126 148 -13 -200 52 -102 78 175 -49 123 212 282 111 -199 29 151 233 102 -170 -125 151 -144 174
5627 174 7 -198 -77 -368 -100 21 -128 26 -239 72 43 -184 92 -55 1 30 -66 -23 -141 -97 -73 50
5649 50 272 -131 341 81 -222 -70 -102 -283 103 199 -189 -252 222 -91 -49 91 -27 222 -31 -174 163 -129
5671 -129 80 -150 71 105 -162 149 79 9 -19 -131 19 -72 -36 63 -169 35 -24 22 -66 -28 6 146 29 175
5695 175 -28 -130 -226 -19 306 129 -12 50 -209 -67 119 75 215 3 134 -58 94 -49 -212 51 -130
5716 -130 -168 -14 106 86 -141 -157 -112 -201 1 -49 -167 -105 274 71 23 -176 -243 -280 309 -126 -158 60 249 103
5740A03j94K85j60j45pR6l3m6J13q7J68q2n6J46k99K17j71R5J09p7J02l38L12
5763E1l9p9K36l17K7J62J17k45L1K52n7r3j30N8r6J66J26j51n3M9j57M71j44k4
5787A61l13J82r6N0R5j85p3J04O6q3o8J51p4R1o1O7J78r0r2J8j11l00K60J55j19
5812h7KL21k01j07k22K07J90k44J11Nk32K25O4k17J96J23k89K16R3j52l7j12N4
5835i3K48k37O5o3J41L5rp2O9k2j77L2J42j69K62N2l88L22N3k37j23J42K63l15
5859g9K76j74p3OK10k20j36J95l8p7O8l6r6J97L66o56R3M36l26j66L33k11j05
5882b13P50o37J97l74p47J102k67o8K92m09L88O8k73M69p6J84O06j061P09r17
5902b77K27M38Q54j754Q7L76r83J569j76Q23m16m54J48o62M27L23n27j16L98l01
$$ plain form
5740 103 -91 194 34 -111 -118 -22 -55 -101 12 -75 93 11 -45 101 -198 19 -152 -57 52 -25 77 -261 51
5763 51 12 -67 169 -148 -121 41 158 -87 -56 196 139 46 -84 -26 -122 44 170 19 -34 15 -142 329 185 161
5787 161 -152 30 -66 -16 79 -106 -179 -75 -9 -92 -160 -9 -83 8 -53 14 192 102 10 28 -83 -383 -123 32 -87
5812 -87 -85 236 35 -72 -294 -87 103 -141 -30 -25 -257 -32 32 -185 11 134 -155 61 154 2 -35 -147 -93
5835 -93 155 -82 -17 -80 61 96 87 15 84 62 -115 -83 59 -110 152 204 -184 138 191 -46 -169 -27 236 -79
5859 -79 197 23 -50 -44 166 -54 -190 5 -33 -110 -42 -78 -174 23 389 -267 -174 262 -64 -230 103 -108 -213
5882 -213 537 -100 97 -277 -1024 78 -189 -257 35 -374 14 82 -191 278 202 386 992 -69 640 -277
5902 -277 -50 388 1242 -512 -425 -49 -1032 537 361 1184 768 314 462 -200 227 550 23 -93 305 4
5922Dm18J105j4r69O35l99J96l04l14P9N95n9L2n77O13J17j041J052K94k17k79
5943A31L08p67J60P68l65j061Q40L65l34j9L37n53J59q5O01k28M2j21m69p0R57
5964E96n95r9k79J036o17k56K81M01m91P4K26m57j17J00K00K11K86l14l55N95
5984D26%m63m92K77j70L13j13M71R1r96O16L66l35m0O26n19O18j17o20M62j027
6005f26K14O54J8o3n61N16M72p32N11r82j39Q06k49N85j301J455q12J001k51q10
6025b94N54p44Q53j043O69p2n16R14M9j95L18l50J11k92J74l11K93j82J59k55
6045a60K26K2k85K08N6j46K08j91R4p8J68k11K03RM6j24k8L9n3K09rk67K24l24
6069a64QJ32r1j5J27l7M2L4n6p9n2L4K69J75m09J36j20J29j48J46j0O7p8J36N1
$$ plain form
5922 4 -414 691 677 -292 343 -56 140 -164 -478 -399 196 137 169 -408 205 322 -719 333 627 410 131
5943 131 439 -328 -168 600 235 -826 14 379 45 26 363 -190 -31 -116 485 257 299 178 -291 -361 596
5964 596 1 -98 -377 659 42 -214 67 468 -23 51 277 -180 -297 -197 3 214 500 186 -169 426
5984 426 426 -37 -529 -252 -422 -109 -222 249 340 -656 -40 326 -9 -49 577 58 676 559 -61 401 -626
6005 -626 -412 242 260 197 -364 152 624 -108 403 -579 -718 88 -161 424 -877 578 -234 767 516 -294
6025 -294 260 -484 369 -674 -5 -77 -593 321 370 175 493 143 254 -38 136 -175 118 -64 95 -160
6045 -160 66 88 -197 11 67 -79 129 -62 32 -46 122 -89 114 123 169 45 17 56 3 212 203 -64 160 -164
6069 -164 -156 -24 -115 -130 -3 -40 2 36 -20 -99 -151 -117 152 327 -82 54 -66 63 -85 61 51 118 40 176 227
6094B27m4j40P7r0L9k11J95j03j46j22L22j82J95j28L57k56N0M5o2j00J85J5K82
6117D05j00l42J53Pl52M55o00Q43p56J009j027K98J6P74n57J34Q56j174J0m97
6137d45o05J090k57n15J327q12Q34r01N48j23J35n51L75J12j25j82J43q9K57k99
6157h3j27n6K99K56l86M7Q6j5J75j79k96L77k56M6M67l13k28K20p8k27L11k33
6179a93L21l45K18J85j66Nl27K20J91J77l25Q2L30k46J22j32O1m60L36j85j11
6200b42K47J25j84J14j72k3N81k52j13lj92o6K05J13l37J44p5L54k23l8R4k77
6222b20J76j6J26k28K72k51j65M5M07m92M67k02K28j07j67J99j00L4n0J16r5J19
6244I6k40O7K67m03K40m0j73K28k43L95k54K10j10J18j29pL5p3j17K62k58l4K27
$$ plain form
6094 227 183 43 120 30 69 -142 53 -50 -196 -318 4 -178 17 -111 246 -10 40 85 23 -77 108 123 405
6117 405 305 -37 116 123 -229 226 -374 469 -287 722 -305 -7 9 783 226 360 1216 42 52 -445
6137 -445 -1050 40 -217 -732 595 -217 617 -284 264 141 276 -275 100 212 87 -95 48 -41 216 -83
6157 -83 -210 -266 33 289 -97 -50 36 21 196 17 -279 98 -158 -112 355 42 -186 34 -44 -271 40 -193
6179 -193 128 -217 1 186 20 25 -302 -82 109 286 -39 43 373 127 249 117 178 -282 54 -131 -242
6200 -242 5 130 -54 60 -112 -135 446 194 81 78 -114 -180 25 138 -199 -55 -130 224 1 -37 57 -220
6222 -220 -44 -60 66 -162 110 -141 -306 -261 146 -346 121 -81 147 40 -127 72 -28 6 -44 72 -23 96
6244 96 -144 -77 190 -213 27 -13 -186 42 -201 194 -60 150 40 158 29 22 57 -16 -133 129 -129 -163 64
6267F4l2j3k24J87m45N73n84M81J87l03l15Q94n95k78k42O14M10m61N69q25o86
6288a024J337K19j204J784j434N03N9J05o06N60l18K29m10j0J8k27Q68m13n1Q8
6308G3j50k26M32K6l27q2O8m37P70m9n46N95l78m28P52n7K61n7o53j92L49M93
6330B37j87j78R9K8j8J14j62k19K55K9P7k38m1K53o8n7joJ6J79k63m3N02k50k22
6355a64J97k91O6J40R2J46l12J41j15p5K27N1j36M7oJ70l12N2O0J18j41k45K4
6378b66K37m1j5J26j99L96m30M10j31j85n6K52P5r3l10L06j14K85o21K53L5J71
6400H5Q1j9j54L5k15K14Q1k15l5n5NJ62J65J3k21P5m4K14k31J00J47l00L37k49
6424b4n1q2K5L1J13j4N3j35L09l88L43k08k01J73l2Q5k2N4r0j5k3j34P6L6J25
$$ plain form
6267 64 32 19 -205 -18 -463 110 -474 7 194 -109 -424 470 -125 -403 -645 -31 379 -82 487 -338 -1024
6288 -1024 313 532 -672 1112 -322 181 240 345 -261 299 -19 210 -200 -210 -192 -419 449 36 -15 73
6308 73 -77 -303 129 155 -172 -254 -186 -623 147 98 -448 147 -231 -659 93 36 297 240 -413 -605 -256 237
6330 237 50 -128 -29 -1 -19 95 -67 -286 -31 -2 75 -163 -204 49 -19 -76 -77 -83 -67 112 -151 -194 308 58 -164
6355 -164 33 -258 -192 -52 40 186 -126 15 -100 -175 52 103 -33 14 8 178 -134 -82 -22 96 -45 -290 -266
6378 -266 -29 -70 -85 41 -158 238 -192 218 87 -98 -154 98 173 80 -230 76 -38 247 -374 -121 -86 85
6400 85 166 147 -7 28 -187 27 108 -107 -142 -197 -192 -30 135 148 -73 2 -42 172 -59 41 188 -112 225 -24
6424 -24 -75 -157 -132 -101 12 -2 51 -84 225 -163 180 -28 -229 -56 -88 -3 -25 29 -61 -76 -99 -233 -157 -121 4
6449DK81k44j58K30j67k9J83l3l2j83N0J76j63kJ36L9l9K58k52k96J74O5NJ6p4
6474e5K42q6n4m8j59M45k14L36m52q3J80k04O5K38j64J55p2M8m0m1j6n8K45l72
6498a64J26J71J79l63n9mL4Q5K7j66J14l5K36q2k60N5K3j86K55j16J10j74K29
6521C5R5k56K24j19K29k94J41j54J69J58k10j53lK22qj8l6j67m7J53o6J02m8O8
6545A7L1Kq0J53k75K70j05j04j04K29k7j69P0k4L5L19j63R3K0k09j01J03k8Q2
6569C5m1J72j14k68K44po3rJ58j78K05k27N6j33K58j04k0j8j6o9or1L47j53j97
6594b39J45O3j66LK47q5j18O8R1n8j78K86M4l18P9J91k08J1k6L92l42J98n3J33
6618A60k4Pmj81P4j17m6J18P8j96J33j81J63J48k71J8N2J48P4j14k64J92m7K27
$$ plain form
6449 4 285 41 -117 113 -54 -83 100 67 35 -148 -98 78 -85 -87 49 88 49 307 55 -241 -67 -2 3 19 -55
6474 -55 187 101 47 -1 -160 285 71 407 -45 -128 52 -152 -87 151 -13 142 70 118 78 37 21 -37 208 -164
6498 -164 -38 133 312 -51 -110 -114 -80 5 32 -134 -20 -55 181 99 -161 -106 -83 -269 -14 -130 -20 -194 35
6521 35 130 -126 98 -21 208 -86 55 -99 70 228 18 -135 -138 84 76 58 22 -145 -192 -39 -105 -3 -51 17
6545 17 48 50 -30 123 -152 118 13 -91 -195 34 7 -162 -92 -116 -81 238 75 168 188 -21 -122 -19 -47 35
6569 35 -6 166 52 -216 28 21 -42 -51 107 -71 134 -93 -37 -170 88 -16 -36 -54 -70 -139 -145 -236 111 -42 -239
6594 -239 -94 -31 -197 -194 53 -32 -150 -82 9 -49 -227 59 103 -215 -136 55 -153 -142 -168 224 -118 80 27 160
6618 160 136 143 139 -42 32 -85 -131 -13 65 -131 2 -179 -16 132 -139 -121 -69 79 153 39 -225 -33 -80 147
6642A47k24K1K35k41k6K7K98j24j48J42j47n6J47k14N9K12J3M3j67P6K2m26j01
6665d32J84L27j02o0L18k63n2j3J95j92J05k05L80j22j40M2M4J82ll11J35J17
6687A34l44M41k46K09m50L58k22J17j58J72m9Q9k93K02J41k1L2j03k12N68R5n87
6709a27J22k69K20j79K84l14M88l5k08j20K77j52k44K23k3j76j8L00o8o5J14q6
6731e6OJ55R3l39r5K31q2J19J58q4k42J19r5K06M7O7r9l76O9L22l43M57l07M6
6755b3J86k30k37K88K16j47j36K65j69j88L19j38j14J16J56K19l78RNj75J19r
6777d6R6Mm8k09P5M1J93J66k06k71Q4j20L76m3L6k10J15r1P9J7j66o2K35p4J42
6802A13K08j65N5l77L6P4Q8R5j53K27j69J69l41P0J10k3l63O7L85j27Qj89k1K10
$$ plain form
6642 147 -77 -56 179 -62 -88 -61 237 113 -35 107 -40 -96 51 -163 -104 108 121 164 -3 73 95 -331 -432
6665 -432 -248 79 -23 -83 235 -28 -80 -93 102 -90 15 -190 190 68 -72 -30 14 196 193 -118 17 134
6687 134 -210 231 -15 194 -256 102 -120 -3 -161 11 -38 51 -242 -40 101 80 112 9 -203 365 460 -127
6709 -127 -5 -274 -54 -233 51 -263 225 190 -18 -138 139 -13 -257 -34 -57 -233 -251 49 -19 -84 30 -56
6731 -56 -50 105 198 -141 -236 -5 -87 32 190 106 -136 -17 -112 94 141 208 109 -267 -198 124 -219 238 -69 -23
6755 -23 163 -67 -304 -16 200 53 -83 182 13 -175 144 6 -108 8 164 383 5 14 19 -156 -37 -46
6777 -46 50 54 6 -203 -128 -87 106 272 66 -205 -121 -241 135 92 128 -82 33 -58 21 38 -128 -190 45 -29 113
6802 113 321 156 211 -166 -130 -56 32 127 -26 201 32 201 -140 -70 40 17 -346 -279 106 -21 -13 -202 -223 -13
6826a3k67K86j43J9L3K13k23J1P3p5R6J02K8k26J6j06K41j61Q7k72M64r5R7l07
6850a22P2n9q5J53J62p7p0J8j19J4j76M45R7j50j43q0K3J11k30J19J50j41P3J20
6874A05q7L15l88o3J13j00K7J22K07l21J30j88J29K6q4J04m5J44k07R7J41l28
6896a51L43l58j45K72J15Rj73L12r7m13K01J26J14j11Lj38J04r1p1J75q5l7K10
6919A14j33J41k0j56N5K47m34J33mk21L17k98K51j6Q4j10n5K02l42K79J3K87m29
6942i5O7n0l2J71Q5j86L45l73K5%K65l46Np6P6M10l11K87k69J53l44K05j32NP0
6967d5Q9M5J29j20j51L8O1p1MJ2K22j04j50L8Km4J0o0M9n2NK94k60J92j59J17
6993I1j27Q9L40l24j48J18M5J6N4j53Q9j09L3k8J27k16J24k18K19J02O4j85N4
$$ plain form
6826 -13 -280 6 -137 -118 -85 128 -95 -84 -11 -86 10 112 140 -86 -70 -176 65 -96 -9 -281 183 88 185 -122
6850 -122 -50 -109 -194 -41 121 44 -26 -8 -127 -113 -289 156 253 103 -40 -120 -97 14 -216 -97 53 -88 -15 105
6874 105 18 333 -55 -118 -5 -105 -78 44 251 -70 60 -128 1 27 -57 47 2 146 -61 36 177 -151
6896 -151 192 -166 -311 -39 76 85 -88 224 127 -286 -85 41 155 44 47 -91 13 -78 -149 26 -59 -96 114
6919 114 -19 122 102 -54 1 248 -186 -53 -57 -278 39 -259 -8 -24 60 -50 -105 97 -245 34 47 334 -95
6942 -95 -28 -78 -110 61 146 -40 305 -68 -43 -43 222 -124 -119 -195 -119 291 -20 267 -2 151 -193 12 -120 -115 -45
6967 -45 44 89 218 98 -53 -15 46 -25 -21 -9 213 109 -41 -3 -1 -45 -35 -95 -46 -98 -93 201 -59 133 -26 91
6993 91 -36 53 393 69 -79 39 84 100 154 1 90 -19 14 -14 113 -103 21 -197 22 124 188 3 57
7016E7r5j9J46r2p9L26j95k4q9p8J55J06Q0Jm07K65K6o8j98M6L34k44k22L55q8
7041aj02J91k65J74J18KM6l25j6J82j16J88j66j48K96j25l4K40k40K01r4l80L91
7064A7nK4j89J94J3k28R9L55l36R5j63J94j68N0j39M4Q7j06J89L2R8j80J36j50
7088c7K0q5J63J3KLo4j32o8roK14J57j8k19J4K01q3Jr0L9M9k61N2L28p7k9P1m24
7117b75K71L33m83J37p0L39l80J74j10J7J75r4J3l71J68J21J04J48l11L72k12
7138F6q8K52j12j17M7o6J07p5j5k16K43j02k14J99k44R5J18K05j46Lj0K32k99
7161a37Q0j6N7J41p0j05N5q1q8r6K12J6j12j44J69k81N48j06o1P2N0j59K22p7
7185H9L3l92J10K51k92M46m49L58k42K91k30l3J31j30J83k76L01p9j95J07P4j50
$$ plain form
7016 57 -38 -57 89 -3 -82 244 49 25 -64 -142 13 119 199 200 -207 58 84 16 -182 -136 198 -46 -268 87 -1
7041 -1 -103 88 -177 -3 115 117 163 -162 -178 4 -112 76 -90 -238 58 -67 -101 139 -101 100 6 -374 17
7064 17 12 36 -153 41 54 -174 -75 280 -56 39 -124 70 -98 -48 -187 -143 -56 -162 27 59 157 -23 113 -37
7088 -37 -17 -102 61 74 76 79 15 -117 -185 -194 -200 14 171 153 -66 -52 149 66 67 -23 16 65 -196 -144 184 107 78 149 -275
7117 -275 -4 329 -154 -17 -87 252 -128 46 -64 -47 128 34 47 -324 -156 -35 69 217 -94 278 66
7138 66 -22 230 118 1 48 -18 89 14 -1 -217 26 -76 -290 -91 -335 -240 -122 83 -63 -60 -70 162 -137
7161 -137 -57 -73 -16 125 55 -50 5 -76 -164 -260 -48 -32 -144 -288 -119 -400 148 42 -19 53 103 -56 166 89
7185 89 122 -270 -160 91 -201 245 -204 154 -88 203 -27 -60 71 -59 124 -152 149 70 -125 -18 56 -94
7207i4O4K5O2J18j96J00k13K68ml29K38l7K3J16l81K38j20j82L11P0J85l43J30
7230D9Op1M9J46j28P4j68m21N08n93N65j26K57k75N73j58l07l07O18o4n31M96
7252A92k12q3j00N54r15O48P2m75K04L8R8p90Q34k65N92k60o1k02O11j65K58o93
7274a20L05m03Q17r26J21L6O55j87m92o87M17R73l22J32p3oJ8N53r64Q2J14k69
7296b26m77j11P91J82J03o67K90k74k15M4J25R05j237M27O83r39N35P07j109K03
7316b60P24l42k37N51j245J340L29q71l0k24L26o14P04k1N93q45k53O42R2j062
7336g03M92k21P69q88N41O35j041M13J21N48q65p78J198J60q01J43M30l54N68
7355C67M27r14j39J43L90j50J19K22n32L60m71J01L37n69J63L63J69r7n19O35
$$ plain form
7207 -94 -30 -5 57 175 -21 79 -134 134 130 -199 39 2 25 141 -240 -2 -122 -304 7 77 262 -81 49
7230 49 55 -16 33 179 51 125 -43 -464 44 -549 16 -110 147 -128 445 287 -20 -327 291 227 -304 192
7252 192 -20 -103 -203 351 -564 84 156 -319 -115 -77 21 -769 65 -200 392 132 71 -131 480 315 573 -120
7274 -120 185 -218 599 -327 -206 -170 485 298 -194 -881 -464 509 187 319 246 240 258 811 -153 -71 43 -226
7296 -226 -703 -814 -23 159 262 -405 -115 -389 -604 -560 -435 470 -767 -340 343 -596 -61 646 -463 -260
7316 -260 464 122 -115 436 -809 531 860 -11 -41 -265 61 -553 151 130 723 -122 -375 267 359 -703
7336 -703 -211 -432 337 -551 -10 625 -416 -3 118 666 -199 -977 221 381 -420 -277 153 -201 367
7355 367 794 -120 -259 -116 274 124 243 465 -67 293 -178 -77 260 -309 -146 217 386 289 -230 405
7375D05l65J51J14k45j4K50k88N50q00jP4L09P4m60L09l64Q41j63m82l4k56k39
7397f34J076m82j047J110q75J549r67N45o97L2O93J32q85J048p00j77M30o03j00
7416e52J247q17p9L74p95J273j378K45P86j104L83R06n38L05k72m74Q88j5k30
7435A53l02L48J57k64k71J19K2J3M12k99l22J95L58m03J28k58j7N5J53Ko4j8k53
7458c56O50o85M34K0j99R5L11j02k95l7J94m5k58M49j10J10l22J42J20o2m57O24
7480B21m67J71N2K38l04j48L03J52n04P6K76j59O70q71K37L98m42k03L28R9n8
7501F5q1j35J17k61M44l6L5n4j66m3R6J4j8j68J96K02k61L2J11k99Q1m9K97j04
7525A5O3J19Jk20J74l43L95l56M9J88m44M34o5J70j74l5j44L83l39r4L82k5k88
$$ plain form
7375 405 40 191 305 60 46 296 8 558 -242 -243 -169 140 214 -246 63 -301 540 377 -105 -139 -395 -634
7397 -634 442 -40 -1087 23 -852 697 -270 275 -422 -390 303 435 -450 598 -102 -279 151 -452 -552
7416 -552 695 -122 -201 173 -622 651 -727 -482 304 -800 -417 489 -49 256 -16 -490 398 383 153
7435 153 -149 199 356 92 -179 -60 -38 -25 387 88 -234 -39 319 -84 44 -214 -231 -176 -23 -21 -85 -103 -356
7458 -356 294 -391 43 63 -136 -41 270 168 -127 -164 30 -15 -273 176 66 176 -146 -4 116 54 -403 221
7480 221 -246 -75 -23 215 -89 -237 66 218 -286 -210 66 -93 577 -294 -57 341 -101 -304 24 123 65
7501 65 -16 -151 -34 -295 149 113 148 94 -72 -115 -19 -5 -23 -191 5 207 -54 -22 89 -210 -129 -178 119 15
7525 15 78 197 198 -22 152 -191 204 -152 -103 85 -359 75 10 180 6 -29 -173 210 -129 -223 159 134 -154
7548a54J81l6K77k70m04N07O9M8j83j22K06m40Q6%O66p36K68o3J67k13J86j46
7570a06Q1k78L05K09j01J01n61O14p0l48O8K02J29o69L31J19J8N42j86q73M26
7591d7m34R16j45k21J1m94O70L5m35j30O29k16K00q64Q70l96M84q33J093o16k3
7612E4j044P17m63J024M70j215O49n51O98K25l62j012L00R41j530O23mJ451j176
7631b05N44L60r82N74k84n87j82M55Q0M05m00O81p80l21M39Q12j224Q76o79J183
7651G65m67k11q54R91K7l70j22J55N47n22K45r6m76N52o25M33r42M60J45N01R
7672A45j184K004p68k04J50j32Q12r59o65J61P31o81l57J446l82O73o72m39M2
7691b79P83n19J091j145N31L5q85Q77r5K2N40j078p19K36K48m19P73l91M70q96
$$ plain form
7548 -154 27 -9 268 -2 -406 101 170 218 35 -87 119 -321 -235 -235 431 -305 -37 -100 67 -146 40 -106
7570 -106 -25 -303 2 211 110 211 -350 264 194 -154 -86 116 245 -424 -93 26 44 586 400 -473 -47
7591 -47 -481 435 290 69 80 -414 256 291 -144 -274 355 139 339 -525 345 -51 433 -400 693 77 54
7612 54 -990 -273 -736 288 758 -457 192 -359 339 564 202 -810 -510 431 -1099 -476 -480 971 -205
7631 -205 339 699 -283 291 7 -580 -762 -307 -227 178 -222 459 -321 -642 -203 609 -615 261 -418 765
7651 765 298 87 -767 224 251 -119 -241 -86 461 -61 184 88 -388 164 -461 -28 -970 -510 -365 136 145
7672 145 -1039 965 197 -7 143 11 823 -136 -801 -640 91 -590 -947 499 117 790 118 -321 -279
7691 -279 504 -15 1076 -69 462 497 -388 489 394 416 956 -122 -841 -605 -357 -776 -3 -394 76 -820
7711h20J141q5q21J307l70P59j094j16N05L04k68j41j321J687L19j350J047j012
7729c29J643k05r74J12j171k40N34L73l89Q86j192R62mp69P75k9k1j75l58P56
7749A85J99l41j89L23l00P07o35J96J987k140L28m53l80J68mn07O55N05M87r50
7769a59l97M72P64j31j436K044j981P84J31o32O24j39k42P11q85J038l85p35R09
7788C55n57o51K79P93q93N79k46L0K71L2J80m15P3N7K55k91q4N1j9q4L15j34R4
7811a0L18j027P14M35p41K97k9p1j03L25l11N03l55p9L85j031L82K68K57r23K47
7832e49N3P3L90L02J74n22o10J037O8m1l05k24J57K62n05P6L64P0J39n31M68p60
7854d14L15J16M25j090P07J91j6jp58J62N05M47q40N90o82M43J33n5n21O5M11
$$ plain form
7711 -820 321 236 -585 722 352 1111 17 -99 406 710 442 301 -1020 667 986 -364 683 -329
7729 -329 1314 1109 135 247 -924 -1164 -630 -257 -646 240 -952 10 6 -763 12 -17 -38 -213 -571 185
7749 185 384 43 -146 177 -123 584 -51 145 2132 -8 320 -133 -513 -345 -349 -856 -201 304 791 -159
7769 -159 -556 -84 680 549 -887 1157 -824 -40 91 -541 83 -56 -298 413 -472 566 181 -554 355
7788 355 -202 -853 -574 219 -674 -95 -341 -311 -40 -8 172 -243 -170 -113 142 -149 -233 -182 -201 -285 30 -104 -10
7811 -10 308 -719 -5 430 -311 -14 -43 -114 -217 108 -203 300 -55 -134 251 -780 -398 -130 127 -796 -549
7832 -549 -496 -423 -33 269 443 -79 -689 348 416 375 70 -154 3 265 -240 -164 200 270 409 -122 346 -414
7854 -414 -99 17 442 -648 59 250 234 233 -525 -363 142 589 -251 339 -343 100 233 178 -343 -278 133
7875A33p25Q20l78j55j40M59k64M34j78M00l52Ml30M72o30k19L46R50l95J48m11
7896a1m16K4R3J019j454J122k17j01k44k5P2P41n70n92N44N60n67j51j88Q82o46
7917a25J461j314p0J47O8m08n89J132q26M46O83n53O80n45p38N29K80n6n0j29
7937B3j9J12k80m3K49P8l97O39j48j23l31N63l07l07M44k60n1P10n95%j83K08
7959a8j15O9j28K85k47J98n1L50m07L9j99K97k46j9K0L33L48l92j14K71p93M92
7981b7k52L86k34J57j56J31Kj35K87r7j80N4J2K04q8j11M17o21M64k85J77J15
8003B20n04L49j04J46m8Q4O2j89j2m7J3O4J74p1k56L4j06K59L6n1j1j87K33j32
8027d4Q2J06k56l4K77k59M16p5q3L4p9j48q5K32j78j1P7n5L9L96k39O7q3l80K71
$$ plain form
7875 133 -592 228 -150 -305 -445 14 -250 184 6 406 54 58 -272 200 -430 -649 -303 647 252 400 -11
7896 -11 -427 -403 -310 709 -745 377 160 59 -185 -210 -138 603 33 -559 -15 545 -22 -173 -361 521 -125
7917 -125 1336 22 -48 99 167 -241 -830 302 -524 -78 605 52 732 187 -551 -22 258 202 152 23
7937 23 4 116 -164 -207 42 120 -277 362 214 91 -240 323 16 -291 153 -107 -158 552 -43 -43 -226 -18
7959 -18 -133 -64 -192 93 -154 44 -7 343 -64 -25 -224 73 -173 -192 -172 161 509 117 3 274 -519 -27
7981 -27 -279 107 -127 30 -126 5 7 -128 159 62 -118 -64 -52 152 64 -47 370 -251 213 -72 105 220
8003 220 -284 65 -39 107 59 143 205 16 4 -43 -30 34 208 137 -119 -85 -191 68 104 53 42 -145 88 -44
8027 -44 38 144 -112 -146 131 -128 288 213 130 164 85 -63 -148 84 -94 -105 -28 -83 -44 352 113 180 97 -283 -12
8052a2j5O0o5o5R5o5j67J08P8q3L54j06k44L9J56r8o9J09Nr4j3P3k71M33k7k08
8078i2K88%k06L2J92n5J01k00n5K64m68J75pQ5j55J81M4l17K75m3J66n8m11N90
8102C26m62k90L79m9K11q9k1J6N1k88k3j14N85k58K70r1m1j95j7K17p4k01K10
8125E2j0J16m2j06j06j21N15l31k35J82K73j42J52r9j13l9N1R4k23K23k23J78
8147D6J4Q7j67j98J28J65j31J80J43m51R6M9K73m75K45K0Jq3J19p1J92k1l28J60
8171gJ00j67r6J8K59l7K5q7lO0m1j39J27J46j19J05k33Q1Q3Q7
$$ plain form
8052 -12 -27 33 -32 -97 -2 -67 -234 -126 -48 -131 223 117 -127 -88 68 -30 -99 10 15 -79 -92 -19 -290 143 116 -92
8078 -92 196 196 -10 22 214 159 260 60 5 269 -199 -24 -31 54 -101 80 124 -193 82 39 205 147 -264 326
8102 326 -136 -426 -47 -96 115 26 5 21 72 -216 -239 -353 232 -26 244 153 112 -83 -100 117 43 -158 52
8125 52 42 158 116 10 -96 -217 298 -33 -268 -86 187 45 197 98 -15 -54 -3 91 -132 91 -132 46
8147 46 60 147 -20 -218 -90 75 -56 124 267 -184 -88 -39 234 -241 4 24 25 -58 61 -10 182 161 -167 -7
8171 -7 93 -74 -170 -152 107 70 95 8 5 65 24 -115 12 158 39 144 -89 -8 75 162
8191A62
$$ Imaginary data points
##PAGE= N=2
##DATA TABLE= (X++(I..I)), XYDATA
0@%%%%%%%%%%%Qj6J6j6K4l2L2m0N5o3P2q8J04j20J44j71J95k24K61l01L44l92
33b08M45n04N69o41P19q05Q99j003J115j236J371j521J683j856K048k259K488
50A304k742L020l327L669m050M477m958N506o139O879p753Q807j0107J1756j3932
65g590J6952k1448K8951m4518J34709k34092r4894L75955r8432j33075J26795
76D9313N1588j16201R091N507J1229L3290k9948o0074M9018L2943j9799j7421
88a464m897j2737J7201J4599o484k4979n307J3384Q821l461O459k965o222j3266
102b1318j6641L2457M5231n3857m7531O4891K5815n2806J2755K5360l7098j875
114b4617L1316o297L405J429l8883M510N9291J014m9960j4092K5758N740j1872
$$ plain form
0 0 0 0 0 0 0 0 0 0 0 0 0 8 -8 8 -8 16 -16 16 -24 31 -32 40 -48 56 -64 80 -91 104 -120 141 -160 184 -208
33 -208 237 -267 302 -339 380 -425 474 -529 586 -650 721 -800 883 -973 1075 -1184 1304
50 1304 -1438 1582 -1745 1924 -2126 2351 -2607 2899 -3240 3639 -4114 4693 -5414 6342 -7590
65 -7590 9362 -12086 16865 -27653 107056 -127036 -221930 154025 55593 -77482 49313
76 49313 100901 -15300 -6209 -702 10527 43817 13869 -46205 2813 35756 15957 -1464
88 -1464 -6361 -19098 -1897 12702 6218 -18761 -24068 -10684 -1863 -5324 1135 -1830 -8052 -21318
102 -21318 -37959 -5502 39729 -14128 -61659 3232 29047 -23759 -11004 14356 -22742 -24617
114 -24617 6699 402 3807 5236 -33647 -29137 30154 31168 -18792 -32884 -7126 -1386 -13258
127a3258J7488J8749l4074k3761L5620J3482k3402m056J453k643J6424Q750k341
140H431p052k4568m25M1582n262l8032K3395K3213k2606R42J1743j0197k981r659
154a1476o505M2733K0493m8393j5607K9503o675j4579K3783J3365k2919k0627
166a6904J3329K2974n650j4432J256o006m574K1307K523k1876J350M468m135J6018
180I648K189k7906M34J8850p261r61J3157q314j3192O958Q840J435o591r626N710
195f630J2841k127r171J021N917j061l698P516L881j6662o879J8025Q065l823
209G215J088q262p148L909l058O971J9885j5795k2585K5094J2428k7937q22J7119
223H102j0865o243J5914Q076o709j4051p100J5370R768j2863k833P968n004l620
$$ plain form
127 -13258 4230 22979 -11095 -34856 764 14246 -9156 -13212 -11759 -14402 2022 10772 8431
140 8431 1379 -23189 -23614 17968 12706 -25326 -1931 21282 -1324 -382 11361 1164 -1817 -11476
154 -11476 -17981 24752 45245 -3148 -18755 10748 4073 -10506 13277 26642 3723 -16904
166 -16904 -3575 19399 13749 -683 573 -5433 -10007 11300 13823 -8053 -6703 -2235 -6370 9648
180 9648 11837 -16069 -15635 3215 -4046 -5007 8150 -164 -13356 -6398 2442 3877 -2714 -12340 -6630
195 -6630 6211 4084 -5087 -4066 1851 790 -2908 4608 8489 -8173 -15052 2973 11038 7215
209 7215 8303 41 -7107 -3198 -6256 715 20600 4805 -17780 7314 19742 -8195 -9017 8102
223 8102 -2763 -9006 6908 14984 8275 -5776 -12876 2494 12262 -601 -3434 4534 -470 -4090
237d090J1284P079j3301j6229J0365K0173q242j3028J0201L80j0837P478Q282
250I515n298m410o488K369J5580o085j4161J2617K591j5179R071J0915j4160m794
264g917P436j238M338K457j0382J130P749p318l521R365J210q163m503R498R235
279I376q979j0844O138M982k792J672j241k249L492j489K632P214j2306j2658
293a7052J5326P249p269P743Q07j6476J17J0033K103K019n878p762J1681P118
307I759j3732j060R915n550o403Q200R024o864j1845L885J2384k774r061O629
321B507L197j1328m40J1182K922o725o005M998N347o707k251R432l475r903P774
336E25P724n866m479j132J899N395k044l711L835l238m888Q997M600q014l087
$$ plain form
237 -4090 7194 14273 972 -15257 -4892 15281 7039 -5989 4212 4592 -6245 1233 9515
250 9515 4217 -193 -6681 -4312 11268 5183 -8978 3639 6230 -8949 122 11037 -3123 -7917
264 -7917 -481 -1719 2619 5076 -5306 -4176 3573 -3745 -7266 2099 3309 -4854 -9357 141 9376
279 9376 397 -10447 -4309 673 -2119 -447 -1688 -3937 -445 -1934 698 7912 -4394 -17052
293 -17052 -1726 5523 -1746 5997 6804 -9672 -9555 478 2581 4600 -1278 -9040 2641 9759
307 9759 -3973 -5033 4882 -668 -7071 1129 10153 3289 -8556 -4671 7713 4939 -4122 2507
321 2507 5704 -5624 -6064 5118 8040 1315 -4690 308 5655 -1052 -3303 6129 2654 -7249 525
336 525 8249 2383 -2096 -3228 -1329 4066 2022 -1689 2146 -1092 -5980 3017 7617 -397 -3484
351c484J57Q45N893j506o029M460J798m435K712J241n019l28J677J499N365k535
367B311q279K616N448l656j030K438l15k395k87N115M085q517o215P979J900n066
383c868M713M222o527m649K220O769K742q794l329J0041j448p141P269M226j0641
398d195j064Q501K224l398n412J78N544R49l043M163j27q842R47Q623K88n885
414e49r77M323O29l939O22M321l537l905N126K364l195j886j658K439M814l665
430A327m080M699j836n033N673L598k901n88k818j925O010k20n836M084L130n347
446b063J093L582k876l630K59M091L574l819l843L428l62l744L977N098n877m869
462e981K984N684M26n501j050N532j867m607M942L400p189k805N788L751k715
$$ plain form
351 -3484 -3327 -2482 3411 1905 -4124 336 2134 -2301 411 1652 -3367 -3695 -2018 -519 4846 2311
367 2311 -5968 -3352 2096 -1560 -2590 -152 -467 -2862 -3149 1966 6051 -2466 -8681 -702 1198 -3868
383 -3868 845 5067 -1460 -6109 -3889 2880 5622 -3172 -6501 3540 2092 -5049 2220 6446 -4195
398 -4195 -5259 3242 5466 2068 -3344 -3166 2378 3327 284 4447 4320 -4522 -3575 5048 5336 -549
414 -549 -1526 2797 3426 -513 109 4430 893 -3012 2114 4478 1283 -603 -2261 178 4992 1327
430 1327 -2753 1946 110 -4923 750 4348 1447 859 -1959 -3884 2126 1906 -3930 154 3284 -2063
446 -2063 -970 2612 -264 -3894 -3635 456 4030 211 -3632 -204 -566 -4310 -333 4765 -1112 -5981
462 -5981 -2997 2687 3113 -2388 -3438 2094 227 -4380 562 3962 -3227 -6032 -244 3507 792
477G92m678J210N041l757k613O784M13o890J136M730m62j821j430J176J945k559
493i83O14N211l279n537M815K974m392P94J832j939K23O35j04J804k036l388L215
510D59K968k799k223L72J645J883j143j844R51j458j135K073J408J040j517m173
526c493J951N151m118l046N563n00m299M013J581l788r17R75J778L095l509l855
542c418N214j79n909N399N366o869m521N431J981l297p67K438J707l550j614L346
558G58J122l730k068M121L524m172l465M321J481o054K275O829m582m971M442
573a69J434j614J065n56p83K147j768n38L785k060l616M840K115m784k5J642j248
590a33O28J389j097P1N5j938P32J917p67j793j19J162R74j642l2J356k150q37
$$ plain form
477 792 -3886 -2676 2365 -1392 -4005 2779 3192 -3698 -2562 2168 1706 -115 -1545 -369 1576 -983
493 -983 -369 4842 1563 -3974 841 3815 -577 217 2049 110 333 968 864 2668 632 -2756 459
510 459 3427 628 -1595 -1223 422 2305 1162 -682 269 -1189 -2324 -251 1157 2197 680 -3493
526 -3493 -1542 3609 -509 -3555 2008 1508 -2791 1222 2803 -985 -1902 -927 851 3946 437 -3418
542 -3418 1796 1617 -4292 1107 6473 -396 -4917 514 2495 -802 -1569 869 2576 -974 -2588 758
558 758 1880 -1850 -3918 203 3727 -445 -3910 411 1892 -4162 -1887 4942 360 -4611 -169
573 -169 1265 -349 716 160 -623 1524 -244 -782 3003 943 -2673 2167 4282 -502 -527 1115 -133
590 -133 495 1884 787 858 913 -1025 -293 1624 857 -936 -1055 107 1081 -561 -593 763 -1387 -2224
608b224K141J076r15q82j982K034K858l283j428M129j240l548L674K144l527j826
624b799K552K114o28k674N75K781k840k179M885K006n246j610L753J174k613r55
640a704K595Q62m082O18M258j952m270K007K917q66j097o51L57P47j324Q37K565
657A817j789l312K495K409k329l60J823k36n43n38Q89J072j331j119K146Q61o20
674A335m92j804M89K144o94r8J656k188k109K600J391j086p46p23K99J525r33
691E66j168K275p09l051L009K012k991k236J731J832p55r76J432L18l124l69L487
708A283J028k961j307K157J635k141j315K799Q15m846J285N233k250m593K147
723a031K237r61n21j99L98O63k118M1L448j435l303K048J890k022q6J257r92j228
$$ plain form
608 -2224 -83 993 78 -804 -2786 -752 2106 -1177 -2605 1524 284 -3264 410 2554 -973 -2799
624 -2799 -247 1867 1239 -1435 -860 1921 -919 -3098 1787 3793 -1453 -3063 690 1864 -749 -1704
640 -1704 891 1753 -2329 -1711 2547 595 -3675 -1668 1249 383 -714 -1365 -1008 -261 -1585 -748 1817
657 1817 28 -3284 -789 1620 -709 -1069 754 518 -25 -563 326 1398 67 -1052 1094 1955 1335
674 1335 843 -961 -472 1672 978 880 2536 348 -1761 839 2230 1144 398 -325 -26 1499 566
691 566 -602 1673 964 -2087 922 2934 -57 -2293 -562 1270 515 -461 971 1289 -1835 -2204 1283
708 1283 2311 -650 -1957 200 1835 -306 -1621 1178 1993 -2853 -1568 3665 1415 -3178 -1031
723 -1031 1206 245 -276 -475 -77 586 -1532 -1491 1957 522 -2781 -733 1157 -865 -951 306 -686 -1914
741a914R32J419K63j685m08P31J52K78M83j139N76L67r07J066J014k089l33J852
759F58N7l08M79j835K28K546j487q19K277r80k820K100K141j366r10J26O43k19
777E11o91O31J205j225j590J950J686k070k190J615J666j278j109K604k73l944
793b502N92L850o66k616J031P32k75j029j26J917J86l125P15L867k331l269K872
810a77J264k183N94J353p25j473l84J716J323j456j269J432K47j297L24J314j363
827g60m19N45Q75J29r46m62L81P18m7k14p99M41K51j50P01P92j367j002J118P70
847E55r9n1p61J55O02l03K20J260j835j076J462J418j218k33oP24j12o27M3J290
867A408j630r28K440J150l423J99J274K08p04o95L070j360k067n2L240j137k143
$$ plain form
741 -1914 -982 437 700 -985 -1393 -662 -510 -232 251 -888 -312 55 -852 214 1228 -861 -1194 658
759 658 715 407 886 -949 -721 1825 338 -481 1796 816 -2004 96 2237 871 -39 87 730 511
777 511 -180 451 1656 431 -1159 791 2477 407 -1783 -168 1498 220 -889 1715 1442 -2502
793 -2502 -1910 1940 1274 -1342 -311 421 146 -883 -1009 908 1094 -2031 -1316 2551 220 -3049 -177
810 -177 1087 -1096 -502 851 126 -1347 -1731 -15 1308 -148 -1417 15 262 -1035 -711 603 -760
827 -760 -1179 -634 241 370 -576 -1038 -657 61 14 -200 -999 -558 -307 -457 244 1036 -331 -1333 -215 555
847 555 456 405 -356 -201 401 98 318 1578 -257 -1333 129 1547 329 96 90 814 702 75 118 1408
867 1408 -222 -1150 1290 2440 -983 -784 490 698 -6 -701 2369 1009 -1058 -1110 2130 993 -1150
884a150J720N06j250k43O23P82j012j032J292J425j844r62J381l99l92O92M71
901F08k49j143m83J020J368j220n83K7J96k27R00k8r62N02m6m74J147m21j011
920a079K69J097n05l24K89m63K7j30J591p0j45j363P8J454o3j344P9J293q78j210
940a397J950R06k265n40K044K92j286K78J82M4n12L9J321J41k048R6K302q03j436
959f92J152O42j170k53J271J92j168j005J429J186j443o83J219n32q13J16J305
976G53j77j141j85J118K27j374N05L40r53K44J325p43l93j0o52Q20P46r52J76
995c26J27n40j2J003n06n21N03n05M59O76k76j341Q63R26n78l72P0J79n88q0J047
1016B08P73r86j240J108Q37q98k81P76N31j423k31J696L18k064nK036n87r29O21
$$ plain form
884 -1150 570 1076 -174 -417 206 988 -24 -1056 236 1661 -183 -1145 236 -163 -555 137 608
901 608 359 -784 -1267 -247 1121 -99 -682 -655 -459 -686 214 186 -776 -274 -320 -794 353 -68 -1079
920 -1079 -810 287 -218 -542 -253 -716 -689 -819 772 702 557 -806 -728 726 663 -681 -602 691 -187 -1397
940 -1397 553 1459 -806 -1346 698 990 -296 -18 164 208 -304 -265 1056 1197 -851 -755 1547 744 -692
959 -692 460 1102 -68 -321 950 1142 -26 -1031 398 1584 141 -542 677 145 -668 -552 753
976 753 576 -565 -750 368 595 -779 -274 66 -887 -643 682 -61 -454 -464 -1116 -296 450 -502 -326
995 -326 -199 -739 -751 252 -254 -775 -272 -777 -318 358 82 -1259 -396 530 -48 -420 -350 -171 -759 -839 208
1016 208 981 -5 -1245 -137 700 -198 -479 297 828 -595 -826 870 1188 -876 -881 1155 568 -361 260
1035B60K57m42o14M77J458m44j683N77J553j157p33J751j51j486O40Q76l51o30
1053A58l10P16K26l44n36P25k34q79Q82P09q07q08K58O36m44j62L45j20q21L52
1073d58N43P0l77j52l00N52J46n55m7O4j16K42R1k34L86l44o48N83J207q69p45
1094i61N16O01p09L30L99l68k56j68P66N08j163l07J005J2q38L54Q57m94p26O10
1114c2R37l70j318O38R69o30l65P14J77j154PR14M04q29n34O54N50n54r2R54q79
1135A61k54M2N09r7k54j52K58L10k20J66q9n70j5O37J26k75k02r3k19K38Q4K31
1157C22l76l75M75k34K70Q1n21r08J486M8m98k18K42m1k48J46K65J91n94n97J161
1178G7N92j164j15R07p76k96R23K25l95n73J09R00L0j089M2J187n69m78R17j07
$$ plain form
1035 260 517 75 -539 -62 1396 952 -731 -154 1399 242 -491 1260 1109 -377 263 1139 788 158
1053 158 -152 564 790 446 -90 635 401 -478 404 1113 306 -502 -244 392 -52 -214 131 11 -810 -458
1073 -458 85 155 -222 -374 -674 -122 24 -531 -578 -514 -630 -388 -297 -531 -145 -489 -1137 -554 653 -216 -961
1094 -961 -445 156 -553 -223 176 -192 -448 -616 150 658 -505 -812 193 205 -633 -279 578 84 -642 -32
1114 -32 905 535 -783 -145 824 194 -171 543 720 -434 -427 487 891 62 -472 182 732 178 86 1040 161
1135 161 -93 -51 458 361 107 -45 213 523 303 469 380 -190 -205 432 558 283 81 -12 -231 7 91 322
1157 322 -54 -429 46 -188 82 163 -358 -1266 220 268 -230 -448 -206 -247 -495 -349 -84 107 -487 -1084 77
1178 77 669 -495 -610 297 -479 -775 148 373 -22 -595 -486 414 444 -645 -603 584 15 -463 454 347
1198C47n93l03Q78J84n90k89N74K13q50J65P49j13m80j96Q00K69p79NK62J6n13
1219b44P71%o90J33L09r6L7J72n63M94n2j10K47r1m84J23L26J31m53K98m27k50
1241d19Q30l90j88m6K41j63L4M19J49r37O0L29L08l31k44J85p8q9R3M93j70p01
1263f15j24J027q2r91M28R42j097j41Q21K49p77k37M72J13J80n65K77K29m48k49
1283e88J155J11j164N4Q21k38m42J84K95k64j86M04J01l90m29N38O37m21l36Q2
1303g6K07j43j51O11r7o31K73N59m37j85L47j93k7L98k55m7p1l70J88L10k06J58
1325A62j38Jj03L93j24l50J76q9k75K86L56Q3o59j07L01J32q4k47M15j85m81J43
1347c94P60l03p07K78P23q05m8Q44l68l40j47O90j74m53m1N74j9j3l29N48m58
$$ plain form
1198 347 -246 -549 329 513 -77 -366 208 421 -429 -264 485 372 -108 -304 496 765 -14 -9 253 269 -244
1219 -244 527 527 -163 -30 279 183 220 392 -171 323 271 161 408 317 -167 -44 282 413 -40 258 -169 -419
1241 -419 411 21 -167 -213 28 -135 -101 318 467 -470 -410 -81 227 -104 -348 -163 -241 -330 -237 256 86 -615
1263 -615 -739 288 206 -785 -357 585 -512 -653 168 417 -360 -597 -125 -12 168 -397 -120 109 -339 -588
1283 -588 567 678 -486 -432 389 151 -291 -107 188 -76 -262 142 243 -147 -576 -38 599 178 -158 -76
1303 -76 131 -12 -163 448 351 -280 -7 552 115 -70 277 84 57 455 200 153 82 -288 -100 210 4 162
1325 162 24 25 -78 315 191 -159 17 -72 -347 -61 295 378 -281 -388 -87 45 -39 -286 129 -56 -537 -394
1347 -394 366 63 -644 -366 357 -448 -496 348 -20 -360 -507 183 9 -444 -485 89 70 57 -272 276 -182
1368a82m13N54P70o37l91L62J40r6J5K7O0m72J88J08JKr7L6K93m55J64J81K0j52
1392B6K38J31j61j49J7j38Q3L00M7l77J20R4k53L65m28J21m5lJ90M47q44k02N87
1415A66L49q29K40M35n51j61M58M98o50k59J50J80q0k23L20P1l67j28N23R5n14
1436b77J1N25rm71L47J16n9l87O9M30n23J0M4M20j96m39M15J16k98m52O07L21
1458C20o52j64P05n58K97RL09n18J90J52l5o6J75l53K94K23l23L10k8k46j93M90
1480C38k95K4M1Rm3J11L83o15l6J83K8k03oM91j67k85j54M41k1n80L21N10m35
1503D0l77P26n0p79M2K79N11k93k34J13K50k15k06K49K2m59p0O32q3o91L36L26
1525F9l67l1K29J38k69J04K82j53j30k92M37q1m6j21M21k16k19j1N06o1n13J50
$$ plain form
1368 -182 -595 -41 729 92 -299 63 203 107 122 149 209 -263 -75 33 34 36 -61 -25 268 -187 -23 158 178 26
1392 26 264 395 234 85 102 -36 47 347 394 17 137 231 -22 343 -85 36 -9 -12 178 625 -219 -421 166
1415 166 515 -314 -74 361 -190 -351 107 605 -45 -304 -154 26 -54 -277 43 114 -253 -381 142 237 -277
1436 -277 -266 259 250 -221 126 242 183 -204 -135 295 -228 -218 -174 246 50 -389 26 142 -156 -608 -1 320
1458 320 -332 -496 209 -349 -52 -43 266 -252 -62 90 55 -11 164 -189 105 328 5 315 287 41 -152 338
1480 338 43 67 108 117 74 185 568 -47 -83 100 128 -75 -81 410 243 -42 -196 245 224 -356 -35 475 40
1503 40 -337 389 339 -440 -398 -119 392 99 -135 -22 228 13 -193 56 78 -381 -451 181 98 -593 -257 69
1525 69 -298 -329 -100 38 -231 -127 155 2 -128 -420 17 -64 -110 -231 190 -26 -245 -256 250 189 -324 -174
1547a74J15j6n2K79k59J01j31N74l38J10l16N0L58n05L80j32J11L9j77M0l49M83
1569A91J27j13k35R8M6j70j82N45k56j11RP04m07o80n9N18o7m39M45K89l81J67
1591C9l71M76K12l74L21l57O32o76L49j09k25n58Q68l37J11n83M51L94j367Q29
1611b75L96j05R4l05O44m40RO45o02o92N80l87o37J445q6J20o80k68M73K85l07
1632i3m27l9P59m5J72o22K99M68q60K46J51J60n01M27m82O23J25m85p1K44K21
1653B70p06N49J70n21n5L13L86k75j45K38J06m45M50q6L74o60K37J00m14k25K88
1674e1m59P81n98J49L64j69j68K9O37p83K77N3j44M6o7j0K11K26r18O91l99L76
1696G4P8m01k66N7R6j55L68k14M08O2r6J4J2j87l12K77M81n84l88L44L33j89L2
$$ plain form
1547 -174 -59 -75 -127 152 -107 -6 -137 437 99 209 -107 -57 301 -204 176 44 155 194 17 57 -292 191
1569 191 318 205 -30 68 114 -56 -238 307 51 -60 -51 653 246 -434 -493 25 -42 -481 -36 253 -128 39
1591 39 -332 144 356 -18 303 -54 578 -98 251 142 -83 -641 227 -110 1 -582 -131 263 -1104 -275
1611 -275 121 16 110 -195 449 9 18 663 61 -631 -51 -438 -1075 370 284 404 -276 -544 -71 214 -93
1632 -93 -520 -559 200 155 327 -295 4 472 -388 -142 9 169 -332 95 -387 236 361 -124 -195 49 270
1653 270 -436 113 283 -238 -293 20 406 131 -14 224 330 -115 335 249 623 -37 200 300 -114 -339 -51
1674 -51 -510 271 -327 -178 186 17 -151 -122 515 -268 9 62 -82 -36 -103 -113 98 324 -594 97 -302 74
1696 74 152 -249 -515 -458 -362 -517 -149 -363 45 107 11 25 37 -150 -462 -185 296 -288 -676 -332 1 -188 -156
1719a56l95R0P3L55P82p61j01k44P11r13J85P24n63l79M9Q45m06J48k03j79K46
1740i2r2M28j4j4J5j75k25j90P9K88P8k30j54O42M45o62P93j547Q13N29k7q11
1762a23P00q3M86k97r15J139m24L13M72j342k59O68o88M42J709J17j973Q06r56
1781b08Q70M36r82k90O53j42n70K2K58J46l65k56L22j3J88m39k31N28kj31J75
1802c1K29m40N9K65k2l09L16j43O6k22J31o9L17N8j86l21K62K19m82Q1O5J55J48
1825A46l52k25nK64OM95l64K85r7j92K60K04o08M05l93J004j634K96N49L35n39
1846a60N84o00K60K42j40k02K28K56n95O47j240K36Q29j28L59o68J044o43j68
1865A41M3N7m97M7n72J076o4n16J297j257Q88n23k73l02N15m8j34K69k69k62L86
$$ plain form
1719 -156 -551 -461 -388 -33 749 -12 -113 -357 354 -559 -374 350 -213 -592 -543 302 -104 44 -159 -338 -92
1740 -92 -184 244 230 216 231 56 -169 -359 -280 8 86 -144 -298 344 789 127 920 -627 186 715 688 -123
1762 -123 577 494 980 683 -232 907 483 796 1268 -74 -333 335 -353 89 1798 1915 -58 748 -208
1781 -208 662 1098 116 -174 479 337 -233 -211 47 193 -172 -428 -106 -119 69 -370 -601 -73 -75 -206 -31
1802 -31 198 -242 -183 82 60 -249 67 -76 -10 -232 -101 -170 147 205 19 -302 -40 179 -303 -222 -157 -2 146
1825 146 -206 -431 -436 -172 -166 329 -35 250 153 -39 221 425 -183 222 -171 833 -801 -505 44 379 -160
1846 -160 424 -176 84 326 186 -16 212 468 -127 520 -720 -484 345 217 576 -92 952 309 141
1865 141 184 241 -256 -209 -781 295 231 -285 1012 -245 643 120 -153 -455 60 12 -122 147 -122 -384 2
1886Bl34j24R37j122N54o3M12L15j812J380K72n82j15Q38q71j67R2M57J42j058
1906h47M70M40r44M64R24r58M6L43L06pk84l37L22l43n12R74j79Q61r75o18P94
1927f0j81P63l4p13J073j158%N46m8q32J984j209m10J290j511K49l56J001n37
1946a43O24k29k02J76l55P95j113N01r23K3M92m1Q85q34l6P06j18o22N84k07m27
1967d64J90L39n03N9M20j9j12J37K50l98j02j65R33o16k32MK38o2j45N22o63O37
1989B48K02n80J83l30L48o06J15P37p7j35j83M96o03n56N80k33N11p7j39k19O16
2010B98J46q28n0L86K39k30qJ94J88k12N68o16j20M16j36Q59p66p63M38oj16m60
2032e79J237m91m49J9J89L57L42q36O5K04J00m50J02N86r87M02L87j030R37n11
$$ plain form
1886 2 -332 -456 481 -641 -87 -150 262 577 -1235 145 417 -165 -280 558 -313 -480 -388 69 211 -847
1906 -847 -377 63 -881 -417 507 -451 -405 -62 244 237 -47 -384 -62 -405 -917 57 -122 739 -236 -854 -60
1927 -60 -241 522 488 -225 848 -310 -310 236 188 -644 1340 131 -279 1011 -500 -251 -607 394 -143
1946 -143 481 252 50 226 -129 666 -447 54 -869 -846 -354 -395 490 -344 -380 326 208 -414 170 -37 -464
1967 -464 -274 65 -438 -379 41 22 -90 47 297 -101 -203 -368 565 -51 -283 -279 -41 -103 -248 274 -389 248
1989 248 450 -130 53 -277 71 -535 -420 317 240 105 -78 418 -185 -741 -161 -394 117 40 -99 -318 298
2010 298 444 -384 -434 -48 191 -39 -47 147 335 123 691 75 -45 371 235 1094 328 -435 3 -3 -119 -579
2032 -579 658 167 -282 -263 -74 283 625 -211 -146 58 158 -292 -190 396 -591 -189 198 -832 105 -406
2052d06N22m2j01j80k44K17J08m5k17j3J90J85R1L5j38M15o36N08n28r1M76J44
2074B50j1L3K42n39J92k07O41j019M60J77K3o5m0l53j65P91n60J0K90l11k43L83
2096b1J71n19N31L80p22L61L5k53N81o15N1J4k20N69n43L39j96L22k90Q1j71J21
2118FJ41k34K3L13l07K42m2J14j27k16J18M0ok66K26m4R1j77L23j99j64J49J2
2141A6l8lJ06K5M8J93n22Q4l7r9K57Q3l76L15o8K07k23j54N5J82k31n4J06N1j08
2166a85J85J33k87J95J95l94L97j07j95J09K7Q2k99K98k70K5J7Q8J66n03K27j08
2188b04J46P7j29N7j71L33j17p5J2r8q8L96J01n5j21k59L43k31mJ08Mj9l1L76
2212C51q9l16L91m09K77k24K18j7k95p2L75k78J15M5J54m00O9k25K3Q7Q6k29L87
$$ plain form
2052 -406 116 74 -27 -207 -451 -234 -126 -171 -388 -401 -211 -26 65 100 -38 377 -259 249 -279 -370 106 250
2074 250 239 272 514 -25 167 -40 601 -418 42 219 242 177 137 -216 -381 410 -150 -140 150 -161 -404 -21
2096 -21 150 -369 162 542 -180 181 216 -37 544 -71 -20 -6 -226 343 -200 139 -57 265 -25 56 -115 6
2118 6 147 -87 -64 249 -58 184 142 256 129 -87 31 71 65 -201 25 -19 72 -105 218 19 -145 4 16
2141 16 -22 -25 81 106 154 347 -175 -91 -128 -227 30 113 -263 52 -16 191 -32 -186 -131 51 -180 -234 -128 -77 -185
2166 -185 0 133 -154 41 236 -158 239 132 -63 46 73 155 -144 154 -116 -91 -74 14 180 -323 -96 -204
2188 -204 -58 19 -110 -53 -224 109 -8 -83 -71 -169 -257 139 240 185 64 -195 148 -83 -87 21 25 6 -25 351
2212 351 262 -54 337 -72 205 -19 199 182 -113 -185 190 -88 27 72 226 -174 -105 -330 -307 -220 -134 -363 24
2235B4K43k54o6k60O91o75K80J25n51P3L65J62n58J10O67m14j36L43l49R3Q6j72
2257a73j52K20J91j45K41P5m03L19K22l70k1J00M04n74Q8L23j81l17J33L10m30
2278a40M22j03j13P45r40Q6p3M51o6l59J36n0q4o65M61L11J07mk7M78n00m32l00
2301f59N44L52l87K55m73N08l77L78o67L67M81k15m7l97K58m05K19o46Q47l6O27
2322E27r22L72K04p32M03p6n3M64l11J48k3o20M50R0j25J42M06j013O92L06n49
2343b20O32m49m91M17R2Q2l23M85J53q08K83L62pn81M69j97K71R8j60r9j6L1n0
2366b6k05O1J37j95L3K9L05k16L48k12m0k6n4J78n1o6q4o4L21j66o2N4p0J20k3
2391B6J70r4j9j96k9L20j90R6p5OL07j91j02J35m3q3K16k53r7K51j55r8j6J90
$$ plain form
2235 24 267 13 -53 -313 378 -297 -17 108 -443 -370 -5 157 -401 -291 376 -38 -174 169 -180 -87 -1 -173
2257 -173 -325 -105 86 -59 182 257 -146 173 395 25 4 104 508 -66 22 345 164 -153 -20 290 -140
2278 -140 282 179 66 811 -129 -43 -116 335 269 -90 46 -4 -88 -753 -292 19 126 122 95 573 73 -359 -659
2301 -659 -115 237 -150 105 -368 140 -237 141 -526 -159 322 107 60 -337 -79 -484 -265 -911 -64 -100 527
2322 527 -395 -23 181 -551 -148 -224 -277 187 -124 24 1 -619 -169 -79 -204 -62 344 -669 23 329 -220
2343 -220 412 -37 -528 -111 -19 63 -260 225 378 -430 -147 215 208 -373 96 -101 170 268 108 9 -7 24 -26
2366 -26 -231 -170 -33 -228 -195 -166 139 -77 271 59 19 -7 -61 117 66 0 -84 -148 173 7 -55 -1 -71 49 26
2391 26 196 102 83 -113 -142 178 -12 84 9 15 322 131 29 164 121 38 254 1 -96 155 0 -98 -114 76
2415G6r6l4j90L46j72J47j00k24J36L9L91l10K2j45k9L60j22j98M46l38k57K12
2437d0Q2k01M4J81r0L0k48J02L72n55L90J05l63n8J77J17Q3n1J16j32j54r4K3
2460a64J58j5J8K65l01j2J3R0j90K76k50J8%N0k85M03%J23k45L3J50Mk58L67l31
2485h3Q5R3L2l13J86LJ61j29l7J88j80K60j90j95J32l1J33n6k58k9K41N1J26k00
2509a0J15k19n2O7L2n2K9J76k35K12o1J76n7Qk52M2j17K02qMr5J25Pp9n8N0j97
2536b47J68K01J4m5k41N4N8j61L56j19j48J75j14p3K92K04l98K4k39M69k28O3
2558F5L6O9l67J46ln9J1J83R5j62K82m11K33J60R6l27L07p05J41L13n9q2K03k13
2582d8k8R7J79k57p3J54k6k90J22K65K5J87l30P4Nj11N9l04M39k18R5j56OJ30
$$ plain form
2415 76 -20 -54 -244 102 -70 77 -23 -247 -111 -72 319 9 31 -114 -143 217 95 -103 343 5 -252 -40
2437 -40 42 -159 -115 66 -24 6 -242 -140 232 -323 67 172 -191 -249 -72 45 128 77 193 61 -93 -187 -164
2460 -164 -6 -21 -3 262 -39 -51 -38 52 -138 138 -112 -94 -94 -44 -329 74 74 197 -48 -15 135 139 -119 248 -83
2485 -83 2 95 127 -186 0 3 164 35 -2 186 6 266 76 -119 13 -18 115 59 -199 -228 13 64 190 -10
2509 -10 105 -114 -166 -99 -67 -119 -90 86 -149 63 2 178 121 129 -123 -81 -198 4 -4 0 -95 30 37 -42 -100 -50 -247
2536 -247 -79 122 136 91 -150 -96 -38 -199 157 38 -110 65 -49 -122 170 374 -24 0 -239 230 2 65
2558 65 101 170 -197 -51 -54 -113 -102 81 176 14 296 -115 118 278 374 47 354 -351 -210 103 44 -38 165 -48
2582 -48 -76 21 200 -57 -130 24 -2 -292 -170 95 120 307 -23 51 56 -55 4 -300 139 -79 16 -140 -134 -4
2606dJ00j58P5N8K1M0k20L1j22J99jr8K96l97kK98j43K32j41Q1K5n4j36J89p5
2631I4k03K4J84K13l11q3J11j4o1J6N9J37k82M10l97N7J03j48mj20J45R3J41m08
2655b44J52L5J76j06mk7j34J93%J41j63k29K63l1j96K50j26J12j36l3j70J2K67
2678Bm9L48j98l09p9L00M1l6j20K26N2l0j27Q7n7k88J21K71Nj06l9J26l16M50
2702B75m03L44j28j47r2M22k6n58K97J64j69j96J94j6K17j82m8K44mM5j42Q0N5
2725B26n6l62K78k14K29k44j43J92L2K11j18P7N6l31J1J96J88l10j14K03k11J37
2747f7M12j55k08K32j11N6k14R8J44l03L12J79p0j55o49O45K72j97j83L42n02
2768a22L9k06L8J04N62r17O15k45k65P62j78K18j144J192n1n99N57k98M03p57
$$ plain form
2606 -4 96 -62 13 71 92 132 -88 -57 -179 20 19 -79 217 -180 -182 116 -27 205 64 145 170 116 -20 169 94
2631 94 -109 -85 99 312 1 -82 29 15 -46 -30 29 166 -116 294 -103 -46 57 -91 -95 -215 -70 23 164 -244
2655 -244 -92 -57 119 13 9 -18 -152 41 41 182 19 -210 53 22 -174 76 -50 62 -74 -107 -277 -265 2
2678 2 -47 301 103 -206 -285 15 56 20 -100 126 178 148 21 108 51 -237 -116 155 160 54 15 141 -175 275
2702 275 -128 216 88 -59 -151 271 245 -313 -16 148 -21 -217 -23 -39 178 -4 -52 192 188 233 91 171 226
2725 226 170 -192 86 -128 101 -143 -286 -94 -62 149 31 108 164 -167 -156 40 228 -82 -196 7 -204 -67
2747 -67 345 190 -18 214 103 159 -55 43 187 -116 196 375 305 150 -499 146 418 221 38 380 -122
2768 -122 -83 -289 -251 -147 415 -502 113 -132 -397 365 187 405 -739 453 402 -197 360 62 465 -292
2788b92J262p40K78p14L52j99R50j204J09K91J1m10J33k16M36k09o3M21k95J96
2808I7k24J97k52K70m1j34J0K6j0J34n8o9J66k53L97l90K90j07J4j21J25r9J68
2831A36j84Mj09n3M63k92K28j61p6J93j83J59k23o4J16L99m53K50k79J35m6j4
2853e4j26K73K15l45o2J23n0K06k22O1j13L62o49P8N19l17M31l46L1j10J80M9
2875A34O3K13k33K1j64o7J9m10K23K13n4J51q6k23M18k87P7l50K96Q3K2j53J37
2898D3J10l56J27J71k13J66j82J44K0P1n3Q1k01L21j31j59n3Q8qo4O5Mj04K6K34
2923A47r3k49K62K3n5L4k29K25l0j75P8n6Q7L68k57k85L12k18j93M31j51K8m1
2946c7K70k62j89M23j41o4k43L91j78j17L18p5o9k35J10J94n1k06P2Q4r1n5L86
$$ plain form
2788 -292 970 230 508 -206 146 -53 897 -307 -198 93 104 -306 -173 -389 47 -162 -225 196 -99 97
2808 97 -127 70 -182 88 47 -87 -77 -51 -61 73 15 -54 112 -141 256 -134 156 49 63 -58 67 -32 136
2831 136 -48 -44 -153 -206 257 -35 193 32 -44 149 -34 125 -98 -162 -46 353 -100 150 -129 6 -40 -54
2853 -54 -180 93 308 -37 -99 24 -26 180 -42 19 -94 268 -381 -303 216 -101 330 -16 15 -95 85 134
2875 134 197 410 177 198 34 -33 -14 -424 -201 12 -42 109 23 -200 218 -69 8 -342 -46 37 59 -94 43
2898 43 153 -203 -76 95 -118 48 -134 10 30 101 48 129 -72 249 118 -41 -94 -6 -14 -78 -13 -9 -113 -87 147
2923 147 54 -195 67 90 35 69 -160 65 35 -140 -62 -118 -31 337 80 -205 107 -111 -304 127 -24 4 -37
2946 -37 233 -29 -218 205 64 0 -243 148 -30 -147 171 96 27 -208 -98 96 45 -161 -89 -5 -96 -151 235
2969B35p5k65m5J08Q8q9j41K5M20m19P8Lp4M2Q6j4N3K9J57n1m34K46J72k22k8
2994a15p9J12J70k70K05k27J53n3J33j15J09J11j42R5l8l68J90Q5j11K71p2j88
3016a44j98M45k50J45r8N82n48k41L17n2J1k63M79l25K79k30L35p6k63Qj7K90
3038A86j38l1j93j46N1M76j40k10N3J73k9j47R3N1m8J75k37p1o3L46j71j12Q8
3061d4n2J35j6K0K93l05j10J96j96P3J21j23j04J26k5k04L14j06J14r4Q5q4j92
3084a78m3J98J40k4j84J83j39Q0K6r1J0J53m38K6L06Kj63J9L44j43k68pK41L7
3108H7l1J4J50k37N6J63k48J59M9q1k41K05j60K35J42m65K69j81n2j51L18J65
3130A65k29j00M87k89J34j16O4P6m00K86j91J02j78J37k19M1L63k13R4J46j46
$$ plain form
2969 235 160 -105 -150 -42 46 -43 -184 -159 261 -158 -80 -77 -151 -109 -23 -37 16 45 202 151 -283 -37 135 -87 -115
2994 -115 -194 -82 88 -182 23 -204 -51 -104 29 -86 23 134 -8 87 49 -319 -129 -44 -155 116 44 -144
3016 -144 -342 103 -147 -2 -100 482 -66 -307 10 -42 -31 -294 185 -140 139 -91 244 168 -95 -87 -104 186
3038 186 48 17 -176 -322 -271 205 65 -145 -92 81 52 -95 -2 49 1 176 -61 -132 -195 151 -20 -132 -44
3061 -44 -96 39 23 43 336 31 -79 117 -79 -6 115 -8 -112 14 -11 -215 99 -7 107 13 98 14 -178
3084 -178 -221 -23 117 93 -91 92 -47 33 59 -32 -22 131 -307 -281 25 27 -136 -117 227 84 -184 -191 50 87
3108 87 56 70 220 -17 39 202 -46 113 162 81 -160 45 -115 120 262 -203 66 -115 -167 -318 0 165
3130 165 -64 -164 323 34 168 52 116 192 -208 78 -113 -11 -189 -52 -271 -230 133 -80 14 160 14
3151A4j04J96j24Q1j27K46j1j22j26K4l9m0L59r4j35J97k76R2l6j33K80Lm37M12
3175A00m2L4l14L14m4k35K48p5K32M5m33l3M19mm6P0l29R1R9m4J02k17J41k27
3199a48K75O0k90L29k95J87n1l32L13L9k1q5N7k30K33Mm35N23p1l2J63N0j53j48
3223e8N2m2o8K05k52K25j04J00j55J9j75M22k67N7J36M5k30J10L13l60Q5J37p7
3246A18m77M83r2p1K54m38M28o33N3P39m18l04L11L73n89N39O08q88M4Q3p1J93
3268B45O61j101J401j485K72J45N89j67n35l51Q80j85m29K7O1k03m0r6N20J02
3288C11j5n35L36o88O96j86K39k26N8l38J67O7k35N81l57O20o82K99K75l59M68
3309D96p12j87R54n02j86j71J0Q6K21K47m76Q3M8K68j47j0K05k26k53J77K2L25
$$ plain form
3151 14 -90 106 -18 63 -64 182 171 49 -77 -53 -92 -132 227 133 -2 195 -81 11 -25 -158 122 125 -312 100
3175 100 58 92 -222 92 48 -187 61 -14 218 263 -170 -203 216 212 166 236 -93 -2 97 53 155 -62 79 -148
3199 -148 127 187 -103 226 -69 118 67 -265 48 87 66 -19 38 -192 41 45 -390 133 62 30 193 243 90 -58
3223 -58 -6 -48 -116 89 -163 62 -42 58 -97 -78 -253 169 -98 -41 95 140 -90 20 333 -27 58 195 118
3246 118 -359 124 32 -39 215 -223 205 -428 -375 364 -54 -358 -47 326 -263 276 884 -4 40 123 52 245
3268 245 906 -195 1206 -279 -7 138 727 560 25 -326 554 369 -60 -33 28 -175 -215 -311 209 311
3288 311 296 -239 97 -591 105 -81 158 -68 -10 -348 -181 -114 -349 232 -125 495 -187 112 387 28 496
3309 496 -216 -403 551 49 -137 -308 -298 -212 9 256 -220 -137 -89 179 32 22 227 1 -252 -75 -53 272
3331B72k73k16K26n5k69M19k01M91m47J73j10J63k63J47r2J88o7n0P8j70K4J31
3353I9l79K43j0qK58j31l01N8L29j59J20k38N7n8J34o8J04n8O4K1r1R4J8n5l49
3378c06K49j22o2J16n9k8K96j25Q5K0r1L39l51L6j8r6L12m87L27K03j47k20j6
3401a45N5nNJ01K88j43j97J03n6J45l22RL25k58K74l27K68L8N2j89k20K04r1J44
3425E8J10j10j17Pp3M6J78j13k65J85J43R2j67j07oR7J67q1l7R9j46R8J1l75K92
3450a4L9P7n7l10L32j48m4J81n9J71k16j75K19j3P4k33K09J35k11l3o9J65n8P3
3474C5j63K42j65M3K27l13J63m4Pm5k5p3l3O9j62K73r9J71J66l13r3m7Q0L45m09
3499a63J03J7O8K49k1k68j3J19r5J57j09J22j20k2K1jJ58j37k68p8M37P3j23r3
$$ plain form
3331 272 -1 -217 9 -46 -315 104 -97 394 -53 120 10 173 -90 57 -35 153 86 36 114 -56 -32 99
3353 99 -280 -37 -47 -55 203 72 -229 -171 158 -1 119 -119 -62 -120 14 -54 50 -8 56 77 -14 80 98 43 -306
3378 -306 -57 -179 -241 -125 -184 -212 84 -41 44 64 -27 312 -39 -3 -21 -117 195 -292 35 238 91 -129 -145
3401 -145 -90 -95 -90 11 299 156 -41 62 6 151 -171 -162 163 -95 179 -148 120 158 210 21 -199 5 -86 58
3425 58 168 58 -59 -52 -125 -79 99 -14 -279 -94 49 141 -26 -133 -139 -42 125 44 7 106 -40 58 69 -306 -14
3450 -14 25 102 45 -265 67 -81 -125 56 -3 168 -48 -223 -4 -17 57 -176 33 168 -43 -76 -145 20 -38 35
3474 35 -128 114 -51 -8 219 -94 69 25 32 -13 -38 -111 -144 -75 -237 36 -63 108 274 -39 -132 -179 -99 246 -163
3499 -163 -60 -43 25 274 253 -15 -28 91 -4 153 44 166 46 24 45 44 202 65 -203 -281 156 229 106 13
3523A3k83J96j55L16p2j20k80N73k68p9J1L41Jj81Q7j93J74n2m1j76K69J07k44
3546e6p4K99q0J03j73P1l20L77l20J46j15K82l00J10O3MN8J01r9k06J72j26J01
3569A8j63j17K34j59J18J22j11j94L26p6k31K4M46n48J86k5K53j76Q0n9l27N34
3591A55k43J53r4J68m0J06J6j83K6L0p4q8p3J74K75l22Pk7o4k0Q9M6k71K24J04
3616G4j43n9J05K58l0L7m40N2L49pl26R6pj73Q1J41k0K2J35k47j31K07K74l63
3640a15J04O7j82K57q9l42L80k92Q5r6J66J14k49J97K22k70j24J66k67J39J9l5
3662a45L22j90J29kp4Mo7l2J20l47K10M6j4J40L8L01m88k15J70J22j21J84j5j58
$$ plain form
3523 13 -270 -74 -229 87 15 -105 -385 188 -80 -159 -148 193 194 13 100 -93 81 29 -12 -188 81 188 -56
3546 -56 -130 169 89 192 19 90 -230 147 -173 -27 -142 140 -160 -50 13 17 75 176 77 -129 43 -83 18
3569 18 -145 -262 -28 -187 -69 53 -58 -252 74 -2 -233 -209 237 -311 -125 -150 103 -73 7 -52 -379 155
3591 155 -88 65 -29 139 99 205 221 38 64 94 20 -68 -141 33 308 -14 -7 -34 -98 -118 -29 17 -254 -30 74
3616 74 -69 -128 -23 235 205 242 -198 -146 203 196 -130 -34 -41 -214 -133 8 -12 10 145 -102 -233 -26 248 -115
3640 -115 -11 56 -126 131 42 -300 80 -212 -127 -223 -57 57 -192 5 227 -43 -167 -1 -268 -129 -110 -145
3662 -145 177 -13 116 114 40 44 -23 -55 65 -282 -72 -26 -40 100 138 439 -49 -264 -94 28 -93 91 76 -82
$$ [...]
8191a29
##END NTUPLES=NMR FID
##END=
