##TITLE=1H_SL73(28.09)-Ag-f3
 CDCl3, 8 sc, 
 29.9.2020
##JCAMPDX= 6.0         $$ Bruker NMR JCAMP-DX V2.0
##DATA TYPE= NMR FID
##DATA CLASS= NTUPLES
##ORIGIN= UXNMR, Bruker Analytische Messtechnik GmbH
##OWNER= root
$$ XWIN-NMR		Version 3.5
$$ Tue Sep 29 10:20:29 2020 Russian Standard Time (UT+4h)  she@DPX200
##.OBSERVE FREQUENCY= 200.1315066352
##.OBSERVE NUCLEUS= ^1H
##.DELAY= (6, 6)
##.ACQUISITION MODE= SIMULTANEOUS
##.ACQUISITION SCHEME= undefined
##.AVERAGES= 8
##.DIGITISER RES= 18
##SPECTROMETER/DATA SYSTEM= spect
##.PULSE SEQUENCE= zg30
##.SOLVENT NAME= CDCl3
##.SHIFT REFERENCE= (INTERNAL, CDCl3, 0, 15.7039)
##AUDIT TRAIL= $$ (NUMBER, WHEN, WHO, WHERE, WHAT)
$$ ##TITLE= Audit trail, XWIN-NMR		Version 3.5
$$ ##JCAMPDX= 5.01
$$ ##ORIGIN= Bruker BioSpin GmbH
$$ ##OWNER= she
$$ F:/spectra/data/she/nmr/H-F/1/audita.txt
$$ ##AUDIT TRAIL=  $$ (NUMBER, WHEN, WHO, WHERE, WHAT)
(   1,<2020-09-29 10:19:29.93 +0400>,<she>,<DPX200>,
      <created by zg, POWCHK disabled, PULCHK disabled
       configuration hash MD5:
       00 E9 B6 7A A2 85 ED C7 34 08 36 98 17 FE 4E 26
       data hash MD5: 16K
       04 CA 06 4C D3 0F 47 88 68 27 4E BF 56 CB 1A 5E>)
$$ ##END=
$$ 
$$ hash MD5
$$ 3E 6E 1B FC B3 3F 60 A5 89 2C 45 E6 2A 12 32 BB
##$RELAX= 
##$RELAX= 
##$RELAX= 
##$RELAX= 
##$RELAX= 
##$RELAX= 
$$ Bruker specific parameters
$$ --------------------------
##$DU= <F:/spectra>
##$EXPNO= 1
##$NAME= <H-F>
##$PROCNO= 1
##$TYPE= <nmr>
##$USER= <she>
##$AMP= (0..31)
100 100 100 100 100 100 100 100 100 100 100 100 100 100 100 100 100 100 
100 100 100 100 100 100 100 100 100 100 100 100 100 100 
##$AQSEQ= 0
##$AQ_mod= 1
##$AUNM= <au_zg>
##$AUTOPOS= <>
##$BF1= 200.13
##$BF2= 200.13
##$BF3= 200.13
##$BF4= 200.13
##$BF5= 200.13
##$BF6= 200.13
##$BF7= 200.13
##$BF8= 200.13
##$BYTORDA= 1
##$CFDGTYP= 0
##$CFRGTYP= 5
##$CHEMSTR= <none>
##$CNST= (0..31)
1 1 145 1 1 1 1 1 1 1 1 1 1 1 1 1 1 1 1 1 1 1 1 1 1 1 1 1 1 1 1 1 
##$CPDPRG= <>
##$CPDPRG1= <>
##$CPDPRG2= <>
##$CPDPRG3= <>
##$CPDPRG4= <mlev>
##$CPDPRG5= <mlev>
##$CPDPRG6= <mlev>
##$CPDPRG7= <mlev>
##$CPDPRG8= <mlev>
##$CPDPRGB= <>
##$CPDPRGT= <>
##$D= (0..31)
0 1.2 0 0 0 0 0 0 0 0.06 0 0.03 0 0 0 0 0.0002 0 0 0 0 0 0 0 0 0 0 0 0 
0 0 0 
##$DATE= 1601360369
##$DBL= (0..7)
120 120 120 120 120 120 120 120 
##$DBP= (0..7)
150 150 150 150 150 150 150 150 
##$DBP07= 0
##$DBPNAM0= <>
##$DBPNAM1= <>
##$DBPNAM2= <>
##$DBPNAM3= <>
##$DBPNAM4= <>
##$DBPNAM5= <>
##$DBPNAM6= <>
##$DBPNAM7= <>
##$DBPOAL= (0..7)
0.5 0.5 0.5 0.5 0.5 0.5 0.5 0.5 
##$DBPOFFS= (0..7)
0 0 0 0 0 0 0 0 
##$DE= 6
##$DECBNUC= <off>
##$DECIM= 32
##$DECNUC= <off>
##$DECSTAT= 4
##$DIGMOD= 1
##$DIGTYP= 9
##$DL= (0..7)
0 120 120 120 120 120 120 120 
##$DP= (0..7)
150 150 150 150 150 150 150 150 
##$DP07= 0
##$DPNAME0= <>
##$DPNAME1= <>
##$DPNAME2= <>
##$DPNAME3= <>
##$DPNAME4= <>
##$DPNAME5= <>
##$DPNAME6= <>
##$DPNAME7= <>
##$DPOAL= (0..7)
0.5 0.5 0.5 0.5 0.5 0.5 0.5 0.5 
##$DPOFFS= (0..7)
0 0 0 0 0 0 0 0 
##$DQDMODE= 0
##$DR= 18
##$DS= 0
$$ [...]
##$SUBNAM2= <"">
##$SUBNAM3= <"">
##$SUBNAM4= <"">
##$SUBNAM5= <"">
##$SUBNAM6= <"">
##$SUBNAM7= <"">
##$SUBNAM8= <"">
##$SUBNAM9= <"">
##$SW= 16.880792210976
##$SWIBOX= (0..15)
0 0 2 0 0 0 0 0 0 0 0 0 0 0 0 0 
##$SW_h= 3378.37837837838
##$TD= 16384
##$TD0= 1
##$TE= 0
##$TE2= 300
##$TE3= 300
##$TEG= 300
##$TL= (0..7)
0 120 120 120 120 120 120 120 
##$TP= (0..7)
150 150 150 150 150 150 150 150 
##$TP07= 0
##$TPNAME0= <>
##$TPNAME1= <>
##$TPNAME2= <>
##$TPNAME3= <>
##$TPNAME4= <>
##$TPNAME5= <>
##$TPNAME6= <>
##$TPNAME7= <>
##$TPOAL= (0..7)
0.5 0.5 0.5 0.5 0.5 0.5 0.5 0.5 
##$TPOFFS= (0..7)
0 0 0 0 0 0 0 0 
##$TUNHIN= 0
##$TUNHOUT= 0
##$TUNXOUT= 0
##$USERA1= <user>
##$USERA2= <user>
##$USERA3= <user>
##$USERA4= <user>
##$USERA5= <user>
##$V9= 5
##$VALIST= <valist>
##$VCLIST= <CCCCCCCCCCCCCCC>
##$VD= 0
##$VDLIST= <DDDDDDDDDDDDDDD>
##$VPLIST= <PPPPPPPPPPPPPPP>
##$VTLIST= <TTTTTTTTTTTTTTT>
##$WBST= 1024
##$WBSW= 4
##$XGAIN= (0..3)
0 0 0 0 
##$XL= 0
##$YL= 0
##$YMAX_a= 271609
##$YMIN_a= -241651
##$ZGOPTNS= <>
##$ZL1= 120
##$ZL2= 120
##$ZL3= 120
##$ZL4= 120
##$ABSF1= 10
##$ABSF2= 0
##$ABSG= 5
##$ABSL= 3
##$ALPHA= 0
##$AQORDER= 0
##$ASSFAC= 0
##$ASSFACI= 0
##$ASSFACX= 0
##$ASSWID= 0
##$AUNMP= <proc_1d>
##$AZFE= 0.1
##$AZFW= 0.1
##$BCFW= 1
##$BC_mod= 2
##$BYTORDP= 1
##$COROFFS= 0
##$CY= 11.3945322036743
##$DATMOD= 1
##$DC= 2
##$DFILT= <>
##$DTYPP= 0
##$F1P= 16.9975609425685
##$F2P= -3.02152046262296
##$FCOR= 0.5
##$FTSIZE= 0
##$FT_mod= 4
##$GAMMA= 1
##$GB= 0.15
##$INTBC= 1
##$INTSCL= 1
##$ISEN= 128
##$LB= 0.24
##$LEV0= 0
##$LPBIN= 0
##$MAXI= 10000
##$MC2= 0
##$MEAN= 0
##$ME_mod= 0
##$MI= 1.114404
##$NCOEF= 0
##$NC_proc= 0
##$NLEV= 6
##$NOISF1= 3.799351
##$NOISF2= 2.8
##$NSP= 1
##$NTH_PI= 0
##$NZP= 0
##$OFFSET= 15.70392
##$PC= 1
##$PHC0= -9969.02
##$PHC1= 10.00089
##$PH_mod= 1
##$PKNL= yes
##$PPARMOD= 0
##$PSCAL= 0
##$PSIGN= 0
##$REVERSE= no
##$SF= 200.130013532006
##$SI= 16384
##$SIGF1= 3
##$SIGF2= 2
##$SINO= 400
##$SIOLD= 16384
##$SREGLST= <1H.CDCl3>
##$SSB= 0
##$STSI= 0
##$STSR= 0
##$SW_p= 3612.71676300578
##$SYMM= 0
##$S_DEV= 0
##$TDeff= 0
##$TDoff= 0
##$TI= <>
##$TILT= no
##$TM1= 0
##$TM2= 0
##$TOPLEV= 0
##$USERP1= <user>
##$USERP2= <user>
##$USERP3= <user>
##$USERP4= <user>
##$USERP5= <user>
##$WDW= 1
##$XDIM= 8192
##$YMAX_p= 0
##$YMIN_p= 0
$$ End of Bruker specific parameters
$$ ---------------------------------
##NTUPLES= NMR FID
##VAR_NAME=  TIME,          FID/REAL,        FID/IMAG
##SYMBOL=    X,             R,               I
##VAR_TYPE=  INDEPENDENT,   DEPENDENT,       DEPENDENT
##VAR_FORM=  AFFN,          ASDF,            ASDF
##VAR_DIM=   8192,          8192,            8192
##UNITS=     SECONDS,       ARBITRARY UNITS, ARBITRARY UNITS
##FACTOR=    0.000296,      1,               1
##FIRST=     0,             0,               0
##LAST=      2.424536,      0,               0
##MIN=       0,             -241651,         0
##MAX=       2.424536,      271609,          0
$$ Real data points
##PAGE= N=1
##DATA TABLE= (X++(R..R)), XYDATA
$$ [...]
1866e67J940k195O55J871k628P24J385j542P16K73r06K94O44J80j306P09O50j226
1884c29J131L61k471K227N81k234J558m42j266J859j89j255O58j20N3K04k02l46
1902b22m34J631m85j859J819p10o90K013j479j226K506j213k05Q22j334J86J180
1919C00l50n36j84O89k91n41J560j483m16K491k124J84J344k169J392J230k326
1936a230J009O97j016R05l63j77P6M06N11j489N35J270j465J036M89k603K280
1953H71O19k265J595n22j002K066o93j096Q08p8K78l16J54l13n55J350j75j824
1971a098J875o88n97J939j971n83J922r54j87P94j484O85M27m3l47l44P20k61
1989a95l10R39j676L13K071k165K59J201j781J356P78k193J137K59n39O06k53
$$ y = [-567, 1373, -822, -167, 1704, -924, -200, 1185, -357, 359, 632, -274, 20, 664, 844, -462, 247, 897, -329, 802, 1163, -1308, 919, 1500, -734, 824, 382, -884, 975, 786, -469, 189, 69, 122, 326, 124, -222, -656, 975, 490, -1369, 450, -260, -950, 1063, -416, -1642, 864, -349, -554, 268, -1066, -880, 300, -50, -586, -770, -81, -372, -913, 647, -836, -1252, 1239, -885, -701, 643, -1526, -134, 1096, -1230, -221, 476, -540, 365, 2, -175, -99, 307, 818, -671, -136, 1134, -331, 705, 1194, -1409, 871, 1490, -775, 820, 298, -704, 1362, 669, -427, 381, 303, 581, 265, 419, 106, -449, 901, 726, -1098, 777, 89, -508, 1431, -540, -1123, 799, -155, -342, 452, -1032, -347, 80, 37, -310, -654, 66, -195, -505, 434, -1242, -929, 1142, -1023, -764, 437, -1344, 12, 790, -1403, -266, -7, -546, 60, -193]
2006a93l05K56K96O35j516N86Q08j074J283n7k028J918K88j560J219k96q09J673
2024A124p44o19M66K0M88n97K88k28l97J382n63j362J688o80n94J893j597l39
2042c71J376r94M5M48n76k06P00J14q12j99Q26n18m49J085j341J83J630j761J63
2061f57J015j179Q09L18j153M03M41m59K06P4j09k37L50K52r38M17R38j438J323
2080C76j18j299J036K46j123J014J52r29O45K30m68L36L64m30j10M32k29l97J099
2099H27l46r76J404n53p39J216o82m62J067l97m01N33k63p6K79J91q44L80M62
2118F20n98j23R65j178%J080j116J15Q09r30K53M85p12k27M32r8l62M92k9n83
2138g05P72p7j044N42O66j092Q05p8p48P77L86r37N92L68o44J28P50j135N36L52
$$ y = [-193, -498, -242, 54, 689, -827, -241, 567, -507, 776, 719, -1309, 609, 897, -663, 556, 260, -549, 1124, 380, -239, 227, 247, 735, 138, 426, 198, -199, 1183, 620, -742, 946, 266, -328, 1565, -32, -371, 1005, 11, 56, 504, -72, -278, 422, 536, -276, -475, 351, -167, -616, 469, -872, -689, 941, -820, -657, 358, -821, -12, 306, -847, -444, -3, -462, -256, -182, -291, -528, -178, 74, -864, -447, 491, -947, 376, 258, -1041, -5, 241, -882, 132, 284, -645, 0, 230, -238, 98, 462, 32, -78, 354, 125, -272, 827, 481, -495, 909, 356, -383, 833, 151, -311, 756, 359, -42, 491, 228, 152, 431, 622, -222, 158, 620, 22, -101, 864, -314, -314, 766, -350, -235, 574, -356, -103, 382, -330, -557, -125, -223, -585, -93, -122, -705, 67, -10, -1054, -512, 154, -938, -133, -211, -959, -182, 204, -733, -141, 227, -417, -289, 461, -674, -138, 214]
2158B14n34o1O61m63j74Q32j31p82J072m27m96J051j96q58O76K7p24P73J49o74
2178f5M13K62p84J78Q47q09J03P48j160L11P17q29j69R25r14MQ35m11m90M71K3
2199B06p05Q83j43p60M71J90o39N61o2p65P35J30q91M61N59p76L46O73j071J29
2219d68N50p17K05P07q08l47J139o06k81R96l24n77R95j79o88O55j43m07N27n7
2239A72p78N47N31q11L47M64n63K44N79o51P9N54p63k1O97p51J89O44o63L3M58
2260E37k92m55Q29k79o01N54l1n94O19l0p49R40m0r73P87O3o57L55J14l05J31
2281g7K45o44n6P36l26k06K47N0q29J146n75l97R38n02l75Q57m22n68J140m87
2301a05k74O37m16j61M86N6q20J39Q36q01K23J034j372K43J316j433J63R80j108
$$ y = [214, -320, -381, 280, -183, -357, 475, 344, -438, 634, 207, -289, 762, 566, -292, 384, 411, -313, 460, 609, -65, 348, 610, -174, 4, 851, 42, 145, 893, -267, 44, 761, -68, -237, 688, -226, -222, 613, 202, -288, 183, 206, -499, 384, 241, -519, -48, 142, -497, 64, 2, -763, -28, 102, -789, -328, 231, -545, -199, 474, -597, -468, 82, -635, -430, 277, -531, -878, 261, -345, -626, 370, 46, -531, 464, 285, -403, 252, 109, -298, 229, 172, -606, -59, 472, -339, 8, 472, -91, 153, 732, 81, 160, 714, -49, -70, 627, -124, 65, 709, 46, 79, 537, 245, -210, 619, 340, -261, 293, 262, -332, 287, 257, -492, 448, 408, -565, 222, 285, -372, -17, 97, -208, -77, 168, -476, -532, 204, -122, -328, -81, -31, -860, 286, -289, -686, 252, -250, -625, 232, -190, -758, 382, -105, -379, 258, -158, -319, 167, 223, -597, -458, 378, -423, -200, 834, -538, -295, 1021, -412, -249, 731, -377]
2320c77K01Q16r97M12L15M1M1pk07k27N72O4j026P33M37j275J008J38j398J231
2340D95n1q08Q40k37n82N23L31n69m67P18k44m51Q09m32m95J198n93r37J368q34
2360d18j78J137j049m9R86q56O4p6O8J5J90L96o59k07J166q51o4Q96j415L72J487
2381I55j532L39Q19j175R03K74p93R9J70J6L0J00jl74N71L10j240J007L74j255
2401d03J287k85j281J367j64q80R08j90m59N96j85l65j55N05J75p60Q51l54o51
2420d43J344o98r14J445j258m7J224j177j46R43k88j05k4k41M12j85L89p80m08
2439i57J513j102K76O54j437Q24Q49j417O91L50j000R20n6p33L61J38M01m42O6
2458a01L10n79O67K28j207Q66K00q35J351n55j051J542l47r03J011p10J89L06
$$ y = [-377, -176, 640, -357, 55, 370, 411, 452, 445, 238, 11, 583, 647, -379, 354, 791, -484, 524, 662, -736, 495, 444, -364, 476, 239, -343, 180, 511, -58, -525, 193, -51, -502, 307, -125, -620, 578, -15, -952, 416, -418, -596, 541, -508, -557, 429, -427, -363, -439, -371, -356, -166, 230, -429, -636, 530, -321, -385, 511, -904, -532, 955, -577, -238, 581, -594, 309, 583, -210, -111, 59, 75, 105, 205, 204, -170, 401, 711, -529, 478, 852, -403, 884, 599, -682, 685, 521, -359, 549, 359, -100, 496, 311, -54, -209, 296, 471, -289, 562, 208, -443, 901, 203, -711, 734, -524, -571, 653, -524, -670, 273, -15, -120, -144, -385, 27, -158, 231, -549, -957, 556, -546, -270, 384, -1053, -229, 620, -797, -106, 244, -756, 164, 108, -625, -264, -126, 275, -167, -101, 209, -370, 297, 525, -682, 184, 384, -451, 900, 345, -706, 836, 489, -414, 597, -113, 76, 382]
2476C82j5j74l18P23l98k74O61n63m18J432q69p11J120p07k40Q48q31K96M70k25
2496A89m74P9j93M51j13L05l79l29J026q45M9L43q13P34L92j317Q31Rm15K14K63
2517Gn46L85J32M0k68j10M99n97P31j08r81Q96M76r29P79k25p42Q65l40l38N78
2538B04l1k26k1L80l19R0K39p3n20N57m33m6R46q90q7Q64n23k7O75p97j79P50
2560E33j37j79m5j09j54J98K99p65M03L47o39Q3M73o04J35O34p70L06K69p57L79
2581a00K24l54j07M78l87k20M94k38k97M90r4n35P50k03n12P69m7o45O13L8m37
2602c20K86O3k08N8K66m15J01P00n67K7N23n55q1P16p30Q0M04j84l37O46l54J9
2624A38L71n05k30O36l99k34N39N3l50N12k43k65k08P88o29K41on40J93N35l84
$$ y = [382, 367, 193, -125, 598, 200, -74, 587, 24, -394, 1038, 169, -542, 578, -129, -369, 479, -352, -56, 414, 189, -285, -206, -399, 52, -61, 244, -135, -464, 562, -283, -234, 109, -704, 30, 422, -895, -64, -55, -470, -256, 7, -539, -154, -22, 18, -250, -360, 139, -458, 273, 165, -816, 80, 556, -373, 406, 181, -561, 304, -36, -374, 204, 173, -53, -74, 306, -13, 77, 316, 243, -277, 280, -153, -199, 747, -143, -230, 634, 111, 84, 759, -38, -217, 533, 396, 217, 172, 63, -91, 107, 406, -359, 44, 391, -248, -165, 308, -296, -161, 473, -297, 9, 278, -479, -100, 124, -230, -337, 141, -246, -466, 28, -210, -507, -17, -111, -646, 104, -99, -611, 158, 111, -534, 79, 117, -320, -34, 29, -179, -121, 145, -270, -169, 531, -36, -9, 514, -41, -122, 594, -136, -56, 348, 164, -173, 473, 119, 138, 509, 4, -226, 410, 11, -223, 316, 369, 19, 531, 288, 23, -185, 603, -26, 215, 209, -331, -138, 397, 13]
2645A3j6L00l43k68O06k45k89M70m86j2K77j28k92N87m26j10K99ln58N30Q7k83
2667b90J3J53Lj20M42n44n7M17m08K09M01k17l69P06n37j72N96j5m69N29j3l04
2689d6L38l01m75O82k2k60R6L87o94O53l0n37N90q9k42K56J77n08N6K28l14j3
2711f8M40l30j76L55k02m14O02l62p1M55j92l43M74k12l94M04j97k25K31L33k72
2732a64j37L31l65J6L91l06K9K16l10l6O63l04k57M48n83M6N91l45l46O08k03
2753a7j06J75q2k92J61L18l05J3L19l92K97K95n39J22O47r11N72J83n36O2M13
2774C97l53j93M84k28j40K04K29n35O18N1q96Q08j37k53M26o65j42O03p9m04M33
2795B28k51o7J3O4k81j15O64k77l18N08m97j95Q18m60k31M16k91j29M51j95k87
$$ y = [13, -3, 297, -46, -314, 292, 47, -242, 228, -258, -270, 7, -121, -413, 174, -252, -362, -63, -66, -624, -94, -7, -290, -277, -124, -121, -241, 201, -343, -400, 17, -391, -182, 219, 2, -367, 339, -198, -370, 226, 211, -258, 271, 258, -46, 292, -9, -484, 198, 176, -84, 12, 399, -295, 358, 328, -209, 381, 292, 50, 306, 483, -25, 31, 259, -55, -68, 372, 42, -134, 221, 19, -395, 207, -155, -226, 229, 37, -306, 168, -44, -438, -34, -231, -456, -225, 108, -164, -301, 30, -335, -319, 72, -234, -205, 11, -299, -335, 328, 24, -233, 215, -368, -322, 269, -76, -422, 186, -17, -123, 52, -30, -322, -161, 157, -148, -135, 184, -208, 89, 384, -155, -33, 614, -297, 275, 458, -78, -16, 397, 44, -149, 335, 107, -33, 171, 400, -135, 483, 534, -362, 446, 309, 56, 482, -183, -325, 278, 199, -205, 228, -23, -90, -77, -13, -294, -409, 255, -22, -340, 168, -329, -524, 294, -166, -397, 19, -272, -401, 50, -145, -432]
2816d32K8O59l32q5L17n33J23M49l73j24O99m96K05K10o89K43N15o55M52J46n84
2837b57M75r2j06j0JO00q25O29l04l26N51K29j031Q64N6o85P88m45n46P38k21
2858H3k26K46l80M86l41O14l36m45N04k3j36L38n05j97N18n49k34P46n42L94J88
2879B03k04l10K45J2J01k64K86l96J46M98o59j35R11p87K87Q1q10Q98K11o08K33
2900f1J18j52K72P0k33l19K53M6q1J05K60m49M68J31p87O15K3o89R59l59m57N60
2922B93j1k39m1P9J22k61J21q8l65Q37l72m32P30n95M2Q57q09j45P92o98J68J10
2944I5l37J43J60J25P8k20J70n48L20L36r19M19L63m56R4N00r02P89p9o04J61
2965c12k2J98J42j07k26J06J80L39o94K48K26l72O50j57p97P85j32k73N17l43
$$ y = [-432, -404, 255, -77, -162, 155, -378, -255, 194, -179, -303, 396, -100, 105, 315, -374, -131, 384, -271, 181, 327, -257, 218, 126, 20, 10, 11, 611, -214, 415, 111, -215, 336, 565, -466, 398, 454, -231, 557, 112, -434, 304, 83, -143, 103, -277, 209, -132, 482, 146, -299, 205, 182, 46, 384, -121, -318, 200, -349, -583, 163, -379, 15, 203, -1, -311, -66, -54, 47, -217, 69, -327, -181, 317, -342, -477, 434, -353, -66, 15, -795, 103, 314, -294, -61, 57, -95, 177, 247, 14, -305, -52, -6, -87, 18, 278, -171, 297, 428, -359, 256, 279, -410, 549, 190, -267, 293, 282, 43, 2, 81, 203, -58, 63, -25, -390, 447, 75, -357, 373, -222, -180, 677, -132, -277, 515, -183, -15, 95, -242, -99, 61, 186, 264, 44, 214, -334, -14, 322, -597, -178, 185, -271, -177, 323, -579, 210, 131, -473, -312, -334, -136, 6, -101, -327, -221, -41, 298, -396, -148, 78, -294, 356, 199, -598, 187, 55, -218, 299, -44]
2985d4l27Q40k59j97j72J48lp1L85k67k61Q19m98k80P17o88J31P78o75r1M12n27
3007a30K63K14l85PM36k16n81M71J37m74L08J37n54L41L38n57K88Q6l51m2N11
3028B47m94R0L64l96P2j97m1J37Q2L94o34M25k10m54P44p5m30O35j48l35nJ54
3050g5l6L14L6m90K78J22m19K87L44l49j24L64j93KR3J3k46M18m1m08M03l59J82
3073A16K40k61k67L92K55p08N68j39m07M30k3n04L26M8j77K43J28k54n5J39j08
3094a8o6L23k90j42L29k92l3K74k38k54M55l2m68O75k24j41K49p8k84J44J39l95
3116c67L39q1P3p3L80o90N04P3m78K24M9O2j89K41Q1j94M05l83j3J38q4j06L81
3139B92m1k67K50j07pK01R7o60O16k85k53M18k32j51J8M64l97Q8L07n05K05J29
$$ y = [-44, -371, 469, 210, 13, -159, -11, -14, -85, 300, 33, -228, 591, 93, -187, 530, -158, -27, 751, 76, -15, 397, -130, 133, 347, -38, -31, 405, 189, -392, 79, 216, -258, 50, 187, -367, -26, 312, -245, 43, 129, -222, -264, 247, -247, -157, 207, -189, -117, -314, -355, -218, -136, 258, -376, 49, -161, -615, 129, 54, -376, 259, 111, -224, -229, -75, -111, 203, 239, -251, 27, 149, -270, 17, 361, 12, -112, 252, 59, 61, 154, 167, -79, 339, 298, -110, 293, -66, 116, 356, 95, -172, 220, 475, -233, 335, 196, -211, 219, 196, -308, 18, 66, -111, 132, 260, 6, -49, 90, -18, -84, 239, -51, -193, 136, -156, -189, 85, -153, -407, 48, 16, -452, 223, -1, -142, 107, 29, -255, -111, 28, -367, -28, -109, -36, -109, 271, -419, 85, 158, -320, -96, -47, 15, -174, 67, 148, -46, 359, -24, -37, 101, 17, -89, 292, 251, -16, 234, 127, 120, 321, 418, -242, 374, 89, -164, 254, 22, -129, -111, 353, -44, 44, 351, -154, 51, 180]
3161A80j35j8L45l37k08J92l8k19L66k81m9L94j69k65K02j27j82L66k14J4K36
3182E3j60j29j32L89k18K25q9r7p2K34j12L6J06j30L0J57m95J55L71k15P3J81
3204A61j79l69K13L71o24L72L98m95K98L9j5j06J42m84K28M00l90M26j07k17j65
3225a03L72j45k49L0K42j95L36k22k60P09m47r4Q4Mj83K98k92j43L73k07O7r3
3247a18J02j32j30M95l49q2L22k99k63P20o11J57J68p5L5J75k16n1K15j34r6O
3269a61J28j34q4L46j32q2J90m15J63J36m5J47L34p25L22L09l47l6q2L64j15l4
3291D7N2k60M40j66r9L86l84O4K93q1l55M51k93%n3j09J61P3j12k00j60L80J34
3314B09l56K11k79o7O57l69l53O50n32L24Jk03j0R9k59J62K12j46M7m23K76o2
$$ y = [180, 45, 27, 372, 35, -173, 19, -19, -238, 128, -153, -202, 192, 23, -242, -40, -167, -349, 17, -197, -183, 53, -107, -236, -368, 21, -197, 28, -61, -158, -230, 4, -108, -72, 34, -96, -66, 91, -404, -249, 122, -93, -20, 161, -18, -387, -174, 197, -427, -55, 343, -152, 146, 185, 170, 64, 206, -278, -50, 350, -40, 386, 279, 62, -103, 269, 124, -125, -95, 147, -48, 288, 66, -194, 515, 68, -26, 58, 62, -121, 177, -115, -258, 115, -92, -25, -118, -16, -148, -278, 217, -132, -214, 108, -191, -454, 266, -345, -188, -20, -95, -60, 115, -101, -152, 63, -71, -167, -161, -33, -167, -251, 95, -37, -119, 71, -344, -181, -45, -90, 57, 391, -334, -12, 297, -50, -86, -168, 196, 81, 47, 99, -161, 279, 113, 14, 400, 16, 80, 373, 292, -63, 388, 95, 95, 42, -67, 94, 167, 55, -145, -305, 75, 209, -147, 64, -215, -282, 375, 6, -347, 303, -229, 95, 96, -107, -117, -18, -277, -115, 97, -49, -2, -425, -149, -211]
3336b11l9K66k43K43j86m04L89J15l18M55j98k94N96m8m09m0M29J9m3j72K02j09
3358@M4Q4l75M29Ok77L21j26l36M65L4j01J96k62j71L53l6k89O8J94j1k55O7j81
3382a59n1N47k67k84N02m67K1M53o13L76m0j22J56k75L15l89K67J29o9l19K49
3403d0k66K59L19n17q6N17l94K58k1j16K19k41j11O4J87j10m4m2J52k04M66J5
3425B64l63K14k17k96N76k07K0J24j34j98L21k32J38J57P2j87p6K48j21L4P4N3
3447B64k17L81n33rK18j49J72J25l35m2L47k59OK6j53P4n6K42k02q1K80q6J82
3470A95J24m66N8K63k44K35l19q9P2J11LJ15l23J61kJ20mn29N69J50n65L68L9
3493D2l91L67j05pL54j22m29M65l04K9K38m3k1l63L32lm6K81k11J03j7l0j78J38
$$ y = [-211, -250, 16, -227, 16, -170, -574, -185, -70, -388, 67, -131, -425, 171, 123, -286, -326, 103, 122, 79, -93, 109, 0, 44, 128, -247, 182, 188, -89, 232, 106, -230, 235, 269, 168, 364, 102, -69, 284, 248, -41, 27, 221, 210, -45, 22, -159, -210, 337, 70, -214, 288, -179, -158, 295, -318, 58, 18, -104, 52, -223, 92, -297, -30, 99, 30, -289, -40, -306, -47, 272, -245, -331, 186, -208, 50, 29, -87, 132, -109, -220, -156, 31, -79, -123, -165, -13, -217, 249, 264, -99, 115, -102, -398, 178, -29, -9, 115, -19, -217, 104, -128, 10, 167, 239, 52, -24, 224, 103, 137, 211, 264, 47, 428, -105, -114, 104, -45, 127, 252, -83, -125, 222, -37, -31, -5, -158, -84, -140, 102, -100, -181, 99, 13, 195, 319, -147, -89, 174, -70, 165, -154, -243, -171, -60, -57, 58, -265, -104, -106, 14, 10, -519, 50, 200, -365, 3, 42, -349, 18, -87, -94, 260, 138, -291, 174, -130, -101, 137, 94, 73, -290, 42, 39, -7, 274, 63, 166, 149, 119, -59, 79]
3517G9k03N24J13l88j23m7L24l57J46o6J09p1K9Rj6K47n27R1L56n15L37k1j90
3540a60p7L80n5qK49n30J34L78l35m5Q0N3l42K63J01l25N31j96l58K93n1l36N60
3563B04l87J35K88j02j77K5J59k80j51M44k91K6J71j94J48J32l39j8O12l56J55
3584B04l20K03M0J30j67p8K38k54j12K1N27l11J42j61l48J59K19p1j44N59m98
3605b2j39L29j42J60J2Q7l39J64j33J09kj51j27K52L7j4j40Oj99rM32m74M67k62
3629i8j11L92J14m54R6Mm0N6J51j48m19O68k78K05k25j35J59k06R7K17j40k86
3651c81J42K38p1k7L54k78M9Q5Lk18J28J53k1j54M60m45K9K87l54K25m4JK8j84
3675EJ13K8R6k29k01K59O6j6q8J02k93J68Nl96M31Q1l90M19k29n4nJ62k07oJ13
$$ y = [79, -124, 400, 513, 125, 2, -45, 279, -78, 68, 2, 111, 40, 69, 78, 62, 309, -218, -127, 229, -286, 51, 30, -160, -237, 143, 88, 80, 329, -201, -67, 311, -24, -69, 11, 64, -278, -15, 86, -239, 292, 96, -262, 31, -20, -356, 204, -183, -48, 240, 138, -39, -14, 145, -135, -286, 158, -133, -107, 64, -130, 18, 150, -189, -207, 405, 49, 204, -116, 87, 127, 257, 90, 12, 250, -4, -116, -95, 432, 121, 263, 102, -246, -87, 132, 61, -83, 476, -22, -161, 168, 26, 186, 198, 285, -54, 110, -23, 86, 84, -67, -194, 58, 95, 81, -59, -53, -252, -261, 171, -303, 164, -98, -209, 183, 297, -157, -61, -57, -97, -41, 110, -38, -457, 211, -67, 138, -87, -222, -63, -269, -172, 45, -95, -381, -239, -1, -72, -99, 255, -23, 26, 111, 114, -104, 24, 177, 156, 2, 462, 17, 46, 333, -21, 204, 160, 161, 189, 5, 118, 146, 242, 13, -188, 71, 137, 121, 33, 135, -158, 10, 15, -381, 50, 131, -259, 160, -69, -123, -128, 34, -173, -179, -66]
3700f6m4M4%m9j94N62m07Q0p8J74ML20o55K85j8J30j48K81k10k57L71P6l70J05
3724f4J22j36J60k7j9o8J70q7j14K47l98K90R3j00j54K41M8l44K90K2j89K7J43
3747A53j44L36k76j31K09j80P0k8M6k07M84l04J72M2j33p1j62J17J04l45N01m28
3769a75K16K62n50K02%j42J27L66m23J7k7R7j28R7j35O5j40L45l40L2K87n41M88
3792@J56k76J1K10k89K39j89j22M10k49K23k35K07J21k65J47k20k0K28J21m93
3813b85O91q4m68L64l81K99K17m40K1J92m28L22Q4J63k16j14K54l73j31M62l20
3834a71P9M30l87l2M6k38L48pm06M07k12K15j46k8j67L45j70n8k07J12N04p21
3856d64L41M01o01M41k49k86N63l59J08J38j03j12L86J3Kk65L2J30k61J01K19
$$ y = [-66, -110, -66, -66, -115, -309, 253, -154, -74, -152, 22, 26, 346, -309, -24, -42, 88, -60, 221, 11, -246, 125, 201, -169, -64, 58, -78, 82, 55, 36, -32, 138, 51, -63, 184, -214, 76, 169, 69, -85, 156, 204, -140, 150, 172, -17, 10, 153, 9, 345, 69, -62, 147, -33, 37, 9, 55, -152, 332, 28, 200, 242, 109, 38, -124, -7, 97, -248, 253, -175, 41, 303, -247, -45, -45, -187, -60, 306, -117, -100, -127, -30, -158, -61, -196, -131, -271, 74, -266, -234, 53, -488, 0, 156, -120, -109, 101, -188, 51, -138, -260, 150, -99, 124, -111, 96, 217, -48, 99, -121, -141, 87, 208, -285, 406, 322, -146, 218, -163, 136, 353, -87, -66, 126, -302, 20, 104, 267, 51, -63, 191, -182, -313, 149, -171, -92, 338, -49, -81, -35, -273, 75, 68, -338, 69, -143, 72, -74, -102, -269, 76, -94, -152, -359, -247, 257, -464, -123, 278, -323, 118, -131, -417, 146, -213, -105, 33, -70, -182, 204, 217, 219, -46, -14, 116, -145, -44, 175]
3877A75m89L85k06n1K17m9K2J83k17J22J87k10R2j60kQj17L7R6j28M78n23k14
3900c64N07k67rK56j44N9j39R9o7PJ24m04K74J14J65l08K63n52N33J6l14K66r7
3923A8j69J22j5M9J3l6j4k1K20j01j91J38K12l18K16j59o5J2j8l12L50J64l50
3946b55J99J20m4L66n26L7M2J82k6k50L74k70J7K06k01J38J86k49n7L00k84l1
3968b6L70k52j12O3p1N1R3q8J74l02P8M1L1N6q8O0m8k13J50O8k61J55J91k84L4
3993a30K89j17p1p4K47j09k02K7P7n1L6j1K46q6j99L08l00j23kpJ70J06o3N5J6
4018C2j5M2m7q9Q4j79R2L8L6J76p9q2J59k24j6J01l0L61j18j98M8R0l11NL68j67
4044G7j73M38j87l36J39J73m47L39j28l5K12K35k74N5N4r4k15R0J69m8r8j1J49
$$ y = [175, -314, 71, -135, -186, 31, -18, 4, 187, -30, 92, 279, 69, 161, 1, -1, 7, -110, -73, 23, -105, 373, -150, -364, 143, -124, -133, 123, -21, 38, -101, -2, -69, -62, 62, -342, -68, 46, 211, -97, 166, -386, 147, 163, -151, 115, 18, -151, -29, -44, 5, 18, -18, -32, -53, 167, 66, -125, 13, 225, -93, 123, -36, -101, -89, -107, -419, -69, 95, -255, -56, 64, 20, 386, -140, -103, -61, 121, 95, -155, 219, -51, -34, 172, -29, 109, 295, 46, -11, 289, 5, -26, 344, 92, -20, 43, -28, 23, 116, 28, 202, -100, -22, 19, 50, 106, 18, 78, 30, -183, -33, 35, -226, -71, 120, -164, -130, 159, 42, -29, -103, 144, 35, -167, -140, -63, -114, -78, -89, 157, 71, -128, 180, -120, -243, -245, -252, -82, 24, -39, 16, 32, 17, 59, 12, -77, 7, -172, -80, -42, -6, 170, 91, 9, 168, -56, -72, 29, -1, 360, 242, 44, 92, 182, -129, -124, 244, 77, -96, 342, 155, -181, -42, 131, -316, 23, -105, -140, 72, 307, 33, 88, 142, 48, -167, -77, 92, 44, -54, -65, 84]
4067H4j87K28j58n5K5N3j85J36j62K85J2j1r6j50J10j1kn4J66q2J10j86j03O8
4091a65j06K43j37M16j56o9n6l1J76rj90J71M8j34j13K7N8L45m14J10J57j07L21
4114C85l15M4L9k28L9J51N9J00j63k24n3K29L5k39J53M9j37m4J95r7p8K33J23
4137B56m30n7L61l87K37R7NL3J20m36M05k71j95J49o8M8M3m5k18L64j3l79M60
4160G9j89M8k21K5K73N3j38Qm0N8o7J28k54L66j20j3J47l06K09m2k20J52L4q6
4184a16K14M4k90J4K33R0Q4j88j48nK43K1k42J45j00m0K12k43k2L17k38r9Q9L32
4208C07k30Q9j86Q1j24K03o3k14L23j35k55J72k8j62L54j43q9j10j94L80J5j59
4230a68QL24L7m95L28R1l21J06J57k64O0J02j75K58M6k83M61m37N8J44j61J02
$$ y = [84, -103, 125, -33, -88, -63, -10, -195, -59, -221, 64, 76, 65, -31, -181, -71, -82, -84, -138, 28, -54, 56, -130, -233, -165, -271, -28, -165, 251, 95, 26, -30, -61, 115, 106, -84, 87, 135, 1, -112, -85, -27, 318, -96, 14, 171, 64, 385, 70, 114, 153, -75, -36, 115, 174, 274, 111, -113, -166, 63, 98, -141, 12, 61, -76, -120, 75, -22, -100, 133, 256, -174, -231, 130, -257, -20, 77, 82, 115, 235, -201, 204, -67, -262, -113, -181, -133, -90, -135, -353, 11, -2, -381, 79, -110, -62, -283, -258, 15, 68, -70, -62, -102, -44, -111, 17, -237, 129, 9, -4, 143, -163, 46, 4, -216, -64, -30, -116, 98, 142, -148, -134, 99, 189, 273, 85, -63, -68, 175, 196, -46, 99, -1, -41, 171, -72, -94, 223, -15, -114, -25, 307, 77, 166, -20, 61, -63, 140, 77, -137, 186, 51, -204, -32, -60, -222, 132, -11, -100, -210, -404, -24, -9, -168, -160, 164, 201, -294, 34, 125, -196, -90, 67, -197, -137, -35, -210, 48, 94, -189, 272, -165, -107, 37, -124, -22]
4252b2R3j40K73r2M7j24J82Q2j56k52J58N6j47M50l54J79k1k59J74n7Q6j38M6
4275F4j11J43k24l4J43k35L51qk82K72k27J01J96k44J56J09j95K17l03l6L69l99
4297a77K49o7j50K62j71P0p0J23r9J35m38L70j13j62L16j47l8J2q2J22p4J06l0
4320e3K8J79m6O0K8J13k62jJ96o11M78j00j78J82k4j3J73m8l18j0L13P1q3P8q4
4345F8k39N10p6n4N2k63%J25l46K27J34r7k12J06J25J42k64j4j62j2M51l31J2
4368a18O1j4m4kp8K68j29kj34K13K5q3m4J96l00J47j9j61J44Q7oj9k1l3J82j91
4394g5l08K82o2K24Q1l06K59O5j20q9K5L79k26j18J37k41r2K90k9L7J14k06K07
4417B28m6p1k02K12k4J5Q3j99O2j74K36k78K16j2l4R8j93j6Q9o5p5J31p4j64L04
$$ y = [-22, 71, -69, 204, 112, 159, 35, 217, 299, 143, -109, 49, 105, -42, 408, 54, 233, 212, -47, 127, 70, 156, 18, 64, -47, 96, -128, -162, -19, -254, 97, 89, -193, 79, -148, -47, 149, -95, 61, 170, -25, 192, -111, -147, 222, -177, 72, 5, -145, 117, -54, 16, -54, 69, -30, 105, -333, 37, -76, -238, 78, -69, -107, -95, -177, -55, -129, -23, -53, -25, 154, 108, 168, 196, 309, 47, 46, 242, -369, 109, 9, -169, 13, -11, -24, 149, 101, -217, -227, 86, 157, 74, 152, 68, -171, 339, 263, 209, 261, -2, -2, 123, -223, 4, 138, 41, -171, -65, 60, 202, -62, -76, -238, -250, 201, -130, -118, -57, -71, -115, -117, -195, 73, -56, -58, -192, 21, 46, -37, -81, 115, -185, -38, -57, -218, -74, 13, 7, -12, -33, -66, 116, -75, -383, -101, -163, 61, 142, -164, 95, 160, 40, -49, -24, 355, 129, 11, 148, -93, -185, 105, 76, 113, 227, 21, 228, 182, 111, -91, 121, 97, 112, 195, -4, 58, -116, 120, -158, 58, 46, 12, 110, -83, -99, -10, -75, -150, -19, -93, -257, 47]
4442D7K00j19p4j7l0j15K53j14rj60K14m27J89K79k90J45K5P5L0j16M6J45r6k64
4466a83N6K13r7j62K20J67l55J89j92K70J19k15q8j7K03l7j25J07k70L29n1k34
4488a53M57n17L9M09k11m5p6Q2J5L55l79N8j1j82J99P1k10j59K42K18l25q7K71
4511F1J05l14Q0m4J57J6j65J83j09Qk6o4n3o4j19L97j99K21k11l9K5j96N57j04
4535A03J6n3m83O35l90J78n2J75k70M26O9k58j48J7k9j5L8p2J20q4J54j17J03
4558F3p0K44pj19k83M16n35K79m2j43K63J33k49n0L64j57M0j30j56l3N30l10l9
4581Ik0M6n0J81k18J47p7m1LQ2k39K13N1k3p3k61K83n7m2J71k00n3J70k37K01
4606c4N0N3q2K5j69L89l83J38j75K70o7o7J02J55l36K83O3l50K33l42K29L3N3
$$ y = [47, 247, 128, 54, 37, 7, -108, 145, 31, 22, -138, 76, -351, -162, 117, -173, -28, -3, 72, 102, -14, 32, 177, 81, -183, -127, 86, -11, -173, 47, 214, -141, 48, -144, 126, 245, 30, -58, -75, 128, 91, -34, 73, -197, 132, 81, -153, 304, -213, -174, 235, 24, -21, -97, -15, 0, 355, -24, 34, 23, -159, 40, 111, -99, -258, -16, 202, -123, -210, 61, 166, -148, -68, -112, 45, 61, -104, 79, -30, -22, -48, -112, -165, -229, -348, 49, -150, 71, -140, -179, -154, -350, 207, 103, 119, 66, -417, 218, -172, 6, -46, 129, -141, 285, 354, 96, -52, -35, -64, -79, -41, -113, 7, -77, 77, -40, 63, -7, 237, 230, 111, -172, 244, -291, -12, -54, -197, 66, 199, -50, -100, 264, 107, 147, 17, -139, -172, 358, 48, 9, -11, 35, -15, 166, -52, 95, 18, -23, -20, 62, -177, 36, 87, 64, -9, -270, 13, -44, -86, 85, -115, -168, 2, -235, -34, 16, 69, -13, 12, -157, 232, -151, -13, -188, 82, 15, -52, 50, 205, -131, 152, 215, -135, 98, -244, -15, 18, 71]
4629G1j09NM81m27j1M3L6Nn1n6K2p3K31j37K79l97oJ95p5J75n2o2M4n9j53J07
4655B6n2K52l68L11j36jk40J71R5k82M3J92j21K31k27l1M27l52k3j25K35j42j18
4678b35P2N6P2o5N9J10p2o5r8M3n0K19J86j62j62M3K9K61k97n9N5J16o5Q1j80
4703a08J40l47M25j28K84M5j86l7L3k16J24J98k42K28j88j62pK40Km5l05K10J63
4726A21k34P2J53o8K64l09JL1J9qPj79K71J0j78J07k89Qp2L44j80J14p2p9LJ63
4752B0J66m51L33j29o9M5J45j05L08l43o4J49rM1J35j96n1j02L54j05j87J1J91
4775H7l44L45m26L11J84j25Q5Pk37L39j67KJ91l91J22K69l11N7o0P9J46j45j78
4798a60M63m04L31K7k94jK34j68p9J14k28L06j22J26m32L43k7n5N3J45m52M91
$$ y = [71, -38, -33, 448, 21, 10, 53, 89, 94, 43, -13, 9, -64, 167, 30, 309, -88, -94, 101, 26, 201, 149, 87, 131, 72, -81, 26, -26, 226, -142, 169, 33, 32, -208, -37, 58, -224, -181, 11, -110, 121, -106, -137, 290, -62, -85, -210, 25, -117, -235, -163, -107, -35, -100, -41, 69, -3, -68, -166, -123, -173, 46, 232, 70, -92, -49, -20, 241, -56, -115, -60, 56, -9, 72, -108, 32, -315, 110, -18, 266, 311, 125, 88, 121, -95, 29, 227, -15, 213, 25, -137, -144, 96, 98, 53, -252, -42, 121, -113, -41, 112, 44, 308, -1, 0, 31, 50, 42, 49, -130, 141, 151, -27, 80, -209, -201, -273, 71, -109, 5, -67, -146, -143, 20, 186, -265, 68, -61, -130, -85, 60, -45, 263, -80, -144, 5, -4, 37, 172, -24, -75, -177, 177, 72, -115, -104, 87, -257, 88, -338, -27, 157, 32, 117, 124, -113, 226, 59, 61, 252, -139, -17, 252, -59, -2, -62, 17, 163, 18, -160, 303, -101, 230, 257, -37, -38, 196, 28, -51, 63, -165, 141, 19, 145, -287, 56, 29, -26, 27, 172, -280, 211]
4820B11k44k9Q6j21j91K06K36l43K22k02K44j73p1J82j99j6K34j25rJ36l59M60
4842A35r5r8k8J75j3j65j71K83k9j53O3J43L1j8kp7n2J64j28l45M31J92l44N5
4866d6P7L5mK13l11j50J68K63p1r2M1m6J37l67L13k77J29j42R2J13l13K43M5o3
4890a3O9mK34l20j30R3j91L6J45j42k2M3%L68l12O8P2P5Q5j24j24j32K34J0qR
4916A9J3j08P2K85l99K6J01k6K08k35J60j15J67k81J95o0l8Q5n3k12J46K36M7
4939B33m2J48l47J12k71L55j74p5M3RMj1K67k98O8Oj26K6J24l9N8j52%J79k01
4964a04J26M8P4k78M3L27m25J54J9j62J18r3K78Oj72K8J1K0M3j85J07j46K82j18
4988AkP7k3m8q9j8O5qK19r9J15j75M0R5J99j70j39j43J79J93k28l5l4N2Q1j09
$$ y = [211, -33, -62, 24, -97, -288, -82, 154, -189, 33, -169, 75, -98, -169, 13, -186, -202, 32, -93, -102, 34, -325, 135, 40, -58, -86, 89, 76, -89, -260, 23, -6, -159, -96, 47, 78, 60, 58, -19, -71, 93, -35, -380, 51, 243, -101, -46, 31, 66, 62, 275, -36, -186, -18, 245, 174, 82, 123, 77, 214, -153, 160, -117, 12, -130, -38, 75, -238, 5, 50, -13, 56, 52, 286, -34, -164, -71, -262, -226, -81, -223, -245, -202, -202, 166, -146, -78, -6, 69, 154, 30, -94, -226, 8, 18, 10, 19, 32, -76, -4, 281, -118, -92, 9, -17, 191, -44, 116, 1, 168, -113, 82, 22, -16, 69, 16, -196, -50, 186, 233, 191, 339, -8, 104, -167, 188, 14, -61, -18, -9, -5, -16, 251, -47, 21, 27, -99, -73, 51, 12, 70, -82, -82, 97, -104, 22, 70, 144, -134, -91, 236, -189, -35, -16, -178, -60, -153, 125, 131, -41, -13, -2, 18, 61, -124, -17, -163, 119, 1, -1, 76, 53, 5, -84, -102, -37, -45, 174, 75, 190, 15, 55, 150, 349, 179, 40, -103, 76, 269, 41, 6, -28, 24, 105, -4]
5014dP7J31m80M09j78K8k36M31k04K09j19N0j77O1l0K13j20j20m2Q2N0k28O1N8
5038g8J23k8j98L26l79K20n6M9N9k79K48O4j62p2R0K66j59l26J11mK25L5k87J77
5062c5R2M4j19p3P0Qj22m5M08k68KJ12j24j17L14j99O6r2L01k56j45M07Nj9j67
5087D8kQ2J13k21K3k2P7k71M02j54R7M4l09J53k29J12K0J59r9j79O6J30K6J9N3
5112A38r1l6o4M4o0K19q7j9J62l55K70j23k81K09M3K9k39J65L56k84R6j13R4l25
5136b52L08P5k21J75Q2m8p1j94K2Q4K4k02K02q3R5k1Q5q1J46o3L3n6r6j69J41
5161h5q7R3K29l57J39K98k05N0j55l7J12N1K02q7j16K8j03k75J99L2j7M08j83
5184A34j83n1K4K52J49k79l1j16k04K51j06J32k2l71M27l8p3p5l3J90J67k46J35
$$ y = [-4, 73, 204, -276, 133, -45, -17, -253, 178, -26, 183, 64, 114, -63, -2, -32, 181, 61, -59, -101, -19, 31, -197, -136, -78, 45, 17, -181, 145, -234, -14, -70, -21, 38, -241, 7, 71, -91, -163, -73, 193, 34, -292, -181, -185, 40, 75, -212, -35, 57, 101, -18, -91, -21, -13, -135, -180, 228, -40, -38, 74, -50, -167, 147, -52, 14, -78, 223, -33, -178, 229, 234, 215, 48, 46, 128, 241, 20, 43, 21, 98, -173, 229, 75, 172, 216, -93, 60, -169, -57, -37, 122, 23, -156, -90, 40, 66, 85, 138, 47, 11, -53, -9, -69, 150, 63, 44, 206, -149, 121, -2, -283, -74, -31, -2, -241, -76, 280, -4, 92, -21, 73, -252, 56, 131, -90, 85, 167, 119, 48, -146, -124, -40, -16, -218, -16, -99, -4, -25, 60, -21, 125, 62, 95, 39, -57, -226, -85, -172, -79, 150, -207, -68, 230, 25, 75, -80, -117, -5, 46, 248, 161, 45, 73, -30, -305, -106, -74, -91, 317, 134, -49, -100, -76, 176, 325, 46, 15, -101, -305, -54, -160, -28, -50, -421, 6, -32, -105, -180, -213, -23, 144, -102, 33]
5207C3n1Ro1J67l09K57r3Lq8mLj36j27N25j79k18L89k63P0q4K10N4j24J16Lj69
5233f7P9lo7J45r5K39o1l45L40j72k46L15kL9O7l59N6L17k09J36k5j50J55k26
5257a39J13O4Nq0n9R3J69n82L05M32m48L53j53m9r4m1M4l0oJ02n3p0n4J23MK71
5283B20j31n0l1p2M5K24j96M9k80J46K64K48m40P2j30q3O3n1KJ65J31j8m6j9K
5308H4k2R4l32K10J84k56J16j0j38K34k68J78k44m2L32J36l73J32o2R4Q3l2p5
5331B3M2Pk20M6j66L27j78p6L72k90p7R4m6K2J92k45J77J17k04J24j59J10J98
5354A90m73K64J23l17K86Lj18J65n10M38j30Q1M7o0n1n6p4K90j80J69L4j14n4
5377d7J28r3J35j23J67J34m70L04o9j50J36j18N6p9J51j44J15J49mk87qJ3O2Q5
$$ y = [33, -18, -9, -70, 97, -212, 45, -48, -45, -133, -137, -134, -270, -397, 128, -51, -269, 120, -143, -73, -157, 53, 107, -17, 99, 102, -67, 12, 9, -58, 87, -8, 231, 170, -175, 165, -7, -253, 62, 60, 99, 166, -193, -137, 180, -29, 107, 82, -68, 87, -139, -26, 38, 43, -37, -96, -3, 166, -416, -111, 321, -127, 226, 73, 24, -70, -111, -67, -97, -103, -1, -54, -124, -178, -55, -51, 220, 89, 39, 8, -64, -19, 205, 9, 58, -222, -76, 188, 436, -4, 68, -62, -145, -82, -133, -131, 34, 165, 147, 101, 82, 84, 62, 156, -176, 34, 218, -38, 78, 68, -70, 164, -104, 74, -170, -212, 120, 256, -117, 15, -47, 47, 130, 98, 23, 65, 72, -148, -102, -268, 59, -119, -195, 177, -113, -190, -96, -142, -120, 72, -173, 4, 121, -83, 41, -118, -8, 190, -283, -19, 104, -213, 73, 76, -42, 123, -387, 51, -79, 2, 49, -11, -62, -118, -192, 98, -82, 87, 121, 7, -47, 81, -12, 123, 0, 167, 301, -169, 135, 66, -84, 52, -66, -10, -89, 62, -82, 33, 182, 178, -109, -117, -104, -42, 43]
5401D3l61K50N5P3J0k72J93j06J8o0K92K0j94j5n5K09p2q4q4J39m8Q5om8L55l51
5427a4j6q8J61r1K3O7J42k05j50K27%p8J34j1o5L9j93J31j32Q1j41L44j35J26
5451A56j62J0j27oK49N6L6j67K5j57K44k82K78j14M2n4L4J74k48P2j86J32P2j17
5475d0j9K58M8q9K4j05j46J16K3k65J10K34j21j20Q8K19k6k66r5Q4L19k54p2k37
5499c32K55K36r3k42R3J54J47k21n8r6M0N7j9R6J4L16k21j16q4J83j91K03k93
5522a72J01o9K08K33k86Q8k16M00j93l3k0j03j2J8l6k5M01k74k5P5qO4k47K16
5546H5l1k82J76J66r9J13m0m5P7n9j09oK20l5k43N5MR3M6m84K86P7j25M09j00
5571A49o5J70m25L27j80MK6J1j62k6J42j04N3J12r7J43k6Q7J4k20mJ8N5j04J03
$$ y = [43, -318, -68, -13, 60, 70, -202, -9, -115, -97, -157, 135, 155, -39, -54, -109, 100, 28, -56, -140, -1, -49, 36, 30, -18, 337, -14, -30, -118, 43, -48, -25, 42, 184, -21, -171, 56, 56, -22, 112, 101, 36, 75, -118, 13, -119, -38, -179, 165, 30, 156, -6, 4, -123, -129, 120, 176, 212, 45, 70, -87, 157, -125, 153, 39, 81, 27, 61, 235, -13, 59, -127, 5, 77, -40, -59, 199, 247, 158, 182, 77, -69, 47, 70, -195, -85, 149, 28, -92, -4, 215, 189, -77, -172, -88, 231, -23, -95, -332, -77, 159, 66, -176, -83, 71, 218, -3, -61, -157, -117, -60, -79, 17, 31, 347, 126, 10, -74, 109, -82, 121, -172, -71, -140, 68, 301, 15, 103, -113, 287, 94, 61, 41, -62, -74, -56, -92, -117, 284, 10, -15, 60, 52, 116, -131, 85, 54, -228, -52, 114, 15, 128, 88, 43, 120, 61, -48, -54, 166, 131, -112, -57, -53, 40, 86, -398, -112, -35, -160, 249, 149, 84, 254, -171, 156, -24, -20, 6, 17, -145, -171, -29, -133, -80, 32, -65, 78, 52, 139, 153, -67, -71, -53, 2, -102, 1]
5596AM1O4k04K3J36J53j62k0j7j00J71q2r0K29l01L66n3k23K12r8l1k09M75k53
5620B8j6q3J7M6j84J44j6j16J36L6j38J50N6k62K57J06l62R0j29L21j42J98k18
5643h1j37K42j49k4J55P5j27K05j95m7J01j47q6O9J88O8n3k43K38k2j81J91R0
5666A30m16M82j64R9q1Q8Q4j96M6M6j41N8j83J87J6k44K69j02n4J8J68j01k9p7
5690i7J27J36m4j28J28r2p7R4nm4Q3j97K04k19k5J72k9J2P7ok85J41m2J38l2R
5716ak20K47o6j31L62l77J99K6r8M9K02j71k43J61j27K88j77k9J80m29K91J14
5738E0N9j02o0r3L36j45rP3j02J04o0l4Q8k70K59j32j47L44m2l4j73K7P3J91j08
5763I3j24n7P2J41m2j38k51M27L4j11k58K32k88J99J39k98K23P7j27j36J61J12
$$ y = [1, 42, 106, -98, -75, 61, 214, 52, 32, 15, -85, 86, 4, -86, 143, -158, 208, 155, -68, 144, 46, 15, -194, 281, 28, 12, -71, -54, -8, -192, -48, -64, -180, -44, -8, -146, 4, 60, -202, 55, 161, -201, -111, -240, 81, -61, 137, -81, -218, 24, -125, -149, 6, 81, -46, 159, -36, -83, 18, -129, -215, -146, 42, 110, 57, -186, 52, 30, -151, 40, 130, -286, 196, 32, 131, 50, 138, 222, 26, 72, 118, -23, 35, -148, 39, 55, -189, 80, -22, -76, -58, 110, 9, -20, -97, 30, 166, 122, -6, 122, 30, -47, 47, 42, -2, 81, -116, 88, -131, -156, 16, -13, -1, 76, 70, -215, -74, -116, 22, -10, -1, -221, 26, -40, -171, 191, -186, 13, 39, -59, -10, 192, 21, -222, -61, -188, 100, -77, -106, 74, -355, -64, 50, 109, 7, -53, -146, 190, 45, 36, 109, 7, 111, 51, 17, 105, -165, 94, -38, -185, 159, 117, 83, -90, -63, 10, 201, 93, -31, -88, -16, 125, 83, -55, -306, 121, 155, 44, -214, 18, -270, -71, 68, -230, -7, 70, -57, -193, -32, 80]
5785H0j59J91r3kJ18k62J91J9R4l99J71J99k95k32N43r7JQ3j67J22k42J23L8q3
5809e8n1L09p0k34Q4LP2j66R1J1r8L17j65j65J69%N1J44j05l09O3J99j96M9O4
5834IJ77k43k8J04l2j14J29N6j76J46k31K85p8m2J93n79N08Kj81p5M5J55L9N8
5858A27K8l89K60l9K8K92k79l1m4J66j74J2K09j38k16J78l3j7R7Q6j96q0J24n4
5882h3Q8J0n7k3j54PL83j65J2q8j08K51j1l9j30N8L5j10Q4J03j11j75J45J0K58
5907A90j04O2j6L4M1j13J70l35M22k84j97J08N9r1K94j89R8j24K6J24l07K57M7
5930A72q0j15O5QLk08M77l72K29k72J36O6j51Q1j55Q9J78j26k0K16j63j12O7k7
5954a4M2K6Q2j50K54j50j99m7l3M5L10l89J90L57n42L85l69K54M2j20m3J50j41
$$ y = [80, -79, 112, 19, 17, 135, -127, 64, 83, 177, -222, -51, 148, -147, -379, 164, 67, 68, 151, -16, 106, -136, -13, 25, -58, -109, 200, 130, -104, -20, -17, 55, -111, -20, -9, -107, 210, 45, -120, 49, 49, 100, 244, 139, -170, -107, 92, -104, -55, 9, 186, -57, -85, 19, -13, -127, 2, 58, -118, 28, -203, 82, 4, -38, 155, -424, 84, 86, -95, -170, -125, 30, 69, 127, 155, -234, 26, -13, 15, 307, 28, -3, -47, 119, -55, -43, 166, 28, -188, -10, -43, -60, 37, 123, -73, -153, -29, -83, 5, 15, -42, -65, -219, -212, 171, 6, 18, -70, -178, 73, 62, 23, -107, -49, -14, -124, -40, 63, -48, -223, -78, -68, 190, 86, 148, 132, 166, 207, 94, 264, -71, 351, 67, -130, -22, 37, -54, 240, 51, 149, 25, 51, 175, -132, 125, 172, 92, -23, 42, 50, 53, -155, 322, -50, 179, -93, 43, 109, -42, 39, -116, -27, 151, 25, 5, 221, 58, -54, 13, -14, 28, 54, 136, -14, 240, 90, -109, -156, -189, -144, 166, -223, -33, 324, -218, 167, -202, 52, 94, -26, -69, 81, -60]
5977f0J22O5j05O2j96J13m4K8q9J29J01r0r2M7J89k65P9j54K61j22M7l08K93Q
6001A9m8q7K51k14l5j01R0j97K69J99k41L5p5J0J54j67J39l4J94k06J2J79l39
6024a93m8L09j23P8r0J49R6l63J07j43J72QJ98l40J35N9R3j63J69o6K8k77K09
6047Dm8lK98j92q3j84K75m3o5J11j32N8Q1j91Q8J83J48o7k07J99j87J20j64j7
6071a8l3M2j1J91j96%O7K0j77K26J35n3k06K90K4k11m8j23J34L1j28q5j2K25N7
6096A41m8j48j19J82l00N11k95p8K06k5k06J17k8O1Q6J63k43J34k27J72j46L22
6118B32k12k8J38l22L50j27j5k40J85q5R0K07k90P9J26j4K9o7K09j19l9M8q2K36
6142B89K6m09lQ7J87j04p2j28J26N1n9J11j6n4j50nM3o7j9K00M9n4l7j31j47K92
$$ y = [-60, 62, 127, 22, 84, -112, 1, -43, -15, -104, 25, 126, 36, -56, -9, 180, -85, -6, -160, 101, -21, 26, -282, 11, 19, -29, -116, 135, -79, -114, -215, -125, -322, -53, 146, -95, -60, -135, -125, 29, -138, 1, -33, 161, -45, -33, 146, -193, -241, 68, -55, 23, -67, 82, 178, -185, -78, -221, -49, -41, 157, -183, -48, 11, 104, -59, 110, 44, 72, -205, 4, -44, -47, 251, 59, -24, -208, 67, 24, -41, 70, -62, -4, 77, -114, -26, 157, 305, 238, 31, 230, 43, 163, -1, -18, -51, -9, -20, 171, -25, -25, 42, 62, -115, 111, 246, 193, -13, 277, 301, 90, 42, -81, 53, 84, -44, -129, -141, 84, 141, 93, -55, -174, 8, -292, 219, -76, -154, 52, 27, -179, -62, -90, -29, 57, 220, -23, 111, -116, 56, -90, 232, 20, -8, 130, -192, 158, 31, 16, -224, -39, -124, -34, 173, -117, -38, 88, 74, 103, 36, 245, 126, 87, 135, 53, 289, 315, -94, -97, -10, 177, 73, 1, -127, -1, 50, -9, 102, 86, 32, -118, -123, -80, -147, -166, 34, 83, 29, -8, -139, -286, 6]
6168Fk17K26k0k7N0n9k14K93Lk0J11j07jR8r0J25l63M43oj5j71O2q5J5j44R8J26
6195A17j31rJ44q6Kk16Q2K93k63k3O4J53J66k87R4l8K16k18L75l20j24J63k52
6218i8K72l99J05K36j46j03M33l68J4Q1N8j03j40J89l6q8p0J93k34J17Q2j11J57
6241D1j07l9l3M0j8k0R3r6o9P6K74m48K68k8j94L62j64J65R4k74L31k59J18j15
6265bJ09k18L15p9j88J02J10j81J57j17kK75j79O5j11M7j16J60j80J52j96J15
6287C8m8n5J72N0j02P3m4k38K94k69J69J95j76j37M24l20J30k92K76m6K0k12m1
6310a39J40Q7M16o95P1R3j04O4J7R9l8J27m42K10R9j72J73m0j25J90N7r7n5p4
6334a38j55K16O0Q7j18J48j11Mq1oK69j01N7j87L9j9j26K4K73K5l07Q7k3k3O2
$$ y = [6, -211, 15, -5, -32, 18, -41, -255, 38, 41, 21, 132, 25, 24, 122, 32, 157, -206, 237, 231, 216, 45, 107, 22, 37, -107, -9, 117, -14, -23, 121, 35, 37, -179, -97, 196, -67, -90, -26, 127, 293, 6, 100, 62, 278, 60, 435, 115, -9, 154, -98, 174, -225, -120, 116, -30, -133, 300, -68, -54, 27, 85, -18, -158, 31, -5, -93, -163, 30, -204, -87, -5, -116, 41, -66, -105, -138, -98, -116, -136, -43, -139, -208, -132, 142, -306, -38, -66, -260, 102, -62, 103, 197, -77, 254, -5, 113, -2, 107, -111, 204, 125, -63, 39, 149, -32, 125, 8, 6, 281, 102, 167, 56, 103, -13, 147, -33, 119, -77, 38, -10, -65, 107, 157, 55, 128, 84, -154, 140, -129, 40, 235, 59, -78, 346, 26, 156, -136, 140, 94, 114, -98, -139, 1, 88, 504, -191, -120, -27, -131, -67, -50, 49, 11, 138, -304, -94, 5, -167, 6, -34, -159, 31, 88, -9, -64, -138, -293, -77, -17, 70, -48, 100, -11, -7, -88, -94, 175, 74, 131, -56, -17, -36, -162, -138, 135, 160, -147, -60, -83, -106, -44]
6359d4p5J10j13J88l0L2j20J77kl2j2L7k9P3k90K6J51N5k84J94o3K06k45N2m2
6384h0j52J04p3N7J87p8j41K18J0J36q1j19L2Q3j64J15Pj23K8j76L57r8k20L61
6408A90l30J5K21j42l0J27M7M8k84J59o3L9k2k09L39k3j95J65J38k81j20K78j10
6431d3J82l8p5P4J43j29L8r6K5k52N6L92k06P1j12k56K13k01K22J0j12J4J25K4
6455F9q5r1P7P4j86p4K66j92K18j22Q4p9j26J80N8lk59L90j02j60j79M31l68J58
6479b1j89K41r9K0j8K14M0l09J21j66J70q1j7PJ57j02J83k27K31k37J61j37K72
6502B14k03O8j46j1J49j45N7M5J54k24Rl5K1J67K5k70K78j75j54J71M6%N2k33
6526a40K11M4j87K13j53K6L8j54K55k31J53k00O1Oj14J23J19k01K20j39M5mQK9
$$ y = [-44, -119, -9, -122, 66, 36, 68, -52, 125, 123, 91, 79, 116, 87, 160, -130, -104, 47, 102, -182, 12, -51, 155, -90, -38, -80, -232, -128, -201, -144, 43, -35, -176, 42, 52, 188, 107, -12, 20, 103, -61, 54, 61, -62, -34, -210, 147, 49, -171, 190, -140, -125, 96, -46, -76, 51, 98, 146, -138, 21, -42, -3, -25, -234, 105, 82, -113, 52, 190, -91, -211, 67, -43, 139, 101, 26, 100, 243, 114, 152, 56, 81, -171, -115, 277, 71, 142, 30, -226, -13, -214, 8, 18, -94, -80, 45, 69, -16, -107, -30, 44, -142, -216, 50, -142, 76, -46, 38, -41, -167, 13, 71, 68, -191, 199, 97, -63, -242, 189, -179, -21, -210, 31, -68, -48, -66, 148, 188, -121, 0, -166, 4, -77, -94, -87, 70, -32, 151, -76, 155, -82, 79, -58, 214, 11, 79, -67, -78, 71, -74, -17, 28, 182, -42, -33, -68, -47, 120, 145, -125, 153, -22, -176, -5, 41, 41, 93, -140, 71, 115, -72, 141, -12, 14, 52, -102, 153, -78, 75, -125, -64, -58, -172, -49, 70, -131, 89, -50, -5, -9, -1, 28]
6550B8j32K63o5p6j83L77q7ok89R4Q5P9j45J22k00L67j72j04j01L06k6j92K41
6573A84n7m60K20J79p6j86L07q9R7l69L33M9p1j19N4R0P0k63mM5J49L5r5j56K15
6598H2r8ON6j36M2j43J13j7p9K73J88k91Q3k45M12l19k8j0q7L73j95pj21O2K04
6623A18k08J99Oj14M0j85M6M9j02K1K13l12K41k0k72N51l69P0K2P2k16L30j18
6646F2o6k67L33k32J28j38O7K73l12L21q3o8p4pJ44O6o7P9j11p7j3R2J04j27J17
6671A44k77K80k48O9J51o2k80K98l63L00N4j96K12qj68J88J42k55R1j6j32k02
6693b78K55K63m00R5J77k49M41j63k81q6J95o4J2J28j29R0J2j51L17pj91j08L36
6716B14j82kJ92n6l63K41k04l4M32n5j66J29j80j11J92K0J08j07m6o1J2J08k1
$$ y = [28, -104, 159, 94, 18, -165, 212, 125, 119, -170, -76, 9, 88, -57, 65, -135, 232, 60, -44, -145, 161, 135, -57, 184, 127, -333, -113, 66, -10, -196, 111, 22, 119, -250, 83, 132, 61, -58, -4, 86, 156, -107, -111, -66, 83, 118, 23, -133, 82, -16, -10, 46, -90, -48, -191, -78, -95, -174, 99, 287, -4, 79, -166, 246, -73, -101, -111, -198, 175, -20, -27, -148, -86, 118, -90, 109, 115, 1, 41, -144, -98, -49, -151, -130, 83, -229, 12, -8, -280, 271, -98, -28, -6, 66, -150, 180, 62, -4, -271, 62, -170, -42, -180, -113, 160, -152, 169, 86, 18, -56, -63, 81, 147, 80, 159, 48, -29, -42, 50, 154, 27, 144, -133, 147, -101, -32, 119, 57, -223, 75, -288, 12, 66, -130, 82, 74, -94, 94, 236, -19, 72, 56, -76, -278, -23, 240, -160, -65, 112, -137, 304, 141, -140, -226, -31, -95, -83, 45, -84, 6, 18, -133, 184, 177, -14, -122, 214, 32, 30, 222, 166, -197, 44, -160, -194, 238, 183, 17, 146, -34, -145, 47, 67, 175, 68, 22, -39, -27, 81, 60]
6739F0j34N3k04L90j66L6k82K86kj08N9Q6j26O4J36j7r2r6m3M70j24m50J96J07
6763I9k51K96j67j63K64mm3J14j41p6O9J95k66L2j29J22M6n2R1J24l03K04k61
6786b00L71k40Q3K9j10O1k0l6qJ4j28J56J27q7P3j48J39Kj88K50k53P4K51k28
6810a6m6L06j79J00n8n8r1J57M0j64J13j0j99r0J98K0j94K12nj15O3j47K00Q6
6834A23k16M1O1Q7j93K13r6j12K08k74L17j92n5j83j18P9K86J90j46j70L36l52
6856a66J76P9l22K35K3k9p9J0k6p9K19J53k36K74l70K24j13l7M5j22J44n4j00
6879a51Nn9L19k06j11R3j64L14r8P9J94j5j18k76N44l73P4P1j41L22k30J57k37
6902gj56J28p5J05j23J55P2n4j83M1K9K11j42j8q9J20J94j7m18J04mO4RM5k8q6
$$ y = [60, -74, -21, -225, 165, -1, 35, -247, 39, 37, -71, -12, 74, -52, 12, 148, 131, 39, -57, -100, 370, 246, -204, -8, 99, -152, 144, -23, -186, 78, 74, 31, 145, 4, -72, -3, 192, -74, -42, -171, -49, -3, -55, 36, 160, -143, 61, -200, 171, -69, 14, 43, -67, -6, -26, -62, -70, -56, -184, -28, 99, 12, 85, -63, 76, 78, -110, 140, -113, -39, 212, -16, -62, 244, 65, 165, 107, 49, -42, 115, 155, -9, 104, 94, -105, -195, 3, 23, -171, 41, 36, -79, -16, -163, 37, 123, -93, -52, 9, 96, -97, 116, 20, -92, 116, -158, 159, -33, -88, -271, -389, -310, -24, 166, 20, -150, 186, -166, 10, 89, -233, 2, 25, -4, -83, -73, -99, -178, 41, 194, -42, 232, -138, 86, -27, -64, -19, -141, 3, -51, -151, -146, -205, 114, -92, -203, -110, -274, 40, -58, 21, 215, 200, 82, -194, 350, -23, 51, 122, -19, 303, 73, 230, -7, -163, -35, -110, -5, -128, 27, 99, 45, -138, -97, -68, 143, 1, -17, -106, 14, 208, 191, -227, -123, -127, -63, -54, -9, -37, -123]
6928a23L27l40k4J37J22j06n0P3Q1k27P6k7K6L5K20k02N9j08L8K54l49K34k93
6951a67J11M4N8j49K4L30k69P0J00J40l89J55J31m04N18k85q8J05jJ19j64P2j21
6974f0K76j36J55n66L11O2k85K49P6k68L7j07J69k8J39k99L77l16K17k06J28o4
6996a39j4L46l05P4m1J98j09J71j06n8J63j07q6K1n4P2k40J60m5M43n19M32k61
7019dr0Q3p4P6k9J12J9P5k53L25m42K80o7j62M79l59J25p6r5PK8K37k39P0Q4K8
7045A38j4P2k40J62k19K52j54j74R7NK04l55J95l8J5J33O2j86P8Q7j90m7P9O3
7069B5oj23L06k60k00K32R0o9j34lJ48k47J35J15j12K0J47r0k85O5L20j32K59
7092B01l46K34k0O2k35j57J73L9M01k61o4Q5k14K78l36J36r4Q4K4N8J16q9n3L0
$$ y = [-123, 204, -136, -160, -23, 99, -7, -57, 16, 97, -130, -54, -81, -55, -20, 200, -2, 57, -51, -13, 241, -108, 126, -167, -56, -12, 46, -103, -79, 251, -18, 52, 152, 292, -97, 58, 189, -215, 303, 18, -70, 35, 34, 153, -11, 61, -60, 216, 80, 235, -331, -20, 42, -243, 6, 82, -186, -149, -256, -87, -115, 24, -275, 102, -214, 3, -203, -75, -139, -153, 193, -112, -38, -79, 119, 10, 181, 75, 17, 180, 73, -13, 8, -46, 26, -214, -54, -99, 344, -175, 257, -4, -94, -11, -85, -9, -38, 74, 93, 168, -85, 240, -202, 78, 11, -151, 328, -31, 94, 18, -77, -70, -42, 195, -44, 26, 110, 138, 124, 196, -44, 118, -101, 151, -3, -177, -80, -75, 129, -226, -31, -69, -54, 79, 141, -45, 33, 120, -70, -117, -38, 25, 19, -104, 202, -58, -258, -26, 64, -5, -139, -142, 6, -241, -106, 9, -103, -83, 64, -26, -311, -246, 74, -58, 201, -145, 89, 69, 131, -104, -261, -88, -49, 352, 91, 27, 112, -102, 176, -160, -24, -118, -34, -10, 48, 164, 75, 22, 52]
7116E2J4j62P4n5n2Q9P8K0K4k0J0J16m9l88L64j16M7M0j97J0j06qK11J65j88k46
7142b73J72J70j02k3J17j63J37m47K10K08k60q4O07k27j71P4J3o6j67K84j39R9
7164c1j36J69l6L6k1K33j92J21l49q7O52o68K62N4j07M32m42J34J10r1l42J89
7186a10J5J60j55NJ58j14L69k48k49K34j12L7j46J26j5K1J93q2l7k3N1q4o0J81
7210A15lp5m6m6J37j46J66j46q9L00j47L4p9J18k03J76k09K53p1j07q1J22Q9j66
7234a04J14j43J40j12K6L59l47K40j62kJ18j92j62K83r1L0K83k21j34L04k82P3
7256A8J79j09j54K5R4o9L9k77K49J85j09j60J21K3l5j40J69k20R9P4q3J81k44
7279a44J58j19Q1j46K39j65m2L1K73k43J89J2k64J95j84K20n1j01j47J16k27K97
$$ y = [52, 66, -96, -22, -77, -129, -40, 38, 58, 82, 62, 72, 188, 139, -249, 115, -1, 46, 86, -111, -101, -207, -215, -4, 161, -27, -273, -101, 69, -33, -56, 61, -102, 35, -412, -202, 6, -254, -338, 269, 42, -129, -55, -42, -108, -275, 9, -130, -31, -167, 2, -34, 2, -19, 214, 22, 143, -206, -293, 359, -309, -47, 7, -100, 332, -110, 24, 134, 43, -299, -110, -95, 65, -90, -85, 73, -41, 328, 80, -169, 65, -47, -10, -156, -30, -45, -24, 169, 87, 50, 27, 78, -6, -66, 115, 112, 37, -9, -55, 82, -64, 102, -44, -133, 167, 20, 54, -25, 93, -110, 66, -143, 110, 39, -68, -149, -27, 62, -104, 10, -133, 7, -105, -79, 280, -67, 173, 11, 9, 127, -65, -227, 56, -35, -5, 278, 57, -77, 227, -55, 18, 197, 88, -66, -41, 53, -16, 23, -254, -5, 180, 71, -89, 32, 55, 20, -120, 49, -171, -72, 2, -81, 100, -144, 14, -105, -24, -170, 69, -96, -138, -107, 166, -77, 112, 124, -140, 55, -129, 91, 40, -61, -208, -92, -319, -22]
7301b2J31m6klL0j61K64l43K39k95KJ44K85N1l39j53K95O2o0j12Q0q1k3k4J01
7326B0k24l9K71m3j02N7J57J65m09J6J67R1j13p3J68k61P8J24p2j57K30m4o5j54
7350b12L35k55qL19j46j22L16l58R1Ll06L50m0j72K29j52n2O4N3J80j51J83j82
7373c3J01J1k33RJ92L7Q5o1q6m1k61K92R2q1P1j57J08M9j7K3p4o1r9J28j71K53
7399G6O2j6j29j5p2Q2R9j87J80k12R3j6O7nJ08p8j4O7j40l5j2J88o9J03j87J68
7425A06j57J08l02K27J16k2m3O4o2j90K5K27n2K5l28N9L19o3l51q3K95P1N4j41
7449i8k9J6L17k86K79j92Kj31P6J47P0l92K41l3R0j36j9r7J35K12k60L37m60K68
7473E7Q8j03l1j86R1J77J05o5k22L17l97J02j7R5j7N9K7P4j57J3J36k17J27n4
$$ y = [-22, 109, 63, 61, 58, 88, -73, 191, -152, 87, -208, -206, -62, 223, 274, -65, -218, 77, 139, 79, -33, 47, -34, -57, -81, 20, -204, -243, 28, -15, -117, -60, 97, 262, -147, -131, 36, 127, 14, -59, 109, -152, -74, 50, -22, -179, 51, 7, -58, -212, 123, -132, -140, 179, 33, -89, 227, -131, -40, -37, -343, 7, -33, -205, 24, -128, -180, -116, -63, 117, -34, 149, -33, 68, 79, -154, -145, 47, 84, 169, 108, 22, -19, -280, 12, 104, 23, 94, -63, 45, 94, 77, 100, 26, -35, -134, -6, -177, 76, 138, 122, -7, -22, -94, -12, 87, -100, 80, -132, -39, -55, 12, 7, 115, 37, 23, 90, -50, -85, -97, 91, 22, 125, -62, 106, -51, 57, -245, -18, 98, 76, 33, 97, 35, -155, -130, 97, 45, 70, -258, -199, 120, 57, -294, -377, -82, -11, 43, -98, -127, -111, 206, -80, 199, 7, 9, -122, -46, 101, 171, -221, 20, -13, 77, -59, -78, -175, -40, 172, -88, 249, -211, 57, 145, 42, 11, -175, -84, 93, 198, 133, -89, 228, -169, -67, -84, 11, -6, 53, 80, 154, -3, 10, 146, -71, 56, 2]
7497BJ06k29O4p6M5R9k8m7j02J54R5q3J74Pj97LP0P6j15L0K9l1jP2j71J3K27j20
7525F6k25J15Q9j84J06r5J35j5J49M1M7j09j88J60Q6k14Oj76J82N8q2l7J74J25
7549B14j32Q3k26j00K18J34k27J78K8M2k89J63o6K14l53p3K80j56O9k3q4J29J13
7572A36k16R0q7J16k7K7o5K81k66J36j66j76K55j34k8n4K70N9k00k34L97r6L7
7595E5p7J7j95K60J4R7j49P1r6j33Qk2L16k33J16j04oOp0R2J23Q8J3k97J26j45
7621a25k7L7K92L2k44j4K0l6K97j02J6j44J4n6j86L87j63q7o6K21l7n3p3K47K8
7646A78l13j23L39p2j4j34J32k85K21p3K56j74n3K58l93L3M20k37j26O2j4J04
7668hj44J79j27K6L73j33j58K98j92n3N8k96J82L56j16k51l3j35K20k52O6R5M6
$$ y = [2, 108, -121, -57, -133, -88, 11, -17, -64, -166, -12, 83, 0, 174, 181, -16, -13, 57, 133, 18, 48, 77, 46, 45, 117, -54, -41, 186, 66, -159, -44, 45, -139, -33, -128, 7, -8, 141, 182, 229, 120, -68, 92, 178, -36, -30, -206, -24, 34, -48, -85, 89, 214, 82, 165, -61, -161, 57, 191, -36, 142, 170, 212, -77, 86, 20, 234, -119, -192, 88, -68, 1, -22, -106, 23, 136, -80, 10, -77, 39, 12, 39, -26, 255, -11, 125, -41, -217, 38, -96, -124, -178, 92, 151, -49, -283, 114, 18, 55, -22, -5, -200, 60, 74, 171, 22, 93, -3, -136, -128, -150, 166, -67, 49, -55, -61, -55, -125, -33, 90, 178, 191, -106, 20, -125, -152, -115, 177, 209, -35, -49, -29, -65, 232, 130, 146, 2, 16, -40, -226, 161, -2, -89, -155, 66, 29, -24, -97, 150, 178, -135, -258, 81, 9, -5, -139, -7, -292, -71, -144, 112, -62, -115, 143, -250, -217, 203, -34, -160, -98, -112, -8, -152, 27, -100, -74, 299, 166, 8, 306, 114, 61, 119, -177, 5, 361, 245, -6, -39, -174, 46, -206, -140, -45, 1]
7691Aq3L2R9J21j81J08l1M7k43J4J74N8R6J8k77J20K95l47J18M8l8K05l00OO3
7716A23k60K37J02j10j02J21p0J6j7Q2j86K5pp1J13p4J01R8o6j54K82j94Q7n6
7740B0l9j29J8K98l70j0Q0L09k28K43K2l11J44m9l07K65M0n5j0L0R7K05j08j74
7764a9j45j42L18p2Q1J0m7J17q6j7N5j29K21j42p5K12k51%M4k3m8K26J81k78j34
7789a43p3J12K1M3m6o9J08J75P7J04l84P5l6J42m21M37O9j93p4j55J07J53m3j04
7813a18j67L95L7j88P1k84J12J45Kj82J35P3l5M3j4L7j91K93l52N9J31R3j64k8
7837i7j08J50K14k13k26M47k83J97O1j89K8j47R9J53j65j4J02r3L58l04J34j99
7859i5j71L11J00j02l8j46q8O4J08k85M58j80L49j56r1J40K2j0l20J21R2k17K0
$$ y = [1, -82, -50, 49, 170, -11, 97, 66, 113, -130, -116, 58, 116, 212, 230, -47, 73, 368, 21, 139, 187, 149, 354, 54, 60, 123, -137, 100, 202, 92, -10, 111, 41, 57, 40, 122, -64, -39, -46, -117, -4, -78, 23, 121, 55, -99, 183, -11, 76, 20, -19, -148, -130, 168, -202, -212, -132, 177, -51, 192, 214, -97, 47, -2, -309, -44, -4, -59, -69, -39, 58, 263, 155, -19, -164, -306, 12, -60, 21, 31, -16, 101, 15, -2, 53, -76, 145, 3, -72, 140, -111, -111, -67, -90, -138, 88, 269, -9, -143, -216, -104, -83, -40, -86, -155, -47, 128, 205, 309, -75, 0, -36, 106, -315, 122, 191, -2, -76, -231, -124, 29, -14, -118, -285, 110, 147, -41, 30, -254, -142, 3, 5, -177, -42, 31, -4, 39, 25, 62, -129, 164, -188, -129, 2, 95, -69, -97, -205, -55, 159, -54, -280, 167, -116, 81, 142, -47, -19, -166, -67, 86, -79, -93, 9, -84, 274, -30, 104, -95, -266, 45, 145, 43, 5, -141, -229, -165, -57, -342, 116, -64, 285, 129, 38, 178, 200, 190, -130, -9, 83, -134, -114]
7882a14m8L72j12K6q9j79L10k65O1p6O1j78K54k22J54J55k75J27q7O3qn9K38k1
7906H8j20J43j77J02L8Q6k07J21k27L09k75M5K28k43K01k50J0R5j13P9K5j5j13
7929a70L14k43Q3OK5Q8Q4k10J37j65K84l50J91J22j07j22j59J73o7K02j99L2L20
7952B69k59j47J48M7r4J33J16l38K32k10J69M4kj2o4jl0oj32J93o2j72J29Q2j34
7977a01%L7J18P2j65j25k0K46L9j79K61k9j34k92K24K37M3r3j08j5JJ32j52j17
8001a20K29j95J27M0n4p3o9K92j54%J40o8j57L8l3L6J39P4j38j82J11K83k76m0
8025e0k42N94l47k05J46j87l5K71k0r7K40K6m5j58J15R5o6j8m4L3Oj69K52O5Q9
8050B49k06j15J31n2R1qk0k80K36l2K2M9j46J31j93l9K30K20k27j14J75kR5j76
$$ y = [-114, -162, 210, 98, 124, 35, -144, 166, -99, -38, -114, -53, -231, 23, -199, -45, 110, -165, -38, -125, -62, -70, -129, 109, 88, -32, 111, -66, 36, 74, 160, -47, 74, -153, 156, -119, -74, 154, -89, 112, -138, -128, -33, -146, -67, -42, -57, -170, 144, -99, -16, -10, 15, 103, 187, -23, 114, -51, 233, -117, 74, 196, 89, -33, -192, -19, -86, 116, -83, -51, 269, 10, -137, 11, 58, -36, 97, 213, -125, 107, -103, 66, 110, 108, 96, 32, 31, 1, -5, -137, 56, -6, -178, -49, 33, -101, -101, -64, 54, 126, -39, -164, -184, 62, 101, -78, 183, 154, 20, -272, -48, 189, 232, 139, 31, 16, 17, 149, -3, -120, 109, -86, 41, 81, 27, -46, -115, 177, 23, 23, 163, 95, -62, -24, -57, -21, 118, 192, 54, -128, -17, 266, -10, -50, -292, 302, -45, -250, -104, -291, -326, -55, -75, -172, 68, 94, 49, -109, 6, 101, 35, 17, -27, 6, 12, -157, 95, 160, 249, 43, -72, 59, 7, 98, 90, 70, -210, 26, -6, 16, 65, -81, 50, -143, -182, 48, 268, 41, -73, 102, 100, 195, 19]
8074A9Lr3J53n8j63L02J7l9k8j17J25J52k48p0j54K14M2n6j26J27m3K8%O9k26
8099a70J68o0l1R1j20j17M23M8j94p4K5Q6k30L31k02l1j87K54j6K09l5J78k5m46
8123a25P3l29M78k54n9RJ89k1Q8j8J13l54L20q8R3r0o4J34j81J99q7O0pM5l06
8148a82O3J72m8R0j85J51j03J16j18j19P4L23l5l21j3L40j67j10K49j09r6p6j94
8171b98L63J04L9N7n15L35p2l1J07j54J28PL3j77K61k65J0N5Q9j43
$$ y = [19, 22, -71, 82, 24, -139, 163, 180, 141, 113, -4, 121, 273, 25, -45, -199, 15, 57, 1, -125, 2, -41, -13, -13, 56, -170, -2, -62, -93, -2, -122, -239, 184, 232, 38, -36, -11, 75, -155, 176, -26, -57, -244, 10, -6, 203, 168, 346, 321, -125, -52, -381, 97, -157, -216, -207, -18, -39, 49, 31, 144, -210, 110, 22, 115, 25, -39, 95, -86, 113, 26, 86, 79, 124, -182, -119, 53, 5, 95, -90, 61, -42, 74, -44, -163, -89, 234, 199, -122, -135, 205, 38, -72, 177, 68, -28, -104, -298, 65, 169, 208, 265, -250, 85, 13, -18, 89, -65, 63, 70, 103, -74, 187, -78, -68, -13, 76, -67]
8191f7
$$ Imaginary data points
##PAGE= N=2
##DATA TABLE= (X++(I..I)), XYDATA
0@%%%%%%%%%Oj4J6j6J9k7L2m0N6o4P2q8J06j30J54j78K08k44K84l28L77m33M96
32B64n61O34p16Q06r05J013j132J265j410J566j736J921k126K351k595K861l153
49a653L473l822M210m643N120n654O258o942P725q634R701j0975J2530j4474J6982
64I202k0354K5146l2515M5363p3804K40467p0025l65131M06198k16272m9983K31421
76A29713j40623l1032Q6571l8818K885l6092O2278l4113j4799P0843q6086n257
88c4530R2349q3660K2409N0858r2137K4063O7197p0387K5485K7812o3365L5411
100A505J7569m4597J6047N304J5705j9311o614L4976n9671L4879N0894r9822N1266
113a870K9767p8841O9061j1146n2227O7715j6906j9838J8531j8779J2910Q32L026
$$ y = [0, 0, 0, 0, 0, 0, 0, 0, 0, 0, 6, -8, 8, -8, 11, -16, 16, -24, 32, -32, 40, -48, 58, -72, 82, -96, 112, -132, 152, -176, 201, -232, 264, -297, 337, -379, 427, -478, 535, -597, 668, -742, 824, -912, 1009, -1117, 1234, -1361, 1500, -1653, 1820, -2002, 2208, -2435, 2685, -2969, 3289, -3653, 4072, -4562, 5139, -5836, 6694, -7780, 9202, -11152, 13994, -18521, 26842, -46962, 193505, 123480, -241651, 164547, -51725, -101708, 129713, -10910, -41942, 44629, 5811, 8696, -27396, 34882, 769, -14030, 56813, -29273, -34530, 57819, -25841, -3432, 47426, -44711, -20648, 46549, -23838, 1647, 29459, -33906, 1505, 19074, -25523, -9476, -4172, 11533, -7778, -14392, 20584, -39087, -4208, 46686, -53136, -1870, 27897, -50944, 18117, 6971, -45256, 22459, 5553, -14285, 4246, -14533, -1623, -791, 2235]
126B235J63k8501M0456l34m1964M7903j8573l2347O5098k9190l2806N5006k8183
139a037j3138L9718l0578o742K5785l226m423q249Q569o899m494L3032l2057j1405
153a5144M3362l5023M940K9879m7428K0302K2974l6740J7235K930j5420J7821
165I688m005q153k728N538Q994j9565J0241Q588k6197K6081Q81l5731L1797O08
179F037k4042K8903j0058k1651K2899o14j1308Q379J555q735J297J2257j1261
192f342p773K1933q753j1288J9589j5583n987K7803j6353p747K0931j6605n42
205f717J6727j4055j144J0816j630n162J432O033j0915N646J4179k0259N337J2103
219A2391k0808J2252R602j8644J0550M704j2860O318M456p869J130P869o796n125
$$ y = [2235, 2398, -26103, 14353, 14019, -27945, 19958, 1385, -30962, 34136, 4946, -27860, 27146, -1037, -14175, 25543, -5035, -11777, 14008, 10782, 6359, -1890, 6679, -220, -4714, 28318, -3739, -15144, 28218, -6805, -1865, 28014, -19414, 888, 23862, -12878, 4357, 7287, -8133, 9688, 5683, -2470, -5198, 340, 9334, -10231, 10, 8598, -17599, 8482, 9363, -26368, 5429, 6037, -18005, 10898, 840, -20811, 2088, 1474, -9834, -1455, 100, -8635, -7338, 4919, -6342, -14115, 7818, -935, -12223, 7366, -8217, -14204, 13599, -2754, -10501, 10430, -6175, -6717, 10010, -4045, -5189, 5627, 3997, -1165, 267, 6300, -4615, 1031, 15210, -5049, 288, 12391, -8417, 3835, 13437, -5207, 5343, 10047, -2813, 3505, 7961, 92, 1222, 9091, 2295, -2830]
233b830Q305k845n236R673n51j1340Q573J711j5103J3503L522j7300J3498j247
247B333j3249J5129j572q226N531j393k451l376P651j856q625J6459j0334r649
261a3628J9726j2217k151J6301j5564K2Q416p157J936M869r1o974L507P168j0935
276f772O160P629j5855P641P073j3557R137O864j2636M852N413r665M374Q664
290I322q379j127O888p596j404J0935l639n527Q084l773p100J0356r05q830Q699
305F004j627r162J0811J98r771Q382l66p416N917N11n967K099L717n078j980P440
321C712n273m285J0798o989m313J1375q916l631R456o207j213O589k957l787K556
336c085J777l697K417N013q185J035O949r484L099Q386j0371L143P488j0694L999
$$ y = [-2830, 5475, 2630, -2606, 7067, 6516, -4824, 3749, 5460, -9643, 3860, 7382, -9918, 3580, 2333, -10916, 4213, 2641, -5585, -54, -1447, -3898, -7274, 377, -1479, -10104, 6355, -3979, -13628, 6098, -6119, -8270, 8031, -7533, -7511, 905, -6252, -4316, 553, 462, -6512, -3005, 4163, -6772, -612, 7017, -8838, -1197, 5876, -7681, 1456, 8320, -4316, 536, 5949, -3716, 658, 9322, 943, -184, 6704, -892, -2296, 8639, 5000, -527, 7557, 3784, -3316, 7040, 6135, -2695, 6004, 4377, -4785, 6026, 6224, -3547, 4835, 4469, -2947, 2970, 3481, -2486, -387, 3330, -1748, -3728, 3712, -1561, -5846, 4952, -2037, -6350, 5025, -3891, -7522, 1934, -4273, -5486, 1103, -1854, -5641, -3085, -1308, -5005, -2588, 2425, -5760, -4725, 2224, -7260, -4161, 4225, -6146, -3003, 4485, -6209, -2210]
351b210O588q887L245M138n010P77L425r3m235M220M047r893O756L463j1771J0922
367E482J323j1925J1356j608p434Q734k097l940M622p5l213j130M236j537l656
382h62P411m334o556J0673m042n956J0548o462n796J0801n223m684Q296m607k982
397c775N663l380k671L501K203m461k052N441m506n9R343j1054j860J1467r690
412e890K290P445j1806M474O599q426L133J080k469K320L44J755n017J846P827
427E505j0210L616O126j2916J0679N248j5404R552J447q323J1565l963o480O785
441C227o87J122k154j196L782n447O798L78j2367J3404l09j1332J3397q309n796
456e489J6525r426m270P554o895L414K319l567O4k746O819k909p642J0698o982
$$ y = [-2210, 4378, -4509, -1264, 2874, -2136, -1359, 2066, 1973, -2262, 1958, 6005, -3888, 2868, 6331, -5440, 5482, 6805, -5120, 6236, 4628, -2806, 5928, 3831, -109, 4513, 4438, 1225, 95, 4331, 2794, -862, 6549, 2215, -4341, 6332, 2290, -3666, 6882, 420, -5376, 5425, 202, -4482, 3814, -793, -3775, 1888, -1492, -4163, -662, 1541, -2920, -4972, 469, -4037, -4096, 5247, -5807, -7667, 3800, -5890, -3600, 3845, -7961, -3487, 3112, -5314, -2181, -1101, -3570, -1250, -906, 849, -4168, -2322, 5505, -4705, -1089, 5037, -7879, 2800, 8048, -7356, 2196, 3643, -4680, 6885, 2922, -3558, 3227, 2540, 3662, 1508, 312, 4094, -1353, 5445, 5823, -6544, 6860, 6551, -4781, 8616, 307, -5489, 11036, 1610, -2660, 4894, -2001, 1413, 3732, 165, 229, -2517, 4302, 1393, -6249, 4449, -2533]
471b533k071J3596j5356j170J4303j1314L033N055j2477N324P273o024r87o39
485c987J507J109k00J854p579L367J0555j1788R14O919j2695J2105N726j8877
499a1070J0169L666p940J1000o052n240O552P7L055o188j24O776p644R103j284
514D856j4802J7654j702j0827J3771j0718l855J7587r647m430N437l819L950J354
528D809k679k833j081R599m883p434J0034p187k60J3024j5724j731J4894j0855
542b307J891N282j2351N856O790o427r29j550L084L95r89L194j0077M309J0877
557G048j3757L784N283j3342J3605K634j5962R383J784m718O782m414l529K875
571b544M769j65p934M847K336n338R905n316j0034J5057j778q983J0681o452m200
$$ y = [-2533, -4604, 8992, -6364, -7534, 6769, -4545, -1512, 3543, -8934, -3610, 3663, -2361, -3348, -3987, -2480, -1371, -1571, 283, -7296, -3929, 6626, -5162, -4248, 2671, -10024, 2081, 7807, -11070, -901, 2765, -5175, 5825, -227, -5467, 1085, 1162, 4217, -1971, -2095, 4681, -2963, 6140, 4856, -9946, 7708, 6006, -4821, 8950, -1768, -5623, 11964, 2317, -2113, 3324, -495, 3455, 4809, 2130, -703, -1784, 7815, 2932, -4502, 5532, -1655, -1915, 11109, -4615, -6346, 8548, -2307, -416, 4866, -7485, -1629, 5161, -1266, -2195, -3745, -661, -266, -1255, 1939, -8138, -3829, 7048, -6709, -2925, 2358, -10984, 2621, 5255, -10707, -1324, 460, -4258, 2524, -1890, -5419, -2544, 2225, 2060, -5874, -1027, 1309, -4029, 5876, 560, -9474, 5583, 3805, -5178, 5503, -949, -5149]
586e149J3756o005o369O747j626m31L299k090k950O85P014m794n259R506o763
601d29r44J2575j4464j145J3737j0965K610N386j1118M887N421m903j981P37K618
616B022l232J948K351j0170P402N742j2616N873L595j0738R873J479j1894P286
630a079K499o167M783M35n693K191M776l045l618N927k465m550J0044m848p673
645h483J3481n037o123J0330o579k221R932n010m100M991J71k276K333J689n575
660b477K347N594p170J154O628q031J958O894r159J134Q422q087N09O281p046
675a049K72O779m878k712N097j419l870N422n94o896O326J695q385O107J503q410
691e012P181R48q182N828J749o230L861J697o006J907M869m904j711O250m921
$$ y = [-5149, 8607, 2602, -3767, 2980, 1354, 923, 4222, 2132, -818, -133, 6881, 2087, -3172, 6334, -429, -1373, 11202, -3262, -4407, 9330, -1635, 975, 6361, -4757, 130, 5551, 648, -1333, -596, 2022, -1210, 738, 3089, -7081, 321, 6063, -6553, -680, 2915, -7823, 2050, 3529, -8365, -1079, 1420, -4747, 36, 471, -5222, -3031, 1745, -1300, -4918, 1009, -1456, -6006, 4038, -810, -8483, 4998, -39, -6162, 4168, -2411, -4632, 5300, 290, -3810, 1181, 1352, -924, 1409, 3098, -2477, -130, 5464, -1706, -552, 6076, -1955, 3, 6897, -2262, -1128, 7294, -793, -284, 5997, -1049, -777, 6002, 1124, -1588, 3509, 2090, -1780, 3642, 3048, -3848, 2478, 4173, -4212, 1895, 3398, -5012, 2169, 3117, -5065, 763, 2512, -3718, 143, 1840, -4166, -2259, 2610, -2294, -4005, 2245, -2676]
706b676k335Q290o000k691Q266n175k544O888l728k621N680j730l958M651N41
721H58n156M740J791o456M351K734o568L746L624o883K537N165o514J030N675
736D674n777K29N532m330j543O035l921k611O218k636m183O357j275m809O240
751D200j208n701O129k78n415M815K65n417L983K145n541J854L728n347N13N183
767C908o619N25N652n775k0M900m666p92M887l348k096M203j704l381N134q51
783d3m565M626J00m758M532P49n163L853K147n341K412L056m789J662L988n398
799b932J201M397m408N16M246m184m86M457k338k205M960k140l356N895j306m496
815b179N712j016m714N161k25m422M244Q70m632K837J550l969J787K614m302P48
$$ y = [-2676, -5011, 3279, -2721, -5412, 2854, -2321, -4865, 2023, -1705, -4326, 1354, -376, -4334, 317, 858, -4298, 442, 2233, -4223, 128, 2862, -3706, 40, 3664, -3219, -682, 4483, -2031, -1001, 4674, -1103, -874, 4658, 328, -1215, 4820, 899, -1712, 4506, 1870, -2313, 4044, 2769, -2040, 4200, 2992, -2709, 3420, 3142, -2273, 2542, 2807, -2610, 1373, 3518, -2023, -169, 3559, -1788, -1275, 3908, -2711, -2186, 3466, -2309, -2329, 2571, -2095, -2887, 2000, -1348, -3444, 759, -945, -4326, 808, -43, -4608, 18, 118, -4640, -108, 641, -4522, -669, 1478, -3863, -1451, 1605, -3184, -1522, 2466, -2932, -1731, 2666, -1742, -1226, 3020, -1164, -1650, 2807, 469, -1736, 3224, 1084, -2272, 3623, 2317, -2179, 3533, 2517, -2197, 2964, 2739, -1683, 2561, 3431, -1201, 1636, 3186, -783, 1004, 3618, -684, 64]
831F4L242m059M97M040m597o51M649l648j121M415l791j639M793k407k499L749
847A037j570k497L738o35l577L016J565m559K195K024m330K180L045n189J531
862b026L219m151J278K658l653O46L309k622p79K972j765j305L512o32l030L606
878A237M76m047L984J06m764N541M46n471M117K58k653L096l32k730J806J553
894B623j425j153K399j431j848M573k781k998O259l117k226M679m567j51M579
909C415l268j065K069j095O0P82m90j970P83L069l249q63L064l938J566L801o167
926c496J217M094m339J976J039m503K649J823j798k80n30J392n84P72J337m779
942d010L185L579n643K713L93m413O148l29m973M332o56q87K748k250j037J008
$$ y = [64, 3306, -753, -256, 3784, -813, -1464, 3185, -463, -1584, 2831, -960, -2599, 2194, -213, -2712, 1037, -533, -3030, 708, 73, -3504, -488, 1077, -3482, -1287, 737, -3593, -1413, 1632, -3557, -2026, 1193, -2958, -1680, 978, -2675, -2029, 1280, -1342, -2121, 851, -914, -2219, 1293, 661, -2369, 1237, 1713, -2334, 1650, 1756, -3008, 2533, 2979, -2492, 1625, 1883, -770, 2326, 1994, -736, 1070, 2623, 1198, 45, 2444, 1013, -835, 3738, 957, -2041, 4218, 1101, -1125, 3554, -1013, -1164, 3415, 147, -918, 1151, 56, 116, 898, 408, -1562, -779, 2290, -959, -1822, 1242, -2696, -1130, 2671, -3496, -2279, 1815, -2524, -548, 491, -4012, -1363, 460, -1338, -1618, -2148, -756, -1340, -568, 769, -4010, -825, 2754, -2889, -176, 217, -4196, 1952, 1623, -3350, 982, 326, -561, 2187, -63, -1100, -92]
958i2J878K68l894L077N33k897N324l290m183P402k393k482M547m663l08N514
974D341l156j367J263p07J419n82l35j441q93N394l274k992M749m127J127N532
990D951q298J362M735m524K589m24m065L147J222o79j787j123L566j813J92K111
1006A162o260M207L848o918L400P70m780O327o54m934L510k5l89J150j258n79
1022a423n0K871L68m762K999J727l482N142k856m896P771j747l193M292l916L30
1038h25M780l121r67L30P59J460j495Q47k017q77N736l755k826N520m446J238
1054C41M527p216J085M584m212J838J40l058K024J041j8k600L29K405k647J440
1070CJ453n895L916L349o406L412P78m536N231n66m316K707N89p68M94m07k39
$$ y = [-92, 1786, 2054, -1840, 1237, 1770, -1127, 4197, 907, -3276, 4126, 1733, -749, 3798, -865, -1173, 4341, 1185, -182, 1081, 374, 1793, 1211, 876, -565, -1458, 3936, 662, -2330, 2419, -1708, -581, 4951, -3347, -1985, 2750, -1774, 815, 391, -3674, -527, 695, 16, -1771, -2894, 672, -1141, -949, 1162, -5098, -891, 2957, -3961, -561, 209, -4571, 1756, 1102, -3832, -322, -347, -736, 414, -844, -1423, -1473, 1398, 1766, -2996, 3, 1730, -1752, 3390, 534, -4362, 3409, 1662, -1531, 2761, -1155, -825, 3955, 834, -133, 197, 956, 2416, 921, 1768, -249, -1126, 4610, 855, -1971, 3549, -897, 341, 4868, -2348, -1263, 3321, -891, 947, 1087, -1971, 53, 1094, 1076, -1524, -1195, 1210, -1437, 3, 1456, -4439, -523, 2826, -3580, -168, 610, -3926, 1305, 739, -3577, -870, -281, -1049, -555, -962, -1201]
1087a201j238L483r53m009M569q53k919N345k618l308O302k576k135L733k148
1102e26p79L361j134j849Q76J783j357m90K485l124L90M258m365l41L968l962
1118h06J187L635n135O95L722l173j34J744k067K69J863n73k249J522J491l188
1134a197J850J427m986L767J687n171L113O04l900L213Q90l684J602J476k212
1149a521K04J790j993o71L279j874k066L740j618k462M456k097k512M492j454
1164c07k492L790j153k217L228k81k767K330R97k905J498J922l398J239K884l507
1180a139R08L166l946M58L262l106k57L646l015n11L238j848j756L422j273k158
1196i09L062l16l207L028O8l097K973K18l265K362J331l497J796J406l555J310
$$ y = [-1201, -2439, 1044, 91, -3918, 651, -202, -3121, 2224, -394, -3702, 2600, 24, -2111, 1622, -526, -1305, 2056, 922, -927, -51, 1732, 375, -115, 2370, -754, -364, 3894, -471, -812, 3156, -806, 381, 4016, -1119, -424, 3298, 125, -9, 1735, -332, -63, 1800, 1227, -1022, 500, 1991, -1197, 653, 2080, -2906, 861, 2548, -2623, 490, 1094, -2806, 407, 1297, -2387, -785, 691, -1521, -1317, 473, -1520, -2191, 1088, -786, -2852, 888, -730, -3192, 1264, -833, -3345, 1147, -307, -2799, 991, -162, -2379, 849, 568, -2199, 131, 1128, -1777, -279, 1643, -1755, -516, 2368, -1139, -231, 2935, -1011, -553, 2709, -397, -654, 2992, -23, -534, 2704, 856, -900, 2522, 1249, -909, 2153, 1837, -1370, 1658, 1726, -1371, 1602, 1820, -1445, 917, 2248, -1249, 547, 1953, -1602, -292]
1212b92K163l372P31K510l098m5K905k638m60K734k009j285L043j354k209L404
1228G28r43k438L079k66k955L201j40l240K929R21l323K141J337l336J887J787
1244A369k975P94K679l246J77L122k710k45L224k530p87L184j759j591L415j483
1260F38j943L679j530k104L091r7k700K472K57k887K189R69l052J679J838l402
1276i03J356K057l629J009K542k931k48K970k822l16K613k129j071L159k003j328
1292a674K796j248j889K496l24k512K557l7k561K224N52k841J999J264k850R90
1308a058K057l373J349K380l421Q29K729l127L78K496k464r4K941k077q87K461
1324A119p87j673K664m82k597L217j17k933L008J00l019L094J56k713K135O86
$$ y = [-292, 1871, -1501, -770, 1740, -1358, -1403, 1502, -1136, -1596, 1138, -871, -2156, 887, -467, -2676, 728, -215, -2653, 426, 160, -2795, 406, 266, -2974, -45, 876, -2447, -306, 1031, -2305, -418, 1369, -1606, -812, 1867, -1379, -1202, 1920, -790, -1035, 2189, -341, -1128, 2056, 297, -1294, 2121, 638, -1305, 2374, 844, -1260, 1831, 1734, -966, 1506, 1763, -1124, 1065, 2034, -1018, 661, 2499, -903, 453, 2510, -1119, -110, 2432, -499, -747, 2223, -599, -915, 1698, -431, -1502, 1657, -346, -1674, 1122, -126, -2015, 481, 157, -2355, 202, 165, -2396, -172, 380, -2461, -462, 802, -2048, -1058, 999, -2374, -1025, 1355, -2066, -1237, 1492, -1635, -1257, 1239, -1225, -1319, 1622, -455, -1342, 1119, 332, -1341, 1323, 841, -1756, 1461, 1344, -1589, 1419, 1519, -1500, 1594, 1750, -963, 1172, 1858]
1340A858k329J341P81j899L73J945j715p29K488j684j287L364k384j464L763k461
1356c9j137L368k654q43K863j509j000J232J17j406J164M44k334J201J842l018
1372a709P67K122l142J379J844l735J484J937k708J265N71j720P95J153p16j211
1388a624J232M30j548J926j17l018L221P89l450L040l73k479L748r94k175K174
1404G82l20m57P54l24k51l15J780p47j896K502q90j333L810l161j426M473k513
1421D68q44K727l122P55K012j745k90P2M00M14o43R40j960L6L353l386l41K548
1439A394l522K492J605m637K362Q52j929J857j130r09J264K03L88j860J04K013
1455E47k207J692L16l548L849N02l454K435p50j368L912j532k040J398j65M12
$$ y = [1858, -471, 870, 1651, -248, 125, 2070, 355, -374, 2114, 430, -857, 2507, 123, -1341, 2422, -39, -1176, 2192, -462, -1305, 1558, 49, -951, 281, 398, -1008, 156, 600, -1734, -533, 1309, -1709, -942, 1180, -1962, -583, 1261, -2474, -990, 947, -1761, -496, 75, -1645, -850, 303, -413, -1624, -392, 38, -1510, 416, 299, -2719, 502, 1291, -2159, 881, 508, -1971, 1777, 783, -1392, 782, 462, 5, 759, 435, 184, -131, 1649, 902, -994, 1508, 618, -715, 3095, -66, -1492, 2981, 468, -376, 2351, -771, -16, 1996, 251, -39, 33, 433, 847, 204, 1144, -816, -780, 2573, -813, -1154, 1394, -2128, 364, 1969, -2668, -306, 546, -1383, 474, -656, -1565, -301, -98, 290, -1570, -1466, 547, -1660, 32, 348, -3200, 649, 1151, -2303, 132, -618, -1986, 1926, 394, -1646, -248, -413, -1]
1471aL15p51M3m37K487o25k945K921p52r71L462l245j217M278k266j22J756k873
1489i43J478J266j280M4r16J505M16j528J371k029K7L677l924L44K287l136K381
1506A040J047l892K210N62j251J045r62o51N55K17Q36k011K88J958k145J443J30
1523D19l426L302P31l075K310r40j147K770j321j314J195n9P93q28k04L99j048
1540a443K589q55k539L069q22j265K932k525m04K965j695j8J067j717Q88Q21o04
1557D44l78j94J383p04o64J560k050O11K715k916l10K370k700J863P48k756J202
1574B24J130r10K26m66j75j79Q89M37k354R77J442k389J581L45k922K719L20k532
1592a637J682j03j653J934l43q06J66O73k76n72O46L7j337K000p06j654K391q76
$$ y = [-1, 314, -437, -394, -831, 1656, 1031, -1914, 1007, 255, -716, 2746, -499, -1716, 2562, 296, 174, 1930, -943, 535, 1801, 521, 565, -351, 1154, 1570, 42, 1413, -616, -589, 3088, -836, -492, 1795, -1341, 1040, 2087, -1805, 405, 967, -284, 761, -201, -852, -297, -80, 756, -1255, -967, 991, -1154, 289, 419, -3007, 295, 1026, -2049, 261, -679, -1826, 944, -377, -1691, -496, -555, 238, -590, -794, -395, -1443, 1146, 291, -2248, 821, -1, -1266, 1666, -859, -1263, 1702, 7, -11, 1056, -661, 227, 1048, 444, 66, -128, 1255, 551, -113, 1447, -603, 8, 2723, -193, -503, 1867, -833, 1030, 1778, -978, 224, 1354, 444, 670, 204, 29, -150, 739, 1176, -1178, -201, 1241, -1148, 433, 778, -2144, 575, 895, -1637, 45, -58, -1711, 223, -120, -926, -760, -87, -363, -935, -289, -252, -1589, 411, -295, -1949, 442, -434]
1610d34j001K419j688q30K284r82q20J148m31m31Q72K82j031L12J404j551L60
1627a18J369j748L11J826k259M12J672j685M07J528j776k65J507p40n88J007P5
1644I35j205J174R8j645J532K50j726J358K91j963J319O98j734Q87L50j115N96
1661A00J005j677J87J125j243l70J485j081q82J966r88r04J785p81j217J979p92
1678c03r72J305k37j372J589nj200Q94L82j377Q73R17j425M21J353j850M87J439
1696I19j643P3J810j606j42J763j090o77J564p62o06J704q52j128J795l32j259
1713d69J305J83j653J398L76j525J044M10j543P52R90j747P32Q92j735N29R07
1730H46j121j79J467j296n42J776j069r76J891r73r37J450m78j093J300J8j502
$$ y = [-434, -1435, 984, -704, -1534, 750, -232, -1052, 96, -335, -766, 106, 388, -643, -331, 1073, -478, -118, 1251, -497, -186, 1640, -619, -207, 1465, -220, 187, 1715, -61, -326, 1181, 441, -147, 860, 935, -270, 904, 1002, -643, 889, 1139, -587, 771, 1062, -901, 418, 1116, -618, 269, 619, -496, 100, 1105, -572, -385, 740, -503, -873, 612, -469, -1351, 615, -373, -1277, 508, -273, -1490, 489, -303, -1275, 30, -207, -1579, 10, 5, -1195, -301, 81, -1296, -423, 494, -931, -510, 843, -1007, -520, 919, -724, -651, 1159, -447, -589, 1174, 84, -593, 971, 209, -397, 1307, 455, -673, 1122, 790, -469, 836, 1019, -634, 764, 1140, -385, 659, 1069, -474, 278, 1268, -479, 253, 1145, -590, -61, 846, -275, -454, 1013, -283, -825, 951, -118, -1094, 797, -176, -1113, 337, -141, -1234, 66, 84, -1418]
1747a418J450J54j514J375J54j310Q19Q51j615N46R86j520J47J575j488m4J772
1764I20j682r4J686j013l81J447r45p03J373m03r78J319K1j237J454K71j685J454
1782H24J94j830J434P00j839J167M06j507J086O17j240J15J104j160m12J468j069
1799E8p98K251j375r92K199j505o34J922q14r83J439p38p96J022j1r80N07M43
1817B15j204O27J003j897M33J653k038M06J299j692O70J246j884M87J075r25j05
1834f31Q28n56o74J300J74j681J577L61j807J549Q2k064K025J88j539J574m27
1851B79r57J333k03o91K50O88m17l29P99l56j061J980q21j237J789r04n38K029
1869A633j919m46K203j518K5P26r19j6P01Mp40j89J339j242K01J413k478Q56J939
$$ y = [-1418, 32, 186, -1328, 47, 201, -1109, -290, 561, -1054, -508, 478, -1042, -895, 680, -808, -852, 920, -762, -856, 830, -183, -564, 883, -62, -765, 608, 205, -773, 546, 567, -670, 784, 1055, -630, 824, 1018, -812, 622, 1322, -517, 650, 1056, -451, 635, 1252, 12, 127, 1231, 71, -341, 1127, 58, -740, 1511, 136, -856, 1343, -162, -796, 1126, 312, -671, 768, 30, -766, 256, 245, -735, -228, 215, -989, -362, 641, -1256, -823, 830, -1208, -802, 497, -1195, -525, 721, -1163, -676, 399, -526, -631, 197, -359, -1033, 267, 441, -1240, 337, 698, -1109, 440, 522, -1542, 483, 671, -868, 706, 279, -678, 655, 452, -239, 11, 699, 282, -47, 752, 396, -665, 1315, 494, -743, 1046, 142, -396, 1633, -286, -732, 1471, -47, -22, 704, -215, -231, 470, 474, -266, -455, 884, -358, -157, 1256, -1222, -366, 1573]
1888A573k734Q90R05k211J907K53j987J223K36n32L27m5m24j16P90L03k129J393
1906c78P97j624J696l62j960K420j59j593J411q25j77J354o97n01K57O83K77r01
1924b82O68k76r85K557j303j457K457j318l17K282k541M4J789j276J69M46r35
1941b78M80K69L61q37m58J731j229j44J481k396Q89J960k771J052M14j542J565
1958E47J74j694P25K67J94j55l39M2m11J087M7k172J578P34j727J584n65j622
1976a706K282m78j351J258p91J95Q42n11j66j86N49L87q70R53n43r40K352j506
1994b30j191K381j421K28J633k260M15J453j017R6J99j96p2L88O58j297j44J685
2012A308j286L1J007j910J098J423k055L74Q65j227J086j17j186P67L4K70l94
$$ y = [1573, -1161, -271, 634, -1577, 330, 583, -1404, -181, 55, -477, -150, -195, -619, -735, 55, 358, -1771, -378, 419, -1205, 491, 129, -1831, 589, 430, -1163, 248, -577, -754, 600, -97, -598, -341, 342, 619, -282, 386, 110, -875, 1682, 379, -1078, 1379, 61, -256, 2026, -515, -471, 1318, 42, 211, 657, -278, 202, 471, 832, -5, -463, 1268, 39, -105, 1376, -1020, -131, 1829, -942, 110, 524, -1018, 547, 721, -973, -248, 19, 213, 58, -281, -239, -650, 437, 484, -1688, -110, 624, -1103, 481, -84, -1706, 576, 98, -1253, 5, -786, -591, 251, -260, -426, -612, -63, 324, -546, 407, -136, -1076, 1276, -230, -1421, 960, -461, -233, 1400, -860, -445, 1008, -9, 87, 286, 90, 18, 406, 1064, -233, -377, 1308, 22, 53, 1060, -850, 248, 1671, -384, -10, 855, -372, 714, 597, -589, 178, 212, 482, 88]
2029H8j00M42r68Q67M5j667J128P25j500J468n73j266J872m30q42O97m22L7J47
2048b52M1m15J0M78j02m93R17m79n28J466q14j050J761j000nQ73j226K47J051
2067D80n21p1P1j07J87j36M54p17K18J216j311K70Q33j500R60P25j434O04O82
2086I03r15J75M20m07p3O51m43n09O17J35o75O92Rj218J088j14q53J147l93q52
2106f15J033r9p22M16J2m43L12M54o56l17R44n51n08J008q95j7Q72n86m09P85
2126A8n04j98R13l96k97M89j48o23O77J20m84R0N93j030N57O48p23r2P56j047
2146f81O86Q74j214L93M82o08m7P08n65k46P19k67l93P79l52n37R18k22q18Q49
2166D58n8o25O33K31q74L57L98q04L63P26r27P9O01n72l14R08o37j30O54p35j74
$$ y = [88, -12, 430, -538, 329, 374, -1293, -165, 560, -940, 528, -45, -1311, 561, 131, -711, -14, -436, -399, -252, -211, -626, -616, -138, -240, -733, 184, -295, -823, 643, -171, -1221, 540, -460, -465, 408, -818, -571, 480, -41, -112, -41, -148, 39, -97, 357, -360, -142, 1074, -237, 33, 866, -634, 326, 1051, -383, 221, 903, -12, 163, 583, 176, 103, 754, 311, -198, 419, 554, -121, 571, 580, -638, 450, 336, -517, 630, 237, -615, 418, 319, -403, 13, 25, -418, -106, 348, -308, -625, 319, -232, -740, 268, -627, -644, 228, -358, -767, 18, -486, -684, 229, -167, -464, 25, -123, -746, -69, 51, -433, -343, 250, -780, -223, 425, -298, -390, 366, -681, 5, 879, -335, 58, 540, -68, -115, 593, 28, -218, 501, 234, -159, 620, 268, -269, 649, 427, -391, 458, 400, -225, 408, 639, -235, 122, 520, -284, 79, 805, -122, -43, 558, -14, -328, 580, -57, -187, 467, -268, -442]
2187d42Q50n91q80J242m95k90O99k08m85O84k08p50P83J87p61N13M21j059O26
2206a64K50o46J61M79n68k26R92n13J73N81p28o0N91n05r5N07k76o3N45j98n22
2227b85R24J4q62N32on27N72J49p27P10J04q76M53K77m44R3N90m61j79O96q65
2248a18R4N58k16p02P44l29k32Q00l51m82Q04o78l63M03O6m85N35j4n75L14M60
2269B33j027N40L58q84L54P11q98L89M76j024L39M73m95N7N67l30l04M35K14n12
2289c28O32r4p74R32k50o07Q29j01p53R34j61n20N25L41q44L88M18m81q4O86l84
2310C04m73Q65o39l84J237p08n83J280q35k54R88j034k33J036n23j05K21q7j07
2329c4J91J42o42J74O81j102L55Q82j621Q06P31j315N24K76p65O62J50o55N7N06
$$ y = [-442, 408, -183, -1063, 179, -316, -606, 93, -115, -600, 84, -124, -874, -91, 96, -665, -152, 269, -790, -164, 86, -560, -399, 80, -488, -714, 278, -235, -62, 519, -209, -269, 322, -183, -278, 229, -47, -110, 435, 237, -285, 639, 653, -209, 323, 317, -210, 362, 511, -216, 494, 598, -278, 175, 452, 8, 101, 691, 230, 51, 747, -118, -24, 534, 318, -384, 360, 31, -201, 599, 248, -234, 570, -108, -471, -68, -2, -487, 48, 34, -541, -227, 233, -794, -254, 104, -780, -426, 285, -613, -224, 252, -772, -433, 40, -455, -398, 169, -161, -465, -30, 184, -328, 304, 210, -564, 368, 118, -489, 340, 239, -514, 420, 259, -261, 264, 605, -239, 149, 567, 86, 2, 688, 304, -169, 696, 57, -327, 910, 202, -381, 899, 64, -190, 798, -236, -469, 567, 44, -61, 160, 73, -34, 157, 299, -343, -169, 512, -590, -235, 647, -974, -168, 563, -752, -228, 48, -717, -55, 95, -560, -503, 3]
2349CM0p49L77N55r58R31J79j390J159j93o65J273o91o72J230k95k87j08P3n1
2369b39N69j62l83M2Q71k04r56J135n94k64J148r79l79J360j040J44P72p65M6
2388A22M44l19Mj51rj8N9O07j003J73Q37j087L32O95j504R54N92j507N60L26o41
2409e34O89l5p77L43K57J93o13L29J38p96J275j38j526J162K87j210J431p50n88
2428h63J262m41k03K4J14J37%q1j93l79R67k33o93J143o18n23J625j445j4J082
2448F68j132O90L45r45M35K90Q8l51k66O45k20N1M07j052O29O42j118K30N11j393
2468h46J274L08j143N23J11l46O00j58l70j73L68J87n56M56p0q02J216m46j102
2487i69J165l65m22R91o16n26J104k46o79M96l45M20m58N82m88j06O84n64j27
$$ y = [3, 43, -706, -329, 226, -732, 199, 378, -1012, 147, -46, -711, 562, -129, -801, 429, 134, -153, -261, -188, -239, 330, 168, -215, -173, 698, 494, -462, 673, 79, -185, 963, -16, -395, 965, -75, 69, 841, 76, 122, 566, 247, 251, 100, 91, 73, 132, 739, -264, -91, 746, -341, -9, 686, -818, 136, 728, -779, -219, 107, -534, 155, 120, -657, -314, -57, 136, -477, -148, -10, -806, 469, 331, -1195, -33, 254, -956, 475, -275, -863, 399, -42, -245, -221, -107, 30, 30, -51, -244, -623, 344, 111, -582, 561, -57, -580, 1045, -400, -414, 668, -464, 226, 571, -374, 61, 351, 439, 88, -178, 467, 247, 298, 705, -347, 282, 924, -194, 36, 547, -846, 428, 736, -407, 116, 227, -119, 481, 323, -47, -220, 148, 335, -221, 235, 165, -637, 579, 133, -969, 196, -169, -591, 400, -216, -742, 362, 116, -563, -67, -412, 8, -450, 132, -356, -462, 222, -342, -469]
2506d69Q86q57O1J134r81j64R04q43L06J53m40M03P1M9k08k2K33n75M41N57j015
2527c76M71N84o90K80L76r21O05J49o69K56K39k44L70k22n8k25K76q7k76M79K0
2548C37q84Q00l63o30J058j98m21P11k74o84N84k31k14K86K38n06J80M77o18j48
2568e00N82l47k68O67o27n3O94o86J90M91k52n29M96J68l84M61L5m52J47L58m40
2589b49K52L27o75L09M00p86N24L94q56O67L02o07M2L52j96l28L28l71N9O03m73
2610A8k31Q16m03j62J40r9j49L22j4m56M69L6n89N24l3m79M53j85kj19M93r11
2632e61L81N11n73j36N25k07m17K95k24q3L93Q6k54J67j52k47N40k21j66L67p7
2653e3m61N51q6m19N23J75m17Q6L42m40j43O76p12M68P8j18j69M95m35j06O79
$$ y = [-469, 417, -440, -379, 755, -226, -390, 514, -329, -23, 130, -310, 93, 164, 213, 5, -17, 216, -359, 82, 639, -376, 95, 679, -11, 269, 645, -276, 329, 478, -191, 65, 304, 60, 430, 208, 150, -75, 201, 114, -162, 317, 337, -547, 253, -110, -740, 318, 120, -301, 410, 136, -548, 36, -195, -409, -123, 115, -391, -211, 266, -352, -500, 82, -265, -533, 134, -493, -546, 148, -538, -348, 143, -109, -638, -142, 26, -358, 103, 138, -314, -167, 191, -249, 3, 330, -345, -36, 364, -422, 102, 496, -360, 307, 609, 2, 44, 396, 200, -128, 200, -171, -112, 491, 18, -213, 603, 200, 38, 178, 79, -70, 252, 238, -218, 251, 287, -302, 222, 189, -290, 163, -22, -24, -143, 350, -561, -180, 331, -242, -378, 147, -60, -477, -182, -406, -489, -96, -10, -264, -97, -249, -496, 44, -177, -343, 24, -53, -514, 37, -49, -468, 55, 230, -187, -101, 241, -199, -342, 334, -378, 90, 168, 50, -119, 376, -59, -165, 514]
2674E14j97p80J080m70l78O96j37k29P6J59m00N20P0n38K96j45k98J19J67k89
2694a64K98O5k93J42J8k43Q9L65l60P5L05n61M7K20j18k20N39k46m87O47l58k17
2716d57J97J88l13L59J42o38M70J36p05M51M86n92J23J00Qk05K64r9r9L21k31
2737i4k50K37L96m70N46j38n94N36k11r6M95j21k29L39j38j20J28j3m72L17N49
2758E97o55J86L26n46m9P78o90N5M46n30l16O88k01l39M97k02L5mj3k68J94M2
2780C1j56M4R8l14J67M72p96O13j51m26N12l0n49M21q7k27L78Rk09k57N15R6k93
2803a39K31j28m91Q94l45m74N43r0l46L90k34P7N45m43J47j55N4J81k64L88j45
2824A96k53N49n90M4N99n24J95L13o85J87J45m8M4J15m38J45J72j50J87k77K31
$$ y = [514, 317, -463, 617, 147, -231, 465, 328, 99, 175, 334, -66, 454, 524, -14, 282, 137, -161, -42, 125, -164, 134, 199, -94, 48, 66, -177, -88, 277, -83, -8, 297, -264, -217, 3, -115, -335, 204, -42, -529, 118, -240, -457, -260, -72, -385, -26, 116, -522, -52, 84, -621, -170, 316, -276, -153, -53, -45, -250, 14, -85, -184, 137, -94, -344, -107, 289, -181, 365, 227, -367, 169, -42, -138, 357, 236, 7, 346, 208, 88, 216, 203, -269, 48, 597, -58, 128, 454, -92, -141, 637, -53, 2, 448, -82, -398, 290, 89, -250, 247, 45, 80, 76, 63, -205, -11, 31, -125, -81, 17, -297, -130, 342, -454, 159, 8, -418, 94, 64, -485, -64, -151, -378, 0, 9, -200, -457, 58, 154, -139, 92, -36, -527, 367, 22, -452, 91, 1, -345, 45, -189, -112, 433, -10, 137, -18, 36, 217, -47, 341, 196, -57, 492, -98, -54, 545, 21, 216, 529, -156, 31, 176, 128, 172, 287, -151, -6, 166, 16, 203, -74, 157]
2845A57k85J96N00r82J73P31r14M84J06o59N42J61o34K83K06j91R6j05J07m90
2865e18O63L3p41N34m3m93Q46m05n68R54l20j35N38m67k36M6L83k49j52L26j35
2886a39r9M08k46k44Q13m01l57O60o23J35M92n55K59K49k27L00m36N0J26P5J46
2907C86n56n3M22l31J98M30p23L23L27n62N07j58o88R06m31M2K74k45J36j92l44
2928c32M25o16N56J99p11N94K0q25R12m0p66M67K38m60O29n92M0K93j13Qk09K98
2950A5k19K4L47m12l4N49o03j8P15m74N4L87o29K54L39l60J80k4K9k39K29K99
2972D09l89l3L29l61K29K32n91M36K16p21O75j74k10J69j60r0J46l4n5P7j98K9
2994f9k26L89q5l45N03l5n91O15k70k89Q28q11j4L87j32j41J98K73m63j46M84
$$ y = [157, -128, 68, 568, -414, -241, 490, -424, 60, 166, -493, 49, 210, -424, -141, 65, -126, -30, -135, -28, -518, 145, 178, -563, -29, -72, -565, 281, -124, -692, 262, -58, -193, 345, -122, -358, -312, 71, -178, -330, -4, -139, -238, 170, -76, -320, 493, 92, -265, 395, -228, -93, 399, -156, 103, 352, 125, 425, -11, 39, 165, 240, 386, -170, -223, 199, -132, 66, 496, -227, 96, 423, -139, 368, 210, -478, 428, -3, 39, 313, 68, 204, 12, -332, 93, -523, 33, 232, -479, 115, 135, -690, 222, 182, -584, -117, 121, -339, 290, -302, -262, 31, -82, -74, -283, 15, -204, -180, 167, -245, -279, 270, -333, -351, 364, -110, -56, 331, -298, -44, 295, -65, 115, 91, 120, -119, 110, 409, 20, -13, 316, -45, 184, 416, -175, 261, 477, -244, 431, 257, 47, 216, 56, -34, 112, 78, 23, 100, -98, -69, -295, 94, 9, -336, 167, 132, -459, 156, -114, -403, 425, -386, -400, -13, -145, -286, -88, 185, -278, -424, 60]
3015F0j33l45P77o68M4M07m47j95N29m35K55M29m67O6J01l02p9N05j9j09J54R9
3037B27l69K98N0n32O01R0n32L63N3k88LK27j86N2L81m50o2M29l66j7J84p0q8
3060bM13n9n03M51j45k92K07J23l02L27k56j9P9J28k95J27J95l29K27J53l84J65
3082IJ9k01r4O31m06k99M48j84j49K23k52n1K82k0j52J16o2l01O52Ok30o6M5m25
3106d61N54J61n58J89K55l54K97J94l35k6O10m30l30N05j11P3J71k95j30M72O0
3127E11l59Mk30K82K13k47n45P82k14l03K41o6r2K51m6j80MK32l61j07K91k27
3149a66K11K8n8J7K11l35k93M62K9m13M65l37M2m9p5n3K73R4l62M15j73j71K27
3172a1k77Q2K37O0k93J84K15o26M95k5j41K38n5l86J38L18j41Q0K41l63k39N00
$$ y = [60, -73, -418, 359, -309, -265, 142, -305, -500, 29, -406, -151, 278, -189, -123, -22, -324, -403, 102, 83, -26, 128, 227, -142, 156, 206, -326, 275, 365, -167, 196, 249, -39, -36, 191, 5, 57, 438, -12, -74, 355, -11, -28, 156, 86, -2, 411, 352, -151, 300, 155, -137, 70, 193, -109, 218, -38, -57, 22, 150, -145, -18, 177, -152, 75, 228, -156, 9, 28, -173, -267, 364, -42, -341, 107, -77, -226, -3, -255, -306, -24, -44, -196, -80, -142, -443, 209, 215, -15, -81, -36, -461, 93, 254, -304, -115, 140, -214, 83, 277, -58, -84, 526, 96, -234, 271, 160, 233, 404, 109, -21, 451, 511, 152, 156, -74, 208, 421, 174, -371, 411, 197, -106, 135, 69, -23, 228, 182, 2, 6, 238, -123, -230, 61, -166, 45, 73, 15, 32, 243, -92, -385, 77, 106, -307, 158, -179, -137, -186, -261, -314, -41, 53, -309, 106, -67, -238, -11, -288, -206, 31, 91, -202, -18, 197, -429, 66, 41, -100, 138, 83, -303, -165, 153, 12, 92, 333, -30, -269, 231]
3194B31j75k71N11j19nKJ13m66K37J66n29L67K03k09q6J94k25R2N28m86j03L31
3216C01k90K9L60m72j95O01l06k87L01m6l0J01k8j15j01M30n68L15K25m54K00
3237b9J64m16K21q2m01M91oj24M0K70m76K06O2l7J7M05k45m82N02j52k25O49k73
3260G9k70M42k84j85M41j11j49K29J63J3k76L15m39M1K48l06j46O70l71J5K54
3281C73n11K56P2l72K12J74K6k04K20j42j16J86K9l98L04k2m86L84o5r4O1Q3m45
3304d75N64p6l03K56J50k18J1n8M61m74q8j2l51O49J47n16M24l1k21N81n32j24
3326b36N68l87o3J68Nj12q9J76j50j05L00m93LQ16o24j41N94l76l0M38k63l5M05
3349C69o45M07Q3j09J22k67J27q9QL44l76nN15p18J20N93p84O57j57j98N6J01
$$ y = [231, 56, -215, 296, 177, 172, 174, 287, -179, 58, 224, -305, 62, 265, 56, -30, 164, -61, 31, 559, 73, -30, 301, 11, 40, 400, -72, -267, 334, 28, -259, 42, -4, -34, 67, 39, -76, -177, 253, -315, 0, 225, -229, -29, 135, -281, -60, -142, -543, -52, -58, -182, -142, 128, -348, -142, -80, -117, -100, 305, 60, -422, 80, -72, -297, 352, 79, -191, 251, -33, -218, 223, 112, -37, 192, 355, 368, 92, 407, -32, 9, 257, -49, -195, 475, 104, 119, 373, -138, 118, 190, -182, 30, 204, 230, 26, 246, 104, -12, 174, 203, -195, 109, 87, -399, -15, -80, -174, -113, -30, -475, 89, 13, -290, -34, 116, -102, -91, -149, 312, -162, -250, -262, -613, 36, 183, -333, 91, 60, -161, 420, -112, -236, 332, -55, -118, 50, 55, -57, -146, 30, -120, -225, 75, -418, -415, 401, -223, -364, 230, -146, -176, 262, -1, -36, 369, -276, 131, 214, 105, 227, -40, 87, -2, 6, 350, -26, -31, 484, -234, -114, 479, -305, 352, 195, -3, 53, 154]
3371A54m93K16R5j64J58m7L41l98J48J58m02L17j44l42N47k77j52N30o08R7N05
3392B39l89J77mj06j98J73k3L25l55K62l30KN39n07L5K19l76J98M9m00M97Q3k11
3415a01K62j4N9n1k22K48j96J12M08o82k7O69o87N72k04n43M44L26l14K99m05
3436d7o0J89J70k60l24N68m8k74J94J00m95K75k7j24K00j38k58N65l73j70L06
3457c1o2K46l2k28M0j07L43m54K35J25l02j6L43k73K6J5k67K08QJ9J74R6R2l24
3481a26K42k33n8L43L0j33l5k44J10K82J02m30M4M99n86J80K48n82N01j79k1n6
3503a02J71J70j0j19J60l72L04L4k34J31k45k42N83k45k71O69m77R9lJ2L5K4K09
3526B81l53j65K75j35K51O6l48r4J37j15R5K20j78k38M18l10q2K5K07Q6p5r3j38
$$ y = [154, -339, -123, -28, -192, -34, -81, 260, -138, 10, 168, -234, 83, -61, -403, 144, -133, -285, 245, -363, -266, 239, -150, 27, 23, -83, -281, -108, -131, 194, -161, 101, -229, -227, 312, -195, -160, 59, -317, -119, -70, -470, 27, 110, -101, 161, 147, 206, 155, -67, 181, -15, 97, 505, -177, -204, 465, -222, 350, 146, -397, 47, 373, 59, 358, -47, -107, 82, 252, -8, -332, 236, 188, -86, 108, 208, -287, -12, -39, -163, 37, -101, -359, 206, -167, -337, -31, -93, 153, 121, -107, -67, -174, 169, -285, -50, 75, -227, -243, 100, -173, -147, -132, -399, -191, -183, -164, 10, 106, 198, -126, 116, -117, -175, 168, 198, 65, 30, -214, -104, 178, 280, -150, -106, 393, -193, -13, 235, -347, 154, -25, -46, -102, 69, 239, 229, 110, 270, -102, 202, 236, 2, 133, -112, -354, 229, -16, -287, 382, -95, 4, 1, 13, 48, 72, 281, -72, -237, 38, -97, 154, 220, -128, -222, -85, -200, -105, 115, -63, -301, 117, -193, -275, -250, -43, 43, -32, -125, -263]
3549b63K87j72j61L68o9o7pL50k68k37N92n80L98L7l21R0M18n38L23p1M0L8k4
3572A63o2rJ52k47J66K14k35m3K81l14j75K62o1k54L30k29P4j29L44k57j1K10
3594A70j42j72K58M6m96O89n33J98J76m00M9j86K45j27L78l51n0j1J18q7L9J73
3616a6j93L59Lm92L75rj23j08K81l76J65J12j83K70l8j13j38M24j96q7J70P6l78
3639b15J71J78j79K17k07q6K79r2k16K11J60q9L23k36l44K28M1j8R3p5j00j20
3661g6K70j69k04N00l99J84L9o8k44K45l33K76K2q3Oj92L13l92N16j41k40R1L
3684g6p2J65p7j11L56k15k34L26j91j1K1K46j99r7P0j08j36L36j54J70L7m0j00
3707i4R0M8j55L10j88LK30m7m24J24Q0q3M5J84r0J7K78l97N5K79k36j18J39j68
$$ y = [-263, 24, -148, -309, 59, -10, -77, -84, 266, -2, -239, 353, -227, 171, 208, -113, -23, 395, -143, 180, 109, 149, 187, 163, 101, 92, 244, -3, 163, 377, 142, 99, 380, 66, -109, 153, 92, -162, 168, -61, 13, -116, 228, -29, -40, 170, 28, -144, 114, 160, -336, 353, -180, 18, 194, -206, -157, -343, -98, -225, 153, -198, -248, -259, -141, -228, -189, -16, -209, 150, 153, -339, 36, 27, -96, -204, 77, -299, -134, -22, -205, 65, 27, -86, -224, 200, 4, -83, 87, 163, -215, -44, 134, -45, 172, -35, -121, 158, 66, -150, 61, 221, 132, 455, 219, -125, 103, 144, 126, 219, 144, 44, -76, 194, 25, -179, 321, -78, 106, 145, 77, -167, 78, -255, 21, 43, -40, -34, -226, 87, -305, 211, 70, -170, -79, -76, -148, 17, -60, -171, 185, -30, -264, 62, -129, -140, -119, 127, -72, -169, -99, -207, -343, -7, -161, 9, 46, 6, -94, -4, 44, -111, 199, 11, 14, 244, 197, -227, -103, -23, -106, -61, 123, 33, 50, 328, -69, -14, 265, 29, -89, 50, -118]
3731a18J60J31J13p2l9l38J35P8lK53l90J88l48K19j03n2K32k48J72q9R3j90K78
3754F2j1l72M08pl71K50p3j5n9m5L30j59L9rk34M86j16m90M35j49J20j33J0oj4
3779a23L76J03k63j65K76l00J42J47n21M12l4PJ03k15P3J17k07J05L02n02M48
3800B81k05J44k16K44q1j49J3p4j08K79Q9n70M49K33m54R4m4J4J98k17m0J78k18
3823a60J56j64J02J43k10M4p9J54K5q0l35L57k4k31M43k50q0K33l47L28J29j16
3845C8j15J70j17J37n10O02k43o1K83k12j4K03j66J41j41j24K21k28R9K62j18
3866A07j72O0j63L48j10j9J34j06N6K56m18l9J8O2K07R5p21N73j59j3J33k47N0
3889f8j88M12j92QP9J08p3m5k7k72K81R8j71L57l71J23l3j28J91l66J17J1rK00
$$ y = [-118, 42, 173, 286, 214, 175, -163, -28, 50, 47, 300, -90, 98, -250, -31, -134, -186, 46, -202, -30, -119, -26, -216, 62, 51, -321, 87, 80, -291, -41, -114, -129, -188, -233, 97, -62, -23, -32, -266, 220, 104, -386, 49, -100, 20, -113, -103, -109, -123, 253, 356, 93, -72, 204, -96, 46, 193, -328, 84, 50, 57, 160, -55, 18, 135, -72, 33, 335, -167, 281, 76, 220, 4, 248, 167, 18, 31, -43, -151, 128, 217, -353, 96, 329, -125, -31, -75, -61, 137, -80, -120, 58, -160, -4, -168, -66, 77, -133, -89, -168, -14, 11, -69, -404, -47, -71, -302, 141, -109, -189, 44, -303, 25, 154, 38, -77, 93, -24, 113, -397, 205, -38, -99, 184, -28, -42, 161, -5, 136, -5, -129, 92, -136, -37, 225, 107, -65, -5, -168, 180, 70, 51, 185, 79, 135, 391, -27, -66, -48, 14, 221, 316, -405, 168, 9, -4, 129, -118, -68, -256, 156, -36, -28, 51, 159, 86, 41, 14, -258, 23, 121, -50, 307, -64, 59, 26, -102, 89, -277, -160, -149, -158, 42]
3913D2r5O3K32n18P0O10o21J02K89m21L11j23j74K30J92m09J67j02L26k66qK82
3935A79j77l0K04j03J69j70j13J21M2r4J84k23l6J7J49o9j10J34K6n6J75j10l16
3958b07O15l77j68K02J30m03L69k64L3q5qK46L1j99p3O6k88K15n7Q9M4K99k65
3981e5k33J71n3J12J64j33q5j52M28m75J78O9q5P7K7J19j47L34k29o2J36l4j94
4004a22K47j55j20J53L5m2K7R1k64K65r1R5k77N15l10j90K98j91j9J87j52k60
4026b80L84P9q5m3K6k1L6j52L6J11m7j57J25p9J83k48L37m71L82m27k1M50j46
4049b8k51J23J91o8p8Q4jj16J94j63J01K12j26l73L52n39L32j8J89k51K09J16
4071I1j33N1K65m06nL15j53j6J77l89J2K76j93K22K10k95j12M07k94k88L36O1
$$ y = [42, -53, 10, 242, -276, -206, 404, -217, -115, 174, -247, 64, -59, -233, -3, 189, -220, -53, -155, 171, -95, -103, 179, 2, -28, 176, 73, 242, 72, -41, 80, 122, 28, 212, -11, -47, -30, 119, 50, -60, 74, 100, 44, 219, 109, -207, 408, 31, -137, 65, 195, -208, 161, -103, -70, -155, -163, 83, 114, -85, -158, -92, -380, -165, -222, -133, -89, 210, -55, -288, -117, -170, -58, 106, -27, -112, -264, 164, -311, -133, -64, -149, -72, -45, 74, -73, 261, 32, -30, 106, 72, -122, 125, -30, -150, 3, 38, -4, 23, 114, -150, 115, 24, 119, -158, 357, 47, -143, 155, -36, -55, 132, -20, -280, 104, 183, 98, 55, 81, 60, 96, -56, -20, 91, 44, -113, 12, -67, 116, -132, 205, -266, 116, -311, -332, 118, -28, -279, -156, 35, -33, -111, -27, -28, -144, 50, -113, -12, 200, 74, -299, 53, -486, -154, -172, 17, -234, -25, 91, -42, 9, 274, -132, -137, 178, 25, 9, 186, -203, -191, 85, -108, 114, 324, 29, -83, 324, 30, -258, 78, 139]
4093A39J12k64J73j78J61l8j09J50n53N56J45j83L1j26M3p2LJ46k74L04l32j1
4115a77K05J65j85o8O6N2n3K70l75N0o4ok09K43J64k93J87l2q2k7J60r1k75K39
4139a36j17k3J68N9j17m1k23L54Q8k5p7K83k53J21J84j45k02J32J39k22q9m9K98
4162A07J83j48l55L84k30k9R0J73Lj08J21k19o8K01j84J83j34rr7J95J49l61O5
4185h8PJ97j36Rl8j98L46m17K65J37r7j45K97l39L21j07l35L53p5n5K02j2J0M8
4209A50k52o9l2M17k19R3q6j05J9j9J58r9N4J01k32J38k39K09J38j85M26k20M5
4232A91q5j3k52q8J48L45n01R2J04k4J00K72l80K03J47k48n6J1J04J84j45M5N2
4255B06l10K09o5O4k12Q6J46M8m75L65J04j85K39j61l31M70k91p6J24J14o3j1
$$ y = [139, 251, -13, 160, -18, 143, 105, -4, 146, -407, 149, 294, 111, 142, 16, 59, -13, -10, 136, -138, 166, -166, -177, 28, 193, 8, -60, 6, 58, 5, 275, -100, -50, -114, -120, -329, -86, 78, -215, -28, -60, -142, -169, -9, -100, -375, -136, -253, -276, -108, -49, -166, -207, -430, -76, 12, -13, -90, 193, -60, 61, 245, 100, -102, 30, 169, -53, -142, -191, 107, 290, 142, -213, 171, -59, -88, 2, 175, 178, 70, 191, -28, -96, 105, -79, 104, -30, -39, -136, 59, 208, -153, -88, -81, 116, -20, -11, -49, -247, 99, -318, -53, 84, -13, -158, 139, -200, 121, 14, -321, 32, -43, -98, 104, 92, 102, 150, -102, -171, -203, 214, -5, 88, 2, -103, -84, -103, 55, -44, 10, 111, -121, 17, -222, -13, 125, -60, 366, 146, 191, 106, 93, -159, -247, -99, 246, -255, -163, -59, -83, 17, 289, -91, 112, 259, 11, -45, -34, 70, 254, 109, 154, 206, -104, 105, 40, 104, -108, -22, 124, 172, -303, 62, 166, -19, 220, 59, -272, 198, -93, -169, -45, 69, 6, -5]
4277eJ02k07k05L07n9j57L03j51j52K22N5k97K09j32N2J60j75L41k24j43K28k58
4299a86L03r5j06J88m12m4O37n47N6N54l17K61k22RR7l80M86m66K81J27l07l0
4321a13K89l66J82J80k67K30j0k80J01K41r8J57l77J26K07L5q1q6p8K03m71K58
4343a8J0l22M87k65p4K86l80M5K38j02j90K87lr7j23Q3L56m08K73m4N3j74j48
4366b30J71K72j15m14M92l87J92kk4J36O0j26J5J7J75j56J45k56J6k39M57j92
4388GO8J06j98J48k79P8j28K77k75K74L1p5J83k25K17j03j4Q7l7nl48J90J42N6
4412A77m91K92N7l39L26R7j4j65J9K06l94K83j78M18l07n1k57M18o3k29J18L5
4434d2P8j34p0J36P5j47M5J04q4J26N0j22j90K25m1J13k21J37jM5j31M3J12j49
$$ y = [-5, 97, -110, -315, -8, -67, -224, 79, -72, -224, -2, 53, -244, -35, -167, -115, 45, -130, 211, -13, -156, 72, -186, 117, 22, -84, 104, -308, -352, 285, -262, -206, 348, 31, 292, 70, 79, 176, -204, 282, -184, 97, 224, -83, -113, 176, -190, -8, 172, -95, 135, 125, -155, -54, 187, 89, 246, -131, -5, 202, 237, 156, 70, -8, 195, -276, -18, -8, -330, 157, -108, -182, 104, -276, -231, 7, -95, -285, 2, -1, -98, -221, -138, 218, -190, 83, 39, 92, -82, -230, -59, 213, 98, -316, 176, -211, -19, -21, -45, 91, 151, 25, 40, 57, 232, 76, 221, -35, -19, -258, 199, 7, 75, 181, -17, 131, -148, -70, -198, 79, -196, 78, 109, 34, 217, -8, 209, 106, 92, 179, 142, 137, -211, -21, 121, 177, -314, -22, 35, -304, 22, 119, 105, -60, -41, 165, -229, 54, -124, 294, -13, -64, -321, 97, 34, -195, -77, -42, 36, -98, -168, -32, 43, -104, -59, 45, -39, 87, 137, 15, -175, 50, 9, 122, -99, 38, 37, 82, -49, -6, 106, -43]
4458d3L0n3J44O9r6q0J16k37K38M8r7J82r7ro4K5j92J44k22l5M70l26J4J50j24
4483d5q7L08o6m43K92J53r3j10J93j11L45m57K4N2L02l64J4K56j05j81M6n9P8
4506e8P3k46k56O48j50l0j22N8j8j3R8k05M26j40k56J37Nj45L04j63j29J36Q3
4529C7m8j19K19rj58J74J44k80L26j65k0j06r6L9K64j56P5LJ46l45L10j30q2k2
4553Ak4j95J40L63l03j10K54j22J17k50K6J77R1k13N2K1j59J97o3j33n9J08J83
4576I9k43J43j22m2J43j5n0J7K3q0M5K54l19j90L01n0k3L26l24J22p7J49k14O1
4600f6N6j49K08M7M8k88K45J41j14m17J64K09J05k87J36K40m8q4k09J86k54N7
4622g4j70K92J06k36K79j77J10LJ44k99p1L34j45k07J40P1p3N5l1k37n5P8J25
$$ y = [-43, -13, -66, 78, 147, 51, -29, 87, -150, 88, 136, 39, 221, 124, 115, 51, 76, -116, 28, -194, -229, 241, -85, -71, 79, -45, -132, 176, 110, -333, -41, 112, 19, -91, 102, -9, 336, -121, -97, -45, 257, -107, -93, 163, 58, -123, -77, -136, -58, 15, -231, -487, 161, 11, -19, -141, -83, -101, -114, -16, -221, 205, 65, -191, -54, -49, -194, 110, -53, -182, -46, 37, -11, -130, 89, 80, -78, 96, 240, -40, 286, 121, 101, -5, -101, -62, 202, 46, 121, 124, 270, -75, 235, 105, 23, 1, -23, -218, -78, 285, -18, -128, 126, 4, 121, -129, -103, 74, 165, -48, 4, 25, -134, 63, 0, -133, -192, -84, 99, -144, -1, -123, -165, -22, -37, -87, -70, -47, -127, -82, 172, -147, -337, -36, -86, -109, 217, -107, 15, -62, 87, -127, -66, -10, -159, 49, 96, 144, -144, 101, 242, 128, -289, -125, 84, 189, -98, 38, 278, 230, 146, -63, 123, -131, -74, -244, 48, 154, -82, 197, 20, 130, 133, 277, -22, -93, 241, 96, -111, 29, 100, 27, 82, 51, -186, -241, -163, -38]
4645c8P8l5r4K0K69k04J9J17k52K90k23j2J02j15O5k19K27nl52K04M6k6K9K79
4669A70j62J88n41K91K03o9n0k4J42j28K5J36j26j24j9J73j27K03j12QR3k2j62
4692c4J32j83J00L40l22j99P1K64j9k90J81j75J73j01j10M67l96R4k0j73J21J74
4714I5j22m7R0n9m9MR6r1k60L33O1M2m32N7n9K54J39l08L45k8j79J62Q4j89K21
4739A60k08j99J90N7J47j05J89N9m75m6J93k5K10o5j79K98J19k74k5k31M20k25
4761a5J07k00K97n3j54j7K27J07l85K18l70K30J43j98J72L2k25L06m30J33k12
4782b87L91m0j20M7j21R8R7N9j54j77L06k14L2J16n91P45k36r4J58j55K05K7O9
4805A61k73K11j78Q7k09L09k28j8L8J83j89K04j47m8L00k29J37n2j87k40K34q4
$$ y = [-38, 40, 5, -89, -69, 200, -4, 15, 132, -120, 170, -53, -65, 37, -78, -13, -232, -5, -10, -362, -158, -112, -138, -109, 170, 8, 196, -345, -54, 149, 80, 30, 6, 148, 20, 45, 181, 55, -69, -88, 85, -42, 161, 49, 57, 150, 128, -34, 98, -85, 15, 355, 33, -166, -95, 169, 150, -140, 41, -134, 39, -62, -172, 295, -101, -7, -27, -200, -79, 95, -27, -74, 16, -43, -92, -88, 8, -83, -343, -10, 51, 93, -339, -282, -341, -87, 52, -256, 89, 61, -118, 44, 128, -61, 160, -48, -247, -57, 0, 147, 42, 231, 290, -185, -231, -38, -63, 147, 82, -97, 201, 320, 46, 21, -210, 210, -15, 92, -108, 189, 136, -18, -35, 192, 299, -86, 132, -238, -8, 135, -63, 109, 141, -84, 222, -208, -75, -287, 104, 64, -56, -9, -130, -32, 65, 124, -30, -207, 99, -115, -83, 33, -558, 187, -49, -143, 15, -140, 65, 92, 161, -112, 99, -79, 8, -201, 108, -120, -138, -100, 83, -106, 98, -49, -97, 203, -26, 111, 59, -128, -368, -134, -218]
4827b18J21KK04m07J75K39j09n2K13n8j71J63q8J36j61n9NJ91j37K09L7q4K8l05
4851a26L14m7P8rl50J11J12k04J61j90J79L46k70k47J64l2k29J64J07p5J20k07
4873a30K03k56o4K10K49k10l3l6J03k52J54K51j89J1j97J28P6k29k6J40qN9j10
4896a56K16J01k59J34j7k10K01K74k53P5q5J6J49j60N2K10l01J57k39K21j37j48
4918a59J99J63l39K01j2J04j56J99l02L90l91r2J74k13K46j8k7j90K87q3k26N7
4940a88J66j30J40j05M2J87j18P4p2j35r2J47J15n6j87J36J30l1rq5J80k14M9
4963e6K14k20J4L8p5L77n08K11L5K7j28oP9Q0J2j37M8K09l0m7m4p7n1L47q4k66
4989c8j4n2J11l8J97j74j18k2J16J18J84k93J15L9Q8p3j87K1K17j3m7O8k62j19
$$ y = [-218, -97, -95, 109, -298, -123, 116, 7, -45, 168, 110, -61, 102, 14, 150, -11, -70, -65, 126, -11, 198, 235, 151, 179, -126, 188, 141, 219, 210, -140, -29, 83, -121, 40, -150, 29, 375, 105, -142, 22, -10, -239, -75, 32, -43, 77, -130, 73, -183, -247, -37, 212, 2, -31, -67, 36, -216, -62, 189, 0, 11, -186, -58, 18, -211, -237, -97, -105, -46, -156, 60, 161, -98, 36, 19, -191, 10, 284, 31, 106, 21, 37, 186, 26, 78, 288, -13, 144, -95, 126, -11, -159, 40, 203, -136, 65, 53, 157, 1, 200, -102, 288, -103, -195, -21, -234, 12, -6, -33, -223, 64, -19, -245, -188, -22, -152, -12, -117, -75, 112, -6, 68, -4, -139, -231, -84, 31, -25, -212, -76, 54, 23, 14, -71, 109, -105, -56, 158, -62, -48, -10, -85, 292, -216, -5, 30, 57, -71, -77, 2, 82, 94, -43, 5, 214, 184, 137, 93, 16, -35, 312, 228, -38, -52, -104, 7, -31, 166, -8, -126, -148, -32, 86, 270, -23, 92, 131, 219, 146, -41, -20, 197, 184, 137, 205, -57, -176]
5013a76K13j51P3k13L29R6j09Lj43k6J10J68j98Kpj76Q5J08qJ82k44k6p4K39K85
5038C42l99Q5j02l8n7J02l0O0r7J40l0n6K82k71k2Q1R6j45R5o0L7O4r6K2jJ1j0
5065CJ5p6p3J6J75P9k64J64k9O7k38M71l13j48L44k99M9J37q1j36P9QK85j44J19
5090B10k96J44J05k24p1p0N9L5P5j96J56J27j58j32L63ll08K31j18o6L50l39Q0
5113d6M2q0nJ71k65L1L62j06q1Q6n9j83J41j16j3L07j84J16j19J63k13J74J54
5136B77o3j35O2l48J63Q5J18j9K3k68K0J83k20K78qj3k5j40j05J39N6K17m60J12
5160g1J29R4q7K92l13q2j9J6J15k01J88ql12J98j90J85O6j59J96j31N4k8J37k63
5184a94l2L48l26J07j21J22K50Qj83j16K38k38P2j7K00r9j73J27Q7L15m14J22
$$ y = [-176, 37, -114, -41, -254, 75, 171, 62, 65, -78, -104, 6, 174, -24, -22, -29, -205, -120, -12, -20, 162, -82, -108, -182, 57, 342, -57, 28, -74, -112, -169, -67, -97, -37, -134, 6, -24, -80, 202, -69, -91, -10, 86, -59, 36, -24, 13, 77, -19, 3, 2, 13, 3, 18, -58, -131, -115, 60, 139, -125, 39, 10, 77, -161, 310, -3, -151, 193, -106, -57, 80, -1, -137, -58, -50, 235, 91, 210, -86, 58, 163, -61, -132, -202, -143, -108, -33, -229, -73, 54, -104, -236, 127, 124, -184, 47, -71, -137, 213, -126, -46, -4, -84, -89, 82, -183, -152, 210, 104, 23, 109, 50, -133, 8, -108, -121, 186, 2, 118, -1, 162, -51, 123, 277, 214, 79, 141, -207, -44, 41, 159, 140, 163, -105, -85, 98, -122, 156, 148, 135, 110, -30, -135, 4, 60, 277, -183, -71, 58, 152, 65, 357, 44, -38, -57, -41, 74, -127, 61, 53, -259, -61, -251, -66, 0, -159, 37, -94, -40, -68, 69, -194, -226, 122, -204, -97, -218, -96, 154, 162, -21, -137, 101, -137, -65, -82, 118, 19, -154, -27, 60, 375, -39, 83]
5206H3R6k03Q4ql84P01l68K59l55K03r5j16P2L15m59K23k3J5m2j31K02q7J39k52
5230a31K29j56K48k36P3J94M1k42j87K08M6j45kM4J82j47J20K8m72N16l91k2r
5253b11L95l23R7J55k14k11K91j61O8M8m7j53M49k40J23m4l08R9K69k21K34j50
5275e5R7P8J85k58O4k79K16q1J10p8j11M27j14j27QJ08l65K48J02j40m4n0k0K68
5299A89J18k98K30m16M12j78k45J32%L11l54O7p8Q2q5j97P8J78j44J28K52j39
5321D3o9P1j37O1L8k2k01L02r2j15M9j24J50k08J00k3J24J22p1N4K5j40k05J46
5345a22p3K29k17p4K72J9R5k11O8J41n9P6nj49P6K1j13NK67m21K71j17%O2j66
5370a25J16K10k23M4O3j93r1M9L44l16k0l0K8Q8n7J86k86K96k31L20j23M8R5j69
$$ y = [83, 179, -24, 60, 52, -332, 369, 1, 260, -95, 108, 13, -103, -31, 284, -175, 48, 25, 40, -2, -133, 69, -18, 121, -131, 98, -58, 190, -46, 27, 221, 262, 20, -167, 41, 87, -58, -60, -16, 166, 19, 139, 167, -305, 211, -180, -202, -211, 184, -139, -42, 113, -101, -312, -21, -182, -114, -66, -113, -266, 183, -57, 66, 22, -286, -187, 82, -139, 95, -55, 42, 120, 305, 47, 111, -168, 48, -33, 77, -1, -112, 315, 201, 74, 82, 190, -175, 73, 175, 35, -9, -59, -79, 189, 307, 9, 239, -177, 235, 57, -188, -56, -56, 255, -99, -32, -110, -28, -113, -310, -232, -54, -198, -70, 182, 43, -26, 45, -92, -31, 7, -15, -216, 86, -6, -121, -72, -196, -46, -254, -154, -177, -53, 69, -2, 52, 77, -63, -268, -122, -195, 34, -183, -257, 15, 34, 129, -82, -14, 127, 68, 144, 139, -10, 66, 87, -26, -21, 246, -175, 96, -21, -21, 41, -125, -9, 201, -22, 22, 85, -108, -199, -150, 194, -122, -142, -172, -144, -56, -113, 73, -213, 83, -148, 172, 49, 97, 192, 23]
5394B3p9j0l8P1J1N8k7J4j56l7J88J9J22j83r3J49o0J34k47J27q4O3rn2J96k34
5420a34M67m55o5Q6J9J94j02K36j47K5o6O0j38J00J34J25l15o3K73l53K33o7j17
5443g0M4n9K75m2q1Mj84Q4JQ1j21L47j87K7m2L6%M8J02k67k21K46j19N1K7M5N0
5470G5q0j94K54j36N1Q9k77K25j24K11P6j1k56N8N1JM0J40k42n9MN5J07l02M21
5495A77k11RJ22K26m29L10l59J98M0l0l8p4J25j69l9o3J99n4K98m43O4K41j49
5518d9q9L49K11l59n5p2J85K34l33k9q2r8J65P6M1q3mK49k61j69K22j29p7P2K25
5543A40l57K30k08L98j70q5j14K14k74K63k68L68J85k34J13j01j75k33L83l2k7
5564A6J27M1J4p1pk1k01k16M58P6k77P7n4p8P9j73M64p7N5j85k31J29kJ28r6L8
$$ y = [23, -56, -66, -104, -33, -22, 36, 9, 23, -133, -170, 18, 37, 159, -24, -117, 32, -28, 106, -141, -14, -98, -35, -44, -96, 100, -134, 333, -122, -187, -101, -82, 112, 10, 246, 99, 124, 58, 118, -20, 80, 214, 339, 24, -39, 234, -119, 114, 47, -70, -26, -85, 190, 148, 67, 71, -113, -29, -28, 53, -68, 279, 92, 119, 77, 113, 113, 161, 263, -4, -225, 21, -98, -47, -20, 25, 75, -5, -199, 55, -81, -30, 59, -218, 7, -117, 94, 170, 159, -97, -39, 12, 13, 53, 193, -49, -108, -104, -49, 58, -244, 177, -34, -25, 97, 323, -106, 204, -155, 43, 83, 53, 15, -59, 66, -103, -142, -205, -6, -60, 238, -205, -141, 100, -49, -138, 211, 422, 63, 8, -64, 121, 355, 22, -7, -89, -187, -22, 54, 95, 12, 8, 257, -4, -173, 49, -80, -157, -85, 140, -217, 13, -195, 203, 33, -52, -166, 48, -226, 37, -231, 137, 322, 88, 201, 100, -75, -308, 75, 43, 16, 143, 184, 198, 127, 120, 99, -102, -318, 140, 216, -61, 16, -38, -116, -37, -210, 254, 177, 232, 47, -184, -55, -57, 71, -25, 13]
5590A3P2j5k1L6l77J99K11k91K65OJ18k78J22L7j39L56k13j48j78L41k39KJ91
5613G0l06L15j48K4K02q0O2j44m2J89k47K30j76QJ07j96L9R0L8k3J21k33J09J02
$$ y = [13, 85, 70, 49, 85, -292, -93, 118, -173, 92, 98, 216, -62, 60, 97, -42, 314, 101, -47, -225, 116, -123, -121, 70, -236, 79, -69, -45, 157, 77, 139, -5, -47, 142, -105, 125, -51, -43, 64, -132, -93, -3, 35, 12, 133, -100, 9, 111]
$$ [...]
8191C6
##END NTUPLES=NMR FID
##END=
