##TITLE=1H_SL73(28.09)-Ag-f1
 CDCl3, 8 sc, 
 29.9.2020
##JCAMPDX= 6.0         $$ Bruker NMR JCAMP-DX V2.0
##DATA TYPE= NMR FID
##DATA CLASS= NTUPLES
##ORIGIN= UXNMR, Bruker Analytische Messtechnik GmbH
##OWNER= root
$$ XWIN-NMR		Version 3.5
$$ Tue Sep 29 10:14:37 2020 Russian Standard Time (UT+4h)  she@DPX200
##.OBSERVE FREQUENCY= 200.1315066352
##.OBSERVE NUCLEUS= ^1H
##.DELAY= (6, 6)
##.ACQUISITION MODE= SIMULTANEOUS
##.ACQUISITION SCHEME= undefined
##.AVERAGES= 8
##.DIGITISER RES= 18
##SPECTROMETER/DATA SYSTEM= spect
##.PULSE SEQUENCE= zg30
##.SOLVENT NAME= CDCl3
##.SHIFT REFERENCE= (INTERNAL, CDCl3, 0, 15.7039)
##AUDIT TRAIL= $$ (NUMBER, WHEN, WHO, WHERE, WHAT)
$$ ##TITLE= Audit trail, XWIN-NMR		Version 3.5
$$ ##JCAMPDX= 5.01
$$ ##ORIGIN= Bruker BioSpin GmbH
$$ ##OWNER= she
$$ F:/spectra/data/she/nmr/H-F/1/audita.txt
$$ ##AUDIT TRAIL=  $$ (NUMBER, WHEN, WHO, WHERE, WHAT)
(   1,<2020-09-29 10:13:37.89 +0400>,<she>,<DPX200>,
      <created by zg, POWCHK disabled, PULCHK disabled
       configuration hash MD5:
       00 E9 B6 7A A2 85 ED C7 34 08 36 98 17 FE 4E 26
       data hash MD5: 16K
       EC 6F D5 68 ED 06 6E 82 22 E9 7B 6C 1E 03 31 98>)
$$ ##END=
$$ 
$$ hash MD5
$$ D2 86 DF 17 11 20 EA 58 FA C6 D0 94 FC AF A8 9C
##$RELAX= 
##$RELAX= 
##$RELAX= 
##$RELAX= 
##$RELAX= 
##$RELAX= 
$$ Bruker specific parameters
$$ --------------------------
##$DU= <F:/spectra>
##$EXPNO= 1
##$NAME= <H-F>
##$PROCNO= 1
##$TYPE= <nmr>
##$USER= <she>
##$AMP= (0..31)
100 100 100 100 100 100 100 100 100 100 100 100 100 100 100 100 100 100 
100 100 100 100 100 100 100 100 100 100 100 100 100 100 
##$AQSEQ= 0
##$AQ_mod= 1
##$AUNM= <au_zg>
##$AUTOPOS= <>
##$BF1= 200.13
##$BF2= 200.13
##$BF3= 200.13
##$BF4= 200.13
##$BF5= 200.13
##$BF6= 200.13
##$BF7= 200.13
##$BF8= 200.13
##$BYTORDA= 1
##$CFDGTYP= 0
##$CFRGTYP= 5
##$CHEMSTR= <none>
##$CNST= (0..31)
1 1 145 1 1 1 1 1 1 1 1 1 1 1 1 1 1 1 1 1 1 1 1 1 1 1 1 1 1 1 1 1 
##$CPDPRG= <>
##$CPDPRG1= <>
##$CPDPRG2= <>
##$CPDPRG3= <>
##$CPDPRG4= <mlev>
##$CPDPRG5= <mlev>
##$CPDPRG6= <mlev>
##$CPDPRG7= <mlev>
##$CPDPRG8= <mlev>
##$CPDPRGB= <>
##$CPDPRGT= <>
##$D= (0..31)
0 1.2 0 0 0 0 0 0 0 0.06 0 0.03 0 0 0 0 0.0002 0 0 0 0 0 0 0 0 0 0 0 0 
0 0 0 
##$DATE= 1601360017
##$DBL= (0..7)
120 120 120 120 120 120 120 120 
##$DBP= (0..7)
150 150 150 150 150 150 150 150 
##$DBP07= 0
##$DBPNAM0= <>
##$DBPNAM1= <>
##$DBPNAM2= <>
##$DBPNAM3= <>
##$DBPNAM4= <>
##$DBPNAM5= <>
##$DBPNAM6= <>
##$DBPNAM7= <>
##$DBPOAL= (0..7)
0.5 0.5 0.5 0.5 0.5 0.5 0.5 0.5 
##$DBPOFFS= (0..7)
0 0 0 0 0 0 0 0 
##$DE= 6
##$DECBNUC= <off>
##$DECIM= 32
##$DECNUC= <off>
##$DECSTAT= 4
##$DIGMOD= 1
##$DIGTYP= 9
##$DL= (0..7)
0 120 120 120 120 120 120 120 
##$DP= (0..7)
150 150 150 150 150 150 150 150 
##$DP07= 0
##$DPNAME0= <>
##$DPNAME1= <>
##$DPNAME2= <>
##$DPNAME3= <>
##$DPNAME4= <>
##$DPNAME5= <>
##$DPNAME6= <>
##$DPNAME7= <>
##$DPOAL= (0..7)
0.5 0.5 0.5 0.5 0.5 0.5 0.5 0.5 
##$DPOFFS= (0..7)
0 0 0 0 0 0 0 0 
##$DQDMODE= 0
##$DR= 18
##$DS= 0
$$ [...]
##$SUBNAM2= <"">
##$SUBNAM3= <"">
##$SUBNAM4= <"">
##$SUBNAM5= <"">
##$SUBNAM6= <"">
##$SUBNAM7= <"">
##$SUBNAM8= <"">
##$SUBNAM9= <"">
##$SW= 16.880792210976
##$SWIBOX= (0..15)
0 0 2 0 0 0 0 0 0 0 0 0 0 0 0 0 
##$SW_h= 3378.37837837838
##$TD= 16384
##$TD0= 1
##$TE= 0
##$TE2= 300
##$TE3= 300
##$TEG= 300
##$TL= (0..7)
0 120 120 120 120 120 120 120 
##$TP= (0..7)
150 150 150 150 150 150 150 150 
##$TP07= 0
##$TPNAME0= <>
##$TPNAME1= <>
##$TPNAME2= <>
##$TPNAME3= <>
##$TPNAME4= <>
##$TPNAME5= <>
##$TPNAME6= <>
##$TPNAME7= <>
##$TPOAL= (0..7)
0.5 0.5 0.5 0.5 0.5 0.5 0.5 0.5 
##$TPOFFS= (0..7)
0 0 0 0 0 0 0 0 
##$TUNHIN= 0
##$TUNHOUT= 0
##$TUNXOUT= 0
##$USERA1= <user>
##$USERA2= <user>
##$USERA3= <user>
##$USERA4= <user>
##$USERA5= <user>
##$V9= 5
##$VALIST= <valist>
##$VCLIST= <CCCCCCCCCCCCCCC>
##$VD= 0
##$VDLIST= <DDDDDDDDDDDDDDD>
##$VPLIST= <PPPPPPPPPPPPPPP>
##$VTLIST= <TTTTTTTTTTTTTTT>
##$WBST= 1024
##$WBSW= 4
##$XGAIN= (0..3)
0 0 0 0 
##$XL= 0
##$YL= 0
##$YMAX_a= 175847
##$YMIN_a= -153184
##$ZGOPTNS= <>
##$ZL1= 120
##$ZL2= 120
##$ZL3= 120
##$ZL4= 120
##$ABSF1= 10
##$ABSF2= 0
##$ABSG= 5
##$ABSL= 3
##$ALPHA= 0
##$AQORDER= 0
##$ASSFAC= 0
##$ASSFACI= 0
##$ASSFACX= 0
##$ASSWID= 0
##$AUNMP= <proc_1d>
##$AZFE= 0.1
##$AZFW= 0.1
##$BCFW= 1
##$BC_mod= 2
##$BYTORDP= 1
##$COROFFS= 0
##$CY= 11.3945322036743
##$DATMOD= 1
##$DC= 2
##$DFILT= <>
##$DTYPP= 0
##$F1P= 16.9975609425685
##$F2P= -3.02152046262296
##$FCOR= 0.5
##$FTSIZE= 0
##$FT_mod= 4
##$GAMMA= 1
##$GB= 0.15
##$INTBC= 1
##$INTSCL= 1
##$ISEN= 128
##$LB= 0.24
##$LEV0= 0
##$LPBIN= 0
##$MAXI= 10000
##$MC2= 0
##$MEAN= 0
##$ME_mod= 0
##$MI= 1.114404
##$NCOEF= 0
##$NC_proc= 0
##$NLEV= 6
##$NOISF1= 3.799351
##$NOISF2= 2.8
##$NSP= 1
##$NTH_PI= 0
##$NZP= 0
##$OFFSET= 15.70392
##$PC= 1
##$PHC0= -9971.548
##$PHC1= 13.20089
##$PH_mod= 1
##$PKNL= yes
##$PPARMOD= 0
##$PSCAL= 0
##$PSIGN= 0
##$REVERSE= no
##$SF= 200.130013532006
##$SI= 16384
##$SIGF1= 3
##$SIGF2= 2
##$SINO= 400
##$SIOLD= 16384
##$SREGLST= <1H.CDCl3>
##$SSB= 0
##$STSI= 0
##$STSR= 0
##$SW_p= 3612.71676300578
##$SYMM= 0
##$S_DEV= 0
##$TDeff= 0
##$TDoff= 0
##$TI= <>
##$TILT= no
##$TM1= 0
##$TM2= 0
##$TOPLEV= 0
##$USERP1= <user>
##$USERP2= <user>
##$USERP3= <user>
##$USERP4= <user>
##$USERP5= <user>
##$WDW= 1
##$XDIM= 8192
##$YMAX_p= 0
##$YMIN_p= 0
$$ End of Bruker specific parameters
$$ ---------------------------------
##NTUPLES= NMR FID
##VAR_NAME=  TIME,          FID/REAL,        FID/IMAG
##SYMBOL=    X,             R,               I
##VAR_TYPE=  INDEPENDENT,   DEPENDENT,       DEPENDENT
##VAR_FORM=  AFFN,          ASDF,            ASDF
##VAR_DIM=   8192,          8192,            8192
##UNITS=     SECONDS,       ARBITRARY UNITS, ARBITRARY UNITS
##FACTOR=    0.000296,      1,               1
##FIRST=     0,             0,               0
##LAST=      2.424536,      0,               0
##MIN=       0,             -153184,         0
##MAX=       2.424536,      175847,          0
$$ Real data points
##PAGE= N=1
##DATA TABLE= (X++(R..R)), XYDATA
0@%%%%%%%%%%%%%%Qj6J6j6J6k4L2l2M0n0N8p2Q6r9J14j32J51j72J96k23K53k86
36a52L25l67M10m59N15n74O38p06P82q68R60j060J169j288J420j565J722j897
54i95K092k307K548k820L129l483L894m378M957n662O542p678R184j1265J4240
69G998k7266J95115k08704l0225J88252k14087O7989P4098q7628M0074J7675l1409
81h118K899m749J6937P13Q058j0440M85r672O5K0253j3451K791k190k2178K9139
96A0542M307n439l782J931P08k3648K5348j1639p911N3674o6656L841N7816o8464
110b9372L4773K3082n4098L9516r854k0683K0561j1632P722l056M1J1175j3619
123e444K851P18k184K53o888N298L001L205m836l366N374k487O818r249J269J0262
$$ y = [0, 0, 0, 0, 0, 0, 0, 0, 0, 0, 0, 0, 0, 0, 0, 8, -8, 8, -8, 8, -16, 16, -16, 24, -26, 32, -40, 46, -53, 61, -71, 80, -92, 104, -119, 134, -152, 173, -194, 216, -243, 272, -302, 336, -370, 412, -456, 504, -556, 613, -675, 745, -820, 902, -995, 1097, -1210, 1338, -1482, 1647, -1836, 2058, -2320, 2637, -3025, 3517, -4161, 5023, -6242, 7998, -19268, 175847, -32857, -63082, 125170, -88917, -20928, 53170, -34458, 5616, 23291, -8118, -5219, -9968, 6969, 7682, 15740, 5300, 5785, -3887, -3822, 16431, 2980, 5771, 3581, -18597, 10542, 14849, 9410, 5628, 7559, 8267, -15381, 9967, -1672, -9583, 44091, -22565, -18724, 39092, -29372, 5401, 28483, -25615, 13901, 4047, -16636, 3925, -7707, 15, -3041, -3000, 8175, -5444, -2593, -1875, -4059, -3806, -10694, -5396, -2395, 810, -4026, -7392, -2018, -4505, 2313, -6936, -5667, 4595]
139D595j4908J1353q548n740K7169k5512J1525J9519l5092J8789o72j8431K2641
152F688o265j11M980m935K189o276R563R07l785M391j2246Q527j807n625J6180
167A2375j2902L800J0976j9660P427J2618j4045n640J4014j0608r397K9568j6121
180B405q850K6004k9222K662K0604j9731R766Q94r561J042k327R884n721M763
194B612L492j4380Q299m716k2N706j1078J2260p703l406J7368j6403O394P354
208E777j8675Q115Q085r054K75J1315j2787p398K5062j5946OK1638k6275P150
222b712P168j6854J5111j849m48L930o427O339p049N520L688q144Q696r692M441
237A718K931r462J6959j2379k062J5655j7121Q619M242j2611O607j751j705Q3
$$ y = [4595, -10313, 1040, -7508, -13248, 13921, -11591, -66, 19453, -15639, 3150, 2478, -15953, 6688, 423, 312, 5292, 357, 2546, -3730, 5833, 6740, 2955, 7346, -4900, 3627, 1820, -3805, 12375, -527, 3273, 14249, -5411, 2016, 14634, 589, -5051, 8963, -1645, -11042, 18526, 2405, -6445, 19559, -9663, -7001, 13603, -6128, 3638, 4532, -5029, -3987, -6314, 3570, -2151, 2612, 6104, -8276, 23, -4693, -4715, 991, -10087, 2173, -5530, -8936, 8432, -7971, -1577, 5777, -12898, -4783, 3302, -5752, -5477, 5838, -6949, -14347, 10715, -5231, -5225, 16413, -9862, -2712, 4456, -12398, 2713, 864, 416, 4346, -2081, 4258, -2791, 2729, 6417, -1727, 6969, -2723, 1718, 4649, -4813, 12146, -233, -2295, 13360, -3761, 4858, 9100, -3511, 3096, 1345, -360, -277]
251b77P658j276j0211J3955j1661l377J4897j5763Q588K829j2525J1007p833K062
265a927O143p463O757n347L85j13m878P423p901N567K540q618J3421j0343k521
280f875J1361j2844N885K377o479N332O3q94m153P471j251p156J4999j1156l423
295f743J3277j4746N931M741o166Q500l858J829j243n169P042m424L134J528l421
310B12L315n206N415k345q53J1859j4288K064P135j2603R936J160q143M232K231
325D121j337l175P636m754o573J1265j1189J48J0994q829M250k300l511L244l073
340c083R203o216n003Q060r399L555K534k838L946k965L947o370j891J0980j0386
355e926L329M967j1845P895L640n726M50L359r99m980R498n518m251J1897j0419
$$ y = [-277, 7381, 6105, -4106, 9849, -1812, -5189, 9708, -6055, 2533, 5362, -7163, 3844, -3989, -1927, 4216, -3247, 3510, -1837, -1452, -1565, -6443, 980, -6921, -1354, 1186, -7432, 5989, -4354, -6875, 4486, -8358, -2473, -96, -6575, -1243, -1180, -2074, -6227, 1244, -7, -7163, 7836, -3320, -6743, 6534, -8212, -2281, 2460, -3706, 4794, 936, 2765, 1522, -3647, 3395, -1029, 2105, 3633, 212, 3527, -1679, 3736, 1391, 538, 12397, -1891, 173, 7308, -5295, 4641, 5801, -2342, 1890, 4121, 2784, -391, 7245, 2491, -4082, 7183, -4006, -3858, 7136, -1693, 2557, 257, -3254, -10, -3083, 6120, -96, -5099, 2961, -6438, -2883, -349, -3187, 759, -2206, 1741, -4629, -6520, 4460, -5926, -2597, 2370, -9475, -1580, 2060, -3666, -3216, 143, -856, -5836, 3662, -1856, -6107, 5790, -4629]
370d629O77O362o624Q094j979r79o19n779J0889o210q88Q459j0447O126J888n326
386i85M153k642N435m469l113Q765r687M728N020j1738O464M253m818k49L693
401D810l670n233J0401o293l548J0560r290K884L136q119O853l472J466R29p065
416e651R067o299r93P485j0256N719K680l609J991n345N290l898j434R427r969
431e795L571N200j0258N976K229m556K150K783m045l111Q156l594j974O274o730
446c724L140K267k423L590n263L562p91m481R290n622J538M845q329L897m56O42
462A682J900l906O633p552j189J0233r619L307N183q445M233R88m072J831K048
477C255k066k879M409j712j227K949k973P95j851J703O87l767O310n309k730P397
$$ y = [-4629, -3952, 2410, -4214, 3880, 1901, 922, 303, -5476, 5413, -797, -1685, 6774, -3673, 2453, 4341, -985, 3168, 526, 5961, 1492, -1621, 7144, -2543, 2185, 7205, -4533, 1931, 6184, 1366, 1117, 4810, 1140, -4093, 6308, 15, -3533, 7027, -2263, 621, 3757, -4362, 2491, -981, 485, 1414, -5651, 3416, -2883, -3876, 3609, -6647, -928, 1752, -1857, 134, -5211, 79, -3819, -5253, 4174, -5795, -2224, 2976, -7282, -1306, 923, -3633, -1483, 1300, -2745, -5856, 2300, -1294, -3268, 3006, -3724, -584, 1683, -740, 2850, -2413, 1149, 358, -4123, 5167, -455, 1083, 5928, -2401, 1496, 1040, 1682, 3582, -324, 6309, -1243, -2432, 7801, -1818, 1489, 6672, -1773, 2460, 3448, -624, 1207, 3255, 1189, -1690, 2719, 1007, -220, 2729, -244, 551, -1300, 403, 1090, -2677, 3633, -1676, -4406, 2991]
493B991o896M086J427n259M200m178K707p53k990Q760q982O62Q516j0122M300
508a531K939n665L059K21r59J07J930l07l766M295k89j999K949j290K85j602K765
525A142n18k972O686m454j381N347m237J985n44L08J532m603O532m348j732Q827
541G570j0549K966P060r493N163P72l793K147j500K538k508R58K053n377L295
556A302L94k754K082m39n2k699K750M14l881N212l040k692L984j615J38j304K393
573A93j181m272P488m869j380Q209r399K515M476p160N228k75j339M89j690M034
589A067l793J601K740n592M472k87k532L128j158J080j400R28Q99k658M469k090
605H74k458M519j779j075R86J820k304j300N291m927N63M916o870L799J961n687
$$ y = [2991, -3905, 181, 1608, -3651, 549, -3629, -922, -1675, -4665, 4095, -4887, -4225, 4291, -5831, -1531, 1408, -4257, -1198, -977, -1936, -1829, 101, -206, -3972, 323, 34, -1965, 984, -306, -21, -1623, 1142, 624, -2348, 4338, -116, -1497, 3850, -387, 1598, 1054, 1362, 2894, -1709, 4823, 475, -1257, 7570, -2979, -13, 7047, -2446, 2717, 3489, -304, 1843, 343, 2881, 373, 1331, 3384, -1993, 1302, 1696, -1058, 1024, 585, 533, -2166, 584, 998, -2883, 2329, -711, -3403, 581, -1034, -896, -2200, 193, -988, -5260, 2228, -2641, -4021, 4188, -5211, -2696, 1780, -5380, -152, -427, -1766, -1277, -2967, 1067, -2726, -1125, 1615, -3977, 495, 208, -2324, 804, -354, 726, -674, 254, 1153, -1505, 2964, 874, -1584, 2935, 1156, 81, 1067, 2887, 583, -717, 4574, -353, 210, 5126, -1744, 2055, 4016, -1671]
621a671L881l56p2j179o18L634m596J999J934n686M362L88l148J306L54m46j526
638a440J960m68k792M158k475j775L378j872o91J104J140k647j273M978l638k17
654b570L987n012K503J343k696Q97J64K179l091L36K762l904L917L07m234L947
670H35r98%r1R3J850l338K481R59l308L724n86j522J736j185n95P71K767k952
688F41j765N080l934P38L032m495K168J308j946l63j85K267k499M32J724l497
704a294K933N49l019J496p90J82j321J784M06l928M226r03l468L968k151J4J818
721E02j692m59q83K588j383j339M042l745O32K758l305N22J375k98j189M05K000
738E31k540J517J454l738L019k81j234K108j114K57r45J654P65l234L792l21k216
$$ y = [-1671, 2210, 1854, 1782, 603, -15, 3619, -977, 1022, 2956, -2730, 1632, 2020, -1128, 178, 532, 86, -1440, 520, 52, -2740, 1418, -1057, -2832, 546, -1326, -2017, -913, 227, -2420, -3693, 1285, -2353, -2570, 1417, -3595, -1092, 251, -2445, -1548, -1384, 795, -2296, -1960, 802, -3102, 815, 1122, -3112, 835, -163, -163, -254, -161, 1689, -1649, 832, 1791, -1517, 2207, 1621, 99, 1835, 650, 55, 826, 3593, 641, -1124, 3956, 22, 760, 3792, -703, 1465, 2773, 827, 464, 279, 2546, 47, 479, 2203, -1294, 1639, 2188, -831, 665, -125, 57, -1264, 520, 926, -3002, 1224, 321, -3147, 821, -1330, -1316, 502, -1190, -1649, -2532, 56, -1327, -2666, 1376, -2369, -1737, 1021, -2284, -1762, -387, -685, -1874, -1469, 531, -2009, -492, 962, -2776, 243, -38, -1272, 836, -278, -21, -966, 688, 1453, -1781, 2011, 1690, -526]
755e26K337j661p5J257J76n60j161K880j499j191L746m052R50K787l368R34Q3
772A057l22k9o03K232k209K64K173l165N69O46j421O76M84j56j284J850k19k832
790b289L025r80j813K213p83o40o39J395o04j711L917j957j470L480l517P3K268
807c2j906O24P84M21j312M0K419l089Q87K306k825J102P43m11n56J091M34j430
825g10J973L99k685K481m10k354K139Q08j163j82K886k629r33L741l049l56L155
842C111l140J002K70p34L21j53J484j638j05K148l293O88J802k817P10J500q55
859C01j016J367J26k488K104k66k453K786o97j641J316P7r03Q3K159j734j266
876b145L315l087m80K252j706M09P95M23p47O6J960l098R28K028l353K288P65
$$ y = [-526, 1811, 150, 75, 1332, 1508, 948, -213, 2667, 1168, -23, 3723, -329, 621, 3408, 40, 974, 1057, 735, 706, 103, 2335, 126, 390, 2563, -602, -33, 613, -808, -132, 352, 196, -1088, 762, 543, -2289, 736, -244, -2057, 156, -627, -1267, -1906, -511, -1115, -2826, 1091, -866, -2336, 1144, -2373, -2300, -32, -1938, -1314, -530, -109, -1421, -1381, 1038, -2051, -1164, 1142, -1683, -581, 162, -249, -805, 286, 720, -710, 1263, 1662, -1023, 1458, 1048, -1306, 833, 1641, 478, 296, 3182, 553, -380, 3361, 312, -44, 3111, -29, 973, 1243, 509, 830, 677, 2161, 523, 418, 2566, -727, -39, 1763, -1054, -344, 1156, 301, -715, 652, 778, -1710, 394, 128, -2325, 461, -236, -1877, -561, -484, -1387, -1304, 855, -879, -2145, 1170, -1917, -2397, -145, -1851, -1442, -647, -224, -971, -905, 1055, -2043, -1115, 913, -2440, -152, 613]
893F13k171J612J82J32m60L98J662k998J748O19k913K287Q37j734J461N52j526
910C01M12J619k208l13K243j678N2J028j027L94j71J503j427q34K925l250P3J879
928A521k993J647J501j972P39K0J31j580Q71O06k727K341O77k956J646J99r04
945a233P43N17j282j4J959k059j439K518p43o03J809k73j566J210J485l071O71
962a371K048k570J490R63j786R76M50M33p50j05J411k090J424R12l636K703J402
979A904k186J387L92j215Q63R6j032n92J823j49r21R89j18q40J446l46j558J087
997A030P29k054L77P24j784J145J395r87m55L21L87j588N75J95k267K727P15l238
1015b053K048j28q43R76n17j96l64Q14k04k231J939J96j284K293o23j057J128
$$ y = [613, -1558, 54, 236, 368, -92, 306, 1968, -1030, 718, 1337, -1576, 711, 1548, -186, 1275, 1827, 301, 713, 2332, 124, -189, 2054, 376, 428, 1456, 429, 823, 652, 2155, 728, -106, 2819, -431, -358, 1521, -1472, 175, 1676, -296, 443, 463, 594, -986, -115, 491, -2236, 105, 782, -2174, -528, -329, -1233, -490, 27, -1255, -1269, 690, -1369, -2808, -290, -1033, -1636, 173, -100, -1666, -456, 1029, -2042, -1371, 677, -1893, -403, 560, -1226, -250, 200, 633, -117, -222, 1189, -901, 523, 1435, -2201, 502, 1904, -282, 1105, 1497, 282, 1145, 1241, 209, -383, 1440, 1291, 370, 1359, 1241, 401, 1847, 1501, -57, 1030, 1759, -295, 82, 806, -978, 167, 1562, 575, 120, 441, 828, -760, -185, 10, -2257, 470, 1185, -2053, -5, -133, -976, 0, -517, -713, -1077, -263, -467, -2698, -759, -563, -1847, 446, -177, -1234, -106]
1032a06k10j268K47M08n91J384R35j905L87J208j73r49M49J166j787J069N14k606
1050a828K301P68j686J953k53q50M16K44n67j259K225j26j738K531j101j546K196
1067A680o14p59M09K45k37q64R05j359N79J405j016l31J009n17j392Q98Q9j943
1085a813K286K91j923J615q48n68R09k16o10k85Q71Lj766J768n09r58K206o85
1103b32j260J537n36r95J06J023o95RJ871j595j00J379j371k06J741q95q29J831
1121G83j02j877J549O56j160J131L67r78l67P75o07j040K107J83j626K625j456
1138I63j155J855j248p72J107J74n02n08J065l70j157K208p66r62J336j082q94
1155g08R27p80p63J744K21j464J053M72k034O49P97r62k07J209n46j424J766n45
$$ y = [-106, -316, -1584, -1337, -929, -1520, -136, 799, -1106, -719, 489, 316, -633, -184, 982, -805, 264, 778, -1828, 473, 1241, -445, 1508, 1255, 405, 821, 1065, 498, -761, 1464, 1338, -400, 2131, 1030, -516, 1680, 1066, 307, 716, 961, 724, -140, 765, -594, -15, 1390, 374, 43, 1052, 535, -857, 41, 130, -1813, 473, 764, -1159, 456, -392, -960, -51, -267, -877, -1162, -291, -288, -2054, -286, -795, -1753, 453, -232, -1492, 45, -491, -1486, -1380, -357, -1052, -1043, 828, -767, -867, 512, -859, -1065, 676, -219, -1048, 783, 681, -1196, 353, 1009, -151, 980, 1347, 369, 2, 777, 170, -870, 1237, 1420, -206, 2419, 963, -192, 1663, 415, -357, 750, 924, 422, -86, 979, 609, -548, 1660, 894, -68, 1268, 186, -708, 219, -561, -1324, 420, 641, -823, 230, 702, -1332, -683, 114, -848, -1055, 154, -392, -1816, -50, -595]
1173e95j157K229p38o77Q55q01p35N24P78o33J22J723j559m12J987j596p76J961
1191E00r62j64P21R9q46Q87O00r53N61R54j444L45N18j080k94J827j89j067J946
1210A959r11j296J483m65m67N69m46L6j4O69q17l57J858j710k57J588j657j22
1228c57Q14r00l58J157L49r83O22n6j528J134K15j558O04J090j034K2R67q77n16
1247a193J691o59j224J325l58q42M00J26j20M92Q02p29j97R96j780O04J163j699
1265a202Q62P96k92o91J24Q91q79P27M87j029J8J195j287j31J386m45k26J335
1283A639n98j443J597k81j271J053J60m77K67M29p49o81J466l36p41J027q82l68
1301a89Q48r28l44P45P77r22M1O44j734O14P12j285L77P72m90k50J85K35r72P90
$$ y = [-595, -1752, 477, -261, -938, -83, -884, -1619, -1095, -317, -950, -828, 895, -664, -1076, 911, -685, -1461, 500, -462, -626, 95, 194, -652, 235, 835, -118, 443, 1397, -47, 298, 816, -264, -558, 1269, 1080, 13, 1959, 1048, -248, 1235, 770, 303, 872, 426, 462, 448, 1117, 300, -57, 1801, 91, -166, 1422, -235, -357, 457, -443, -801, 356, 705, -278, 344, 288, -1240, -106, 109, -1449, -845, 245, -789, -767, 200, -677, -1193, 498, -161, -1385, -60, -418, -1260, -860, -734, -854, -362, 440, -289, -486, 510, -1270, -666, 497, -1202, -340, 456, 164, -527, -403, 488, -391, 336, 823, -206, -188, 1007, -280, -411, 975, 530, 304, 1639, 1041, -402, 1195, 914, -357, 696, 856, 379, 646, 1075, 326, -355, 1111, 775, 34, 1061, 179, -189, 659, -269, -613, 132, 909, -13, 28, 672, -1062, -448, 264, -1021, -644, 128, -362, -612, -427, -192, -1164, -374]
1321c74L33j258O54L28q18N70q7k23L71Q79p24l78Q09n59m77J019o40j69J110
1340C66m74k93N34K20p78N22O42j249M97O06n63l3L74L78m18Q96J3j497Q61K93
1360H97j398J430n7o13R82m8r22p2J043q65n78J468j304o90J785j003n30J054
1378E79k95n08P91j43j489R28K00j206J340L6n12K15j41l3j107J016K20j117J167
1397e9j06r76Q38l18k32K86O17k86m42P06n70q86J579m36o24J474j03p34Q00n31
1417cp63P50P06j095L68J043j007J78M88l27j43J133n30q83R60k05j168J341J15
1436I58j032R27k8J0o99K04K2m79J095j78j541J765o06r45J228o29k21N99n0n47
1456a47k03M57l73l63R64m78l24O63k01j072P38J7q65J170j59j215J168j11m91
$$ y = [-374, -41, -1299, -645, -317, -1135, -565, -652, -875, -504, 375, -349, -727, 82, -477, -954, 65, -575, -744, 366, -108, -401, 133, 353, -425, 97, 739, -510, -13, 593, 30, -3, 371, 749, 331, 1227, 1240, -257, 604, 897, -501, 929, 872, 259, 1241, 1193, 271, 199, 1242, 377, -201, 1267, -37, -727, 1058, 55, -475, 579, 284, -224, 567, 424, -1065, -137, 63, -1143, 197, 233, -279, -64, -205, -238, -1345, -329, -109, -1226, -59, -165, -1141, -303, -621, -853, -567, 50, -236, -678, 28, -542, -1428, 151, -285, -909, 565, 462, -272, 528, -3, -766, -16, 690, -405, -37, 1006, -1, 177, 665, 338, 195, 1328, 798, -85, 875, 670, -498, 843, 958, -74, 853, 825, 835, 136, 340, 362, -117, 978, 800, -741, 1024, 418, -527, 701, 72, -149, 450, 400, -147, -350, 107, -266, -629, 335, -143, -467, 196, -5, -1077, -339, -322, -1187, -17, -176, -1391, -223, -334, -825]
1475h25K68K65q7m06M59N3q88J294n19o01J853j045l98P93m24j51K56K65j59q8
1495h5Q19r61j47J435p64m28J299o78m95R11o55j02R44n90l94O89K46q20o6Q09
1515I67n06q58J507n00r44J675j244n69J619r14l79O03m56l88L42M46r34K22Q23
1534E12q19j65J304j798N0Q66k20o57M93K62q14R80p8j041N47N00n50j70P84n68
1554e82n08J330o50l86J029o38p2O68o79J88p8O65l93l28J137n84n57R70o69j42
1574b79J296r09Q5N43m57J0J97J02m35R3N89o90P7K79k37r7O84n22n98J294o12
1595D13p65J084q34J45M72k26j32n54Q21p02l26J058p46J05J013j398K09O03n19
1614b79m1J91q1m10J36O51q39M2P24p80J97K94l76k63J023n85k37O98m68m08P76
$$ y = [-825, -557, -292, -379, -785, -326, -273, -1161, 133, -386, -987, 866, -179, -577, 216, -208, -359, -103, 162, 3, -85, 734, -227, -374, 1061, 297, -131, 1168, 490, -5, 906, 251, 149, 1093, 503, 109, 798, 1044, 224, 158, 967, 461, -397, 1110, 610, -334, 1341, 97, -472, 1147, 233, -146, 457, 1, -387, -45, 401, -533, -311, 512, -307, -472, 832, -966, -916, -50, -270, -927, -434, -172, -986, -6, -84, -1125, -578, -78, -628, -798, -14, -582, -1090, 240, -410, -796, 233, -405, -477, 191, -488, -300, -378, 287, -106, -434, 703, 119, -438, 532, -137, -279, 1017, 108, 193, 736, 279, 289, 486, 588, 153, 246, 835, 145, 222, 501, 264, 167, 851, 329, -269, 1025, 413, -352, 732, -102, 43, 515, 289, 157, -397, 424, -278, -604, 454, -292, -187, 826, -572, -363, 240, -279, -320, -129, -210, -620, -484, 167, -672, -630, 94, -686, -489, -195, -571, -834, 189, -396, -633, 65, -403, -811, -35]
1635c5j13n83O76N16o89j53Q84m50m48J032p51n5J066j045J52O94p9m47N7N25
1655G54o80M01P00j518P03M84p64L07L88m06m56J083o43o15P92k97m58Q58k43
1674C90n65K39L21o05j44Q20r75j46J143r19j05O60l75O1k08L12n29J60K53n88
1694h00L33K63m98J96L90n61J38P53n49k66L45N0l57N64j32m09N50n2l21P5L58
1715G0m36P7P03o74K33P06n84j96O71o0o99L90K27j57j05N99n88K85K75o30R5
1736B02M94p13l7O49j03m20N14j19p13Q92l0q12L30K55o49J35M77l66m23P99m91
1757a29k40P32o01l07O71m41l74K71O93r98L07O61p06l56P34n11J74M11m67l89
1777h65N59K12n12M22P8m76O35L1o53N70kk12j50Q07j64n95P51n90K8O44o17Q1
$$ y = [-35, -148, -731, -55, 461, -228, -381, 503, 53, -395, 637, -114, -169, 897, -148, 4, 698, 619, 172, 229, 754, 74, 475, 1175, -343, 360, 844, 80, 387, 775, 369, -87, 996, 353, -262, 530, 233, -225, 633, 390, -175, 64, 385, -220, -364, 456, -519, -665, 478, -441, -546, 114, -261, -200, -408, -96, -625, -465, -212, -800, -467, -204, -702, -506, -116, -677, -539, 214, -335, -601, -256, -206, -563, 1, -131, -540, 10, -42, -363, -288, 70, -366, -289, 414, -260, -27, 679, 95, -101, 570, 510, -189, 201, 428, 271, 166, 765, 177, 462, 737, 107, 202, 696, -17, -54, 595, 492, 72, 586, 467, -246, 646, 616, -196, 134, 389, -260, -125, 352, -14, -437, 362, -129, -369, 363, -238, -545, 126, -315, -689, -418, 275, -723, -416, 245, -461, -817, -83, -594, -420, -9, -476, -865, -306, -94, -606, -184, -106, -582, 53, 84, -569, 1, -1, -213, -363, 444, 280, -315, 436, -154, -126, 518, -99, -18]
1799a8L16J99n20M23J02m84J46P08o74l0N37p75K13K48j76k36N74jo04P66l38
1820C76n77N33L8o90M06J89k77q0N11m84k6N84p15l65O05l03k63L53j78J9j06
1841d50L59m64J96M27q62J86Q00q65p3O31j22o28Q48j41m75N40J66o05M53j93
1861b72m2K83L95l82k19O76j06o77P25k48m56Q69j45k70K53q2l59K99L57n22l9
1882C8O26m41l49P14m62O2M28l40m6K99L5m80l2M86n90l9K65r4k32O52n46k89
1904c35L89k40m8N32l72o53N14J38j85j39O39l71l20P50j035N6P25o05J61N53
1924A54l75k76O87n49j52L52L07n56R5O75n63p1N92k71m25P12n23J87L60o14j54
1945d08Q79j75k39J24L4j61p8L41n43N09M03o32J3N45n74K17M34l53k42J48o5
$$ y = [-18, 298, 497, -23, 400, 502, 18, 164, 872, 198, 168, 705, -70, 143, 391, 215, -21, 553, 552, -52, 714, 376, -201, 332, 370, -320, 86, 275, -2, -82, 429, -55, -81, 503, -212, -577, 28, -275, -538, -185, -363, -344, -450, -91, -555, -359, 68, -794, -608, 192, -673, -746, -115, -237, -865, -17, -158, -633, -93, 73, -532, -79, -272, -314, -31, 364, -18, -237, 439, 333, -344, 381, 133, -323, 546, 401, 131, 384, 302, -57, 242, 599, 77, 38, 664, 223, -126, 588, 126, 188, 616, 276, 230, 529, 564, 84, 52, 538, -52, -91, 174, 80, -152, 500, -46, -335, 54, -186, -234, 298, -74, -727, -213, -75, -260, -399, 240, -131, -451, 299, -736, -680, 45, -560, -399, 154, -221, -497, 190, -359, -511, -159, 148, -408, -313, 362, -201, -272, 320, 49, -376, 336, -187, 0, 360, -254, -408, 471, 296, 57, 181, 215, 54, -24, 317, -226, 283, 686, 54, 67, 612, 38, 255, 689, 336, 94, 242, 177]
1966A77l74L46L31p72N23K60q64L94M69o20l2L83m05K12J77k30l31O11k76l89
1986d10M3J92l42K0O96p42M3N64l84j25N44l89J9q7J58k86L29k30j02K48K18n67
2008e90M25O86p04P5L10l92n4J40J45j29N52oo08M11J37m05r2O49l77j21M72o80
2030a56M47K18m60M09o0j14k20q4N86n28r8M02n62J52N68p09K85K94o21R0M64
2051C03j69l74M18m95j34P19j48l07J44K49n90J51N8m72L46K32k74j45M69j90
2071b09k60N63k64m61L1Q39q25M38J63l65L97K19n64J65L54k96j39M06m80k2M63
2092A53N4j73J63K94p20K92J47k44N7M67k27k82N76l04j34N21m71k98L99P5m21
2113g6K12K72m86L74L88n71K07J70n25m5Q4P3j85K31m1m04N03jk17Q1jn99K48
$$ y = [177, -197, 149, 480, -292, 231, 491, -373, 21, 490, -130, -162, 221, -184, 28, 205, -25, -356, 255, -21, -410, -367, -175, -517, -497, 199, -543, -500, 64, -320, -445, 99, -290, -271, -358, -200, -486, -157, -387, -489, -241, -23, -590, -165, 521, -183, -108, 202, -190, -244, -104, 41, -88, 464, 458, -150, 261, 398, -7, -99, 550, 173, 52, 524, -156, 291, 509, 49, 458, 398, 284, 64, -20, 566, 38, -60, 342, -220, -68, 500, -209, 76, 370, -251, -161, 303, 134, -240, 178, -317, -451, 268, 120, -187, -43, 206, -384, -233, -175, -647, -301, -69, -343, -488, -19, -209, -469, 94, -170, -631, -600, 239, -586, -148, 15, -350, 47, 266, -298, -133, 221, -75, -214, 192, -288, -310, 153, 207, 34, 197, 491, -229, 63, 210, -34, 23, 490, 263, -19, 557, 253, 119, 640, 169, -129, 270, 345, -76, 136, 408, -78, 296, 684, 113, 320, 490, -35, -80, 4, 77, -108, 123, 82, -322, 181, 180, -37, 44, 43, -556, -308]
2136c08K25n42J50M08j94n4L93j00k32M16l94l72N55j55OJ76J20m51K25L27o01
2157d02J70L62k99j85K58J36j50J78J63m09L79j82k94M29L21p88J17P16m13K22
2177C29K3j87j69M69m33J8O96n03j89Q1J97k35J00N06r57L92K52n19K15R5j02
2198G9m77O57k1n41M74q6l80p2N17n00J10J71n49N5M33j42J84J72l98j62L22J19
2220c5m66M68M5m58M31n0l25K73J02m33K00M41n22k0N70l19k52O33l08p3L50l11
2242e9j6K16J41m47K55N20l56n7L02k58n4J71q8m32M02J33o17L48K47m83L60J26
2264C54l47q2M04m58pJ48J29l78K21l9j10K07J30m57J36L07m53L15M1m85J68K92
2286C6l27o4K86L5k35J81m4m77L90K59k72J91rl83J99L13m99Q3K81P0l09M08k45
$$ y = [-308, -83, -625, -475, -67, -261, -315, 78, -22, -254, 162, -232, -604, -49, -204, -198, -22, 98, -353, -128, 199, -402, -232, 130, -169, -354, -96, 40, -110, 68, 231, -178, 201, 19, -275, 154, 475, -313, -196, 520, 107, 329, 352, 165, -4, 465, 32, 50, 746, 243, 54, 135, 332, 97, 197, 703, -254, 138, 390, -129, 86, 181, 79, -398, 259, 238, -303, 171, 85, -295, -367, 150, -350, -240, -69, -618, -563, -130, -272, -88, 84, -314, -476, -154, -35, -501, -33, 12, -446, -15, -65, -390, -117, -15, -448, -248, 193, -329, -349, 221, -98, -350, 283, -25, -98, 252, -59, -75, 141, 282, -165, 90, 610, 254, 197, 499, 241, 187, 358, 270, -162, 240, 373, -244, 104, 351, -132, 228, 354, 7, -75, 329, -129, -136, 12, 141, -237, -16, -55, -165, 42, 172, -285, -149, 158, -295, 20, 61, -424, -256, 36, -291, -355, -69, -34, -269, -88, -132, -609, -219, 40, -232, -41, -50, -433, -234, 79, -420, -337, -56, 14, -295, 113, -132]
2309a32n3M14j21k30L14j73l73L23j22l39O39L34k68q5K85l04l24N13k83j18M10
2330C07l7j89Q6J48l05J91K76n43J42Q3k29Q7K17j4m65M83j97k16K66Kl62J70
2352i9L60o08K66J88n90L13M01o32j5O29p09J61J27q8L9l5N66n29L31K0n50K61
2374a93J28m2o8J20j64J32K28ll82M32j09k36K88K6l44J45J42l30K92J45l90L52
2396A69J73k52N3K28l28K03R8k53J48j13K87m34J98K32l61N9K31m77L41Ok85J8
2418e9L91k66j50J24K7k79L08M3l61K36K31m56o4N36k80k27K51j42j01M2n7J10
2440a43J62L3k27q8L01l30J16J30m33K99M3J1j4P9J01k46L41O8m88L14P9j86J84
2463A06L0k24K48K52l55J6K22m63J89oN07m21L45j71j02K30j80k97L14m3m03M22
$$ y = [-132, -185, 229, 108, -122, 192, 19, -354, -31, -153, -492, 147, 481, 213, 128, 413, 109, -215, 298, 15, -103, 307, 270, 81, 167, 315, 10, 201, 477, -66, 76, 159, -70, 17, 234, 220, -245, 238, 41, -175, 91, 93, -269, -99, 261, -347, -81, 107, -483, -170, 231, -401, -416, 213, -496, -335, -208, -296, -257, -292, 274, -255, 76, 96, -454, -193, -65, -107, -175, -55, -219, -87, 141, 138, -244, 188, 79, -157, 131, 157, -187, -42, 100, -230, 62, 207, -183, 169, 342, 90, 143, 371, 43, 246, 344, 91, 239, 126, 413, -21, 177, 409, 48, 107, 338, -139, 202, 208, -77, -59, 332, 66, -84, 40, 67, -212, 96, 139, -222, 14, 245, -211, -275, 261, -19, -246, 5, -137, -238, -196, -253, -143, 19, 52, -175, -263, 38, -292, -176, -46, -479, -180, -137, -126, -140, -61, 40, -206, 135, 203, -285, 29, 108, -78, 106, 136, -88, 160, 412, 57, 73, 295, -168, 21, 15, 522, 101, 446, 275, 173, 403, 223, -74, 240, 197, -206, 216]
2485B16J57l64o3K79l27R0K51j18l83P7J44k39L48j14q4M54k93Q4l78Q8r9Q1J20
2508g3J74o05K39K25l33J68K44k66L07q3n21M05K33m97K59L32o40M54l53Q3k6
2529b74K96lk53L80%l03K70j89l55P25l26K52j73J02Q3l74M60k98j30K12Q2k01
2551a7L14L0k68N7L91o02M7L29l67J98M6M1k66M54m37q4L90j61k99K99qk63K49
2574G3K63m84NP4Q3q0M04n94p1N45j66m97P22l31m17N13m0m17M01J76m74JK20
2597i1j23k07L56k55M22j52p7k73J73L03k10K43J50l86J43J67k81P3J16l13M75
2618B53%k31J91J26k83p2M82j92k38K96j54k28K79j00k56J45L19l23j82L74j17
2639H9K0n7J18l43L68m3k50L37m2k15M8Qj87l27N46j05k47L81j02l00K17o1j50
$$ y = [216, 373, 9, -54, 225, -102, -12, 239, 121, -262, -185, -41, -280, 68, -46, -130, 324, 31, 115, -263, -175, -274, -193, -73, 101, -504, -265, -40, -373, -205, 39, -227, 80, -3, -524, -119, 114, -383, -124, 208, -432, 22, -331, -248, -274, 22, 19, -234, 146, 146, -157, 113, -76, -431, 294, -32, 220, 47, 149, 232, -142, 318, 20, -110, 102, 184, -17, 297, 327, 59, 116, 507, -95, -48, 281, -86, 112, 158, 199, -67, 387, -50, -134, 256, 95, -204, 95, 87, -176, 73, 336, -148, -143, -69, 14, -66, 338, -256, -327, 218, 52, -445, 277, -54, -471, 42, 2, -415, -14, 162, -312, -311, -91, -214, -421, -65, -320, 102, -50, -127, -400, -227, 76, -134, 109, 259, -127, 16, 183, -98, -25, 91, -222, 253, 253, 22, 213, 339, 56, -16, 466, 274, 36, 332, 178, -50, 229, 129, -127, 18, 337, 14, -168, 206, 89, 109, 52, 170, -173, 195, 152, -98, 239, 197, -18, 30, 38, -149, -476, 70, -35, -282, 99, -3, -303, -86, -147, -297]
2662b97J71N8k52J7K45l78L44J94m4kk34j06K43K26j83l03J72j29J75J57M6k95
2684a75K86q6Q0m6J43k72l40M28J60l19M99m52J39J36j75k17L86J95k03r0R3k52
2706h2L4P52p70J35J40q6j73K44l68r6L35N1j56J49j64j97K67j3j99K93j67r7
2728a68k33K93k5k94M44j18k8j15K26n3j09K19l36j43N97l16lJ03j97L1K48J7
2750D0j52K03j64k85L66j7QJ04rl66J77J68Qj83J05J35j27J46J72n71M28j5j01
2773G0Rp2n5K19K55j98j18K29l49J12p8L0J56k96j0O9L53m4o53L58P9j66K78K7
2797B05k36m9O9j85j57N83m10K05k09j26L0K91j42K8l8K01k38j05M69m99K01J65
2819E3l72Q3J31o3p8k0J80q2J67N8m26J88J34l14K72L55k50M4P8m6n7K40k90J89
$$ y = [-297, -126, -68, -320, -303, -58, -436, -92, 102, 58, 56, -178, -284, -41, 185, 2, -301, -129, -258, -83, 74, 120, -175, 111, 25, 105, 59, 202, -70, -410, 18, 178, -141, 358, -94, 45, 181, 6, -211, 175, 370, 167, 77, 170, -82, -48, 704, -66, 69, 209, 123, -50, 194, -174, -270, 65, 116, -40, 109, -55, -252, 15, 2, -197, 96, -71, -168, -401, -108, -133, -427, 17, -101, -129, -244, -18, -71, -180, 39, -297, -440, 157, -159, -162, -59, -256, -225, 23, 40, -112, 91, -73, -358, 8, -9, -1, 103, 94, -272, -95, 73, 81, -102, 3, 138, 11, 157, 329, -242, 186, 171, 70, 79, 7, -48, 171, 426, 228, 110, 339, -10, 102, 24, 54, 210, -86, -96, -27, 326, 282, -371, -13, 66, -100, 178, 205, -31, -80, -11, -196, -353, 230, -180, 25, -184, -310, -280, 11, -131, -103, -141, 60, -178, -283, 186, -313, -112, 53, -319, -236, -105, -168, -246, -266, -86, -168, -1, 57, -369, -181, -47, -361, -89, 266, 16, 60, 138, 92, 35, 275, -15, 174]
2843A74j1j3k06J45q2J30N7k3l16K84K71n17J94K49k32k25L09j13l35N24M9m37
2865a24K80J41k82pQ6j32Q1J04j59q2O8o4p7K97l33q0M24k00k49K4K92o8N7J7
2889A4m61K04rJ79k01L58k60%Q6j08p3K30m9J0N8J59j84Q9j5m1O1O5j44j52Q8
2914i6L44m04L74M7m02M81k61k49K9M93k42R6j80J82m36L64j19k28L66l50p6O18
2936C51q6r4M30m39j87J24J69l19l8J76n3q4m8j43L25j32M7j50L26n2k36J71Q2
2959A40k87J41l60L92l70L46j13r3N09l95J68j14J8k97L92l43J44J74j53j31L44
2980A12m8l37K03K03k6j7L21k72j71M92j39n62O20l36k28J67R1N8p6K91m32L4
3002e2K52j76m3M34m52k07L17J03J5J04m24N9L00N0n12L25M9j4l17J24K8j51M41
$$ y = [174, 163, 150, -56, 89, 7, 137, 194, 171, -145, 139, 410, -107, 87, 336, 104, -121, 188, 75, -260, 264, 313, -124, 156, 297, 15, 8, 94, -38, 43, 147, -12, -94, -26, -90, -167, 130, -203, -283, 141, -59, -308, -284, 8, -60, -3, 14, -447, -243, -252, -73, -274, 84, -176, -176, -90, -198, -271, -41, -90, -80, -22, 137, -47, 42, 27, -14, 47, 112, -32, -184, -96, 248, -156, 218, 265, -137, 344, 83, -166, -137, 356, 114, 210, 30, 212, -224, 140, 21, -207, 159, -191, -267, 351, 265, 171, 601, 162, -25, 99, 268, -51, -89, 87, 34, -50, -98, -241, 84, -48, -1, -151, 175, 123, -113, 58, 140, -147, -6, -366, 26, -344, 2, -111, -204, 305, -90, 78, -36, -18, -315, 77, -266, -122, 52, -101, -232, 112, 64, -273, -70, 133, 107, 90, 411, 139, -32, 460, 321, -241, 379, 43, -185, -18, 73, 131, 55, 346, -86, -52, 200, 24, -19, 415, -37, -244, 73, 176, 191, 295, -129, -70, 230, 280, -232, 93, 142, 128, -189, -65, -37, -188, 253]
3025B53j68j18L13k58k37P3M3PM0K6Rp8l1k4m2L44k27j74L19Q0n68O73k57l31
3049c33L95K2k56J07J20k36j44M57j49j30J62R1j40K61J8l74L35r5o6J71m8j06
3071F2o5J25r4J4K73l14k04O53n36K34j42J69k46J49l20L33l3r3J26j4M2j31j85
3094a97K98k81pJ19O6L5q1J63k33J61q2j27J65n2n0J6R5J13m27R9K62k48L04j47
3118c6k92J75K03k81K12K17j32k39L09p8r7K98k76L2J04Lj10k33M94m63N3K01
3140F4J9m1J3j13K77j00j11L4J25j61NR5r8k01M03r8k04J92n0j43J12Kr6J46N7
3165A28L2k81L81m69O3L35j1m7j32j28L6j18K60m24M45l11k7K73J06m29J39J36
3187d3j9r8J70n6j42K54j00l12L74j0k41K37n7n5p0K93j89j0K17l21O8P1N5P4
$$ y = [253, 85, -33, 280, 22, -215, -142, -99, -92, -52, -26, -17, -95, -126, -150, -192, 152, -75, -249, 70, 150, -418, 255, -2, -333, 62, 84, -172, -65, 55, -181, -325, 132, -17, -147, 15, 106, -34, 227, 245, -129, 206, 111, 45, 216, 168, 62, -3, 122, 28, 42, 315, 1, -203, 450, -86, 148, 6, 175, -71, 78, -242, 91, 58, -35, 91, 77, 119, -12, -197, 101, -180, -187, -68, -2, 33, -48, 115, -118, 43, -39, -166, -1, -53, -103, -87, 8, 121, -306, -207, 55, -193, 111, -36, -328, -153, 50, -231, -19, 198, 66, -173, 136, 58, -39, 259, -17, 15, 119, 122, 12, -221, 273, -190, -137, 64, 83, 42, 55, -58, 219, 119, 8, 42, 167, 6, 11, 106, 8, -193, 210, 112, -92, 100, 50, -93, 19, 21, -75, 71, 128, 160, -121, 260, -209, -146, 189, 178, 131, -1, -129, -93, -211, 49, -375, 70, -241, -268, 5, 111, -318, -179, -43, -62, -160, 10, -46, -188, 66, -34, -346, 28, 18, -223, 14, -43, -98, -168, 125, -64, -74, 143, -178, -110, -39, 16, 90]
3211I0j82K9j8K55j24O4%K11k20j28J62Qk25N42n18m6L53J6o54N04k7J37L0ok51
3236Bj08M04j26j81j09K46j23K90l13J4J95j6l04K13N5k66Q0K22l37o1L67k37
3258i3r3j6R2R4n8J53q6j07J98k79N1rK77m0j87m5O0L38l57J66l6r7k5K53j04
3283E0j4p0J17q8J78J61k91n5M00l83J25J8K1k11M2K04k64R2P9M6J40l54L01m2
3307B02l88J60l6R7m2Q0M7r5j66L60k47k13N05m58J87J45l38K97l18L70j81k61
3329b93L76l6m77L88j17k04M55l04r4N73l59l2K43k92n5K67k1o4J15n2K9l9Q6
3352I3j97L7K05l4j17P5j48R7J88j66L1q9L06m70J29J08K10m74L61Q2l72L76j59
3375G2k6K5q4j22K37m0K3k09M00l68J75Qj60%K43l13J47O6K53n26K31k12J56l7
$$ y = [90, -92, -63, -81, 174, 50, 114, 114, 325, 105, -23, 139, 147, -78, 464, -54, -100, 253, 269, -385, 119, 92, 229, 259, 253, 2, -106, 298, 172, -9, -118, 128, 5, 295, -18, -4, 191, 175, -129, 84, 139, -127, -47, 175, -162, -223, 144, -93, -186, -202, -110, -16, -74, 79, -7, -114, 84, -195, -144, -153, 124, 84, -103, -148, -88, 250, -107, 59, 23, -74, -99, 154, 50, 36, -34, 83, -5, 173, 334, 43, -12, 388, 5, 130, 148, 169, -42, 0, 204, -60, 32, 111, 157, 297, -57, 244, 202, -186, -26, -62, 35, -7, 73, 120, 25, -141, 219, -28, -241, 264, -194, -7, 138, -200, 97, -221, 149, -32, -293, 83, 47, -430, -42, -159, -363, 92, -212, -306, 267, -92, -124, 119, -173, -228, 39, 18, -46, 69, 17, 46, 7, 93, -104, -67, 138, 104, -13, 62, -86, 11, 199, 33, 64, -25, 281, -189, -60, 48, 258, -216, 145, 227, -145, 231, 72, 46, 71, -13, -135, 102, 62, 85, -124, 276, -92, 83, 91, -69, -69, 174, -139, 8, 74, 327, -199, 32, -180, -24, -61]
3399f1J11J38l74L28m23K88p6J2k85N17k83m8J84p1m2K34l68p7J56K04j51O0K00
3422A73j24o1kj07J41J10k98J45j95N02q9k4L5k62J11qj11J29J97l04M2L80j75
3445B05k08j40L21k68J96L1o3J40ol04Q7l4K54m99L91p5p8L17j40k05L71m59m5
3468b11Q0J39j07J81K36l97R6l4j61K21J06l87L31Np9r6J9j28Q9J36L5k6rJ71
3492B10k02K3Q2k17O2J86J32l67LJ75k43K54m3j77J76j63J98O0K02m46K96p8j0
3515A13m3Q5M1m00K52r1k14N22J6m52K37m5k60K30L12n3K0j29m8j44K51k90J19
3538B9J82m27K53r9p8K4P8J92l02j16L61j77k20M32k98QM07k91j54J73o0k13K42
3561e4O9j40O8O4k20J78J9o3J8J79n2n10O96l29k0K07j09j47L28J69l70P5j80
$$ y = [-61, 50, 188, -186, 142, -281, 7, -69, -57, -342, 175, -108, -156, 28, -43, -85, 149, -219, -296, -140, 64, -87, -27, 173, 49, -12, -14, -121, 20, 130, -168, -23, -218, 284, 195, 171, 206, -56, 55, 47, -64, 65, 262, -42, 0, 380, 205, -3, -143, 178, -90, 106, 137, 74, 214, 208, -96, -9, -43, 211, -288, 103, 28, -50, 267, 127, -78, 293, -166, -211, -131, 8, -99, 82, 318, -79, 17, -17, -178, 43, 149, -238, 93, 98, 19, -77, -58, -186, -97, 39, 74, 48, 39, 210, 8, 31, 113, -104, -42, 144, 276, -91, -88, 87, -156, 98, 55, -122, 54, -109, 89, 149, 351, -95, 201, 123, 113, 70, 155, 196, -204, 48, -43, -257, 265, 281, -171, 66, 21, -239, -9, 303, 250, 270, 141, 93, -51, 200, -90, 29, 211, -216, 37, -62, -140, -116, -38, 154, -148, -264, 97, -80, -300, 132, -166, -158, 249, -42, -196, -23, -83, -296, -54, 15, -125, -57, 7, -213, -35, -16, -79, -61, 118, 66, -444, 252, -77, -97, 110, 1, -146, 182, 351, -19, 56, -124]
3584a24mM19q2l4l22L25l06J13J05p9j39O4L54k61P6l42J71P3K5j65L89l4k59
3607c7J19L3j98K10J83k41j61K58m51K20Q9j0O5l21L80j93J58R6m20J25O3J26
3629I3j50L0j3o9j30K00j92R5M1N3l7p2j90J92J60j98O3K16j34K6L5j74N2L02
3653A99m57N4K09J79j64j16L01p55M00K49j46J32J05l25N6K51r3l75L75r2r5O0
3675d8L97k59k37M84m24p9K81j67q5M79n37J75L6J1j88K6L50k42k18L53k17K59
3697A50q9J49k37J49l13K3J13NJ75k3o6k36R0p8J31j66K67k25N3J68l6K5k54K78
3721E3p8j23K44l43K08J33l29K00j9M3K48q8j08r8M13n74K12J49k12Q8J92k27
3743a6O5J4r3J6r3oP2k6j6L20k3j18l45K21J67j32l7J72M6m31K18L30n44J21L7
$$ y = [-124, -128, 291, 209, 175, -147, 178, -128, -15, 90, 11, -128, -64, 290, 29, 105, -237, -66, 7, 32, -133, 256, 222, -37, 82, 115, -83, 127, 310, 69, -92, 166, -285, -65, 24, 14, 79, -242, 138, -55, 103, 199, -221, -96, -33, 93, -57, -27, -40, -109, -239, -39, -231, -136, -95, -42, -79, -151, -341, -149, 11, -187, -124, 92, -42, -16, 19, -155, -103, 199, -258, -204, 5, 184, 20, -96, 205, -550, -150, 99, -47, 85, 190, -135, -79, 172, 79, -296, 79, -13, -108, -48, 349, 90, -147, 337, -87, -166, 115, -52, -137, 342, -195, -20, 16, 27, -161, -135, 215, -27, -245, 108, -109, 150, 61, 210, -27, 122, -191, -168, -55, -50, 125, 102, 36, -200, -110, -188, -57, -223, 44, -181, -128, 40, 4, 29, -225, 53, -25, -148, 96, -247, -39, 94, -235, -35, -54, -11, 237, 149, 41, -57, 356, -218, -6, 143, -69, 19, 211, -16, 49, 63, -30, -14, -107, -113, -41, -67, -83, 237, 214, 96, -249, -28, 139, 7, -30, 142, 188, -243, -25, 305, -239, -118, -81]
3768h1J95j80J5M5m4J72q2m4J98l66OJ05m6q8Q6J76K6j47l6Q4Oj34l4J41k26k
3794b55J2K96nq5K25Q6l60J26J5j38k4M52k14m35J55J53L7K72j66l18K63n7J44
3817A79k67%j2K07J10m83N16j6k38K2M11l95Q4l4mj05K57j36k31K29k18P0J78
3840A24l03K11j39J0J88j42J22p2P1Q8j68ok4p1Q2k59J35K8m5L95m58M7L09k04
3864h1r7K75j95J8L9O9j00Q9n5k41J86n9p8j11M52l6j6O0j02n5J18rlJ49j32l6
3890D9J87pk23J12rn0n4J1J0k71N12l62J79J56m21J70J93o3J46l0j62j50J08j92
3914a61J81j33L8L1j94j85K57j70L29O6n1J58j61j51K32J5k85K47j1j5p7n4l37
3937d31N8L16O0j49R0J62p5k6P4l50K22J96k50M3J47l11R9J85n3j12L2L08m19
$$ y = [-81, 114, -66, -51, -6, -50, 122, 40, -4, 194, -172, -166, -61, -107, -195, -109, 67, 93, -54, -90, -6, 0, -134, -168, -27, -253, -255, -243, 53, 48, -37, 188, 274, -86, 40, 55, -83, -107, 345, 131, -304, -149, 4, 41, 313, 147, -171, 92, 35, 179, -88, -88, -100, 107, 217, -266, 250, 234, -4, 18, 429, 34, 118, 84, 80, -25, 232, 96, -135, 94, -124, -54, 124, -179, 32, -107, -97, 91, -51, 71, -1, 70, 158, -10, -16, -40, -111, -29, -288, -153, -125, -170, 225, -233, -186, 123, -81, -178, 97, -98, -80, -41, 28, -72, 17, -38, -279, -93, -152, -230, -341, 111, 75, 59, 119, 17, -38, 80, 71, 68, 217, 85, 49, 236, 229, 6, 118, 109, 59, 5, 16, 26, -245, 267, -95, 84, 240, -181, -11, 182, 119, 265, 235, 73, -77, 31, -161, 20, -113, -75, -44, -238, -423, -166, -336, -7, 59, 8, 166, 5, -146, 86, 101, -184, 63, 52, 37, -40, -94, -431, -373, -57, 3, -146, -56, 106, 31, 5, 79, -271, -49, 147, -103, -60, 87, -224, -125, 60, 7, -105, -73, 235, -184]
3960a84L84l2k82J90j51R3p4L07k64k8J33l31K16L67k85j11K75j41r0Q7K00ll38
3983f2L17l12l8K36j90J4P4J01m22L34o0q3L14l04m9K95m88L32l3k5p5m8J00J47
4007G5N9J05j34q1o0j92O8J57P6k47o9K07Jo4q6J28J00R6j57R7n9j90N2K79P9
4032B40j22j60P2R9L4J00k36l0L31l61L07K1o3l63M06k44K09J1Kj1p7m7l69J41
4056a10J41j56K42k17K1l1L09k36K7K55m48J97j28M9r5J87m5k88L48J18k89J85
4078C6j19J79j27k23N06k27L6j95j9l6J83o0q0L46k72j29j5n6J48K11k36J73N2
4101G6R3k95K04N3q3j55K90J9q4j25j2m4L57l27N6o2M1m9L03l31K06KJ16j56J91
4126B84j83j06K3K1k55J30K68k13l4K40l37J80K10k28R5l54L43k44k0J05j16K56
$$ y = [-184, 200, 168, -114, 76, -75, 18, -56, 251, -13, -41, 92, -239, -23, 344, 59, -52, 223, 82, -8, 79, 279, 276, -62, 255, -57, -95, 141, -49, -35, 39, 140, -282, 52, -8, -91, 223, -81, -130, 165, -323, 9, -24, -49, -124, -172, -72, 75, 134, 239, 105, 24, -36, -228, -160, -3, 73, -174, -243, -36, -35, -99, -185, -57, 43, 139, -18, 79, 20, -170, -118, 161, 240, 118, -42, 30, 129, 163, 263, 27, -3, 328, -33, 274, 295, 232, -131, 275, 31, 240, 251, 253, 242, 165, 118, -251, -110, 31, -125, 117, -100, -79, -110, 199, -37, -10, 245, -203, -6, -134, -85, -180, 7, -38, -326, 22, 140, -149, 36, -83, 96, -31, -254, 252, 25, 61, -134, -153, -189, -6, -66, -146, 200, -72, -201, -216, -272, -124, 87, -149, 24, 76, 169, -126, 78, 131, 48, -107, 183, 202, 118, -7, -19, -63, 294, -33, 23, -39, 2, -47, 256, -75, 131, 133, 249, 93, 284, 101, -5, 18, 39, -216, -86, 182, -31, -65, 175, -162, 18, 228, 0, 95, -259, 84, -160, -180, -75, -191, 65]
4148F5j04M4j2j35R9oJ10j06j28J42p7n7J56k33Q9J11mmJ01p6q8K2r9J69J7l9
4174d3J43N1K3l18K43K98j52m04J37J8k65K15K92k79K99n0l24K17j6q9j2L90j80
4197A94j12J29lk98J82J4m03J06L32j57Q2Rk06R6J7J29k31K43o2j57J1J33j02
4220e4L81l69J08j92O6M0k93K44j91J71J02J3j70K12J22k21M8k56J75l7N6q0j
4243a26K21k44l0K25q7j9j23L4K32Oj94j89K75R0k60N17k88L2j13Jo9o2M22l40
4267h9K0K25j23k2N7O9l04J25N0p7N8K81k79p2K57Pm71M33M9l23J49o0JN3m2Q6
4293E8j73J71k03R0J80m25J03K89k52K61k65K14j09J27n6k52M20k37MN0j14J20
4315Ao5J51k03K54k3l41L8J13N5K7p3N3j9k4K30k97J61Q2k31J55j7m8M4J46k68
$$ y = [65, -39, 5, -7, -142, -43, -49, 61, -45, -173, -31, -108, -165, -9, -242, -153, -42, -46, -50, 51, -25, -113, -91, -190, -21, -4, -43, 100, 151, 174, -144, 99, 397, 245, -159, -22, -4, -269, -54, 238, -41, 258, 208, -116, 101, 85, -4, -16, 374, 194, 82, 211, 208, -90, 92, 106, -297, -191, 141, -16, 66, 75, -131, -35, -18, 111, -120, 123, 61, -96, -85, 48, -54, 327, -42, 66, -126, -60, -20, -313, -69, -260, -89, 13, 26, -144, 68, 190, -31, 17, -239, -64, -101, -45, -125, -126, 95, -149, -179, 46, -41, -60, -183, -149, 83, 89, -105, -294, -19, 71, -189, 328, 40, 72, -41, -40, -109, -171, 251, -89, -69, 156, 33, 11, 68, 137, -167, -42, 8, -69, -11, 270, -9, -81, 176, 183, -288, 145, 194, -129, 20, -40, -39, 14, -28, 58, -115, 56, -147, -57, 123, -302, -199, 90, -162, 99, -166, 48, -61, 66, 10, -242, 178, -59, -55, -5, -119, 1, -64, 87, -116, 138, 115, -226, -188, -75, -20, 7, -66, -13, -32, -56, 174, -123, 38, 120, -111, 44, 27, -21, 23, 169, -99]
4340i9K66L9j60L8j02J61m24K99J60k11L48l10R4kJ71j47j09j59K02m5L5k13P6
4363i2Q7K20O4m40J65k03L22k47k19K90p6J22n2p5J46J71k12k6J70k44J95o3j7
4386a4m8j2j11Q3L1l02K28J34J86k76J56k71J70K44l17J74j57o1J14O9N5l0J52
4409A97l35J43J42j62J25m3P0p7Q4j59k84K24J33j26J48K5R3j89M5j00j51K48
4431E1J28l37J90j30k8J94n0j8R8j68K57k82l6J50j54L14n46L64J55q7k73r1M22
4454A23k44J35J5l2r2K40k20j08J26J75K9k8M5j48j58R8l3N8r8J92q8km3O5J01
4479A08m8o4K13N5k93J71j46J0m1J59j60K7L0J34j09K50k70j31J66j61J13J20
4501A33n2k72L56J77k75J66j19j79J73J14l01J1R1J52j15N6j40L1J56k0l23K18
$$ y = [-99, 167, 206, 46, 84, -18, 143, -281, 18, 178, -33, 315, 5, 99, 97, 268, 121, 12, -147, 55, 10, 45, -168, -92, -5, 215, 279, -161, 4, -199, 123, -124, -343, -53, -129, -7, -59, -134, 12, 183, -29, -55, 115, -129, 66, 3, -14, -62, -74, -185, -102, -71, -373, -145, -11, 175, -101, 55, -216, -46, 198, -119, 55, -102, -163, -49, 20, 75, 45, 197, -138, 5, 147, -15, 110, 67, 137, 60, 144, -15, -299, -75, 58, -68, 80, 105, 198, 9, 54, -46, -197, 51, 179, -158, 32, -98, -126, 68, 18, 0, 98, -70, 187, -95, -131, 19, -135, 179, -367, -3, 152, 65, -208, -299, 123, -121, 14, 29, -3, -95, 145, -75, -183, -57, 118, 147, 119, 164, 16, -142, -44, -77, -19, -117, 75, -13, -15, -58, 7, 108, 60, -4, 209, 264, -29, 142, -4, 6, -35, 124, -36, -9, 21, 155, 46, 296, 26, -105, 61, -100, 13, 133, 81, -191, 165, 342, 67, 233, 114, -65, 108, 222, -79, -68, 23, 175, 60, 116, -24, 7, 163, 143, -180, 38]
4523C8O0j34O8l65Q2K22J97j34n7j6k1m7j30K44j66J26j5k4L46k77l79N31J10
4546B59l59J60n9k72M52j47n0L7L61m14k39M42j47j58P6M8J01j51N7j09K12j0
4568I0m1J55Ll02N1J96o2Nq2q1j28K15K63j20j28jk37N46k18j89n4J41j23j35
4592b36J82K88k08j2J58k92L93j73j60j45J99q1j8Pl14N55l04M2P1M17m23PJ45
4615I8p8j77L10k68q1Q3K28l41J47J41M4r8N3j33K72j42j15R9J19j62n4M6j3J17
4639I5k61J00N8j08J83q0J1K67m89M15J19q1l90J47N6j54J84j3j78J09J02j64
4661g2J52j00r5J39P4k04Q4J19j65M1P7j86k39L69R2q0J16k33j16J50M7j84MN9
4685a51M07l21J96j61LJ12L7k94o8O78n22J77j90m7L46k95K04k48L71j36l77K39
$$ y = [38, 98, -36, 32, -333, -251, -29, 168, 34, -23, -39, -60, -107, -237, 7, -159, -33, -48, -72, 274, -3, -382, 149, 259, -100, 60, 1, -271, 181, 34, -16, 21, 382, -32, -271, 171, 24, -134, -58, -10, 91, -60, -3, -112, 100, 90, 49, 204, 207, -95, -44, 152, 90, 95, 13, -68, -196, 19, 282, 162, 34, 33, -204, 342, 124, -65, -119, 22, -101, -236, -54, 234, 26, 14, 172, -120, 273, 100, -60, -205, -6, -87, -105, -98, -412, 143, -161, -119, -48, 369, -54, -47, 98, 20, -157, 153, -115, -196, -113, 115, -226, -79, 62, 106, 8, 61, -72, 200, 58, -57, 42, 161, -1, -55, -9, -22, 95, -166, -66, -8, -116, 67, -13, -2, 265, -224, 191, 310, 229, -161, -14, 42, -112, 72, 59, -119, -10, 92, -72, 80, -20, -115, 24, 98, -106, -22, 97, -68, -27, 50, -136, -375, -6, 86, 6, 122, -111, -227, -77, -30, -214, -210, -151, 256, -65, 131, -30, -27, 85, 122, -172, -240, 438, -84, 93, -97, -144, 202, -93, 111, -137, 234, 98, -279, -40]
4707d0n4J34J79o9j36J28n8Q0k21J89O1l42K69Q0j08J68k41p6M0k07j02M93J74
4730C41p22M22j38Q7K90j79j53N2j1L6K51j58k43o1J06K89m63K38O6kL1K6k52
4753a47L16j50K1P4J66k34l04K44k66K49j09L13q2l0j54J11j38j04K93J80j12
4774A37j80R5n1r1K86r1q2k3J74k12Q4nQ6j62qj05j1J5N04l22j48J92r9J30r2
4799B1N8k58K45oj16mr9J11k00K34m2J93nl91L39k7P4l58K38k76N4L04l36k07
4823d54M15P6j29o1K26J5j64Q2o2j13J92N9j3J8k64j37K07k7J64k8j05k0j12K89
4847E4k11J07j6J02j20r1J71L9J65o0J40j79p5K1P7k04L5N2J43l9j38l7mK34M5
4872B11k68K28Qj31o1L4J05k98L13k41o2K4K92p7k02K22j0m9K3L32l77o6j00Q
$$ y = [-40, -94, 40, 219, 150, 14, 142, 84, 164, -57, 132, 193, -149, 120, 200, 92, 260, 19, -57, -17, -224, -326, 167, 341, -381, 41, -97, -10, 280, 101, -52, 0, -11, 25, 276, 118, -125, -186, -80, 209, -254, -16, 50, 48, 79, 105, -147, 169, 19, 40, 114, 280, 46, -258, -14, -280, -31, -140, 173, 91, 61, -93, 18, -120, -224, 69, 249, 137, -43, 52, 1, -90, 196, 105, 23, 0, 174, -38, 46, 41, 127, -35, -43, -148, -159, -144, 360, 38, -110, 82, -17, 113, 21, 79, -179, 66, 60, -56, -60, -159, -48, -248, -14, -56, 137, 132, -259, 80, 53, 127, -231, 7, -269, -215, 89, -247, -454, -39, 37, -92, -153, 73, 88, -76, 6, -56, -169, 23, 82, 69, 87, -177, -314, -107, -134, 30, 2, -103, -123, -235, 54, -157, -50, -66, 36, -84, -175, -4, 35, 200, 140, 280, 101, 26, 47, 124, -80, -45, 7, 150, 111, -27, -64, -68, 166, 211, -57, 171, 179, 48, -13, 21, 126, -172, 141, -100, -162, -138, 154, 77, -125, 97, 87, 38, 61, 393, 16, -50, -150, -142]
4896a42K06j39J07j94L48l36J40N7n2P8m34K05Q4J60r9k3p0K17r4K53l61J6J71
4919I8p2j01k6K65q2j71K26k5k52K92k40K8K67j19j29L17p8k01o1L44l95J76n0
4942A1j66K00M3j53jJ87n9l41M21p0m8J2j78N9N1J43k1k5N4r6j37L23j67J3o4
4967iJ22l5j76J02J66M3k72om9M7N5k30K77j22j38J64p2J09o1K75j33l0l3L8j05
4992g3o4j1j53K82K55k57Q6n9j26J16M9j44J97J28k81K13L9l99L30k5k95L52j22
5015C8L5R3nk95J99j9O9j51n1J57k17J95J93k92j60L67K47n80j60J71QL20k30
5038f8K18j29J18l43J15M6J39j96P3J69j13o0Q3p8k92L83j04O1r3m2J23K74m01
5061a17L0K62k20O7p2J19o5Q8l45L12N8j13o6ol8j21J62Q3k52K05R2p3j22K4L12
$$ y = [-142, 64, -75, 32, -162, 186, -150, -10, 47, -5, 73, -361, -156, -72, 88, -11, -34, -104, 113, 19, 272, -89, -73, 98, 26, -75, -101, 164, 82, -89, 137, 112, -140, 152, -88, -60, 207, 88, -41, 276, 198, -3, -64, 280, -115, 61, 11, -155, 45, 88, -65, -66, 121, 62, -279, 142, 72, 24, 36, -142, -83, -32, 111, 90, 65, 119, 23, -114, 209, 42, 55, -9, 113, 78, -98, 4, 170, 213, -59, -65, -114, -67, -12, -242, 35, -87, -225, -61, -133, -24, -85, 190, 57, 27, -6, 32, -73, -137, -148, -301, -19, 236, -21, 65, 6, -120, -4, 45, -99, 98, 226, -55, 158, 197, -202, 128, 103, -192, 160, 38, 73, 166, 161, -134, 65, 46, 115, -36, -87, 70, -147, 48, 241, -51, -211, 156, 403, -177, -337, -166, -158, 162, -68, 150, 21, 139, -204, -89, -43, 96, -100, -27, 142, 29, -31, 52, -26, -318, 65, -39, 22, -71, -113, 10, 284, -117, -87, 175, -45, 22, -50, 69, 4, 92, -253, 59, 117, 4, -62, -68, -106, -227, -65, 18, -234, -29, 63, -10, -132, -108, 204]
5086B04o4K7k89K36K61k09j57r1J2O2MJ51k81J31k13J37R8n2o3oK1J10j36K32
5110A25p0q4K96k71Q6l2r1M9J09o5R5k21P1k5o5J42k27L43k31J87j45j32J9J5
5134a22J86k58K99l64J98m6p6j48L87n9M5j95J17J41r4L01p9j93po9l5j05J81
5157Eq6J28K08Mm39K11J72j92J58j58Jn0N8n5j51J92J99k40J25J6k21p2J12K73
5181A98n05N95j53j50M1j11J15P7k05N9Q6K13l41n3J81L8j09j25K56n8mK5k17
5204a47P1K9J8L1O1j22J31p2M0%l7q3q6K66j38l1J75Lj57J15J43l7o2j35q3j0
5230a17K48j91K4o1N8K70j9j32q6p6m8L86m87L05J71j31J18q9j74K50k24J3J17
5253A25l6J16j8k06K9n7J05k89K14P7l18J89j08J55J70k61K21j86R4o7M0m8J93
$$ y = [204, 140, 167, -122, 114, 375, 166, 9, -82, -70, -8, -4, 147, -134, -3, -216, -79, 19, -33, -96, -102, -81, 29, -107, 125, 55, -29, 267, -4, 82, 50, -41, 8, 117, 52, 147, -74, -3, -28, -93, 49, -178, 165, -66, 121, -24, -156, -137, -122, 64, -194, 105, -259, -61, -107, -183, -331, 56, -3, 42, -153, -36, 105, 11, 312, 233, 40, 33, -36, -71, -176, 5, -81, 47, 255, 259, -180, 31, 203, 11, 169, 11, 12, -38, 20, -35, -186, 6, 205, -35, 90, 106, -115, -187, -75, 198, -307, 288, 135, -15, 26, -85, 30, 107, -98, -39, 47, 260, -81, -134, 47, 85, -24, -149, 107, 49, 45, 70, -147, -76, -47, -29, 2, 63, -59, 72, 0, 40, 40, 3, -80, -166, 100, -38, -69, 106, 109, -48, 67, 210, 173, 111, -24, -107, -117, 131, -60, -36, -97, -39, 231, 212, 80, -6, -82, -130, 256, -231, 74, 245, 114, 232, 143, -31, 219, -5, 8, 125, 89, 205, 187, -19, 10, -47, 58, -231, -17, 60, -258, -69, -177, -22, 148, -113, 108, -78, 16, -51, -11, -59, 134]
5276A34j78J57m9k11J56R6j78R1O7k3j88O5r9M8J62p2n6nJ40k22K12J12k09Q4
5300C4J50k47Q1M2L4L2M7J8Jq1k45K46k8n9k43L37K2Oj31l4K70j23l8j34J36J39
5326B32j74k14L00j92R5p7N1J1jm2P4K9jj42m5N8p8J71j79J21J06k52K12k00K51
5351A14k40J18Q0n1lJ33j83R5Oj87Q4J88j52J27k82L47j52j40K80J35l78p0K61
5374A30K1j27n0j05J54l9J62l28L35j25k5J08j18J24j3k8l3N2q3J32k29J92N5
5397A62j04J11l1L1k56J75k27L45j02j91J42j16j85M27m11N15k5k95K13k30m4
5418i6Q2k42M10R7k21j82N6J08k59K51j28K00k36RJ72J11j98r4M59k38j48N9M0
5441A2j12J51k2Q6J78j85k74K60k13mN7J25K4k3n9O6J06j51Rj37J68J3r1J16m3
$$ y = [134, -44, 113, 64, -147, 9, 105, -73, 18, 85, 62, -126, -61, -160, -112, 50, -22, -78, -83, 57, -165, 47, 159, -50, 34, 184, -63, 18, 60, 94, 126, 173, 191, 192, 111, -134, 112, 84, 25, -218, 119, 141, 147, 16, -18, 252, 129, 91, -43, 93, 232, 58, -156, 144, -48, 47, -30, 21, 32, 31, -11, 63, 92, 91, -51, -96, -38, -116, 55, -124, -3, 103, -149, 63, -137, 114, -126, -8, 72, 21, 18, 151, -32, 63, 69, -118, -34, 154, 2, 129, -153, 194, 42, -98, 182, 317, -61, -131, 130, 151, 24, -26, -131, 23, -16, 146, -182, 153, 28, 3, 111, -7, 117, 104, 76, 43, 95, 12, 144, -85, 107, 162, 58, 169, 138, 169, -87, 88, -139, 206, 104, -87, 55, -61, -246, 181, -230, 285, 260, -35, 178, -52, -96, -14, -256, 154, 251, 30, -152, -96, 12, -247, 4, -124, 76, -160, -151, 21, 132, -66, -160, 299, 61, -87, -28, 12, -100, 51, 29, 115, 293, 108, -166, 94, -119, -123, -66, 59, 83, 60, 1, 67, 173, 22, 31, -106, 62, 75, -16, 100, 57]
5466E7j39j40K26j26K19O7k84J10J26j29J55P2k36J41j17K9o8J65j6l40J28J64
5488F4j83J55R5J11m39J20q2K06j40L3O1k1O9o4J51j14R1j26r2P6J31Nj21J4m3
5513d3j2O7J50k85J26J10j84J52r1L93l31j77L65k84j6L9k43L34j05K19j97k7
5535d0N4p9L6o6j20J77J16k09K19J28p5m11J72K06k21K03p6rk2N4L4N1M21r19
5559c76M09L39l43m0M27p60L42Qn0J69k77J13j74J14j09K65m5R9j56J2N6k10K57
5582G0k8k6K95o4m01L1OJ27k14J86O9j27j92L72k19J94j83N7j53L56k33r2K40
5605G1J34l44J66J36K2j78K7J63j22Ll5k93K94j23q2J9R0L59j84o4r3j7jO2L8
5630D8Q1n6n9%k95L32J10j72j70J44j8K43j01l18J42J11j60M2N7J50r3O8l4j30
$$ y = [57, -82, -222, 4, -122, 97, 164, -120, -10, 116, -13, 142, 214, -22, 119, 2, 31, -37, 128, 112, -228, -100, 64, -119, 36, 131, 242, -197, -77, -159, 47, -93, -60, 1, -20, 49, -15, 136, 22, 113, -13, -105, -29, 102, 107, -14, 0, -43, -55, 12, 162, -123, 3, 113, -71, 81, -10, 383, 52, -125, 240, -44, -60, -21, -264, 70, -35, 184, -13, -40, 14, -65, -29, -95, -215, -38, 78, -131, 88, 216, 141, -270, -98, 108, -113, 90, 14, 5, -17, 37, 71, 122, 543, -376, 33, 372, 29, -11, 416, -344, -2, 6, -44, 125, -152, -39, -213, -99, -208, 57, 12, 111, -45, -33, 23, -187, 70, 42, 16, 311, 247, -154, -123, -117, 10, -204, -18, 51, -76, -268, 104, -115, 79, -104, -47, -200, 156, -77, -169, 71, 205, -139, 27, 163, 185, 7, 34, 197, 75, 78, 43, -250, 44, -79, -161, -142, -52, 307, 123, 59, -34, -51, -52, 10, 48, 129, 73, 14, 14, -281, 51, 161, -11, -181, -37, -55, 188, 87, -231, -89, 22, -138, -96, -39, 111, 18, 86, 52, -78]
5654g8J40n1j00j77K64J44j82J53l72K29k20K56j04J09M7k36J49K0K4j86L42j71
5676@q0N2L7J65j04j07L49j07n1k90J67p8K6J07Kn5m0K68k60j10o9J1J74L4J72
5701B13l66p8j3J46K47m8l1k66K11J41k92J68q9mo8L1P0Op4K86l35P4Nj17L75
5726A92r1p9m1n7jJ69k06O5K94k41k96K54R1n8J51l32L01k83K03p2k40K87j99
5749a89k8M77l71k9J21l3Q7J46p7m5J89j11j93o1L62j04Q3j17j80K88O3m80J70
5772c2J69j78Op4j04K86J1O4k65J8J18j16Q4K66m91K69k4K7j08M8J15j5j33K72
5796B13k04r0K24j95J62j60j53K29j8J71j58L5j0p4Q0R6j40RL0O5l43L46p1q6
5820d2L9J4o8n8K64m1r0M3p0j56K58R2L7n6l71J22OQj36K28K11j38R4j53q4kM2
$$ y = [-78, 62, 11, -89, -266, -2, 142, -40, 113, -259, -30, -250, 6, -98, 11, 58, -178, -29, -9, 15, -171, 171, 0, -80, -28, 9, 174, 70, -37, 312, 205, 154, -136, 31, -47, -21, 86, 88, 33, -7, 261, 1, -109, -178, -167, 7, 41, 213, -153, -231, -244, -98, 149, 101, 70, -196, 15, 156, -136, 32, -57, -61, -129, -98, -28, -22, -96, 190, -145, -71, -66, -183, 192, 101, 22, -19, -76, -77, 92, -114, -49, 245, 4, -292, -38, 53, -5, 146, -186, 115, -168, 35, -37, -277, 10, -189, -217, 260, -111, -140, -19, -52, 35, 181, 104, 59, 248, 137, -56, -117, 245, 141, 224, 107, -73, 215, 278, -202, -32, 137, -41, -35, -109, -213, 73, 84, 148, -117, -99, 19, -97, -13, 253, -238, 31, 7, 34, -74, -26, 89, 74, -59, 213, 9, -81, 143, -52, 110, -50, -203, 26, 8, 179, 21, 56, 46, -28, 52, 148, 8, 17, 47, 112, -231, 115, 44, -42, -3, 11, -57, -115, 149, 108, 18, 61, -9, -165, 93, 185, 222, 166, -205, -83, -77, -69, -205, 23, 234, 96, 190, 37, -47, -49, -7]
5847gq0L34m9l5j41N8pj80J76j97Q2J47k24P2j33L8P3J68j05k8R2nK40m35l9M7
5873a38J24m2k17K05M5j43J65j13k8J30J13q3O1p9J96r3jj26K8P9j78P4k2O9q8
5898f2J54j7j70M7l8L33l59J57m0J22k5m2j00J25p5j4L2Q3K0J55j17j92L3j20
5922a10K58%j10o1J63l04J11j3J06J99k67m3L8j67Q1L2P8L3j33K00k38K2J38k46
5946b33L35j96m9j4K97k01J2J62j42k05J90j83K05J36k8P7j04q3k55O40m26K8
5968c7L42j12k3k88L32j93m3o2J47j00JJ57n1j12L09j22k66K29l3K0k71L24k40
5991i2J88J1j92K5J83k93K58o2L5J52R4l82K85j2k36j48J40J96j31Qp1Q9P7J09
6015B31k29m3P4n3Q9l5J13l82J10J16j00K27k62P8L60l56L4j00k2J40OLq2K7Q8
$$ y = [-7, -87, 247, 198, 163, 22, 80, 73, -107, 69, -128, -46, 101, -123, -51, -184, -146, -73, 95, -10, -38, 54, 49, 289, -146, -185, -138, -14, -56, -273, -68, -23, -166, -1, -114, -142, -12, 101, 18, 79, 0, 196, 103, 102, -24, 4, 83, -95, -21, -43, 26, -62, 92, 75, -95, -48, -86, 247, -112, 45, 5, 127, 102, 60, -40, 85, 10, -4, 28, 111, 131, 286, 169, -23, 10, -110, 148, 148, 38, -23, 140, -164, -53, -66, 40, 239, -28, -71, -33, -200, -119, -87, -9, 24, -109, 91, -147, -125, 13, -233, 102, -94, -143, -157, 140, -61, -49, 113, -29, -234, -44, -227, -22, 114, 86, 163, 59, -24, -279, 361, -65, -37, 305, 193, 170, -118, 214, 21, -22, -84, 63, -37, -36, 121, 70, -42, 267, 145, -121, 108, 75, 95, -176, 148, -92, 96, 107, -85, -60, 123, -170, 88, 26, 61, 213, 307, -75, 210, 198, -38, -186, -46, 150, 19, 27, -44, 45, 122, 231, 2, -41, 33, -20, 69, 34, 147, -235, -125, -9, -109, 118, -144, -66, 294, -62, -28, -128, -150, -10, -4, -1, -83, -56, 32]
6040C2J7k46L51k77R9J64r8m6j32J49L8oM2L4j2O1j01M7OK09m38J98j30K8N2L4
6066G5q5n9k8J39k60J11OJ76Nj41Q8p3k43K37J66j02%J10j59j77K67M3k57J11
6090e0J15l28K93o8l5K22J0m38M0L40N6k58J79n6o4J63j08p5L15l46K87k40l3
6113g9j41J63J94r3r7K30j73k05M2L49j03K5nn2J9l34K52%q8J1J7K09j25J56j46
6138B6K9O5l57M14l25J90P1%j58J99k93n3K7J50J72q9r2J83K8j23J00j87K37l02
6162h8J92J23l25J11O4k72L5L83k87J11j40l2J28l8K07k11K70k85M5L3r6jRMj03
6187a63J20K8J31j21J35qj23Q9N1k10K07j51M8K31l03P8j83M26j69j64K91j71
6209F9J60j87Q6j60P6J24j08j41K70M8m15J08j24J94PJ36j60J87k58k16M07jj75
$$ y = [32, 49, -197, 154, -123, -24, 140, 42, -4, -136, 13, 51, 45, 87, 121, 109, 170, 69, 116, 122, 331, -107, 91, -39, -11, 41, 75, -10, -69, -97, 42, -218, -107, -101, 75, 80, -61, 27, -46, -289, -52, 114, 12, 12, 122, -37, -214, 53, 96, -161, -50, 65, -263, 30, -38, -73, 149, 159, -279, -239, 101, 157, -101, 78, 22, -42, 121, 13, -62, 253, -93, 194, -46, -79, -220, -57, 137, 44, -53, 177, 4, -201, -159, 190, 87, 112, 107, 55, 74, -260, -8, -8, -96, -85, -68, 141, 16, 172, 26, 55, 120, -237, 177, -148, 42, 113, 113, -45, 154, -139, -192, -165, -15, 157, 68, -24, 159, 187, 64, 164, -23, 214, -88, 104, 227, -98, 13, 77, -195, -160, 223, -64, 47, -93, -125, 3, -35, 172, -39, 231, -54, -9, 24, -72, -73, -64, -60, -163, -43, -15, 116, -5, 130, 122, -1, 88, 139, -71, 136, -15, 33, 264, -39, 39, -144, 282, 113, -51, 240, 69, 229, 42, 128, -32, 44, 168, 60, -81, 189, 237, -178, -70, -194, 0, 7, 143, -17, 170, -88, -304, 103, 102, -73]
6232g3K2J1N4r7J38P2k09l9rl6J75l3J25l00l3M5R9n0L9q9J71k52L41l2%k16J70
6259fP6j32l68N17j38m4J36j52L98l51n2M0J99j46J4j07K69p2k56K92j48J2K01
6282A82j93K30l5m67M40rl11M15l39J45k67J05Q8l5J03j94M3O3np5J57k3m7R2
6306F3j80P2J8o7m4J50o0L1j0l6L6j21J67J11m33O37m08n0J89l7k93K78o5k75
6330c27M07j47K00k57J59j23%N1Q3j32J15j0O2R6k11j09J86J37o8k3J36k32LJ1
6354Gn9j52L28j48M6q3K3J55o0K6P8Nj58J11k49K66j38%j0k4O9J50k39j80M4J99
6380Gn5Q5m3k03J59j42Q6M0M5j54L5j17J26K14Jk39n7J74J27l6q7J84k6j74J03
6405E3j07J58p0J68m07N20l50k08L50J78k99M1N2j0k94N37k40k13K42l56J22Q9
$$ y = [-73, -51, -40, 14, -83, 55, 127, -82, -121, -130, -166, 9, -24, 101, -199, -232, -187, -88, -138, -99, -188, -17, -269, 72, 40, 40, -176, -6, 70, -62, -430, 87, -51, -95, 41, -111, 287, -64, -116, -76, 123, -23, -9, -116, 153, 81, -175, 117, -31, -19, 182, -11, 219, 184, -283, 157, 148, -163, 252, -87, 58, -209, -104, -16, -51, 52, -142, -99, -36, -41, -116, 41, 18, -29, 63, -117, -45, -27, -94, -138, 12, -48, -17, -27, -63, -27, -148, 19, 130, -303, 334, -74, -124, 65, 28, -265, 13, -52, -327, 80, -67, 133, -124, 35, -88, -88, -37, 46, -86, 29, 19, 81, 177, -34, -143, 43, 180, 112, 89, 225, -7, -4, 7, -52, -204, 124, -24, 22, -61, -38, 117, 57, 83, 161, 166, 8, 119, -130, 136, -2, -2, -12, -36, 33, 183, -56, -236, -192, 7, -48, 37, -6, -209, -50, -192, -106, -66, -21, -175, -140, -257, -131, 83, 84, -155, -212, -38, 89, 53, -34, 150, 124, -50, 53, -54, 104, 34, 202, -205, 315, -35, -243, 107, 285, -14, 27, 79, 69, -225, 312, 72, -141, 101, -255, -133, -44]
6427d4L9L5o3k5J01j62L26l44K94j66j02K07l2j88L2J76r7jP7j43K34q5j68J90
6451I1qm1k7j03J90j80O0J33j46j97K76j45k9O0k8M8J13l17j85N74j09k7L6Pj61
6476a15m8K9K8m6J57mJ46k03J80j86R8k57J48L14k61o3LK5K74j24Q6l50O2kJ47
6501C8j1M3M06o47L19l65l7M63p6q0j8K20m12N10l37P9K4l7Jm0ll7j9K03j42j09
6527f4o9K27k02K5R6L6P0O1j30o9J8m0j08O6Q6k03J35j42J67j29J58r4O9N2j00
6552h4j91L04N7k93J24L62k60J50r4P0l15L10P3r2j5m6j16K2p5L69n10K14L93
6575C57j57o5j30P2j25M7q2J13OKm8K21l68K37j35n9O0J73o9r1J9J89j19k50K51
6600D9j88K64j88j19J51o6J68q1k03K45K7l4jp3j2J45n00N45R8l65K62o9j66J91
$$ y = [-44, -5, 30, -33, -58, 43, -119, 207, -137, 157, -9, -111, 96, 64, -124, -92, 84, -13, -14, 63, -80, 154, 69, -99, 91, 83, 42, 15, -88, 102, -78, -18, 115, -31, -228, 48, -97, -126, -66, -94, -46, 67, -250, -435, 139, 30, 3, 39, 46, -115, -163, -134, -106, -152, 5, 1, 147, -56, 124, -62, 36, -221, -73, 241, -20, -83, -80, -55, 219, 95, 181, -169, -107, -109, 38, 27, 70, 476, -171, 148, -217, -254, 209, 133, 53, 35, 255, -157, 353, 16, 95, 119, 82, 83, 43, 40, 3, -16, 187, 45, -64, -133, 94, -108, -83, 13, 49, 119, 180, 50, -19, -1, -41, -149, -83, 3, -200, -65, -207, -40, -169, -11, -105, -36, 16, -84, -275, 29, 86, -207, -83, 279, 19, 169, 75, 145, -170, 140, 213, 121, 106, 60, -56, -34, -109, 260, -250, -36, 357, 200, 135, 5, 77, -48, -1, -83, 30, 36, 38, -10, 211, -157, 80, -55, -114, -54, 119, 50, -41, -22, 167, 48, -202, 49, -139, 125, -63, -182, -31, -97, 71, -10, -213, 32, 59, 25, 24, -49, -61, 84, -416, 129, 227, -138, 124, 55, -111, 80]
6624H0j66R2J32j98j61L56J5k38K11M2k06J37l22L3K9K46k76L47r7l9j30K65j71
6647a9j49N25k60k73J58q8P6J46m13K65k7L7J17p1N7k02J85K7j0j74n7K47M5j68
6671b6J47j45j2J00l45N04k10KK20j74l06L50O1o7r0J10k63q0K53j13P6m3N6L0
6695C5k64K36j23l4J32n7j7J73j39Q1p2Q8J14j65J36l74M19j93J41l26J87m2J61
6718I7R3j88K5j53J47k23M21l17J12J17k2q7K16k44l5Q0l3n2K35L4j91J28j85
6741b5j16J73j54P6q2R8o5m2L50m78J56K82L5k00j86K23j76J19Q0N6l6j71N6p7
6765a04l2K24k81R1P0j00M5J30RJ78l68KK51P0k03jL54l06l4J11k39k5J98L8R3
6790A71j59j26R2K76l55J34j74P8l3k06L40Q8n5j30m9k11L68K07j56Kk31K01j26
$$ y = [80, -86, 6, 138, -60, -221, 135, 150, -88, 123, 165, -41, 96, -226, -193, -164, 82, -194, 153, 56, 17, -113, 152, -19, -168, 357, 97, -176, -18, -106, -30, 116, -297, -32, -59, -22, 95, 24, 81, -121, 64, 91, 81, -93, -150, 97, 142, -26, 121, -24, -36, 64, -281, 223, 13, 15, 235, 61, -245, 105, 166, 99, 9, 119, -144, -224, 29, -84, -8, -51, 5, 35, -229, 7, -116, -150, -18, -75, -92, 81, -58, 23, -49, 39, 153, -12, 124, -250, 169, -24, 117, -209, -22, -64, 97, 190, 2, 27, -126, 21, -202, 219, -98, 14, 131, 109, 22, 238, -6, -41, 39, 6, -46, 189, 223, 32, 160, -25, -141, 32, -122, -46, -128, -30, -95, -137, 213, -265, -109, 173, 208, 8, -178, 45, -131, -12, 68, 124, 88, -83, -27, -104, -136, 88, -193, -102, -32, -132, -87, 43, 52, 230, -138, -136, 115, 185, -18, -19, 335, 29, -5, 106, -133, -158, 40, 78, 171, 12, -114, -22, 254, -101, 33, -141, -63, -96, -302, 38, 126, 71, -59, -108, -319, 49, 256, 100, 102, -129, 72, -54]
6813e4Q9j34J90k70L4Q8N0m9q5K58m1j12j08K97r6j76K41Q4l15K92j60k6M3Jj06
6838f5L0j24NJ02P8k49L92l1l11K15L07l53o2J99j87j4J0k8j14J25j73L46R4O
6862A98N9j54N1k15p6L37k07k8K36m00j0N59k53q5J38K9j90M2j43jP8J66j39j14
6886a22J59N1k8o6k00m9K28nO2K4J79l05K08lj39P5j0J34j57k20Q7K7J6N0l6J96
6912A56j89K39j93J13j79N1k6j36J05P1j28j18L60j09j01M1J03r8J72j30Mj97
6934a89j43M75m8j15J06j26N3k18O1j53K74N7P9J23j01J31l3m61P7J72m3K38k71
6957e5J43j03L38j44q8k4l12K13j13J14j58K23J49l50J64Q2k0j7j99J95q6k2M2
6980b8j71L41k21N3j02J57M0k49K1J92j73l3J83j70L42k01j8J63nj86J93l37P5
$$ y = [-54, 35, -99, 91, -179, -145, -57, -7, -56, -141, 117, 76, -36, -144, 153, 57, -119, 122, 206, -109, 183, 23, -3, 40, 41, -65, -35, -159, -154, -52, 26, -223, 169, 138, -173, 42, 349, -4, -66, 133, -54, -68, -58, -86, -200, -75, -248, 98, 192, 198, 257, 103, 154, -61, -137, 200, -7, -35, 201, -199, -209, 350, 97, 12, 150, 179, -11, 31, -112, -113, -35, 131, -8, -122, 37, 88, 60, -6, -206, -255, -27, -32, 30, 54, 233, -72, 136, 133, -6, 69, 59, 193, 36, -184, -97, -70, -54, -4, -40, 156, -33, 206, 13, 126, -53, -2, -28, -164, -59, 12, -116, -234, 126, 17, -84, -43, 60, -38, 134, 4, 8, -189, -332, 143, 95, -20, 86, -40, 13, -205, -144, -297, -23, 34, 113, 236, 135, 266, 233, -228, -151, 21, -22, 216, -55, 88, -15, 323, 179, 91, 67, -245, -32, -145, -31, -189, 34, 183, -167, -3, 79, 59, 42, -157, 38, -48, -70, -28, -199, 142, -79, -26, -128, 29, 69, -180, -159, 33, -140, -173, 10, -160, 182, -19, -37, 126, 121, -65, 128, -209, -134]
7003a34O6R6j37J19l9O3K7J31k37K60k23j47J5K15J28j79R7Nk70j8L34m2j33J13
7027A10j98rK21l02J47J78k21J3m7K22j48J42j13j79K76J46k66l4Q8j11J24j06
7049f7o1J32J85j91j53L54l72K7P9J80k38P0N4j58J34O7l5K01k77J18L2j43L9
7072b3l1J44k68K27q2Oj4J14J09j04l14L49l11J39M8M0p3qJ88o6j2J41j61l9K10
7097B09m08L12k06n9K35j15j13L85n2j51J4J52l43J0J64r4j59J11M0J55r5K09
7119B01k56J00J3m3k80K11J7j48N0JP9K24J2j15p1J07j87J61k20J34j52M0K38
7142A16m0J23j21j7k27o1Q1K74k35j40L55n3j20m5pl0k26K68K35N1p3N8k67J08
7166GN5Q1l77J83qJ80j66J81k98M93l72K04r9r4N0j03K65m8j3r3j55N1J52k42
$$ y = [-134, -68, 28, -109, 10, -29, 34, 61, 192, -45, 215, -8, -155, -140, 75, 203, 24, 121, 126, -144, -162, 172, 130, -3, 110, -88, -97, 124, -178, -31, 147, -74, -61, -108, 114, -34, 108, -5, -184, 92, 238, -28, -62, 26, -85, 39, -67, -128, 4, 189, -2, -155, 199, -173, -146, -67, 113, -125, -55, -1, -159, -25, 42, 7, 208, -69, 49, 81, -62, -23, -54, 90, -178, 49, -33, -27, -41, 73, 182, 78, -236, 113, -198, -59, -11, 29, -44, -52, 136, 70, 58, 199, 38, -1, 209, -199, 113, -93, -152, 83, -32, -145, 240, 188, 37, 51, 203, -140, -130, 34, -60, -219, -108, -68, 87, -8, 201, -55, 45, 58, 15, -265, -54, -37, -185, -135, -134, -55, 169, 181, 66, -5, 102, -85, 76, -144, -10, -162, -122, 116, 76, 199, 78, 61, -166, -227, -146, 128, -107, -247, 108, 55, -65, -110, -117, -147, -373, -105, 130, 181, 108, 166, -101, 7, 62, 143, -234, -51, -59, 121, -45, 136, -162, 331, -41, 163, 64, -30, 20, -83, 182, 134, 121, 28, -127, -76, 76, -166]
7190a66K87j78j12L67j97j81J49J02j49q0m0J98n5Q7j40j79K34J17l2RJ32k33
7212f0J18j75K4M8L18k04K1k10K06m3k12O5k70K19N8J36j30n3j09l1L62J8Q1J10
7236B87l21o1K19l5j93K9J61l81L25p9M1j27K09J07j64j22M0l0M97l64j97J42
7258a7J52m4k76L83k43l5M9K3R4k09N5j91K09J67ok33J37J41j61P5j76j52J74
7281h4j25J37j26K82k00Q8J36l2p9j30J73q2N5J23j22q8r3L35j71J2Q1k9pj21
7305f7K0j83J04J43p7k3p3J71j45K25O5l36M13k00J59l67L53k64J10J63m30J81
7327e8J95J2k71J10o9L6J40m3K6J22j91J4q5J23m03L39J08k62q6K92O6j63n4K83
7351A81n28N33j50Q7l52J24J61m7j30O8oR5M1k37L45k74J2mK17j58k23L89k41
$$ y = [-166, 121, -57, -169, 198, 1, -180, -31, 71, -78, -158, -198, 0, -55, 32, -108, -287, -53, 64, 32, 41, 173, -60, 58, -117, -93, -45, 273, 69, 90, -120, 86, 43, -169, -104, -374, -155, -97, 39, -91, -144, -253, -284, 78, 96, 177, 287, -34, -95, 124, 89, -104, -75, 86, -295, 30, -49, -8, -135, 74, 181, 17, -105, -65, -95, 402, 38, -159, -17, 135, 91, -185, 198, -45, -80, -31, -8, 86, -123, -68, -259, -50, 117, 111, -122, 15, 156, -5, 70, -106, -258, -84, -209, -72, -198, 84, -116, -28, 108, 76, -3, -133, 40, -42, 13, 136, 14, -74, -167, 168, -3, 9, 90, 61, 54, -67, -47, -230, -126, 17, -60, -83, -156, 15, -130, 95, 160, -176, 237, 37, 196, -171, 182, -82, 28, 191, -239, -58, 137, 149, -122, -12, -81, -45, 95, 52, 78, 200, 9, 23, -62, 61, -342, -3, 105, -157, -243, 49, 115, -48, -102, 181, -347, 186, 36, 123, -229, -105, 56, 9, -121, -53, -59, 36, 77, -160, 185, -89, -77, -81, 136, -22, -245, 144, -97]
7374i7q0K60j41n9J68N0Qj00j27J49K2K6k01j8K63J71j83P5l57L15j47J4j7k08
7398b14J93j51R9K21j28k0J16k16L5J11j0Q3n1J6p2N9n0r9l4Q1J45n3n1j96J90
7423DPp2lJ36L0p3L6j30p7PM6K1L07k62j29K64j93n0J66l2j33Q0J33k65J94l5
7449b3QJ9kl74L40K40l04o8K22L8J2j76J43k11J41N9k19L19J81j92J18j99p2k44
7473b44J62K00j32J80q6k58J61K2j37M9j6K30k17K46m17J93j1M7M9N7k4Lm2M0
7497E5j53L7Q6K43kn8m22J67Q6J30j50J9rp0K96l82K67r2j88J1K00p4j0j39L7
7522a15K67n1o7j27J4M9K3R5k4j75K49l47J76k33K13J9j0n5P6R9K01k51J52k63
7546h5R0P4l03K49O0j27l9K5m0K76j27N6L6K3l02p2M11k47Pm2J62l40M53j37j64
$$ y = [-97, -177, 83, -58, -117, 51, 101, 109, 9, -118, 31, 53, 79, -122, -140, 123, 294, 111, 186, -171, 144, -3, 11, -6, -214, -21, -172, -73, 148, 20, 0, 116, -100, -65, 46, 36, 119, 68, 84, 12, 71, 21, -78, -112, -31, 114, 61, 10, -186, 4, 11, -61, -64, 72, 102, 29, 65, -65, -142, -135, -89, -68, 239, -23, -152, 112, -81, -131, 35, 3, -130, -50, 83, -182, 12, -23, -15, 4, 2, -372, -32, 208, -96, -164, 58, 96, 108, -68, 75, -136, 5, 64, -155, 164, 345, 153, 271, 72, 0, -244, -82, 118, -14, 166, 80, -178, -17, 5, -132, -83, -99, 131, -86, 160, -257, -64, -75, -28, 21, 78, 54, 57, 15, 55, -98, -61, 25, 268, 266, 208, -214, -47, 39, 169, 19, 38, 29, -41, 255, -127, 140, 48, -140, -129, 71, -3, -13, -152, -115, 152, 101, 34, -93, -79, -30, -7, 88, 64, -111, 138, -209, -33, -266, -53, -34, -44, -99, -23, 76, 277, 26, 178, -85, 5, 79, -224, 25, 85, -42, -81, -56, -96, 180, 53, 109, 145, 168, -134, -206, 205, -42, -35, -77, 85, -255, 198, 61, -103]
7571a03j13L64k38q1O31m66Q6k0p7L15l92k7o3K75p4o1J91j71J52k7Lj45J12j11
7595d0R1j40O2k62R5J41R5R3j75l3J70P8l22J59J62k60J13K28k04j51kO5Q6k34
7619a85M23j48o8j8j48j22L48Q3l50K23j32l6J95k19K30N7p2K20k38j46L12m78
7641b69K23p0J52q6j05J11n8J34l58L04K9r4k6Q5N7j58L01l26J37j17K9j51K95
7664C9K69l64o6R0K48m82K29J34k20J71l00K84j34J1N6P6j3N2j43J77j05j38J22
7687gj75J70P8k29J96q0l2K85M9j21j79K01k03qK18m02K59r7j22O2l8P6q0L46
7711A67n7J26k36J58k02l8K81q0M8j67J98l24M71m37K06j05L2n9q0K7L01r7k81
7734a48K02RnJ15j17ll3r1L08j61r4j16K05j20j5L7L1j25K24lk60M16k18K80k52
$$ y = [-103, -216, 148, -90, -171, 460, -6, 80, 60, -17, 298, -94, -121, -184, 91, 17, -44, 147, -24, 128, 101, 104, -41, 71, -40, 51, -89, -27, -289, -194, -53, 42, 135, -40, -73, 97, 175, -147, 12, 174, -86, 27, 255, 51, -100, -102, -37, 49, -185, 238, 90, 22, 4, -144, -266, 82, 165, -185, 38, -94, -130, 65, -154, 76, 133, 61, 281, 43, -103, 209, -269, -46, -116, 36, -50, -155, -44, -102, 32, -326, -22, 7, -87, -113, -28, 29, -129, 172, -154, -17, -134, -105, -256, 39, 308, -56, -122, -32, 216, -266, -37, 97, -123, 48, -252, 32, -102, -91, -35, 41, 28, 80, -63, 114, 9, -129, -7, -182, -12, 66, -163, 33, -47, -79, 206, 255, 134, -45, 156, -47, -55, 163, -239, 20, -77, -199, -137, -175, -99, -179, 167, 110, 236, 0, 158, -44, -82, 199, 119, 167, 0, 198, -126, 345, -92, 114, 9, 41, -18, -98, -71, 230, 133, -148, 54, 63, 58, 173, 56, 53, 20, -71, 237, 76, -18, -134, 71, -49, -64, -27, 4, -121, 103, 100, -160, 256, 38, 318, 66]
7759F6j72J53m1Ml54M64k11n2m3P6K04k64K34J72n18K85O5n6Q1%M1k09J21mQ1
7784A23m8M7p4P1l3m2j12j80L47k39L73m49M68l23p0K48j83J42P8j6l66N2Q5J64
7808F3o0J02j61J0k41L16k34J48j08J02J3o0m7L5J04r6m7K24k90J68m6J25M1L1
7832I2J23l84M59l59q6J78KM3J17q0p7M5mq9n7j02O7J84k50J0M68k37J67l87M4
7857a13R6nl6K5j2O9k43J54j75M29k81K34l84J79o8K24k01j0L73k50k9q5J94j84
7881i9J57J03k9k21R4j91J04qO0n3J55J28j56J0j17K91l03Q5kJ13r8m8P3Nj98
7906a45Ol1l7n1K73m2j09J28j23J70J6J42j74j41J8J52m5Q5k12j64M42m21L20
7929E7j94k2K37j61R8n2J14k88M1J54j8j90Q2J32J44j4k38J04J07j31j56Q2K07
$$ y = [66, -106, 47, 6, 10, -344, 120, -91, -143, -186, -110, 94, -170, 64, 236, -282, 3, 68, 12, 93, 93, 134, -75, 46, 42, 123, 75, 122, 48, 119, 86, 44, -68, -248, 99, -140, 233, -216, 252, -71, -141, 107, -76, 66, 144, 128, -238, -186, -101, 63, 3, 105, -56, -46, -287, 29, -205, -57, -165, -63, -50, -110, -157, -122, -18, -114, -161, 63, -227, -59, -105, 20, 61, 92, 215, -169, 290, -69, -155, 23, 25, 68, 185, 105, 28, 73, 69, -20, -77, -179, -112, 72, -178, -168, 300, 63, 230, -157, -113, -17, -22, -58, -33, -45, 24, -219, -65, -240, 189, -92, 142, -242, -63, -131, 93, -108, -118, 255, 5, -24, -109, 85, -99, 58, 161, 132, -89, 5, -186, -82, -90, -30, -83, 72, 200, 44, 54, -63, 228, -75, 10, 8, 121, 23, -25, 48, 53, -145, -139, -170, -207, -258, 15, -27, -136, -8, -131, 39, 55, 197, 23, -118, -100, 52, 7, 92, -120, -284, 158, -263, 57, -137, -159, 78, -83, 15, -37, 77, -211, -170, -16, -34, -224, -142, -10, 134, 120, -118, -14, 93, -38, -194, -112, 95]
7952I5M2m90K47K72o8j83J39J99o28J64K96j03l2K18k62J63J1j18J89m79M12n2
7974C2N2k3k65PL74l81K81J05j30J73l06K30j77K4J03N6L9j65P6k16n2j9O3Q8
7998c1P2P5k00J0p3J54K7j6J72q9n9L9r8L7J35j31j60Q5P1J61k18r9J54j51kK29
8024I4n4q0l04M89m92K41M90n57K09m4Q8K84l71k35L10p8j32m5N73l44k1kl12
8047b93J55Nj6J91K4j80PK8J21J42j19k51K5K56k35J02J02q0l29M14l69L20j27
8070a07J26r5n0J32J48r1P7K3j33M4q6p9L52j45m12K94J69l65J96Q4k33J21j03
8093a33L85j41%j1j56o8l2K33L7j08p2j42R0L3M1L2r2K31l9L32l72n7Q1l7j31
8118i6J19j72K31k7j30j31L74j33l2J13k37K97Pl19k9N0j04K27J4k8M0p8ROl9
$$ y = [95, 137, -353, -106, 166, 98, -85, 54, 253, -375, -211, 85, -18, -50, 168, -94, 69, 80, -38, 151, -328, 84, 32, 84, 61, -204, -197, 177, -204, 77, 182, 52, 225, -81, 149, -28, -4, 99, 155, 194, 29, 105, -111, -163, -182, -119, -31, 41, 116, -84, -74, -147, 7, 34, 18, 190, 101, 42, 81, -17, 20, 155, 24, -136, -51, 20, 181, -37, -136, 18, -133, -135, 94, 40, -40, -344, 145, -347, -106, 384, -173, 36, -8, 80, 364, -7, -242, 68, -10, -142, -187, 386, 42, 21, 19, -293, -138, -133, -149, 42, 66, -114, -107, -79, 42, 184, 65, -186, -161, 95, -140, -38, 64, -16, -345, 69, -300, 20, -107, 19, -76, -126, 6, 154, 63, 140, 163, 30, 74, -12, -91, 261, 116, -296, -2, 167, -198, -2, 82, -151, -30, -133, 252, 111, 111, 100, -56, -124, -156, 77, 114, 6, -66, -208, -118, -85, -44, -12, -104, 127, 88, 420, 48, -9, 72, 35, -96, 23, -149, 82, 55, -75, -206, 168, 35, 3, 116, -121, 176, 183, -136, -165, -115, -219, 8, 22, -6, 34, -44, -35, -29, -68]
8143f8K43k63J89o4Q2k8j25N4J89m5j68j20r9M78k75j67J13Q9pr3j56J54J57J30
8167B00k95O9Pj41J37k94K40n7L24j79J85j31r5j0j05J4K38J97l28J54j21J51
8189A60r8r5
$$ y = [-68, 175, -88, 101, 37, 119, 91, -34, 20, 209, 164, -4, -124, -223, 255, -20, -187, -74, 15, 8, -85, -241, -87, 70, 200, -95, -26, -19, -160, -23, -317, -77, -134, 190, 11, 196, 65, -30, -40, -145, -131, 107, 304, -24, 130, 9, 160, 62, -33]
8191c3
$$ Imaginary data points
##PAGE= N=2
##DATA TABLE= (X++(I..I)), XYDATA
0@%%%%%%%%%%%Qj6J6j6K4l2L2m0M9n7P2q8J04j20J37j61J90k17K49k86L24l68
33a96M18m72N32n97O69p49Q35r28J031j145J268j402J549j709J884k077K289k521
51a321K775l057L373l726M123m572N088n687O389p230Q256r536J1185j3406J6561
66I215k1405K9839m8466J57253n1250k28370K76005j59885l3585J56614r6698
77a0733p030N8595n4017R349J924J6287j731j417r726n204M80j721J6521n593
91E984j4570J2961j9576K1631J3011k0337k132k589M937j5100J0628J5464k8411
104a8099M1904l0725l6557P8912m6439j2809N8370o1101J6180K3039l8726K5679
116c72n65m438Q320q999J1455r983m341Q629n125K822l188M013O051j413k511
$$ y = [0, 0, 0, 0, 0, 0, 0, 0, 0, 0, 0, 0, 8, -8, 8, -8, 16, -16, 16, -24, 25, -32, 40, -48, 56, -64, 73, -88, 102, -115, 134, -152, 172, -196, 222, -250, 282, -315, 354, -395, 440, -488, 543, -602, 666, -736, 813, -896, 988, -1089, 1200, -1321, 1454, -1603, 1770, -1956, 2167, -2405, 2683, -3004, 3385, -3845, 4411, -5125, 6060, -7346, 9215, -12190, 17649, -30817, 126436, 75186, -153184, 122821, -37064, -70649, 85965, -10733, -17763, 40832, -13185, -3836, -1912, 14375, 12644, 11227, 1501, -3703, -3223, -4944, 11577, 5984, -8586, 4375, -15201, 6430, 19441, -896, -3028, -5617, -680, -15780, -5152, 10312, -18099, 23805, -6920, -43477, 35435, -11004, -23813, 34557, -26544, -10364, 12675, -26051, -372, -937, -5375, 2945, -6054, 5401, -4582, -8923, -294, -5419, -2597, -5785, -1772, 4279, 2866, 355]
131C55n530P011j22R52j175o416J3249j0400N77Q056j4372K4541j0649j2605K9747
146B3219l1190O57K1723k5545J8877M983j3571R331o997J143j954L153O017j1111
160a265M435o596J393Q862j1466J3190m432r519J5678j5667j622J6943j2913q899
174a1878J3718q71j3696K2506k343k5012K6072j2945j5009L1740j6818l612J1910
187C762j4350M544J859O231n84n295P613j3181L416N954o856R903q917M959M554
202C612j1923J7292q534p229J5685j6475K472J4215r239k977R875m948j1910K1894
216A1810k605j7009K3972j7281r286K2034j7146Q263Q344j0483O707p504L383
229C199n89k743Q988j0807M794j294m667J0937j1350Q871Q1j4557J9091j1090
$$ y = [355, -5175, 1836, 1714, 2666, 1491, -4925, 8324, -2076, -1499, 6557, -7815, 16726, 6077, -6528, 23219, -7971, -7314, 14409, -11136, 7741, 12724, -847, 8484, 1487, 2630, 676, 3829, 9846, -1265, 3170, -3426, -2033, 6829, -4637, 8553, 4121, -5398, 10280, -5387, -7009, 9934, -2979, -11878, 1840, 969, -12727, 9779, 7436, -17576, 8496, -4449, -19458, 12282, -4536, -8148, 3762, -10588, -6044, -4185, 2046, 1462, -3833, 3780, -9401, -5985, -31, -6887, 3016, -5901, -942, 3612, -8311, 8981, 447, -6782, 8903, -7572, -5100, 9115, -124, -3101, 6774, 1826, -10084, 11810, 9205, -7804, 16168, -1113, -10399, 11635, -5511, 2752, 11096, 613, 7320, -184, 3199, 2610, -133, 8855, -1952, 2842, 1548, -3119, 7818, -3532, 5339, 5420, -9137, 9954, -1136]
243a136m260J3241j5073L814M560m070K684K517J481j2484Q626k1j2737J8856
257E998r025m292J3329j5809P114K510o508J0811q082J768Q16n383N745n328O215
272a21j342j787Q893j0582O927j69j1097J4805p598k328J0165q533L902K819l616
287C38j267L327M184j0187R666j331j2619J6331q120l695J3267r369M815k98m801
302B41L448o791O294o8k535M913n744K254j663O50L347n991R037p869o998J3499
318F024r982J850Q432j1466L305M087k523k722L335O01r919R759k425p417J5019
333E958p538k894M216o507N740j589L417Q4j0261R467l247k402Q356n384L175
348E91j260p15J34n207J1401m745n246J0675j0330L044Q738p663k92L216L88n071
$$ y = [-1136, -5396, 7845, -7228, -3414, 1146, -2924, -240, 2277, 3758, -8726, -100, -121, -12858, 5998, -3027, -7319, 6010, -9799, -2685, -175, -6683, 4128, -3954, -2186, -1370, -6753, -1008, -6336, -121, -1463, -3250, 5643, -4939, 1988, 1819, -9278, 5527, -2071, -4399, 5766, -2767, 1135, 3954, 338, -929, 2398, 6582, -3605, 6061, 4730, -7889, 8442, 322, -3373, 9894, 525, 5340, 5042, 241, 3689, -3102, 3192, 3124, 589, 5502, -242, 2012, 349, 999, 4346, -1645, 7392, -477, -7475, 6024, -3958, -2108, 6324, -5142, -1837, 2250, -273, -2995, 340, 941, -8978, 781, -1644, -9061, 5958, -1580, -4474, -258, -6765, -1025, -2614, 803, 887, -9374, 93, -3154, -5556, 2800, -2584, 591, -669, -1384, -1250, -6457, 4944, 199, -5047, 5628, -4702, -1658, 7080, -583, -875, 2341, 2729, -2342]
364b342N882R64r404J1357l994p048J2120o323K288K740p712L483m640P145Q67
379E383q941J0861p281j152Q082q934L550L04n53Q80p234Q901m068l241R754j0759
395d448J714Q400p015j358K987j707n025P370P04r393J1038m191n143Q897q418
410e588L528K402m728M973o776N147J582p529R847o206l74P915p094J806k000
425c095J644K555n522R352m962l924J0072r442J685P500o963J152L187k818l408
440b987O761Q59o814O685l136k251O346m372J773j925j032L999n664O934j016
455D160n713P591p421L93M545l424K986m101K669q41o226J1170n556l992R265
470E505q283M0M707m773J261K236j719k501L097O79l400L112k159j029J351k75
$$ y = [-2342, 3540, 4504, -4900, 6457, 2463, -4585, 7535, 1212, 3500, 6240, -1472, 2011, -2629, 4516, 5383, -3558, 7303, 22, -1130, 6952, -1982, 1568, 1872, 1319, 2199, -5035, 3866, -202, -3443, 6311, -4448, -2734, 5666, -1349, -2707, 280, -1427, -6452, 918, 1622, -7771, 3267, -924, -6067, 2830, -5588, -2060, 342, -4386, 587, -6189, -1042, 540, -6989, 2858, -3348, -3722, 4193, -2901, -1095, -3095, -1451, 1104, -4418, 4934, -28, -3952, 6120, -3322, -1637, 5863, -1100, 52, 3239, 421, -2987, 3774, 4633, -2181, 4504, 1368, -883, 5463, 1091, 2864, 939, -93, 3906, -1758, 5176, 4160, -1553, 6038, -1383, -990, 3555, 131, 3117, -984, 1685, 844, -5382, 5788, 232, -3760, 5505, -2778, -2738, 1969, -2804, -1543, 693, -1026, -3527, -430, 249, -3151, -39, -2198, -3227, -1876, -2151]
486b151K329m004L421K12o866Q631k902k037O152p001L038R9j343L798n040O644
502B980k990n759J1695p241j580P846p070J760K680k384J151O64O46l368K572
517A602K172l814K796o81j383Q0Q58J811m155M400n46n385O565k617j841K937
533B799k924K527l330K495J337o829Q559n152m417J1676q907k96N691o444K267
548i48L66J28P3j962L479m393O10L693l829J420J67p79o69P66K507m211K881O39
566f2m700M720k74j806Q20J7J902m703M771J024o231Q794n303l448R587o897J051
583g38M133m543K187j410K848q79k466N031m928J189L609m854L166J5j145M03
599A618j008K400k625J676J130m931M001j04k534J726L91j086k250M064j484l760
$$ y = [-2151, 178, -3826, -405, -193, -7059, 1572, -1330, -3367, 2785, -4216, -1178, -1079, -2422, 1376, -3664, 2980, -10, -5769, 5926, -1315, -2895, 4951, -2119, -359, 2321, -63, 1088, 1752, 2398, -970, 1602, 3774, -40, 2756, 2075, 692, 772, 1630, 3441, -714, 3686, 3140, -2245, 4320, 1703, -138, 2799, -125, 2402, -928, 1567, 2904, -3925, 4634, -518, -4935, 6741, -2166, -2462, 3229, -3215, -948, -582, -454, -381, -2343, 1136, -3257, -2647, 1046, -2783, -1363, -1196, -1975, -2644, -1878, 629, -3582, -701, -62, -4762, -42, -316, -2122, -1302, -1285, 617, -4086, 685, 1709, -4522, 4272, -1031, -4479, 5108, -1789, -738, 3395, -1148, 1039, -371, 2477, 1598, -868, 4163, -765, 424, 4033, -821, 2345, 2360, 1215, 1618, 610, 3010, 385, 2061, 3191, -1740, 2261, 2157, -377, 1349, 1740, 654, -1596, 2468, 984, -2776]
615b776O857n095r86N389o379K361K055k949Q35j684L115j815j836M372n216J963
631a789L409m804J258J171o14o32K31J773l618K855J081m194M053n01j939J826
647d34L85j082j712M435p15l678M744k633n39L578l151N13J369O55j520j199M048
664C064k718L90K967n142K721J604k468J439j172J801j805j74L084m138K094J382
680B929l362K115p28q64O26J323j327l096M752j332l077M417l444m58L304k929
696a151n8K63J095o21j678K683k738J045K115l430Q77P77r23K13J06J685l372
713c112K031K305m808L131L10k201L146k385r7N30J516K13k924L754j173k471
729b235M374k709p67K990j358k08Q1J713j164n01K559l352J365K081k976J925
$$ y = [-2776, 4081, -1014, -2000, 3389, -2990, -629, 1426, -1523, -688, -2372, 743, -1072, -2908, 1464, -3752, -1789, 1620, -3184, -1926, -755, -1369, -2001, -1770, 3, -3615, -760, 321, -3873, 180, -321, -2260, -434, -49, -1131, -2843, 1592, 877, -2801, 1943, -690, -1229, 2349, -802, -289, 1080, 1735, 215, -984, 3064, 346, 736, 3703, -1439, 1282, 2886, 418, 1857, 685, 2486, 681, 507, 3591, -547, 1547, 2929, -433, 1682, 954, 90, 716, 2039, 712, -2384, 2368, 1036, -2041, 2376, -1068, -1526, 1778, -1151, -1209, -946, 149, -472, -2150, 533, -2205, -1160, 955, -2475, -1598, -821, -1744, -1531, -1425, 260, -3112, -1081, 1224, -3584, -453, -143, -2344, 802, -1583, -1680, -1150, 366, 579, -2345, 1409, 236, -2235, 2139, -570, -1337, 1653, 295, 87, 168, 1881, 717, 216, 2775, -577, 788, 2869, -107, 1818]
745A818m63r66Q05k6J557k863J406J968m279K354q2j761J825l37k37q82J441N9
763A337l163L703j897k031M130l163o36K018j185M86p04J391j019j445K827k096
779a447j295K304j068K16Q50n52p00Q83J110k927J572J394k902K043J81j290M12
796a216R24M26j812K297K64l074L276j122j893L613j254m00J226m06k81p91K417
813B194j944j016L159k073j02J777r94j83N21P66j432O58J031k821J153J291k810
830h25J565J173j323m04J772q93l088L662j120k452L741j989j403K231j361K74
846d40K97J27m12j638K934k627r80L432k690J46K442j159o66M18N87k223J146
863a306J690k764J776O58k275J511O95o11j02J378m70k166K693p38k127L288p39
$$ y = [1818, 1355, 389, 1194, 1168, 2725, -138, 1268, 3236, -1043, 1311, 1229, -532, 1293, 956, 719, -163, 1278, 1337, -1826, 1877, -20, -2051, 2079, -1084, -1720, 298, -887, -401, -1105, 286, -733, -2178, 649, -1447, -2742, -438, -1506, -1290, -440, -992, -1692, -809, 301, -2626, -1054, 340, -2562, -519, -338, -1628, -1216, -292, 134, -1678, 619, 883, -2191, 1085, -37, -1930, 1683, 429, 29, 1255, 849, 568, -223, 2194, 250, -766, 2393, 320, 218, 1995, 1001, 818, 1339, 2105, 673, 1331, 2362, -459, 694, 1985, -825, 740, 1913, 590, 186, 1958, 1065, -2023, 1639, 519, -1933, 1808, -181, -1584, 647, -714, -440, -143, -16, -428, -2066, 868, -1759, -2739, 693, -1997, -1851, 591, -568, -1234, -816, -229, -2452, -1306, 384, -2380, -604, 54, -2221, -710, -15, -626, -728, 650, 180, -1986, 707, -31, -2158, 1130, 391]
880C91p55J443Nn28q52J693j199j187L447k359J83K424k745R17J037j101L47l67
898G94J172j669n56K438k990J269K091k091L13Q12j589m47J559j223j312K702
914A273q70j600K000j267j13K62L89j46j773K630j511k247L260j750P5K503k546
931a431M51M96k93o64l08J879j822L32K421k874N18J873j623N71R13r91n78J133
949Cl07j449K121K72r20J469l63j348P87J113k073l49L229k022k16K495k263M91
967F70Q17k16k82o52J256j237k85J946k931J112L064k709j30J288j955L72M30
984E58q49l66J462M10j782Q67O6j307R36L03j325M63R32j615k31J451j311N20
1002h18J583r86j158O86J4o61m71J342j246J092J932l508J264J379j863Q47K55
$$ y = [391, -364, 1079, 1084, 556, -296, 1397, 198, -989, 2458, 99, 282, 2706, -39, 878, 1915, 814, 1161, 794, 1966, 297, -259, 2179, -811, 458, 2549, 458, 771, 1583, -6, -453, 1106, -117, -1429, 1273, 403, -1197, 803, -464, -577, -315, 74, -72, -1845, 785, -726, -2973, 287, -1463, -1388, 1115, -1431, -980, -484, -777, -1441, -1749, 130, -1692, -1360, 1061, -1813, -1295, 578, -1045, -474, 439, -552, -1130, 3, -304, -1753, 368, 640, -280, 1189, 826, -522, 265, 1378, -695, -1044, 2185, 163, -53, 2442, 179, 670, 1487, 1271, 989, 337, 1593, 356, 71, 2017, -914, 198, 3262, 553, 423, 1711, -244, 128, 558, -291, -657, 805, 1215, -567, 300, 366, -941, -5, 298, -1027, -564, 368, -1247, -1478, -27, -1338, -818, 765, -221, -1379, -693, -679, -1340, -1811, -469, -1715, -623, 1309, -2199, -935, 444, -1419, -572, -317]
1019c17p43J59M14M72j533J463J302j762J450L40k322J030Q23j408K50J299n83
1036C34N57J211k032j2J153O6j135R3J320j509LJ763k509J494K036k577Q26K71
1054A353j610M47L30m16p09J031J257k342J642k05k243J818L23j976O93L92q8
1071c03p75K83K60k03J566q46j462R30k47j103O17J001j392Q66J860k623Q20J228
1089D77k108J117R4n84M30Q4N53j458J229J086j935J891K32k532J605L53j004
1106d70J76J322j66p36J556j012j114J763q29j141J915k19j339J319N23j729Q69
1123F88J311j522K20R53j722j35P35k00p39Q92J203k065J164l0j873J633n54r59
1141a000J175R1p44k61O62J3j180J614n0j783J185k60j429J386J47q39J149Q56
$$ y = [-317, -1060, -901, -487, -15, -1548, -85, 1217, -545, 905, 1245, -1077, -47, 776, -632, -382, 917, 334, 891, 2102, 70, 58, 1211, 1277, 142, 235, 1555, 46, 49, 1812, -697, 797, 2833, 256, 1082, 1353, -257, 190, 520, 104, -605, 426, 1683, -659, 983, 778, -1465, 353, 676, -1300, -607, -215, -303, -1078, -795, -535, -738, 828, -18, -1480, -550, -797, -1900, -1283, -282, -1674, -808, 1052, -1571, -751, 477, -1631, -514, -420, -1004, -574, -490, 63, -1395, -166, 920, -1015, 876, 1108, -1424, 181, 534, -470, -294, 1028, 862, 126, 1682, 670, -444, 1319, 490, -651, 1264, 1045, -294, 1025, 1548, -181, 688, 1999, 477, 697, 1650, -72, -207, 528, 328, -411, 481, 1684, -381, 783, 753, -1120, 513, -41, -1000, 175, 266, -478, -739, -77, -64, -1244, 370, 320, -1463, -278, -538, -1967, -581, -434, -1273, -124, 732]
1159G32j661k0J067j488j62J465p03k67J150j96j349J345M75j563J740K82j787
1176i40J208l73o38P57N12J97m44J180o68j628K175n78j477K178n28q28J006q9
1194A022p26n0J077p31J2J018j651k47R43l85p55J389O66j451P71o3j760J004
1212H3L77j458J148J5n58J03L81n90m89J417m02j553J742j004r50J728o79m88
1230a177J076N83j406J87M73j153J85J251j186L57J326p74o22J005l36p21J438
1247E06Qj697J428k4r25P10K46J24J86M86n19j016J304o72n49J772q66l83J315
1266A434p23m06K67M84n34j95R43j345k20J422q84l83J091Lp90O58Kk180J559
1285B03J17j419J059O05p13k2M63m17r45J033N75j865J132j45p90Q93k50o17N50
$$ y = [732, -929, -949, 118, -1370, -1532, -67, -770, -1037, 113, -83, -1432, -87, 388, -1175, 565, 847, -940, 268, -105, -743, 14, 526, 723, 279, 1459, 791, -837, 1338, 760, -717, 1461, 933, 105, 1111, 1022, 296, 246, 1323, 592, 604, 1622, -29, -276, 667, 282, -473, 916, 1582, 131, 902, 839, -921, 83, 460, -998, 150, 165, -393, -290, 91, -499, -988, 429, 27, -1526, 216, -788, -1738, -10, -689, -1177, -101, 482, -924, -737, -264, -1417, -1232, 19, -1167, -810, 516, -258, -880, 125, -211, -932, 506, 514, -1183, 245, 221, -704, 6, 252, 376, 562, 1048, 529, -487, 817, 145, -404, 1368, 502, 119, 1434, 711, 305, 572, 1056, 522, 327, 1270, -75, -295, 1127, 243, -140, 951, 954, 164, 822, 824, -1356, 203, 320, -1099, -40, 565, -148, -170, 293, -124, -1069, -36, 539, -1326, -194, -339, -1129, -236, -486, -1103, -553]
1304e53N89o75n97R92p66j92J474r39n43J541m22p03K86J09j40M77M60j271P79
1323i4M73j054N77N69m53K44O27j52j066M97K47p05R20L46n89O59n6p75M82Q1
1343G78o66L14O56j139M87P82r73j47P13k95p7K18P5j491N93R72j416O47P48j138
1363c59M03K10r70oR47l55r46J084l14j009J514m61r72J368q0q61J27M85j286
1382a481N54R49j130O47J086j403K44K07k37k25O26P19j542O34Q90j241P61J19
1400A77l56M92J55M7n09L82M4r13J240M69j477J375j7j344N03M14o70M85O79j043
1420A33J59P45p64k23J010l57n82M82J1j120M56O04j379R41P52j363N86K18m86
1439a77j25j57N51n81K46N71j613R68M98j403J095J46p92M94P7o25j97P01j49
$$ y = [-553, 36, -639, -1236, -244, -1010, -1202, 272, -667, -1210, 331, -91, -794, -508, -399, -539, -62, 398, -873, -94, 379, -675, -98, 471, 18, 262, 889, 737, -329, 168, 415, -290, 630, 976, 387, 1046, 990, 215, 697, 778, 112, 426, 1082, -57, 430, 1212, 239, 92, 805, 510, 433, 651, 726, -765, -172, 800, -616, 31, 779, -359, 44, 254, -716, -722, 225, -130, -1076, 8, -306, -1315, 199, -262, -1234, 134, 54, -807, -680, -195, -1481, -927, 22, -1108, -461, 625, -778, -534, -327, -564, -789, -163, 556, -986, -352, 538, -703, 58, 177, -179, 313, 468, 515, 6, 388, 432, -481, 759, 1228, -249, 1126, 1109, -235, 268, 682, 12, 497, 1176, 133, 292, 1037, 273, 50, 1060, 703, 121, 603, 614, -506, -50, 554, -825, 116, 868, -495, 91, 309, -177, -302, -459, 92, -489, -243, 328, -1285, -317, 181, -1222, -127, 19, -773, -279, -202, -827, -1024, -323, -472]
1458d72n43J130k82p79O99K63j155O18O84j060R06M63j413P88Q19j186O99L49
1476E28l55m70N21L33q80Q17L39j174J450m80q50J114m15l63O24r8j76k18P64
1495A011m36p10J029l01q74J680n62j317Q51o2p79J116k68o82Q34J9j004nP09
1514B49m84o05J123l14j109J304J51j759J621l10q22J157o13n44K83K95l01j27
1532h05J161o02q66J385r88n64J449L2r45N49K10l76K00N36r85L82N59l92q2N17
1552C75n6r41J008N36j419J352r9j007R59n17OK08J23J3p20J063j33r36J181o48
1572C48o39J492r04o15J070j98k73j92K29q9k24M52m36n71O58j88p6M86k74q21
1592g65P43K1j077R17K85p71M84j2o90K32O92k52o90O18L49q24P21o71k87J099
$$ y = [-472, -1015, 115, -167, -946, -247, 16, -1139, -521, 163, -897, 9, 472, -941, -153, 666, -520, 179, 528, 173, -297, 224, 557, -323, 494, 833, -341, 1109, 629, -221, 893, 478, 115, 739, 641, 465, 247, 1011, 575, -135, 894, 593, -281, 1399, 837, -480, 371, 309, -470, 646, 378, -304, 530, 549, -455, -460, 249, -235, -840, 283, -31, -1140, 164, 315, -1444, 177, -133, -955, 202, -411, -955, -672, -377, -678, -805, 356, -246, -1112, 273, -715, -1279, 170, 202, -743, -194, 16, -360, -160, 376, -609, -227, 332, -60, -142, 375, 319, -622, 386, 922, -497, 855, 756, -251, 708, 191, 197, 405, 528, 541, -179, 884, 751, -185, 996, 348, -291, 1201, 297, -318, 752, 554, 281, 89, 318, 229, 5, 457, 21, -550, 108, -80, -156, 330, 56, -765, -22, -1, -1078, -161, 124, -647, -163, -175, -865, -633, 59, -193, -883, -265, 84, -740, -19, -690, -977, 122]
1612A22k97l55M39n4l34J57M44m94k43Q79l31k65P68l80j55N47j78n30O65J10
1632E15n38N70l72k59N79L88m53n25R07k04o76P93l52m38R51m71n00O57k06m04
1652c8N18K73p24J94M71p95j53O44m85o4N80l51o69P45J16q45L57P1l32K07K54
1673b6n94K48L66n68j50O73k55m61P44n48l43J079m23L0n0r5m1N9M91m76m8R50
1695E62q11j45P11m33j04Q67o87k75P86p1m76L87J35n01M77O0k80l2L66P0l66
1716B40L41J1r48J146k36q38Q91k21k17J45%l17K3M47m4n49N82l99o41R41m37
1737h0l80M59K31q01N35L14r38M03M07p79K12L24o34J2M92K6o33Q60l06n34P84
1758b6k2o82M08j21j06L17N48k97l89P53n69m90J035l63j03M41l42k78P40n7o85
$$ y = [122, -175, -530, -91, -145, -479, -322, 122, -372, -615, 264, -67, -332, 436, 56, -99, 448, 270, -260, 405, 515, -23, 547, 175, -84, 495, 883, 430, -95, 812, 608, -68, 725, 373, -65, 886, 415, -85, 572, 366, -38, 480, 753, 29, 223, 694, -101, -254, 390, -95, -159, 421, 70, -599, 146, 262, -583, -226, -155, -487, -280, -26, -620, -372, -6, -574, -724, -51, -306, -767, -23, -571, -914, 165, -258, -228, -278, -373, -414, -355, 136, -340, -388, 562, -249, -394, 317, -116, -220, 647, -40, -315, 471, 400, -76, 311, 446, -55, 422, 482, 202, 170, 536, 606, 240, 581, 592, -356, 790, 554, -284, 607, 386, 169, 314, 314, -3, 20, 467, 423, -126, 456, 57, -584, 357, -80, -460, -1, 230, -571, -36, 278, -660, -257, 150, -629, -417, -93, -727, -715, -223, -197, -830, 30, -276, -810, -26, -48, -730, -322, -443, -549, -232, 316, 19, -370, 383, -186, -676, 359, -4, -107, 334, -8, -286, 454, 397, -288]
1779b88K28P89o79O4M95p42K37L67k40j84R99n75n39N33J6l53M45J4o56M97n8
1800C70m12R9M73o62j51L93k74m78R02l39m11O44R8o63L35K80r00N51J80o37L30
1821b72L11o23J30M72m97k12J023o70o07P61Q6p59M81J05k19L54Q4j92m3L70j68
1842h5m14Q03o19p6O58l87q8M35n4k29K79J53n55L51J31m57M56o3k4l8L62q4m72
1865a7N92L05j177Q24n4m66M18J6k43o2K74j78l54N63m88l00N98l59m06P91m2
1886B35n62N89k01n10J29K98m64K40K42j90j88L82k23n16P55n07n24J014O5r35
1906h71Q82m8n87L73K33l65N7K71Pm27P55m47l82R80l08l94N00k00k43M38j9l54
1928a49L31M03m30k92N02k38K46K47l28k09P73q55k9L01P4m49P46p6o89N19J45
$$ y = [-288, -60, 729, 50, 114, 609, -133, 104, 471, 231, 47, 1046, 471, -68, 465, 481, 128, 573, 587, -69, 428, 370, -42, 57, 530, -132, -283, 110, -164, -642, 260, -79, -490, 154, 252, -411, -76, 204, -696, -145, 35, -602, -272, 39, -584, -454, 18, -479, -691, 332, -338, -945, -184, -98, -857, -376, -271, -490, -136, -52, -244, -287, 83, -85, -499, 304, -315, -391, 267, -120, -208, 227, 173, -56, 223, 376, -179, 172, 303, -154, 302, 239, 215, 177, 539, 455, -17, 575, 880, -297, 527, 473, 7, 425, 441, 198, 136, 410, 232, -122, 441, -47, -347, 251, -108, -514, 277, 235, -327, 262, 61, -449, -320, -22, -486, -246, -4, -194, -382, 0, -223, -739, 16, -491, -1015, -1, 64, -871, 11, -37, -624, -251, -18, -383, -326, -55, -48, -475, 280, -167, -549, 431, 123, -271, 229, 29, -214, 224, 205, -149, 182, 585, 155, -137, 365, 127, 373, 620, 292, 83, 856, 1, -28, 273, 347, -102, 644, 568, -121, 398, 543]
1949E43k93l08J24O2o05J048o25k08P79n56m6K72k67k67J41N0k96J39M81l44r1
1970b67N49n47k97M68j29l55J61J48l30L48J28l30K52K53k69k03L04p0n11O88
1990in49N9Q56l76k55P41l67l73L57k45J08K13M7n0j32N63l64k38P80o17L9L85
2012E73j13m04N25k13k65L09J20l99q2L21m71p8O66m27q5N42m35m69Q40m76J12
2033I1j21j3J22k66L03j88l55N64l64l11N33n25J14N93n70j54M43K10p60P56j53
2054e1k29J90J34n62J43J70j83K20J48j15l43P70p5n01O16j66l30J58J27k88L70
2075B03L20n74J72N17m61m91R83n67j0L56k97l25M57j10l4L54K95p99K44N7l66
2096g6O9K73k37lM88n62L1J82J28n40M13j58l65M94J24n31l5K95m19L46L67m52
$$ y = [543, 250, -58, 66, 128, -477, 571, -54, -262, 517, -39, -85, 187, -80, -347, -206, -156, -452, -313, 168, -176, -267, 282, -265, -562, -94, -223, -578, -417, -269, -599, -251, -123, -453, -201, 52, -217, -420, -116, -186, -697, -9, -558, -499, 357, -19, -274, 467, 100, -273, 84, -161, -53, 160, 207, 157, 25, 588, 224, -14, 766, 149, 188, 573, 460, 56, 581, 368, 103, 412, 532, 133, 51, 372, -99, -177, 489, 62, -23, 519, 84, -385, 455, -21, 91, -30, -43, 79, -187, 116, -72, -427, 137, -227, -538, -5, -530, -416, 177, -393, -547, -104, 106, -654, 102, -51, -280, -90, 44, -518, -375, -205, -388, -168, -20, -135, -478, 292, 217, -284, 332, 166, -164, -6, 121, -167, 203, 523, -51, 121, 638, 177, -314, 669, 102, 92, 448, 151, -174, 283, 173, 139, 493, 788, -11, 233, 290, -76, -7, 266, 29, 26, 514, -48, -17, 165, 293, -247, 166, 8, -357, 137, 261, -270, -305, -10, -429, -83, 284, -168]
2118a68j99M05m48l28N66j5j36L26q9l33K07K92n30M2M26j99OM15o19m1M90k5
2140D5j26K89k73n10N11P7mM5L10m96P0N57o74o3N41m5l62M87j16m78L29L19l43
2163I0K62J27m11P7J22n32K59M52n53N6M06k47m31M42j96r6L45J60m76L9J02p9
2185h2RN22o05oL84m42n8kj79j00P39k44k95L30r2j68J1L76p03K92L79o09J86
2208c57M77k85o6M44l68K16Q8k75m58O43P5m17L1N25l96K29K05l04o5K57M7l32
2230h6M40l02L1J32L3j78K58J83n33O2L12n85L67Q8Kj38L91l71o5q2j18j80N32
2253A93n7l61L85J40n37J36M40l61O5L60o34p4M59m40M7j7K08oJ3k20mJ64m5m71
2277f17M93Qk90K30N83o64j62M80k46Q1K70j55l29M60J93o56L14K40j76J22K31
$$ y = [-168, -367, 38, -410, -738, -172, -187, -323, 3, -86, -419, -212, 80, -450, -408, 18, -181, -175, 240, -379, -420, 70, 45, -81, 208, -65, -575, -64, 13, 9, 54, 364, -132, -62, 495, -179, -242, 299, 254, -108, 379, 263, -215, 114, 433, 90, 352, 479, 68, 145, 267, -265, -6, 446, -107, -51, 355, 108, -323, 119, -77, -173, 172, 332, -144, -105, -3, -82, -73, 449, -156, -162, 222, -220, -278, -280, -459, -559, 180, -64, -359, -29, -121, -289, -278, 98, -605, -313, 66, -543, -357, 120, -165, -231, 213, -155, 61, 149, -126, -584, 59, 134, -283, -252, 273, -123, 106, 311, 7, -58, 199, 246, -86, 354, 52, 83, 215, 248, 70, 328, 511, -22, 40, 352, -233, 134, 222, 224, 86, 477, 106, 41, -41, -159, -339, 193, 136, -225, 160, 300, -237, -101, 339, -22, 43, 403, -231, -305, 154, -286, -239, -256, -48, -54, -41, -261, -265, -101, -146, -617, -124, -116, -406, -176, 407, -257, -419, 61, -185, -104, 166, 11, -318, 142, 335, -321, -7, 233, 57, 179, 410]
2298D10m53n1K36j92k0L16N2l51M11l03o6M33j29n19L01L09l48K05j30lJ97Q4
2320C89q8l08L69n72p8M69l54R1J73L4j11K8L12m05j7J12k19j63K47j86p8K78
2342g7j18k75O12j62l79M77Qk55M3J31j32k3L57m53J8L17j58k72O24m60p2L23
2364G4o2n21N47K96n43J25j4l34M48L75o92K01N82l14j80K89K0k27J54J7j74P0
2386A37K08l06O4K90k92O9K82l99p8N23m65j23L14%l88L87j95M3l60M62m37L1
2408b33O14o85K96K69l77j39K36j31N8J84q7l53K74j2l43Q5M45j37j53J05j42
2429b26j64Q14o90O1J52J01k69K44o9j0o0L28l19K65N1m74J70j66L06J29J55l40
2451a1J42J14o6l42K02J98k66J44J89l70K06J46r8k21L12k04k07M06j28j70L37
$$ y = [410, -43, -94, 142, -50, -70, 246, 298, -53, 358, 55, -11, 422, 293, -226, 75, 384, 36, 241, 111, 108, 305, 389, 301, -7, 362, -210, -288, 181, -173, -82, 91, 125, 14, 42, 354, -51, -68, 44, -175, -338, -91, -277, -355, -77, -195, -470, 142, -20, -399, 78, 86, -169, -126, 5, -127, -150, 207, -246, -228, 89, -69, -341, 283, -177, -249, 74, 12, -509, 38, 334, -209, -84, -98, -432, 16, 391, -301, -100, 482, 168, -12, 277, 297, 70, 224, 241, 67, 137, 345, 39, 103, 393, 101, 170, 452, 53, -25, 498, 33, -90, 224, 224, -164, 223, 28, 71, -289, 173, -264, -233, 381, -304, -8, 261, -116, -255, -19, -150, -92, 92, 5, -348, -74, -86, -429, -344, 101, -36, -189, -84, -226, -390, 424, -266, -205, -53, 48, -221, 23, -46, -56, -116, 212, -107, 158, 209, -265, -95, -261, 45, 174, 329, -11, 131, 245, 179, -163, 39, 237, -29, 115, 304, -66, 140, 286, 188, -33, 279, 75, -132, 274, 146, -24, 313]
2472C13k26j20K55l7j02k38K89l11K35K36m73K36J02l19J1K19j32J83k21P1m25
2493d54J20J48k92L74K53m75L28J12l61j18L27n8l66N80j14l48R4M06n02M0M00
2514I4L4k3M5l55j87P01m97P0L18l15R0L17l31J46k6L49k78k10M53m23J86K60
2536D18k91J1p5J65J03k69J8k84M44o5m9j16K72l60Q9J67l30K46P8m69l62N10
2558a49o0P4M39k88k84R9Q9k28K16j23j73M35k01j94n9L83l70j4N83l81J07J00
2580Ap6n9j40L71j15LQ0m02O43l74k52K10J78j96J1K56k37K72n9l29j23M20R5
2603A78o5m3K58k71l5M31k59k32K71j85k53M53j29k22K27P0m40O44k49j26j0K20
2625B33m96P0K61m2j65L43j52m25M80j87k37M80n1l91J48J8J51j8K12m70J18j10
$$ y = [313, 87, -33, 222, 185, 83, -155, 134, -177, 58, 294, -179, 57, 159, -160, -149, 70, -62, 121, -100, -29, -454, -334, -186, -478, -104, 149, -326, 2, 114, -247, -365, -38, -96, -462, 118, 4, -344, -250, 156, -346, -306, 94, 128, 105, 150, -205, -392, 309, -188, -118, 200, -115, -25, 292, -39, 107, 81, 430, 152, -58, 395, -28, 158, 418, 127, 138, 63, 228, 331, 62, 80, -204, 240, 175, 126, 10, 282, -78, 11, 178, -152, 94, 172, -297, -659, -149, -209, -135, 304, 16, -268, -169, -80, -308, -92, -215, -388, 47, -154, -348, -407, -24, -394, -408, 175, -206, -99, 1, -75, -134, -274, 97, -18, -15, 65, -337, 306, -68, -320, -110, 68, -128, -117, 139, -98, 174, 115, -214, -337, 83, 178, 113, 70, 328, 57, 22, 453, 194, -38, 233, 48, -205, 248, 119, -103, 124, 194, -246, 398, 149, 23, 13, 233, -263, -193, 68, 26, -139, 204, 52, -373, 107, -80, -317, 163, 112, -279, -131, -113, 38, 20, 232, -238, -120, -230]
2647b30Kj26M89l50J1J0K25n8p1P7m3nK10k37K04l46J20P2J39r5J30K06k59l7
2671C8J25l1k83J91J71l15K69qk10K1M13n75L54J92n95K90M9l3k64N13k31r6J53
2694A38J78m53%K17l21K90J31k55J36k04MK5K74k88j40L51l67L49M9k69j33P0
2716b18K40j73m5K39m37L74p0M1k37K68j78L0N5M8n1K82r2l34M65O0n75L45K04
2739B41l18p7j6K03m6K78j10k77L36j27j55K38k02J45j5J23k11M3L16k60q8K86
2761C07m01K23J4l7O6k3j3l24N23l28Ro4K6j55J92K58k51j77L31k90n9K28j66
2784a11p0K23n2k04J34j01q2J18J00l82M23J99n10N6n0l6J22L56j89k75J74K44
2806H7p2ol2l06L77K24l38k56M02j41k36M23P6k80L70j91J36j35n4J61j55K40
$$ y = [-230, -228, -354, 135, -215, -204, -194, 31, -27, -98, -21, -64, -69, 141, -96, 108, -238, -118, -46, 93, -2, 128, 334, 75, 38, 163, 132, -151, 40, 211, -104, 165, 157, -53, -32, 381, -194, 160, 352, -243, 47, 96, 63, -201, 312, 81, -15, 138, 316, -137, -137, 80, -241, 49, 180, -75, 61, -143, -139, -114, 160, -128, -268, 83, -284, 65, 114, -155, -288, -218, 22, -151, -196, 43, -394, -20, -90, -49, -286, -18, -196, -166, -111, -63, -114, 168, 76, -258, 207, 267, -308, 37, 241, -77, -154, -170, 33, -13, 265, 155, -122, 214, 87, -68, 170, -32, 113, 98, 221, 10, 53, 369, 109, 21, 307, -94, 129, 143, 106, 172, 149, 136, -188, 335, 7, 16, -48, -22, -177, 15, 273, 22, -155, 176, -114, -173, 55, -111, -181, 42, -10, -214, -80, -181, -263, -145, -45, -427, -4, 195, -315, -259, -309, -345, -223, 133, -56, -331, -157, 87, 15, 9, -23, -329, 48, 272, -66, -322, 80, -61, -297, 126, 202, -78, 292, 101, 237, 102, 48, 209, 54, 294]
2828B94l78J31J34R4j42j3J9J28M4l38L7K44J14l78k4L02l23J74J30k02n3J5P
2851A6J6P0j18j49J97J32k92L47j14m19J77K22n73M14J44m47K55M9n4k02K76k5
2873g8k48L52P2o28M88jk6M0J68n34L43O0j05J71N1k34q7J59R4j32L04M6n08M47
2897B14p2k79o1L67k35L39K45m98J03J81l69J70J30p6j34J00J77l58J34j00J04
2918H2Q2K28n90K58K3j37P3n0M8k60J08Q0k76M12k2m08M37n72K83K73j30N0L6
2941B8L35k83l30J59K19k06J81p5j17P2J9k79L96j27p9j00J25m83L65L01p2j15
2963f6L16k22j74M48l41j53K07k32M9L19k47J81O5m8k65K91M3j06M7M39m93j10
2985e2M80k41K8K8j91j74J47k1k74k9L56Pk42M60m18oJ11O9j09j6J48l66L38m4
$$ y = [294, -84, 47, 181, 275, 133, 120, 139, 267, 311, -27, 10, 254, 368, -10, -34, 268, -55, 119, 249, 47, -6, 9, 16, 32, 102, -16, -165, 32, 164, -128, 219, 105, -314, -137, 85, -488, -74, 70, -377, -122, -73, -127, -329, -53, -78, -326, 26, 98, -530, -42, -43, -69, -29, 139, -395, -52, 8, -97, 74, 125, -109, -196, -37, 57, -75, 229, 275, -233, 214, 142, -137, -198, 169, -66, 273, 518, 20, 123, 304, -65, 105, 235, 159, 25, 125, 302, -56, 78, -22, 82, 164, 392, -198, 60, 83, -54, 19, -31, 17, -243, -135, -55, -331, 81, 59, -349, 88, -484, -201, 72, -58, -8, 28, 363, 80, -250, -91, 128, -78, 103, 28, -89, -17, 2, -277, 119, -8, -87, -187, -62, -545, -180, 121, 49, -66, 250, 28, -146, 302, -39, -192, 15, -217, -168, 151, -96, 85, 150, 102, -163, 128, 171, 65, 112, 551, 58, -52, 428, 187, 215, 243, 52, -122, 25, 4, -270, -299, 57, 64, -178, 282, -136, -142, -31, 38, -71, -87, 61, -305, 33, -11]
3009a1m3j80M90l90k15J04oK25j4J05j12nj79k3L38j43q6R0J5l3o6J77k88N67
3033C17k88j26Q0J14rm50P03l05Po6J34k36J77K2O5j64L68l08j65m1K17k07L00
3056A39j11j31K93j09J83q6m0j75J79J54l74M1K03l16Q6L02j69pR2j38m13L21
3078g6L9k43K17L0l20L57N8l79K91P2j19k77M71k8m68L25M1l2j19R0j28K63j26
3101f1j35L05j28L1O9J67l04J21l0k3j23M93l34k89N06o8j65K24K90p37M29J27
3123C65l69j2K13j90n7J61N7j47K37r4j76K10l48J10M2M6J5j47L51n11L09l5j8
3146A2MJ96n7m58J52J54o6K8J85k18K71j02k70Q7m7K33j39O6k40N5O8N4j06J38
3170@l9j2O9J83j99j09J64j19J74o5j85j43K44o7O7J96k93p5M12r2j68J43R2j41
$$ y = [-11, -54, -234, 256, -134, -349, -245, -251, -26, -40, 65, -47, -52, -231, -254, 84, -59, -145, -55, -40, -73, -139, 38, -250, 317, 29, -97, -17, 97, 88, -362, 341, 36, 43, -23, 111, -125, 52, 74, 139, -25, 343, 35, -130, -171, 46, -161, 139, 28, -103, 190, 81, 264, 178, 138, -37, 142, 296, -78, -37, 166, -150, -64, 238, 69, 62, 154, 16, -397, -76, -37, -280, -63, -33, -353, 4, 62, -317, -26, 46, -73, -350, 121, 93, -375, -50, -9, -41, -160, -70, -198, 65, -61, -196, 109, -19, 12, 81, 248, -56, 65, 35, 12, -111, 382, 48, -241, 265, 197, 32, 256, 546, -191, 238, 365, -4, -16, 197, 7, -50, 111, 168, 21, 258, 164, -12, 198, -150, -40, 2, 48, 63, -84, 267, -244, 65, 30, 12, 16, 212, 155, -303, -151, 3, -63, -35, 150, -68, 203, 101, -169, -82, -129, 104, -35, 31, -209, -154, -86, -32, -138, 0, -39, -51, 18, 201, 2, -107, 57, -62, 112, 47, -138, -281, -37, -104, -37, 159, -134, -209, 203, 111, -57, 86, 178, 37]
3194C7J57j15j87K6L12l24j27J34K34q4J73m8j46J41k99J50j3L85n15N1L17k58
3216Ap9M36m71J04J25l7l1K8j1l01M91k45l60K74J81k75K53k01j05J61K38Kk94
3239a16J18O7k63Q0p0j4K16q6O0R5r0k38Q5M75m19j86L05J68m69L98j38P0K1o1
3263HR2k6J27n03J86K66j55p6L33j81j22M2M73l18l04M26k34K05j65On8J58k98
3286a18J75K49l83n4L90m20R0L13k58j40L23l44J78P3Q4l56K1J24R2o5%n6rJ31
3310D0L1r0j95J06n5J33k63J65Q2Q9k33j38L86L8k15L21n80K81L94k50l27M63
3332A83j77m24N72m0l8lP3j72J12K38j10k14J8R4j51L79m48K17K79k47l77L78
3354A42J66k82K25N3m54K69j29O8J11j06O0k76L33r2n6J62m4j73L4J39j31j78
$$ y = [37, 194, 79, -108, -82, 230, -94, -221, -87, 147, 63, 236, 188, 42, 183, -116, 34, 21, 406, -109, -58, 259, 1, -78, 358, -113, -9, 116, 79, 48, 76, 65, -236, 255, 10, -350, -76, 105, -170, 83, -118, -223, -62, 176, 178, -116, 2, 69, -194, -114, -184, -198, 18, -68, -8, 87, -3, -241, -156, 319, -100, -286, 19, 187, -282, 116, -22, 48, 69, 8, 100, 74, 201, -302, -116, 150, -5, -81, 252, 71, -51, -9, 464, 146, -158, 268, 34, 239, 74, 80, 22, 180, -118, 57, 306, -77, -131, 259, -161, -71, 242, -16, -156, 167, -177, 1, 74, 158, -198, -177, -53, 39, -26, -26, -82, -91, 40, 71, -19, -214, -108, -163, -30, -293, -128, -46, 43, -190, -328, 58, 96, -119, 202, -378, -97, 297, 47, -280, 183, 6, -418, 154, 114, 76, 73, 146, -26, 86, 324, 214, 0, 18, 112, -39, 340, -108, 109, 388, 141, -236, 142, 308, 26, 251, 304, -150, 119, -10, 58, 169, 63, 123, -153, 180, 88, 32, 194, 150, -23, 11, 150, 19, -159]
3376a59J28k22L9K60k10J15PK13l72L77k54j6l1p5J9K39k18P0N3L21j00j41J22
3399A65m80K06j32K86j64J38l5p4P5J60l31M07j09k21J67J07k55l0J16R5j25M5
3421A1J01L1j36J60j26J41j38m07O66o2l11l6L48j16j14j72J46J3K10J9l62J15
3443a9J51m9P1p5p8NJ08m44R7L12j17q7K29p3j50R3L1k91K32k2mM6n4j6j14M46
3469B28o16J53J40j20J80K81j92o0m5J49j66K18j7l02K54J4N6k91K57k37N9K10
3491A53j53q2j02J27J09J77k56j60R6L32k40j49M24j67P5J70m59k8M37k47N0J65
3513B72k56R2O9k59J35M7J08m28K1P9J51j49K31j09q5P1j13NJ67j09k3P8k07J87
3537b5J05l6l6j59l2Jj3K96j63K75l33J5k79L54k78J19J15P8Nn2L1j32J67Pj47
$$ y = [-159, -31, -253, -214, 46, -164, -49, -42, 171, -201, 176, -78, -94, -125, -200, -181, 58, -160, -90, -37, 284, 184, 43, 165, -315, -109, -241, 45, -119, 19, -16, -90, -15, 145, -186, 221, 112, -109, 58, 165, -90, -120, -4, 91, -34, 11, 112, 143, 7, 167, 41, 182, 44, -363, 303, 241, -70, -106, 242, 126, 12, -160, -14, -1, 209, 228, -134, -19, 132, 83, 154, 79, 1, 6, 114, -330, -233, 79, -38, -125, 104, 31, -119, -26, 5, -286, -54, -76, -80, -34, -88, -104, -218, 228, -388, -235, -95, -215, -35, 246, 54, -6, -51, 98, -68, 150, 133, -169, 85, 99, 155, -136, 121, -116, -57, 153, 0, -82, -184, -57, 52, 229, -27, -187, -91, 241, 1, -148, 276, 109, 184, 354, -105, -133, 304, 57, 107, 272, 16, 108, 177, -82, 53, 100, 208, -220, -199, -120, 31, -118, 113, 4, -81, -10, -123, -118, 49, -60, -83, -5, -212, -25, 80, 44, 8, -151, -183, -182, -195, 101, -62, 213, -120, -105, -384, -30, -308, -189, -74, 4, 9, -43, -12, -144, 23, 30, -117]
3562a17K1J19R3j94J06M9j49J95l49K16K4K11q6M5k07j60J85Q1L9O8O8l33N4L3
3586A2n8J86n0n9L23o03L08k65J76l6p9J3K03m6j88M21k14j14J24nk71J54J2q9
3610a45lOJ8J47K7j32j68J29K06l38M79l37k58K44O2k52K93J15k76K70R5l18K14
3633G8kj81O7L0k6R8L0o4p9J11l4r5J52J11M7k88J73j88K9L14k27J39m1n9l6J03
$$ y = [-117, -96, 23, 116, -78, 28, 77, -72, 123, -226, -10, 14, 225, 139, 184, -23, -183, 2, 83, 122, 190, 258, -75, -21, 12, -46, 140, 90, 31, 354, -249, 59, -206, -30, -66, -145, -132, 71, 25, -163, 258, 44, -70, 54, 49, -222, -68, -56, -145, -148, -142, -124, 23, 50, -82, -250, -121, 85, -253, 226, -111, -369, -125, -63, -315, -22, 93, -183, 87, 182, -136, 78, 76, -105, -38, -8, -34, 64, 94, 30, -49, 62, 28, -67, 85, 196, 243, -45, 128, -60, -31, 283, 56, 195, 154, 95, 59, 162]
$$ [...]
8191b56
##END NTUPLES=NMR FID
##END=
