##TITLE=1H_SL73(27.08)
 CDCl3, 8 sc, 
 27.8.2020
##JCAMPDX= 6.0         $$ Bruker NMR JCAMP-DX V2.0
##DATA TYPE= NMR FID
##DATA CLASS= NTUPLES
##ORIGIN= UXNMR, Bruker Analytische Messtechnik GmbH
##OWNER= root
$$ XWIN-NMR		Version 3.5
$$ Fri Aug 28 10:46:19 2020 Russian Standard Time (UT+4h)  she@DPX200
##.OBSERVE FREQUENCY= 200.1315066352
##.OBSERVE NUCLEUS= ^1H
##.DELAY= (6, 6)
##.ACQUISITION MODE= SIMULTANEOUS
##.ACQUISITION SCHEME= undefined
##.AVERAGES= 8
##.DIGITISER RES= 18
##SPECTROMETER/DATA SYSTEM= spect
##.PULSE SEQUENCE= zg30
##.SOLVENT NAME= CDCl3
##.SHIFT REFERENCE= (INTERNAL, CDCl3, 0, 15.7039)
##AUDIT TRAIL= $$ (NUMBER, WHEN, WHO, WHERE, WHAT)
$$ ##TITLE= Audit trail, XWIN-NMR		Version 3.5
$$ ##JCAMPDX= 5.01
$$ ##ORIGIN= Bruker BioSpin GmbH
$$ ##OWNER= she
$$ F:/spectra/data/she/nmr/H-F/1/audita.txt
$$ ##AUDIT TRAIL=  $$ (NUMBER, WHEN, WHO, WHERE, WHAT)
(   1,<2020-08-28 10:45:15.50 +0400>,<she>,<DPX200>,
      <created by zg, POWCHK disabled, PULCHK disabled
       configuration hash MD5:
       00 E9 B6 7A A2 85 ED C7 34 08 36 98 17 FE 4E 26
       data hash MD5: 16K
       BF DE 44 16 E4 6E 8D E8 85 B8 B6 DE B6 88 B1 6D>)
$$ ##END=
$$ 
$$ hash MD5
$$ 01 AD 51 BC 43 AC 19 29 B4 BE A9 50 7C E1 F9 01
##$RELAX= 
##$RELAX= 
##$RELAX= 
##$RELAX= 
##$RELAX= 
##$RELAX= 
$$ Bruker specific parameters
$$ --------------------------
##$DU= <F:/spectra>
##$EXPNO= 1
##$NAME= <H-F>
##$PROCNO= 1
##$TYPE= <nmr>
##$USER= <she>
##$AMP= (0..31)
100 100 100 100 100 100 100 100 100 100 100 100 100 100 100 100 100 100 
100 100 100 100 100 100 100 100 100 100 100 100 100 100 
##$AQSEQ= 0
##$AQ_mod= 1
##$AUNM= <au_zg>
##$AUTOPOS= <>
##$BF1= 200.13
##$BF2= 200.13
##$BF3= 200.13
##$BF4= 200.13
##$BF5= 200.13
##$BF6= 200.13
##$BF7= 200.13
##$BF8= 200.13
##$BYTORDA= 1
##$CFDGTYP= 0
##$CFRGTYP= 5
##$CHEMSTR= <none>
##$CNST= (0..31)
1 1 145 1 1 1 1 1 1 1 1 1 1 1 1 1 1 1 1 1 1 1 1 1 1 1 1 1 1 1 1 1 
##$CPDPRG= <>
##$CPDPRG1= <>
##$CPDPRG2= <>
##$CPDPRG3= <>
##$CPDPRG4= <mlev>
##$CPDPRG5= <mlev>
##$CPDPRG6= <mlev>
##$CPDPRG7= <mlev>
##$CPDPRG8= <mlev>
##$CPDPRGB= <>
##$CPDPRGT= <>
##$D= (0..31)
0 1.2 0 0 0 0 0 0 0 0.06 0 0.03 0 0 0 0 0.0002 0 0 0 0 0 0 0 0 0 0 0 0 
0 0 0 
##$DATE= 1598597114
##$DBL= (0..7)
120 120 120 120 120 120 120 120 
##$DBP= (0..7)
150 150 150 150 150 150 150 150 
##$DBP07= 0
##$DBPNAM0= <>
##$DBPNAM1= <>
##$DBPNAM2= <>
##$DBPNAM3= <>
##$DBPNAM4= <>
##$DBPNAM5= <>
##$DBPNAM6= <>
##$DBPNAM7= <>
##$DBPOAL= (0..7)
0.5 0.5 0.5 0.5 0.5 0.5 0.5 0.5 
##$DBPOFFS= (0..7)
0 0 0 0 0 0 0 0 
##$DE= 6
##$DECBNUC= <off>
##$DECIM= 32
##$DECNUC= <off>
##$DECSTAT= 4
##$DIGMOD= 1
##$DIGTYP= 9
##$DL= (0..7)
0 120 120 120 120 120 120 120 
##$DP= (0..7)
150 150 150 150 150 150 150 150 
##$DP07= 0
##$DPNAME0= <>
##$DPNAME1= <>
##$DPNAME2= <>
##$DPNAME3= <>
##$DPNAME4= <>
##$DPNAME5= <>
##$DPNAME6= <>
##$DPNAME7= <>
##$DPOAL= (0..7)
0.5 0.5 0.5 0.5 0.5 0.5 0.5 0.5 
##$DPOFFS= (0..7)
0 0 0 0 0 0 0 0 
##$DQDMODE= 0
##$DR= 18
##$DS= 0
##$DSLIST= <SSSSSSSSSSSSSSS>
$$ [...]
##$SUBNAM2= <"">
##$SUBNAM3= <"">
##$SUBNAM4= <"">
##$SUBNAM5= <"">
##$SUBNAM6= <"">
##$SUBNAM7= <"">
##$SUBNAM8= <"">
##$SUBNAM9= <"">
##$SW= 16.880792210976
##$SWIBOX= (0..15)
0 0 2 0 0 0 0 0 0 0 0 0 0 0 0 0 
##$SW_h= 3378.37837837838
##$TD= 16384
##$TD0= 1
##$TE= 0
##$TE2= 300
##$TE3= 300
##$TEG= 300
##$TL= (0..7)
0 120 120 120 120 120 120 120 
##$TP= (0..7)
150 150 150 150 150 150 150 150 
##$TP07= 0
##$TPNAME0= <>
##$TPNAME1= <>
##$TPNAME2= <>
##$TPNAME3= <>
##$TPNAME4= <>
##$TPNAME5= <>
##$TPNAME6= <>
##$TPNAME7= <>
##$TPOAL= (0..7)
0.5 0.5 0.5 0.5 0.5 0.5 0.5 0.5 
##$TPOFFS= (0..7)
0 0 0 0 0 0 0 0 
##$TUNHIN= 0
##$TUNHOUT= 0
##$TUNXOUT= 0
##$USERA1= <user>
##$USERA2= <user>
##$USERA3= <user>
##$USERA4= <user>
##$USERA5= <user>
##$V9= 5
##$VALIST= <valist>
##$VCLIST= <CCCCCCCCCCCCCCC>
##$VD= 0
##$VDLIST= <DDDDDDDDDDDDDDD>
##$VPLIST= <PPPPPPPPPPPPPPP>
##$VTLIST= <TTTTTTTTTTTTTTT>
##$WBST= 1024
##$WBSW= 4
##$XGAIN= (0..3)
0 0 0 0 
##$XL= 0
##$YL= 0
##$YMAX_a= 215085
##$YMIN_a= -169703
##$ZGOPTNS= <>
##$ZL1= 120
##$ZL2= 120
##$ZL3= 120
##$ZL4= 120
##$ABSF1= 10
##$ABSF2= 0
##$ABSG= 5
##$ABSL= 3
##$ALPHA= 0
##$AQORDER= 0
##$ASSFAC= 0
##$ASSFACI= 0
##$ASSFACX= 0
##$ASSWID= 0
##$AUNMP= <proc_1d>
##$AZFE= 0.1
##$AZFW= 0.1
##$BCFW= 1
##$BC_mod= 2
##$BYTORDP= 1
##$COROFFS= 0
##$CY= 11.3945322036743
##$DATMOD= 1
##$DC= 2
##$DFILT= <>
##$DTYPP= 0
##$F1P= 16.9975609425685
##$F2P= -3.02152046262296
##$FCOR= 0.5
##$FTSIZE= 0
##$FT_mod= 4
##$GAMMA= 1
##$GB= 0.15
##$INTBC= 1
##$INTSCL= 1
##$ISEN= 128
##$LB= 0.24
##$LEV0= 0
##$LPBIN= 0
##$MAXI= 10000
##$MC2= 0
##$MEAN= 0
##$ME_mod= 0
##$MI= 1.114404
##$NCOEF= 0
##$NC_proc= 0
##$NLEV= 6
##$NOISF1= 3.799351
##$NOISF2= 2.8
##$NSP= 1
##$NTH_PI= 0
##$NZP= 0
##$OFFSET= 15.70392
##$PC= 1
##$PHC0= -9981.614
##$PHC1= 21.00092
##$PH_mod= 1
##$PKNL= yes
##$PPARMOD= 0
##$PSCAL= 0
##$PSIGN= 0
##$REVERSE= no
##$SF= 200.130013532006
##$SI= 16384
##$SIGF1= 3
##$SIGF2= 2
##$SINO= 400
##$SIOLD= 16384
##$SREGLST= <1H.CDCl3>
##$SSB= 0
##$STSI= 0
##$STSR= 0
##$SW_p= 3612.71676300578
##$SYMM= 0
##$S_DEV= 0
##$TDeff= 0
##$TDoff= 0
##$TI= <>
##$TILT= no
##$TM1= 0
##$TM2= 0
##$TOPLEV= 0
##$USERP1= <user>
##$USERP2= <user>
##$USERP3= <user>
##$USERP4= <user>
##$USERP5= <user>
##$WDW= 1
##$XDIM= 8192
##$YMAX_p= 0
##$YMIN_p= 0
$$ End of Bruker specific parameters
$$ ---------------------------------
##NTUPLES= NMR FID
##VAR_NAME=  TIME,          FID/REAL,        FID/IMAG
##SYMBOL=    X,             R,               I
##VAR_TYPE=  INDEPENDENT,   DEPENDENT,       DEPENDENT
##VAR_FORM=  AFFN,          ASDF,            ASDF
##VAR_DIM=   8192,          8192,            8192
##UNITS=     SECONDS,       ARBITRARY UNITS, ARBITRARY UNITS
##FACTOR=    0.000296,      1,               1
##FIRST=     0,             0,               0
##LAST=      2.424536,      0,               0
##MIN=       0,             -169703,         0
##MAX=       2.424536,      215085,          0
$$ Real data points
##PAGE= N=1
##DATA TABLE= (X++(R..R)), XYDATA
0@%%%%%%%%%%%%%%Qj6J6j6J6k4L2l7M5n4O3p3Q8j04J20j37J59j83K08k38K70l04
$$ 0 0 0 0 0 0 0 0 0 0 0 0 0 0 0 8 -8 8 -8 8 -16 16 -21 24 -30 33 -40 48 -56 64 -73 86 -97 111 -127 143 -161
36a61L44l89M37m90N48o12O78p51Q37r28J025j133J250j378J519j673J840k025
$$ -161 183 -206 231 -259 289 -323 355 -396 441 -487 538 -595 655 -723 796 -877 963 -1062
54a062K231k458K714l003L326l696M126m626N218n931O807p904R300j1074J3010
$$ -1062 1169 -1289 1425 -1578 1748 -1948 2178 -2448 2770 -3161 3646 -4258 5042 -6032 6978
69F978j8463K26570k72089M074J90670k59609J24403M4359r6011P2212o888j5632
$$ 6978 -11485 215085 -57004 -52930 137740 -121869 2534 46893 -49118 23094 16206 574
81E74r453j6329N4644k3792J511J4234k0797j0079K0542J826p492J4842l3987
$$ 574 -8879 -25208 29436 5644 7155 21389 592 -9487 11055 12881 5389 20231 -13756
94a3756o897N2244j8086P179j1689p479K0448m0053K7574l985o940N9942q9515
$$ -13756 -20653 31591 13505 20684 8995 1516 21964 -18089 9485 5500 -1440 58502 -31013
107c1013J8824N9160q2461O4804m012n0262O5904n4712p9L5371l7335L2880j8645
$$ -31013 -12189 46971 -35490 29314 25302 -24960 40944 -13768 -13847 21524 -15811 17069 -1576
120a576l508L4697l9715O615J4846j6139P256p961l525J7246J743k0761R016Q423
$$ -1576 -5084 29613 -10102 -3487 11359 -4780 2476 -5485 -9010 8236 9979 -10782 -1766 6657
134F657j5816J9516j3799r159K6996k2225N72O26O94J7962k9092K7695N111l7819
$$ 6657 -9159 10357 -3442 -12601 14395 -7830 -7258 -6632 -5938 12024 -17068 10627 15738 -22081
148b2081L4292k4298m729L4313l4130J8509O010j4463J2869k3143K0398P555k0185
$$ -22081 12211 -12087 -16816 17497 -16633 1876 7886 -6577 6292 -16851 3547 11102 -9083
161i083J4295j5078O732L407j3095K0944j1418K207J0673k1354J0093R917j4109
$$ -9083 5212 -9866 -3134 273 -12822 8122 -3296 -1089 9584 -11770 -1677 8240 -5869
174e869n299J3552q594r656K9369j7934k940K3637l6602J5071J2525k1581K1470
$$ -5869 -11168 2384 -6210 -15866 13503 -4431 -7371 16266 -20336 -5265 7260 -14321 7149
187G149j4459n18O538j8113K4257n437k737J0985k0640J0597j740l371N620r061
$$ 7149 -7310 -7828 -1290 -19403 4854 -583 -3320 7665 -12975 -2378 -4118 -7489 -1869 -10930
201a0930J5249j4485K508K0405k4777J6681J198k4096K1482k789p701J0060M14
$$ -10930 4319 -10166 -7658 12747 -12030 4651 5849 -18247 3235 446 -7255 2805 3219
214C219r335j353J5937j2160Q434J2677k6866J5523m838j3178K2782j2986J0490
$$ 3219 -6116 -7469 8468 -3692 4742 17419 -9447 6076 1238 -11940 10842 -2144 8346
227H346L732j7247J7343j1468L250Q270j3532J3077j0377J996N632j0198J6650
$$ 8346 12078 -5169 12174 706 3956 12226 -1306 11771 1394 3390 9022 -1176 15474
240A5474j3538J272J3320j7876J4052m093r884J0347j2022O995K385k7N191r660
$$ 15474 1936 3208 16528 -1348 12704 8611 -1273 9074 -2948 4047 6432 6405 11596 1936
254A936N825q744K079O451j4416J8644r954q364J8531k2236J1015P499j5817J6390
$$ 1936 7761 -983 1096 7547 -6869 11775 1821 -6543 11988 -10248 767 8266 -7551 8839
268H839r012k776J882q082R909q560O527L855r284J2314j2743J786O750j2862
$$ 8839 -173 -2949 -1067 -9149 760 -7800 -1273 2582 -6702 5612 -7131 -5345 1405 -11457
282a1457J2638r142p11J0771j1185P806l907r05N495o450R933j0157K521N820
$$ -11457 1181 -7961 -8672 2099 -9086 -1280 -5187 -6092 -597 -7047 2886 -7271 -4750 1070
296A070j6906J5594n835j316J7990j8235R432k167j3669J8396j0377K812O805
$$ 1070 -15836 -242 -6077 -7393 10597 -7638 1794 -373 -14042 4354 -6023 -3211 3594
309C594r331O875n673L287P9J96J1750j7535N532L599j3345J8298q200m549J0734
$$ 3594 -5737 1138 -4535 -1248 -1169 -973 10777 -6758 -1226 2373 -10972 7326 -874 -5423 5311
324E311p781N633k346O67Q43n943P790j1026N142P484r278J2207j3206L01J0232
$$ 5311 -2470 3163 817 1484 2327 -3616 4174 -6852 -1710 5774 -3504 8703 -4503 -4202 6030
339F030j3553J9031q930j2072J8248j7034M498R403r935R693k232j845m490o8
$$ 6030 -7523 11508 2578 -9494 8754 -8280 -3782 5621 -4314 5379 3147 1302 -3188 -3256
353c256J0029j0091P183k574r959J5456o093N71L768o934O158m467L378p05l899
$$ -3256 6773 -3318 3865 1291 -8668 6788 695 1266 5034 -1900 4258 -209 3169 2464 -1435
368a435R451j1185M004L108n904J5000j0883R96K415j3591J9189q551m647J5315
$$ -1435 8016 -3169 835 3943 -1961 13039 2156 3152 5567 -8024 11165 2614 -2033 13282
382A3282j8757J0153N172j3705J0957k566k74o99m130N605o221O552j392q239
$$ 13282 -5475 4678 9850 -3855 7102 4536 4262 3563 -567 5038 -1183 5369 3977 -4262
396d262R404j671l15O1k908l24m194Q478n377j885Q404j2181R281j700q222J2876
$$ -4262 5142 3471 3156 3217 309 -15 -4209 4269 -1108 -2993 5411 -6770 2511 811 -7411 5465
412E465j2108P177O65j5735J9835j0617k189J3472k0507J2480N410j2325R494
$$ 5465 -6643 534 1199 -14536 5299 -5318 -7507 5965 -14542 -2062 3348 -8977 517
425E17p180L84J285l086P657o685M453J173q571Q759k810k245N648j431l275k233
$$ 517 -6663 -6279 -4994 -8080 -423 -7108 -2655 -1482 -10053 -1294 -4104 -6349 -701 -2132 -5407 -7640
441g640N093j127K364M88o867R115m125N85N454j2350J3829o402r296K0425j3789
$$ -7640 -2547 -3674 -1310 -822 -7689 1426 -2699 -2114 3340 -9010 4819 -1583 -10879 9546 -4243
456d243N149Q589j9116J3978k370o149J1376p440M881m280m441J1834q201M279
$$ -4243 906 9495 -9621 4357 1987 -4162 7214 -226 4655 375 -4066 7768 -433 3846
470C846K516p972Q102m975k879O496j793m49j809L43K451J323l251l34L782o716
$$ 3846 6362 -1610 6492 1517 -1362 5134 3341 2892 1083 1426 3877 5200 1949 1615 5397 -1319
486a319M771j390m821J4985j4396k354J3738j4641J0880qj1086J4487j1175m7
$$ -1319 3452 2062 -2759 12226 -2170 -4524 9214 -5427 5453 5445 -5641 8846 -2329 -2376
500b376N597o820J1997j0875n88J0734j2631P980j835m651J0465j0526J772N090
$$ -2376 3221 -3599 8398 -2477 -3065 7669 -4962 3018 1183 -3468 6997 -3529 -1757 3333
514C333m817M795n364n7P302m828k509M135r59k555M295n368O43J1199j3243K147
$$ 3333 -1484 3311 -2053 -2110 5192 364 -2145 1990 1031 -1524 2771 -2597 -1954 9245 -3998 -1851
530a851P954j0162P534m380j508Q791j1146O718j312l772J1032j5230N587Q426
$$ -1851 6103 -4059 3475 -905 -2413 6378 -4768 1950 638 -3134 7898 -7332 -1745 6681
544F681j1553Q495o599K93P311j2153Q687q32l956Q743j2692L755P802q773K234
$$ 6681 -4872 3623 -2976 -2683 4628 -7525 1162 330 -3626 5117 -7575 -3820 3982 -4791 -2557
559b557K315j984j505M00K66L04M582o765j244N585k276J420m676M024J935q311
$$ -2557 -242 -2226 -3731 -3331 -3065 -2761 1821 -4944 -6188 -603 -2879 -1459 -6135 -2111 -176 -8487
575h487Q266m251R47P953j4017P022K292n773Q360q047N722Q60j0318J2764n827
$$ -8487 -221 -4472 -3525 4428 -9589 -2567 -275 -6048 2312 -5735 -13 847 -9471 3293 -2534
590b534R80O790j3591R883J860p761O242j901K505p82l688L742p73L881l615k838
$$ -2534 -1554 5236 -8355 1528 3388 -4373 1869 -32 2473 1691 -1997 1745 972 4853 1238 -1600
606a600O678k717p7L25O64M15j803K552l246L257J540p146P329k373k148L980
$$ -1600 5078 2361 2284 2609 3273 3688 1885 4437 1191 4448 5988 -1158 6171 3798 1650 5630
622E630n977P893m124n427J0258q987M703K729j1670J1312j717o136N642l777
$$ 5630 -347 7546 3422 -2005 8253 -734 3969 6698 -4972 6340 4623 -1513 4129 352
636C52K757j903p07J623l388N649m599k556O837n630J545J269l259K333k864J648
$$ 352 3109 1206 499 2122 -1266 4383 -216 -2772 4065 -1565 -20 1249 -2010 323 -2541 -893
652h93Q60j064R65k774K430n95j15n11k072O492o081j023N995o846O403q20o361
$$ -893 -33 -1097 -132 -2906 -476 -1071 -1186 -1697 -3769 2723 -3358 -4381 1614 -5232 1171 351 -6010
669f010P313l635Q76R87l681N445m500J703K051n110O487k970p00L138n555L751
$$ -6010 1303 -2332 -1456 -469 -4150 1295 -3205 -1502 549 -4561 1926 -1044 -1744 1394 -4161 -410
685d10k98j05K060n194L634M3j644L054k489R79O98q84j450r33N001l838L80K654
$$ -410 -708 -813 1247 -3947 -313 -270 -1914 1140 -1349 -370 328 -556 -2006 -2939 2062 -1776 -1396 1258
703A258o106N873j8l578L367l286J404J57q45K024l447M343j395l650N452m211
$$ 1258 -4848 1025 1007 -2571 796 -2490 -1086 -929 -1774 250 -3197 1146 -249 -3899 1553 -2658
719b658K797J846n543L187k092J861J987m127M333k081p46L188l779J690Q73o72
$$ -2658 139 1985 -3558 -371 -2463 -602 1385 -2742 1591 -490 -1236 1952 -1827 -137 736 64
735F4j97j137L239k090J807J817n860M628K50k451L701l201M06P74p2Q49j618
$$ 64 -133 -1270 1969 -121 1686 3503 -2357 2271 2521 70 3771 570 976 1750 1678 2527 909
752I09L485j480j055K654m740K976P30k213L287l534K129P67k994L828l417Q96
$$ 909 4394 2914 1859 4513 -227 2749 3479 1266 4553 1019 3148 3915 921 4749 1332 2228
768B228K758m336K066r95m32J231j461K073k398J110J812m622K856j926j310K819
$$ 2228 4986 650 2716 1721 1289 2520 1059 3132 734 1844 3656 -966 1890 -36 -1346 1473
784A473k572J394J80q96Q98k273J584j283M57P43k573K028k353M91K493m174M052
$$ 1473 -1099 295 475 -421 477 -1796 -212 -1495 -1038 -295 -2868 -840 -3193 -2702 -209 -4383 -331
801c31n98l272M381l954J31J665j809J832j118J299k36j760L220l324J332J949
$$ -331 -929 -4201 180 -3774 -3643 -1978 -3787 -1955 -3073 -1774 -2010 -3770 -550 -3874 -2542 -593
817e93l281K313o24o29J031j029K103r63Q62J325k391J677j112p03R83N59J109
$$ -593 -3874 -1561 -2185 -2814 -1783 -2812 -709 -1672 -810 515 -1876 -199 -1311 -2014 -1031 -472 637
834F37j750K694n03l830N529k935j148M903m677J165J100j760J463p09K317j368
$$ 637 -1113 1581 1078 -2752 2777 -158 -1306 3597 -1080 85 1185 -575 888 179 2496 1128
850A128q87L181m665J865J535m322M084p25r90J675p48R59j823M01Q45j985K360
$$ 1128 241 3422 -1243 622 2157 -2165 1919 1194 204 1879 1131 2090 267 668 1513 -472 1888
867A888j048j553J295J70l72j42K663j690j675L066l698M62J997k952K788r8J48
$$ 1888 840 -713 582 752 380 238 2901 1211 -464 2602 -1096 -634 1363 -1589 1199 1101 1249
884A249L9j447L281l574K28L240m899M568p63m452N429k378L94K051k569K852
$$ 1249 1288 -159 3122 -452 -224 3016 -1883 2685 1922 -2530 2899 521 915 2966 397 3249
900C249k092j245J991k848J662J153j678K428j65k158R08J290k415j05J657j588
$$ 3249 1157 -88 1903 -945 717 1870 192 2620 2455 297 1205 2495 80 -25 1632 44
916D4J302q91j444K214j112J788k013n64L994n325K82J903l955N216k061j903
$$ 44 1346 455 -989 1225 113 1901 -112 -676 3318 -2007 -1725 178 -3777 1439 -622 -2525
932b525M695m621J908j15l331M832m258K28L739m330J866j48j257K874j000j651
$$ -2525 2170 -2451 -543 -658 -3989 843 -3415 -3187 552 -3778 -1912 -2060 -3317 -443 -1443 -3094
948c094J052O28o75k284N05K191n36Q4J077j466J234J275n025K875K592m408L257
$$ -3094 -2042 -1414 -2089 -4373 -3868 -1677 -2213 -2129 -1052 -2518 -1284 -9 -5034 -2159 433 -3975 -718
965g18j05j861L008l107K815J292l833M947m016O57M351q129L865M081l948L678
$$ -718 -823 -2684 324 -2783 32 1324 -2509 2438 -1578 -921 3430 -4699 -834 3247 -701 2977
981B977k219o19L990m116l92R28M75K457l404P06K892k900J473N14k331L462r42
$$ 2977 758 139 4129 13 -379 549 1024 3481 77 783 3675 775 2248 2762 431 3893 2951
998B951l820M277j937k453M020j321J682j13l678M520k354k272K868m912N242
$$ 2951 -869 3408 1471 -982 3038 1717 3399 3286 -392 4128 1774 -498 2370 -2542 2700
1013B700J719p321M865j21j517K389m361K762J402l274J764l066J284K776m215
$$ 2700 4419 -2902 1963 1842 325 2714 -1647 1115 2517 -757 1007 -2059 -775 2001 -2214
1028b214M024N66m036L115j845r08K165l545J203L925l093J71l08j91L401l446
$$ -2214 1810 2376 -1660 1455 -390 -1298 867 -2678 -1475 2450 -643 -472 -780 -971 2430 -1016
1044a016j452M659l246J253l60m398O032p03k977M458k749J149k33l208M009l069
$$ -1016 -2468 2191 -1055 198 -162 -4560 1472 769 -2208 2250 -499 650 417 -2791 1218 -1851
1060a851J12L724l958L541j167l965N602j857j947K154k226K490k50m197K521
$$ -1851 -1739 1985 -1973 1568 401 -3564 2038 181 -1766 388 -1838 652 402 -3795 -1274
1075a274J099l09J484k842J121K177m224O91J446k934L860j113j721L920l467
$$ -1274 -175 -484 1000 -1842 -721 1456 -2768 -2077 -631 -3565 295 -818 -2539 1381 -2086
1090b086j70K351k100J845k027M6L177m492J847M91j747N300l236j854L995k642
$$ -2086 -2256 95 -2005 -160 -2187 -2141 1036 -3456 -1609 -1118 -2865 2435 -801 -2655 1340 -1302
1106a302j21k8o61K627j103O79N58j522K367j216j886L578j016k141K675l57j615
$$ -1302 -1423 -1451 -2112 515 -588 91 649 -873 1494 278 -1608 1970 954 -1187 1488 1131 -484
1123d84K094j062N65K242j522J37p31J30N62k561K926P62k651L523j797j518L680
$$ -484 1610 548 1113 3355 1833 1970 1239 1369 1931 -630 2296 3058 407 3930 2133 615 4295
1140D295l815Q04J831k356J529j310K25J668k735K202O05j881J936k132j207J359
$$ 4295 480 1284 3115 759 2288 978 1203 2871 136 2338 2943 1062 2998 866 -341 1018
1156A018o78j019J582R20j174K40O7j528N00L01o46n23R10m63j809K142l42j589
$$ 1018 340 -679 903 1823 649 889 956 -572 -72 229 -417 -940 -30 -493 -2302 -160 -502 -2091
1174b091K731j091q80J655k643M83k96j62J589j457K322j44k566K529j868q52
$$ -2091 640 -451 -1331 324 -2319 -1836 -2132 -2294 -705 -2162 160 16 -2550 -21 -1889 -2741
1190b741K868k034L35Q96n77p45N16J208p52N51Q65j586J80N0o56KP00P27k63
$$ -2741 127 -1907 -1572 -676 -1253 -1998 -1482 -274 -1026 -475 390 -1196 -1016 -966 -1622 -1620 -920 -193 -456
1209d56J185l89j297J137r06l88J060o64P91l65j33N68j256K225p62q87J972j954
$$ -456 729 340 -957 180 -726 -1114 -54 -718 73 -292 -425 143 -1113 1112 350 -537 1435 -519
1227e19j0M43j569P31J288M28m37J04L72k076J187O20k151J548O83j068K06N12
$$ -519 -529 -86 -1655 -924 364 792 355 459 831 -1245 -58 562 -1589 -41 642 -426 -220 292
1245B92p22j13K182j134j179J720j224o33R98j011O04J273M92n99q64J136j278
$$ 292 -430 -543 1639 505 -674 1046 -178 -811 187 -824 -220 1053 1545 946 82 1218 -60
1262f0J03J223j938J276J320j120m29N18L94n60J006L79k066J290K39j745O94
$$ -60 43 1266 -672 604 1924 804 375 893 1287 727 1733 2112 46 1336 1575 -170 524
1279E24O71j24N59J048r26j361J212m32j005Q75l82P18P5m07j05j013J338J50
$$ 524 1195 1071 1630 2678 1752 391 1603 1171 166 1041 659 1377 1452 1045 940 -73 1265 1415
1297A415j350O51n72O3Op00J19k44J657n08j166R62j410j34J037j663R27J57n
$$ 1415 65 716 144 207 213 -487 -368 -612 1045 537 -629 333 -1077 -1211 -174 -1837 -910 -753 -758
1316g58L23j140K90J01l34O14q75l05M32m96M54o03Q44K42M64P6j142K32j7l40
$$ -758 -435 -1575 -1285 -1184 -1518 -904 -1779 -2084 -1652 -2148 -1694 -2297 -1453 -1211 -747 -671 -1813 -1581 -1598 -1938
1336a938L12m00O01M41M78j66r49J014l97L58O94j672J509j85o17J105j174Q21
$$ -1938 -1626 -2026 -1425 -984 -506 -672 -1621 -607 -1004 -646 48 -1624 -115 -300 -917 188 -986 -165
1354a65J076n24J405k511J53J745k197J522M67j299K141j30k016J074N17k68q89
$$ -165 911 387 1792 -719 -566 1179 -1018 504 971 -328 1813 1683 -333 741 1258 990 101
1371A01J134m16p97J462r03o02J359K89p78Q92j42k547K019q5j548J674o24K09
$$ 101 1235 819 22 1484 581 -21 1338 1627 849 1741 1599 -948 1071 986 -562 1112 488 697
1389F97J325j827L06k09O1J485k681J358R18k369J735n91m08J550j510Q90k07
$$ 697 2022 195 501 292 353 1838 -843 515 1433 -936 799 208 -200 1350 -160 730 523
1406E23p54P89j752J462Q33k192K026J09j489J674j293q80K217q72j127J454j18
$$ 523 -231 558 -1194 268 1101 -1091 935 1044 -445 1229 -64 -944 1273 401 -726 728 610
1423F10l53J58j121J376p4o00R62j363Q40K12k726K958Oj567J896j503P57N17
$$ 610 257 415 -706 670 596 -4 958 -405 435 647 -2079 879 885 -682 1214 -289 468 985
1441I85k635K225q19M9J314l263K559K32k567K185q88N7Q04j532O82j7p08L24
$$ 985 -1650 575 -244 -195 1119 -2144 415 647 -1920 265 -623 -566 238 -1294 -612 -629 -1337 -1013
1459a013o88R51J366k588P64J514k536P47Q23j702K299r62j742K803r77m49M11
$$ -1013 -1701 -750 616 -1972 -1208 306 -2230 -1483 -660 -2362 -63 -1025 -2767 36 -941 -1390 -979
1476i79p00J994j507p23J459j741J710J0j995L940j688j416K375j995J237l9j716
$$ -979 -1679 315 -1192 -1915 -456 -2197 -487 -477 -2472 1468 -220 -1636 739 -1256 -19 -58 -1774
1493a774K249k93j81O05j566K463l86k128K652k95j577J550j007J50J773j897
$$ -1774 475 182 1 606 -960 1503 1117 -1011 1641 1346 -231 1319 312 462 2235 338
1509C38N8J900l54q19q72J347N02k210J860o6j657L240l050o43L941l064mJ721
$$ 338 396 2296 1942 1123 251 1598 2100 -110 1750 1684 27 3267 217 -426 3515 451 447 2168
1527B168j709J123j232k7J236j274J366j122n92K608k982n63K505j235l89M09
$$ 2168 459 1582 350 323 1559 285 1651 529 -63 2545 -437 -1000 1505 270 -119 290
1543B90q94R12K93j151l3Q13J20l07j303J480l45j361J907j194l21J856k232Q89
$$ 290 -604 308 601 -550 -583 230 350 43 -1260 220 -125 -1486 421 -773 -1094 762 -1470 -581
1561e81J374k514J093k88M60P94k177J655N35j709J905k278J320J756k895Q72
$$ -581 793 -1721 -628 -916 -456 338 -1839 -184 351 -1358 547 -1731 -411 1345 -1550 -678
1577f78M77q25J451j491L86J011q63M62k35o08R30p92N9J121r06j70J042r05L42
$$ -678 -201 -1026 425 -1066 -680 331 -532 -70 -305 -913 17 -775 -716 405 -501 -671 371 -534 -192
1596a92J46j226J393J72r34J41o39J585j94k048K344r94l82J514k330J224N51
$$ -192 -46 -1272 121 293 -641 -500 -1139 446 252 -1796 548 -446 -828 686 -1644 -420 131
1613A31j164J236p93J67L57j195J314o68n09J496j340N93O21j192P56N33n94l64
$$ 131 -1033 203 -590 -423 -66 -1261 53 -615 -1124 372 -968 -375 246 -946 -190 343 -251 -615
1631f15P47J09J23k18m87O48K35J02n11l11J429n15q03J567j680P28J265j340
$$ -615 132 241 364 146 -341 307 542 644 133 -178 1251 736 -67 1500 -180 548 1813 473
1649D73P51j28m01N12m29Q80j020K7J483j752M51P27j280J118k8j164Q37L98o27
$$ 473 1224 1096 695 1207 778 1658 638 665 2148 396 847 1574 294 1412 1384 220 1057 1455 828
1668H28j61L16k1k87J30j24m36N74M3o33l93R01p70J51Q85j533L26M69j095P31
$$ 828 667 983 962 675 805 681 245 819 862 229 -164 737 -33 118 1003 -530 -204 265 -830 -99
1688i9j86k86l6L4L24p16J17R22j324P72j5r40P32j18m85O42m69K03k13j19M63
$$ -99 -285 -571 -607 -573 -249 -965 -848 74 -1250 -478 -493 -1433 -701 -819 -1304 -662 -1131 -928 -1141 -1260 -797
1709g97n58N90j08k02o6p4L98k73O93n88k33J084p61L68N8k15L18J44j70J35n93
$$ -797 -1355 -765 -873 -1075 -1141 -1215 -817 -1090 -397 -985 -1218 -134 -895 -527 -469 -684 -366 -222 -392 -257 -850
1730h50R13k33k21J000j020M68J61p36N63p9PJ14K89M05j046Q63K80o11J27J29
$$ -850 63 -170 -391 609 -411 57 218 -518 45 -34 -27 87 376 781 -265 598 878 267 394 523
1750E23l80k78M82p4l46J070l78o71R09o07l70O13l91j93L36rk05m3R86j063M8
$$ 523 143 -135 347 273 -73 997 619 -52 857 250 -120 493 102 -91 245 236 31 -12 974 -89 -41
1771d1O18o42J24M48m62j3L98j12j76N34n5q79P62L23q42N08q2m38J93N62k61
$$ -41 577 -65 59 507 45 32 430 318 142 676 621 -258 504 827 -15 493 411 -27 166 728 467
1792D67l90J100l86q30J189p18l88Q30l96k87N24K71q33N09K16p05N22k23k90
$$ 467 77 1177 791 -39 1150 432 44 874 478 191 715 986 153 662 878 173 695 472 182
1811A82Q0L07m56k30P02Q3q43P10o9j172Q29j99n74Q39m27k53q0M42j23o26Q30
$$ 182 262 569 113 -117 585 668 -175 535 466 -706 123 -76 -650 189 -238 -491 -571 -129 -252 -878 -48
1832d8l60p08Q55p30k07Q04p71L53J29J14L9m87O5j35m57O54k13l89J084p44k51
$$ -48 -408 -1116 -261 -991 -1198 -394 -1165 -812 -683 -569 -530 -1017 -952 -1087 -1544 -890 -1103 -1492 -408 -1152 -1403
1853a403R71j87n33O69l22J23o9n30N14K30J4K97p40J230j56j457J445l02m15
$$ -1403 -432 -619 -1152 -483 -805 -682 -751 -1281 -767 -537 -523 -226 -966 264 108 -1349 96 -206 -621
1872f21J043o62L86J33k75P42m77M09j4p58J272o21p94J088m10J69Q24j004K19
$$ -621 422 -240 146 279 4 746 269 678 664 -94 1178 557 -237 851 441 610 1434 430 649
1891F49Q70p72j6l89K71O69q81K17M33q96J250n31j055J578p18q87J701j426R1
$$ 649 1519 747 731 342 613 1282 401 618 1051 155 1405 874 -181 1397 679 -208 1493 67 158
1910A58N55l61Q46o33l36O28r25O73o43j096K225n79j054R62p71P77K47j335O26
$$ 158 713 352 1198 565 229 857 -68 605 -38 -1134 1091 512 -542 420 -351 426 673 -662 -36
1929c6K17P5l87n80R14j8j105J486o54j01J102j515m4J492j843O67Q84p51M29
$$ -36 181 256 -131 -711 203 185 -920 566 -88 -189 913 -602 -646 846 -997 -330 554 -197 232
1948B32r92N81O10p99K30n7k94J524j833k72J953j653L69P93j266J687j119m32
$$ 232 -760 -179 431 -368 -138 -195 -489 1035 -798 -1070 883 -770 -401 392 -874 813 -306 -738
1966g38J026j120M93m02j11J753j275o39J353q50J34L04j245J123k0j465R98Q6
$$ -738 288 -832 -339 -741 -852 901 -374 -1013 340 -510 -376 -72 -1317 -194 -214 -1679 -681 -595
1984e95L64J57j326J370J87j375J137j274P27Q60j893P95J249j300N74m41J95
$$ -595 -231 -74 -1400 -30 157 -1218 -81 -1355 -628 232 -1661 -866 383 -917 -343 -784 -589
2001e89P12j417R76N26j202J129q48Q7J680j777O20Q93j185Q28q18lJ110o10K27
$$ -589 123 -1294 -318 208 -994 135 -713 -626 1054 -723 -103 790 -395 433 -385 -388 722 112 339
2020C39j6j0Q74j115m43K011j214R9O99j317J000K95j150J133j97k39N67r38R13
$$ 339 323 313 1187 72 -371 1640 426 525 1224 -93 907 1202 52 1185 988 749 1316 378 1291
2039A291n39r46J414n34J77R58j767Q14Q71k215J135n9k62K56p26J93N18l06M61
$$ 1291 752 -194 1220 686 863 1821 54 868 1739 -476 659 600 338 594 -132 61 579 273 734
2058G34q60K73R56j706L31P05j445N07N41n94J037m47m58P3k65N14p27k94J533
$$ 734 -126 147 1103 -603 -272 433 -1012 -505 36 -558 479 32 -426 -353 -618 -104 -831 -1125 408
2077D08j172j69O67r82R71L47j358J325n2r64O4R4K17N3k8N82k66N5j08o95P45
$$ 408 -764 -933 -266 -1248 -277 70 -1288 37 -15 -979 -915 -821 -604 -551 -579 3 -263 -208 -316 -1011 -266
2098b66J70n70K84O09o09p0j19K86L66J6j80r9j5j05m96K26P10o49M57M39k76
$$ -266 -96 -666 -382 227 -382 -452 -571 -285 81 97 -83 -182 -197 -302 -798 -572 138 -511 -54 385 109
2119A09J22j43m25R7r2J6N57j92J05l95j52P55n73K22K24o18L0M26q62N93J62
$$ 109 231 88 -337 -240 -332 -316 241 49 154 -241 -393 362 -211 11 235 -383 -353 73 -789 -196 -34
2140c4J27p5L52r8j90k82L78m45M06%j43J43M13n01j10N39m44K76L17n82J8L33
$$ -34 93 18 370 272 82 -200 178 -267 139 139 -4 139 552 51 -59 480 36 312 629 47 65 398
2162C98l51q7Q40J46o88N19J43o47qN98q73N43M59p11J7Q43m11k78M56k40j07
$$ 398 47 -40 800 946 258 777 920 273 265 863 -10 533 992 281 298 1141 730 452 908 668 561
2183E61j1K87o23J50J85J7K80J35n04lj18l92k1M41l32J77L07k25l56J47n3k99
$$ 561 550 837 214 364 549 566 846 981 477 474 356 -36 -57 384 52 229 536 311 -45 102 49 -250
2205b50J2m9l04K89K32j143M04P33l42O9J45l02l8j7m49kL90N5O4m7j91j15J93
$$ -250 -238 -287 -591 -302 -70 -1213 -809 -76 -418 -349 -204 -506 -544 -561 -1010 -1012 -622 -567 -503 -550 -741 -856 -663
2228f63L03m16k30L97R1k46K54l72M0P64j52k99L15O8n20K01o4j90N69J63Q5j20
$$ -663 -360 -776 -1006 -609 -518 -764 -510 -882 -842 -78 -230 -529 -214 -146 -666 -465 -529 -719 -150 13 98 -22
2250b2O2k07j0L52j90K2J44n2k25L89J97m64N12K76l83r3L1j31L7o7J2K9L89L5
$$ -22 40 -167 -177 175 -15 7 151 99 -126 263 460 -4 508 784 401 308 339 208 245 178 190 219 608 643
2274F43k50L7ll61K44P7k10P3K01n48j07O41j19Q6K58o14j83N42m41j60L88j04
$$ 643 393 430 427 66 310 387 177 250 451 -97 -204 437 318 404 662 48 -135 407 -34 -194 194 90
2296I0J17J04J56n09J90J99k69l3K69j23l15K44j32k98Q08k45j05O58p65p4m5
$$ 90 207 311 467 -42 148 347 78 45 314 191 -124 120 -12 -310 498 253 148 806 41 -33 -78
2317g8K2O6k70R91l57l00N87p52k3P19p56M2M41k94K8rJ43j27n5O05j115M57L96
$$ -78 -56 10 -260 731 374 74 661 -91 -114 605 -151 -109 332 38 66 57 200 73 18 623 -492 -35 361
2340C61p51j54N78k55m4M96m62K73m0m76L9O5N7j34J3K67k23l01M26n20M25P21
$$ 361 -390 -544 34 -221 -265 231 -231 42 2 -474 -435 -370 -313 -447 -434 -167 -390 -691 -265 -785 -360 361
2362C61j339K41M82o03J38j87O86K38q52O12m17l23M37m58N65M67q08K32M23o42
$$ 361 -978 -737 -255 -858 -720 -907 -221 17 -835 -223 -640 -963 -526 -984 -419 48 -760 -528 -105 -747
2382g47M64j18K60ok8J13n71K74L59l07oQ33m87K41J56n33N16j19n44P69j18K12
$$ -747 -283 -401 -141 -147 -175 -62 -633 -359 0 -307 -313 520 33 274 430 -103 413 294 -250 519 401 613
2404F13k01l63Q61k97m81J042p97J92M51j272Q91K88o92L58J93K20m41o44P34
$$ 613 412 49 910 613 132 1174 377 569 1020 -252 639 927 235 593 786 1006 565 -79 655
2423F55j23k25L24n38K52P87j370M22P70r44M32j58J05J7o10p8N68l71O43p30
$$ 655 532 307 631 93 345 1132 -238 184 954 10 442 284 389 406 -204 -282 286 -85 558 -172
2443a72J92P53j119J94O04j059Q44l43o16R58k63k32j44Q9O30n76m41R96j002
$$ -172 20 773 -346 -152 452 -607 237 -106 -722 236 -27 -259 -403 -314 316 -260 -701 295 -707
2462g07M77J61q07J015K04r88Q24m0n61j52J1J37N70o12J95lL06K79j113N86N54
$$ -707 -230 -69 -876 139 343 -645 179 139 -422 -574 -563 -426 144 -468 -273 -276 30 309 -804 -218 336
2483C36j006M31M0k06N78o56J08M61j04Rn72M69M03j169K76P83o34M53k33n43
$$ 336 -670 -239 -199 -405 173 -483 -375 86 -18 -9 -581 -112 291 -878 -602 181 -453 0 -233 -776
2503g76J108n17k25L03O0J35p65P7N68k23k53M38k86N14k7r34O94J77o00L86K5
$$ -776 332 -185 -410 -107 -47 88 -677 -600 -32 -255 -508 -70 -356 158 131 -803 -109 68 -532 -146 -121
2524a21J77J92p23L23j00K72K21n27O72jq97Q39J20m71L85l55L17L96l95p0k49
$$ -121 56 248 -475 -152 -252 20 241 -286 386 385 -512 327 447 -24 361 6 323 719 324 254 5
2545EM37K74q44N62K51m10L15k23l66Q04j69j74K30q8l99K86j30M78k03k10L31
$$ 5 442 716 -128 434 685 275 590 367 1 805 636 462 692 604 205 491 361 839 636 426 757
2566G57n10L31m4p57J159n62m60O92k30m9om30J25k2L1J44o45O00J2q38R42m73
$$ 757 247 578 534 -223 936 374 -86 606 376 327 321 -109 16 -6 25 169 -476 124 136 -702 240 -233
2588b33j65O84m74k41J85n07L60o7O4m8m6N01n36k42K14k0n1L04l06k18N97L6
$$ -233 -398 286 -188 -429 -244 -751 -391 -458 -394 -442 -488 13 -523 -765 -551 -571 -622 -318 -624 -842 -245 -209
2610b09n04L49Q8q6M4j46J85l58M82j7l97N18k98j22P03l61k38K23r6K27j3P%
$$ -209 -713 -364 -276 -362 -318 -464 -279 -637 -155 -172 -569 -51 -349 -471 232 -129 -367 -144 -240 -13 -26 -19 -19
2633a9k22N88l87o8O40m86j45J70J37j11j98L52k94K55L4k59L13j68l5O0l8K06
$$ -19 -241 347 -40 -108 532 46 -99 71 208 97 -101 251 -43 212 246 -13 300 132 97 157 119 325
2655C25l92L80rm11K29P2l77O05K1o99L24j14J68l03N64p7m42N15l86k54O86k14
$$ 325 -67 313 304 -107 122 194 -183 422 443 -256 68 -46 122 -181 383 306 -136 379 -7 -261 425 211
2677B11L1j07Q2m7o9M43p46K32K51j73K5L22m28K88J42r4q2j49K81j94M2j07k55
$$ 211 242 135 217 170 101 544 -202 30 281 108 133 455 27 315 457 363 281 132 413 219 261 154 -101
2700a01K46K0j09K29J98l35j43N00j43m33Q18n03m54O43m8m18J66K3m30L07J01
$$ -101 145 165 56 285 483 148 5 505 362 -71 747 244 -210 433 385 -33 133 156 -274 33 134
2721A34m69K78K36n02L23j40j88Po9J64k00L37k37K0oj99j44K76k32L28k54qK76
$$ 134 -335 -57 179 -323 0 -140 -328 -321 -390 -226 -426 -89 -326 -306 -312 -511 -655 -379 -611 -283 -537 -545 -269
2744b69l63L00k61kL99l02qJj60K91k11K62j19J11J38m70K67N88p23M06N5j95
$$ -269 -632 -332 -593 -595 -196 -498 -506 -505 -665 -374 -585 -323 -442 -331 -193 -663 -396 192 -531 -125 -70 -265
2766b65Pj27N09k15L5J36j90K02J78k19K80k86J57J50J9j48j26J44l6j8K47j37
$$ -265 -258 -385 124 -91 -56 80 -110 92 270 51 331 45 202 352 371 223 97 241 205 187 434 297
2788B97K71k14j83K19k56M41j4m03N20m97J4O27n63K29k93Q6J34k24K17j31J7
$$ 297 568 354 171 390 134 575 561 158 678 181 195 822 259 488 195 281 415 191 408 277 294
2809B94J33l42J04J78m58M13j61l0L9J88l36l21L23J78j75Q9K10l90J64Q8l48
$$ 294 427 85 189 367 -91 322 161 131 170 358 22 -299 24 202 27 116 326 -64 100 188 -160
2830a60j71R42p33J66J46o81P03j21l94L57k53J59j73N0N81p40K08K03l45N35
$$ -160 -331 611 -122 44 190 -491 212 91 -303 54 -199 -40 -213 -163 418 -322 -114 89 -256 279
2850B79r9l64Q5Q9J25k81Q0o5j81M59j78l00L47J72p71K98M45l87K10Q5n25O35
$$ 279 180 -184 -99 -10 115 -166 -86 -151 -332 127 -51 -351 -4 168 -603 -305 140 -247 -37 48 -477 158
2872A58l95j29J98l8K1k02m5N33o11K82K04o46N24k88n27R84l07k95J84J22K84
$$ 158 -237 -366 -168 -206 -185 -387 -432 101 -510 -228 -24 -670 -146 -434 -961 23 -284 -579 -395 -273 11
2893A1k69j88K34k55K23O5n77R33q6o03L48J63j68K04j01J68J83l41q9K38M0k28
$$ 11 -258 -446 -212 -467 -244 -179 -756 177 91 -512 -164 -1 -169 35 -66 102 285 -56 -145 93 133 -95
2915i5k80M65M20m99M00N4l82P32o51qL67k65K99l52M4P42r23K80L64m70M69k64
$$ -95 -375 90 510 11 411 465 83 815 164 156 523 258 557 205 249 991 68 348 712 242 711 447
2937D47k89N50j77l72J46N4N0j13j74L20j52k4j24j05N26j20o16M25J93p48L11
$$ 447 158 708 531 159 305 359 409 296 122 442 290 266 142 37 563 443 -173 252 445 -303 8
2958HL6K8N2l21K84mj53J26o09R17N8j028N14J29n67P25p73J57M84l40j77J27
$$ 8 44 72 124 -197 87 83 -70 56 -553 364 422 -606 -92 37 -530 195 -578 -421 63 -277 -454 -327
2980c27PL32o54N43N5l27M74n32j13O07l56l02O48l26o7J59m44O07n8j99K37k45
$$ -327 -320 12 -642 -99 -44 -371 103 -429 -542 65 -291 -593 55 -271 -338 -179 -623 -16 -74 -273 -36 -281
3002b81N81k90l56O35l11m81N45m43M46k3l49M81j24j58K31m40N47m12j63M27
$$ -281 300 10 -346 289 -22 -503 42 -401 45 22 -327 154 30 -128 103 -337 210 -202 -365 62
3022F2k60M1M17m81K81J1k04OK54n1k62P4J25N0j35J59P9l61L47Rl85M79l71r1
$$ 62 -198 -157 260 -221 60 71 -133 -127 127 76 -186 -112 13 63 -72 87 166 -195 152 161 -224 255 -116 -207
3046b07J56rK06j27j38M47k91R0j1l19N48l58m7L32l54R5L54l73K8M30j22j96
$$ -207 -51 -60 146 19 -119 328 37 127 116 -203 345 -13 -60 272 -82 13 367 -6 22 452 330 134
3068A34r0L27j14J9L62k19j72L13o9k35P4N6l56L98m9k46L10j42j77K16J07l71
$$ 134 44 371 257 276 638 419 247 560 491 256 330 386 30 428 379 133 443 301 124 340 447 76
3090G6j90K90n4j10K41k68M1M23m17J25k54J97j56l11J38k48M65K08n12J66J54
$$ 76 -114 176 122 12 253 -15 26 449 32 157 -97 100 -56 -367 -229 -477 -12 196 -316 -150 4
3111DR0m62J67m8Q0p4j85J25j70L37l98K39l6j88J06p5r0O1K96j77jM12p4n84
$$ 4 94 -368 -201 -249 -169 -243 -428 -303 -473 -136 -534 -295 -331 -519 -413 -488 -578 -517 -221 -398 -399 13 -61 -645
3135f45O46l24K85n9j70P0k31J09j45J34K05j71K89J65l69J28j0J82j77J45O6
$$ -645 1 -323 -38 -97 -267 -197 -428 -319 -464 -330 -125 -296 -7 158 -211 -83 -93 89 -88 57 123
3156A23k29K17R8l34N20l03k2J32k4J08k34M61k86j75L83k89O2J15j46j59R5o8
$$ 123 -106 111 209 -125 395 92 70 202 178 286 52 513 227 52 435 146 208 323 177 18 113 45
3178D5o2l2K60PO5R8l81J48R3k98j5O5P2l28L57J15k07J32J83l66K12Q0n5k48
$$ 45 -17 -49 211 218 283 381 0 148 241 -57 -72 -7 65 -263 94 209 2 134 317 -49 163 243 188 -60
3202f0J13K88j15J52l02j13O0l2J00J1P6m5N4j54j87m7K68M5q3L64l22k8R9k23
$$ -60 53 341 226 378 76 -37 23 -9 91 102 178 133 187 33 -154 -201 67 112 29 393 71 43 142 -81
3226h1J43J63J81m26L80j28k91O4M7l37L84K39l06o3o1nO6K61j82J16j71n9j51
$$ -81 62 225 406 -20 360 232 -59 5 52 -285 99 338 32 -31 -92 -97 -31 230 48 164 -7 -66 -217
3249b17o4J65j92J12M8k57P8K18l71J50J12Rk94J53K3l3Q8N8k05L47k06j21K93
$$ -217 -281 -116 -308 -196 -148 -405 -327 -109 -480 -330 -218 -209 -503 -350 -327 -360 -272 -214 -419 -72 -278 -399 -106
3272a06k10n9O5K9N9RR8K6j10K26k71J14j42k0J90K8K14k20J46K2N2J18k03J14
$$ -106 -316 -375 -310 -281 -222 -213 -115 -89 -199 27 -244 -130 -272 -292 -102 -74 140 -80 66 88 140 258 55 169
3296A69k12M87l92j70J72K56k00M84k63k60L40j24k25O11k98Mk0r4L03l76J37
$$ 169 -43 444 52 -118 54 310 110 594 331 71 411 287 62 673 375 379 359 265 568 192 329
3317C29O6j82K21k14k22K84N3k87K91L9J4Ll70L94l36K91m93P5J32K0j23J30N
$$ 329 395 213 434 220 -2 282 335 48 339 378 392 395 25 419 83 374 -119 -44 88 108 -15 115 120
3340A20j19O8j88J46L2Ol41K77J4M5k82K68N0n46P21l98k19K99k09J83L9J51j66
$$ 120 1 69 -119 27 59 65 -276 1 15 60 -222 46 96 -450 271 -127 -346 -47 -256 -73 -34 117 -49
3363d9o9K41M0l16j7k10J55J81l22j08M25j38k65N39k84L3K62m77J99k9J07p7
$$ -49 -118 123 163 -153 -170 -380 -225 -44 -366 -474 -49 -187 -452 87 -197 -164 98 -379 -180 -209 -102 -179
3385a79k43P32m29m81O48j96l64M79l3j13K07m63K43M2O3O7k75L68k00j18J33
$$ -179 -422 310 -119 -600 48 -148 -512 -33 -66 -179 28 -435 -192 -150 -87 -20 -295 73 -127 -245 -112
3406a12N0k79M01k53J05K08m06r6J2J92J70l4n9K68k57L81m07k40O96k54l86O18
$$ -112 -62 -341 60 -193 -88 120 -286 -382 -370 -178 -8 -42 -101 167 -90 291 -116 -356 340 86 -300 318
3428C18k57j63R0k73K89L19p13N17k9J08j09m98P92j46k33K22j96j51K98J79j28
$$ 318 61 -102 -12 -285 4 323 -390 127 98 206 97 -401 391 245 12 234 38 -113 185 364 236
3449B36K60j48m1n02L43P6j59L38qn7K9m60K16L60m53K1M92j77l4l51K17O0l26
$$ 236 496 348 307 -195 148 224 65 403 395 338 367 -93 123 483 30 51 543 366 332 -19 198 258 -68
3472f8L93k09j16K17k57n13Q18n87K79J09k3j95j11oK07k14L96n16K03J79m2l73
$$ -68 325 116 0 217 -40 -553 265 -322 -43 66 43 -152 -263 -269 -62 -276 120 -396 -193 -14 -56 -429
3494d29L48k97K7M10l22N1J09j44j21NJ89j77K50j03P2P9j15q0K9K86o32L83j2
$$ -429 -81 -378 -351 59 -263 -212 -103 -247 -368 -363 -174 -351 -101 -204 -132 -53 -168 -248 -219 67 -565 -182 -194
3517a94p8J97j86J15M7j96L20R6k13j0o0n2M56k81n0K31R0k56k0L2NJ27J92l42
$$ -194 -272 -75 -261 -146 -99 -295 25 121 -92 -102 -162 -214 242 -39 -89 142 232 -24 -44 -12 -7 120 312 -30
3541c0J29J54m97J73M47n45L30k5N5j35J82j45P3j64J52J7k07j01K88j72K11k21
$$ -30 99 253 -244 -71 376 -169 161 136 191 56 238 93 166 2 154 171 -36 -137 151 -21 190 -31
3563c1K87j49l24O6J77j85L51LQ0l15o0P7K23k43O2l09N08j26j89K16K36j82k77
$$ -31 256 107 -217 -151 26 -159 192 195 275 -40 -100 -23 200 -43 19 -290 218 92 -97 119 355 173 -104
3586a04M78k26n9M6k12N9M09j97r6J68Nq0j78K42k59j7K39m07K38K85q1q9q0N4
$$ -104 374 148 89 135 -77 -18 391 194 98 266 271 191 13 255 -4 -21 218 -189 49 334 253 164 84 138
3610A38pl23P19m55P3j9j31J45q9K5j12o0m8l69L87k49p4N22p0j28pr8j41K39
$$ 138 131 -192 527 72 145 126 -5 140 51 76 -36 -96 -144 -513 -126 -375 -449 73 3 -125 -132 -230 -371 -132
3634a32l0j76J40R7j0l62K80l18J27K10q7rm7M5m0o0K82l02K62l2J11j12M2k21
$$ -132 -162 -338 -198 -101 -111 -473 -193 -511 -384 -174 -261 -270 -317 -272 -312 -372 -90 -392 -130 -162 -51 -163 -121 -342
3658c42J25p3J36j21L11l59J48K84l19J21K73k9k20J99j7k08K41K78k90j5k4J03
$$ -342 -217 -290 -154 -275 36 -323 -175 109 -210 -89 184 155 -65 134 117 -91 150 428 138 123 99 202
3680B02j83J27k38L06J25q9j73pN0j76K59J43J62k26P4o9o9J24M3m54L02N7l17
$$ 202 19 146 -92 214 339 250 77 70 120 -56 203 346 508 282 356 287 218 342 385 -69 233 290 -27
3703b7K34j84j79M21j09j92J46R9l39J49J74k65j14L71l33J27K19j19p7Q2r9R4
$$ -27 207 23 -156 265 156 -36 110 209 -130 19 193 -72 -186 185 -148 -21 198 79 2 84 -15 79
3725G9J9k36O0r5K30q4q6L50O0l56P0n0o6K68j35r4L03k50q1J21k74J80nJ15k35
$$ 79 98 -138 -78 -173 57 -27 -113 237 297 -59 11 -39 -105 163 28 -66 237 -13 -94 27 -247 -67 -72 43 -192
3750a92l4K21o4rL5k77P5M84k94j34J33l4j13J4O0J54j50P6Lo9K59l33k98N58
$$ -192 -226 -5 -69 -78 -43 -320 -245 239 -55 -189 -56 -90 -203 -189 -129 25 -125 -49 -46 -115 144 -189 -487 71
3774G1r6l95M66l00p9K02l15Q9J04QK37l65J40J86k83J93r1j28J29Q3l46M07o3
$$ 71 -25 -420 46 -254 -333 -131 -446 -357 -253 -245 -8 -373 -233 -47 -330 -137 -228 -356 -227 -144 -490 -83 -146
3797a46k81L73M3l0j6J8j6N0k38K99Q3l03J76j28K06m1k01O33l41j5K7j60m5R4
$$ -146 -427 -54 -11 -41 -57 -39 -55 -5 -243 56 139 -164 12 -116 90 49 -152 481 140 125 152 -8 -53 41
3821D1J51P6k07K58l9k84K54k8L0L41n67L31j18j72P2k26M74k19O0RN6j05J8j14
$$ 41 192 268 61 319 280 -4 250 222 252 593 26 357 239 67 139 -87 387 168 228 237 293 188 206 92
3845I2J27kK7k55N2J6K23k28j69K84O2k77K51j57L64l35k74M27l84J02k2l8L6
$$ 92 219 217 244 -11 41 57 280 52 -117 167 229 -48 203 46 410 75 -199 228 -156 -54 -76 -114 -78
3868g8p1J31j30j10L57j51n46N11o4p8L19m01J01K92l53j24L76j68j86J25N12
$$ -78 -149 -18 -148 -258 99 -52 -598 -87 -151 -229 90 -311 -210 82 -271 -395 -19 -187 -373 -248 264
3889B64j08j09l88J39Q9o3J24m4K27l35l0M76l32QN4k27J96k66R7K85j52K39j16
$$ 264 156 47 -341 -202 -113 -176 -52 -96 131 -204 -234 242 -90 -82 -28 -255 -59 -325 -228 57 -95 144 28
3912B8k57M02j40j87J76k73M87l87K4M8l7N7o2lK4J08N9N5k82L12j20k94K08L91
$$ 28 -229 173 33 -154 22 -251 236 -151 -127 -79 -116 -59 -121 -124 -100 8 67 122 -160 152 32 -262 -54 337
3936C37n02m9N48l62K15j48p4j17K99p6jjJ21m19J25M50m45Q5J2L96J07l49J45
$$ 337 -165 -214 334 -28 187 39 -35 -152 147 71 70 69 190 -229 -104 346 -99 -14 -2 394 501 152 297
3959B97k61J95ql20L17Mk22J99j40n7L73r3j92M3J83L1l10K46N5m71J54K49jl84
$$ 297 36 231 223 -97 220 224 2 201 61 4 377 284 92 135 318 349 39 285 340 -131 23 272 271 -113
3983a13J60m2O3J00k22P8K81l08J34k06R2P2J1n8k92L91j07j70K44j10l9k71M1
$$ -113 47 5 68 168 -54 24 305 -3 131 -75 17 89 100 42 -250 141 34 -136 108 -2 -41 -312 -271
4006b71J10K40n0k94Q9Q7j33n6K76l04K98p7J46p9j81J53k44J19l6q8J83kk9l43
$$ -271 -161 79 29 -265 -176 -89 -222 -278 -2 -306 -8 -85 61 -18 -199 -46 -290 -171 -207 -295 -112 -114 -143 -486
4030d86N66l27r4K41L44o30K54L1m28K64M05l90L77j76j05j28M8L12j45J56k7
$$ -486 80 -247 -341 -100 244 -386 -132 -101 -529 -265 140 -250 127 -49 -154 -282 -234 78 -67 89 62
4051F2k53M42l19J8K66j63j88N7K47r9j44j7kP1K64L5k64J63j50N3K0P7j64L66
$$ 62 -191 251 -68 -50 216 53 -135 -78 169 70 -74 -91 -93 -22 242 277 13 176 26 79 99 176 12 378
4075C78k89k46M20j48N1m4k50L67n37K89K65k64J24l6n6J70l30K89m4p1J29j74
$$ 378 89 -157 263 115 166 122 -128 239 -298 -9 256 -8 116 80 24 194 -136 153 109 38 167 -7
4097gj35K3J75J77l32K01Q1j40r5J95J49k96r4J36N9l4J06pl59j3M38j86l1j21
$$ -7 -142 -119 56 233 -99 102 183 43 -52 143 292 -4 -98 38 97 63 169 162 -197 -210 228 42 11 -110
4121a10K87o7j2j9L3J90l04O6l9rJ37p2j99p0K39r8R5k9l63qK51K38l71K22J7
$$ -110 177 110 98 79 112 302 -2 64 25 16 153 81 -118 -188 51 -47 48 19 -344 -352 -101 137 -234 -12 5
4146En7l2M72n16j16M76k26j48J4j05kJ07j18Q6j15K18k81J47K39m27N07m75K15
$$ 5 -52 -84 388 -128 -244 232 6 -142 -128 -233 -235 -128 -246 -160 -275 -57 -338 -191 48 -379 128 -347 -132
4169a32k22K26Oq3K08k08j01J67q1j04L69m32M36jn9j7k2J42r2m5j1j35L63j86
$$ -132 -354 -128 -122 -205 3 -205 -306 -139 -220 -324 45 -387 49 48 -11 -28 -50 92 0 -45 -56 -191 172 -14
4193a4J46j01k7K8J17M3p1k96L36P2j20j24J69Q1j33M9J82k66M42l57l31N29k63
$$ -14 132 31 4 32 149 192 121 -175 161 233 113 -11 158 239 106 155 337 71 513 156 -175 354 91
4216I1K96l62N1J2j6J28k68l1L14M6q7K4k63J90J93j80j43K90k80n8N5K90l44
$$ 91 387 25 76 88 72 200 -68 -99 215 261 174 198 -65 125 318 138 -5 285 5 -53 2 292 -52
4239e2N5J60l36M29l94J46q9K66j60k6Q8l4j38J12R5j51k0J04j94j40M45m90K83
$$ -52 3 163 -173 256 -138 8 -81 185 25 -1 87 53 -85 27 122 -29 -49 55 -139 -279 166 -324 -41
4262d1O0p1j7J40p3k96L10Q3J08j06j54p7K13l4j70K2R1j56J79lQ1j56R6M4l24
$$ -41 19 -52 -69 71 -2 -298 12 95 203 97 -57 -134 79 45 -125 -103 -12 -168 11 8 89 -67 29 73 -251
4287b51J06K39j96J01R2k24O7J57P7m47K74j07J22R8j83M5m0p3KL9J60n7j71K11
$$ -251 -145 94 -102 -1 91 -133 -66 91 168 -279 -5 -112 10 108 -75 -30 -70 -143 -141 -102 58 1 -170 41
4311D1k26R6j75mJ74K25m9k77J25Q6j47K25p4j24P5m8J7n1K04j81J06K00r7j60
$$ 41 -185 -89 -264 -268 -94 131 82 -195 -70 16 -131 94 20 -104 -29 -77 -60 -111 93 -88 18 218 121 -39
4335c9Q0n8oj12J60K57j63o5K3j90K55q8P3J69j04J64k03l4M7l89K99R6O3J46
$$ -39 41 -17 -23 -135 25 282 119 54 77 -113 142 54 127 296 192 356 153 119 166 -223 76 172 235 381
4359C81m40j33L78l31J08K62k14K12O8o4l10L87l9k69J11j95L39n02L07J4j07
$$ 381 -59 -192 186 -145 -37 225 11 223 291 227 -83 304 265 -4 107 -88 251 -251 56 70 -37
4380c7J42R2k27K05m01K26K7l0N1q3k7L6j14O2L5m84M88k67L01J02l39J15J00
$$ -37 105 197 -30 175 -226 0 27 -3 48 -35 -62 -26 -140 -78 -43 -527 -39 -306 -5 97 -242 -127 -27
4403b7J7KM1k27J83j91J38K22k51Q4P0k44O0Q2j10K56k21Q4K37l73o5K77r7J92
$$ -27 -10 -8 33 -194 -11 -202 -64 158 -93 -9 61 -183 -123 -41 -151 105 -116 -32 205 -168 -233 44 -53 139
4427A39k23Q9L0L9j0O0L9J80n39K22k3l72M03j06L5J39k74r4J66K16j94r1J35
$$ 139 -84 5 35 74 64 124 163 343 -196 26 3 -369 34 -72 -37 102 -172 -266 -100 116 -78 -169 -34
4450c4p7J65O1k22J09l3m1j39K77M7P1j82J44N7j45j38K40j53K38j45j83m3J75
$$ -34 -111 54 115 -107 2 -31 -72 -211 66 113 184 2 146 203 58 -80 160 7 245 100 -83 -126 49
4473D9J89k83j7J55O4r8R7k95J64j57q3K20K77j78J00o7j97O9J68m3j24J55N3
$$ 49 238 -45 -62 93 157 59 156 -139 25 -132 -215 5 282 104 204 137 -60 9 177 134 10 165 218
4496B18j06o3J2J56l07K97j39J95k4j13k22J18l5K95k71J40K17m01L41l32O5L5
$$ 218 112 49 61 217 -90 207 68 263 239 126 -96 22 -13 282 11 151 368 -33 308 -24 41 76
4518G6n7M1r8k5K03p4m23K84j36L24k38J13k67k3L24j16k43j2K01o0K70n8n6j30
$$ 76 19 60 -38 -63 140 66 -357 -73 -209 115 -123 -10 -277 -300 24 -92 -335 -347 -146 -206 64 6 -50 -180
4542a80N1o9L8P1q9Q1l9J17m6K07l68J05P6j32M1l6J51j23J63l9R8k17P2j25M8
$$ -180 -129 -198 -160 -89 -178 -97 -136 -19 -65 142 -226 -121 -45 -177 -136 -172 -21 -144 19 -20 78 -139 -67 -192 -144
4567a44K83l04J63J24j92O7K69j49N3q9j19J94lr5n9l5L9N2o1j0o1j70N58j76
$$ -144 139 -165 -2 122 -70 -3 266 117 170 81 -38 156 153 58 -1 -36 3 55 -6 -16 -77 -247 311 135
4591A35o7LJ07j97J37R5N7j30r6p5Q2J41j53RJ88l42Q5K02k80K33j5n2L9J44L4
$$ 135 68 71 178 -19 118 213 270 140 44 -31 51 192 39 48 236 -106 -21 181 -99 134 119 67 106 250 284
4616B84l68K58q8J15l01N9r3K10L41m17J8nk04M05k40K5m2K04J17m02K48l63L41
$$ 284 -84 174 86 201 -100 -41 -134 76 417 0 18 13 -191 214 -26 -1 -43 161 278 -124 124 -239 102
4639A02J33L6j36k1k18J01J6n1j65RM11l37J3L22j18l53M44k10j34L95j96k34
$$ 102 235 271 135 114 -104 -3 13 -38 -203 -194 217 -120 -107 215 97 -256 188 -22 -156 239 43 -191
4661a91K8Q1%Q4o3p1K35j98R7k21P6K28l26P1Q1K9N6K0q9J32r8j58M43k70k49
$$ -191 -163 -82 -82 2 -61 -132 103 -95 2 -219 -143 85 -241 -170 -89 -60 -4 16 -73 59 -39 -197 246 -24 -273
4686b73R7j06R0J68k57J55p4J97Q9j44k4l4M5qJ06k15J24K13k82j49J34L4N8K58
$$ -273 -176 -282 -192 -24 -281 -126 -200 -3 86 -58 -82 -116 -71 -79 27 -188 -64 149 -133 -282 -148 -114 -56 202
4710B02j57P5j56M5o7N3J36j34J23J76l31J44J8o3K93m18P5J88K0Kj32J58q9j3
$$ 202 45 120 -36 9 -58 -5 131 -3 120 296 -35 109 127 64 357 -61 14 202 222 224 92 250 161 148
4734A48J1j07k6m3R4lJ3k6K1J70m12O7J23p5O1M1J1k4j95O1J14j83J34l5n6K19
$$ 148 159 52 26 -17 77 74 87 61 82 252 -160 -93 30 -45 16 57 68 44 -151 -90 24 -159 -25 -60 -116 103
4760A03j28M1M9J43r0r4j73Q3k44L55m4L2j48J36k31j00O6L2J0k2L35M5k59MP7
$$ 103 -25 16 65 208 118 24 -149 -66 -310 45 1 33 -115 21 -210 -310 -244 -212 -202 -224 111 156 -103 -99 -22
4785b2j53k14L15J32k78J93N6j7r1P1j72K72j78l7j20J53N7K56l78K57n0j09P2
$$ -22 -175 -389 -74 58 -220 -27 29 12 -79 -8 -180 92 -86 -123 -243 -90 -33 223 -155 102 52 -57 15
4808A5j01k41N23k28K93k14j25K64k66K9Q3m7j70J14k06L75m07O6K80l1nL6R9
$$ 15 -86 -327 196 -32 261 47 -78 186 -80 -51 32 -15 -185 -71 -277 98 -309 -243 37 6 1 37 136
4831A36j43L3LM7N3k76J26k63K24K03j92J42K03k61l5O4R5k45K8J93lOj18P0M2
$$ 136 -7 26 29 76 129 -147 -21 -284 -60 143 -49 93 296 35 0 64 159 -86 -58 135 132 138 20 90 132
4856A32n1j82J76L1j67J37j96n0L97jk26p7J18J87l24K08o1n3p8j13Q2L16M6k86
$$ 132 81 -101 75 106 -61 76 -120 -170 227 226 0 -77 41 228 -96 112 51 -2 -80 -193 -111 205 251 -35
4880c5O1K7o0j23J23K81k35J22K3l63J82O7K3j3J10o4n9J4J72k08K0m4J36k08
$$ -35 26 53 -7 -130 -7 274 39 161 184 -179 3 70 93 80 190 126 67 81 253 45 65 21 157 -51
4904e1J57j52J26l33J60L8Q9j60k6j8O32n63j68l2J92j73K52j52J71p8j12K57
$$ -51 106 -46 80 -253 -93 -55 34 -126 -152 -170 462 -101 -269 -301 -109 -282 -30 -182 -11 -89 -201 56
4926E6k16K61l20J83j55R7K6J56j54o6n8J32P9O2j41P1J5q2N08m42p7K68l18o
$$ 56 -160 101 -219 -36 -191 -94 -68 88 -66 -132 -190 -58 21 83 -58 13 28 -54 454 12 -65 203 -115 -121
4950a21J94j15J02j30J90l26J35J70K8l51J76J01M2l8k19L60j41j59M8L23l08
$$ -121 73 -42 60 -70 120 -206 -71 99 127 -224 -48 53 95 57 -162 198 57 -102 -54 269 -39
4971c9J6P5n9k11L65j22N5q1k7L80m14K49l5p5P7k09Rn6K01j13J63j16n8r8L17
$$ -39 -23 52 -7 -218 147 25 80 -1 -28 352 -62 187 152 77 154 -55 -46 -102 99 -14 149 33 -25 -123 194
4996A94j4k46J57l87J68K23k57M40k40J7K14j18j31o7N4O3j93J49k6k6nK69k02
$$ 194 180 -66 91 -296 -128 95 -162 278 38 55 269 151 20 -47 7 70 -123 26 0 -26 -31 238 36
5019C6J02n8L1k18K35o2k34K15p6P5j02J31O5j73K46j00o8j21M5j5N4m3n0K60
$$ 36 138 80 111 -107 128 66 -168 47 -29 46 -56 75 140 -33 213 113 45 -76 -31 -46 8 -35 -85 175
5043A75j41k14J95j83P1rJ64k67K2J10l9R7q7J05J27j99P8j35J9j79M35k94L18
$$ 175 34 -180 15 -168 -97 -106 58 -209 -187 -77 -116 -19 -106 -1 126 -73 5 -130 -111 -290 145 -149 169
5066A69k92P3j21j26K46J33o1l1Q2k78J67K96j97q1J3j8j18j00K47j13O9O0j31
$$ 169 -123 -50 -171 -297 -51 82 21 -10 72 -206 -39 257 60 -21 -8 -26 -144 -244 3 -110 -41 19 -112
5089a12nJ07j47K05O3qk51J36K2Kl0J86nm38K52j42J01J99J3J07o2j52p0J83j39
$$ -112 -117 -10 -157 48 111 103 -148 -12 10 12 -18 168 163 -275 -23 -165 -64 135 148 255 193 41 -29 154 15
5114A5m9J92J17q5j4N8m0o5k6k36O6J26q2j01K59k31M8J2J64K3l58K68j80K72
$$ 15 -34 158 275 190 176 234 194 129 103 -133 -67 59 -23 -124 135 -96 -48 -36 128 151 -207 61 -119 153
5138A53j88k0J25k52L48k16K05k68m8J13l4J19r5J19n6K02l75P5K98q4j14K36
$$ 153 -35 -55 70 -182 166 -50 155 -113 -161 -48 -82 37 -58 61 5 207 -168 -93 205 121 7 243
5160B43k07j18J07o8j75J71kQ4n2J41k22l2J48o0j02M13j15j42R1j56j40J25j32
$$ 243 36 -82 25 -43 -218 -47 -49 35 -17 124 -98 -130 18 -42 -144 269 154 12 103 -53 -193 -68 -200
5183b00L94j85p6J2J43j35l4L9J60J34n16L50l3k92K78R3j35N4j70J86p9L0q5
$$ -200 194 9 -67 -55 88 -47 -81 -42 118 252 -264 86 53 -239 39 132 -3 51 -119 67 -12 18 -67
5206f7lp8J34k25J17N7J54k11j43L81k55R6q0R9J73p9o0K3j1K6J07l6j84K25j61
$$ -67 -70 -148 -14 -239 -122 -65 89 -122 -265 116 -139 -43 -123 -24 149 70 10 33 22 48 155 119 -65 160 -1
5231aJ77j62rK1K24j22j26Qj64L01j7j96J53J6k60K16k61K73J2j68l1J81K69k73
$$ -1 176 14 5 26 250 128 2 10 -154 147 130 -66 87 103 -157 59 -202 71 83 -85 -116 65 334 61
5255F1r2OQ5j30L1J73j34K1r3K09j45K43m8r2q6l7L50k40l1j33R5J12k74J67l16
$$ 61 -31 -25 60 -70 -39 134 0 21 -72 137 -8 235 187 95 9 -28 322 82 51 -82 13 125 -149 18 -298
5280b98L58p1j70M6l7R9K59l80K38J5j04l3j16J23J04l27J58O3Q4q2L25Km03R2
$$ -298 60 -11 -181 -135 -172 -73 186 -194 44 59 -45 -78 -194 -71 33 -294 -136 -73 11 -71 254 256 -147 -55
5304e5PQ5J78j28r5j19J31k6L36m60J17J46j91K78j23O0k31j57O2J73L2P9j08
$$ -55 -48 37 215 87 -8 -127 4 -22 314 -146 -29 117 -74 204 81 141 -90 -247 -185 -12 20 99 -9
5327ij20J03J07j72R7P4L5q2l7M1J51j42m6R3k25J60PK15k10J40j83l73L90K92
$$ -9 -129 -26 81 -91 6 80 115 33 -4 37 188 46 0 93 -132 28 35 250 40 180 -3 -376 14 306
5351C06l89j58J38PJ4n5K59P1k11o3J06M4k1k27M71j2l28J37J69K6m08K20j37
$$ 306 -83 -241 -103 -96 -82 -137 122 193 -18 -81 25 69 48 -179 292 280 -48 89 258 284 -124 96 -41
5374d1O7p3L52k42M3j35J07k03K27r1j74L63k75J27k28K50j97L12j41M3o4l6R0
$$ -41 26 -47 305 63 106 -29 78 -125 102 11 -163 200 -75 52 -176 74 -123 189 48 91 27 -9 81
5397H1lJ23p6j26N6j22k9J33m5J59r7j35J95J17q3O9Qj76j4l65L89J33k42J95
$$ 81 78 201 125 -1 55 -67 -96 37 -8 151 54 -81 114 231 148 217 225 49 35 -330 59 192 -50 145
5421A45j19J94p4k39r4P2P9j41M0J74k05j01N11j46k8m0j28O6p4mJ35k14L59k79
$$ 145 26 220 146 -93 -187 -115 -36 -177 -137 37 -168 -269 242 96 68 28 -100 -34 -108 -112 23 -191 168 -111
5445a11M8j1j35K25N8j83K0J76r9k14K49J57m40M24k95rP2M4lJ91j87J28j55N16
$$ -111 -63 -74 -209 16 74 -109 -89 87 -12 -226 23 180 -260 164 -131 -140 -68 -24 -27 164 -23 105 -50 466
5469D66n65j32K07qK18j93n6M7J37j6m3k65L68j84J52J04k4l99K08o5N4J71k30
$$ 466 -99 -231 -24 -32 186 -7 -63 -16 121 105 62 -203 165 -19 133 237 213 -186 22 -43 11 182 -48
5492d8m4K45j88J09j51K23Mj14n7k9r4J81K2J0Q3k60L75Q6k21l0p0N8l37J83J27
$$ -48 -92 153 -35 74 -77 146 150 36 -21 -50 -144 37 59 69 152 -108 267 353 132 102 32 90 -247 -64 63
5517F3l6j25K69l63L82k66J7P3j52P4O8j90J19L11k89m3L14j58m6q1j67L75k81
$$ 63 27 -98 171 -192 190 -76 -59 14 -138 -64 4 -186 -67 244 -45 -88 226 68 22 -59 -226 149 -132
5540a32K54l38j00L25j09Qk7K04j19MK44l87P6J07O6n2J22k25P9n6J8Q2j11j64
$$ -132 122 -216 -316 9 -100 -92 -119 85 -34 -30 214 -173 -97 10 76 24 146 -79 0 -56 -38 44 -67 -231
5564b31M48k14L8J38k78K52k38jl3J13j5j22J89J96l14K56m3l94J54J74l0J2p9
$$ -231 217 3 41 179 -99 153 -85 -86 -119 -6 -21 -143 46 242 -72 184 141 -253 -99 75 45 57 -22
5587b2k00K75q1N8J28k06M8K87m81L12j00J51k80L0N9J63m07N18j94j33J95k27
$$ -22 -222 53 -28 30 158 -48 0 287 -194 118 18 169 -111 -81 -22 141 -266 252 58 -75 120 -107
5609a07q3K27P7j89p0J21O7k2K05k09K13k06p4K00j70L6J60j23oO0m1R3k03O5
$$ -107 -190 37 114 -75 -145 -24 43 21 226 17 230 24 -50 150 -20 16 176 53 47 107 66 159 -44 21
5633B1Q1J45l5j15j56J16l6o2J13l12J75P0j04K17K3J59l81K3J77j10R0j81R9
$$ 21 102 247 212 97 -59 57 21 -41 72 -240 -65 5 -99 118 141 300 -81 -58 119 9 99 -82 17
5656A7o9J32r3K9j76K04L3N0k49L1o0K20o6k0J47r2K0j11J29J0m5Rl37K78J95
$$ 17 -52 80 -13 16 -160 44 77 127 -122 -91 -151 69 3 -17 130 38 58 -53 76 86 41 50 -287 -9 186
5681A86j9n46L69J29j55J38j92l7L72l14M5j37J33J62j88J54j59J71j10j45J27
$$ 186 167 -379 -10 119 -36 102 -90 -127 245 -69 -24 -161 -28 134 -54 100 -59 112 2 -143 -16
5702a6L61k45j20J64k43K49k68J03K37l83J9k5J46O9M3j71J35o5K69j14j42j22
$$ -16 345 100 -20 144 -99 150 -118 -15 222 -161 -142 -167 -21 48 91 -80 55 -10 259 145 3 -119
5724a19L37k04J3k23J97Q3j53L25k34k26J96L63l07p3J41j05j0k7n0K71k68J27
$$ -119 218 14 27 -196 1 84 -69 256 22 -204 -8 355 48 -25 116 11 1 -26 -76 195 -73 54
5746E4j15r5M0M15j57M6J2j41J46k79L1j95J34J78Kk36K37j6KJ9m2j13J74M2k07
$$ 54 -61 -156 -116 299 142 188 200 59 205 -74 -43 -238 -104 74 76 -160 77 61 63 82 40 -73 101 143 -64
5771f4J60K7k27K76j21j1N6r8j4K6J1j25l4J95j1j48k0J06K61j26j86n6J73Pn1
$$ -64 96 123 -104 172 51 40 96 -2 -16 10 21 -104 -138 57 46 -102 -122 -16 245 119 -67 -123 50 57 6
5796Fk26J09L00j92p7k1J02m5k45M83k72L09j91j97J31J13j40j62L89j99p1J16
$$ 6 -220 -111 189 -3 -80 -101 1 -44 -289 194 -78 231 40 -157 -26 87 -53 -215 174 -25 -96 20
5818B0l5L17l88J4K21l60J82J95k46J19l0q8L2k7J45q2n2J9J56k68J19j27j36
$$ 20 -15 302 -86 -72 149 -211 -29 166 -80 39 9 -79 -47 -74 71 -11 -63 -44 112 -156 -37 -164 -300
5841c00M28r4mn1p8N8k30M27r9j16J35j1n3j06P7J7O9p7p7m2L34k74N4J73j49
$$ -300 128 34 30 -21 -99 -41 -271 156 57 -59 76 65 12 -94 -17 0 69 -8 -85 -127 207 -67 -13 160 11
5866A1M6k0R5M3j07J7j88l8K80Oj8Q7j69j89K89j40K29o6k71mJ76j03n9K80j67
$$ 11 57 37 132 175 68 85 -103 -141 139 145 127 214 45 -144 145 5 234 168 -103 -107 69 -34 -93 187 20
5891B0J09q8j1j43j8J26J81j62J77r7k21R7M5q1O2L7N6j18N8N5%k54M82j44k73
$$ 20 129 41 30 -113 -131 -5 176 14 191 94 -127 -30 15 -66 -4 33 89 -29 29 84 84 -170 312 168 -105
5916a05n5L12k85J60J05m1k73L7K83r2M5j66K86j26Q0j81N4j14m7J2J67P4j75
$$ -105 -160 152 -133 27 132 91 -182 -145 138 46 91 -75 211 85 165 -16 38 -76 -123 -111 56 130 -45
5939d5L4m2Q1JJ61j93j41M92j01j79Qr5K14l68J91n0j15J76j64P4m2L75l97p1
$$ -45 -11 -53 28 29 190 -3 -144 348 247 68 76 -19 195 -173 18 -32 -147 29 -135 -61 -103 272 -125 -196
5963a96L38o3k06J18J00j60mL5J27j88L8L39l5j21J00j20j54j43J97j2J88k01
$$ -196 142 79 -127 -9 91 -69 -73 -38 89 -99 -61 278 243 122 222 102 -52 -195 2 -10 178 -23
5985b3N9k3j4K36l71K19j49K48l2q4j38J72k50J63k2M3l4r5K32l54K91J72j29
$$ -23 36 13 -1 235 -136 83 -66 182 150 66 -72 100 -150 13 -9 34 0 -95 137 -217 74 246 117
6008A17J13k60J79l5J0j78qQ2R0l3j49J68m8k7j44N3J78l6qk62K36K0n4o5L74
$$ 117 230 -30 149 114 124 -54 -62 20 110 77 -72 96 48 21 -123 -70 108 72 64 -198 38 58 4 -61 313
6033C13l27j39l4R7L02m17K50NQ5k71k4k0L70r5k88J53K70j90j72r6Q0m9K23N9
$$ 313 -14 -153 -187 -90 212 -205 45 50 135 -136 -160 -180 190 95 -193 -40 230 40 -132 -228 -148 -197 26 85
6057H5l00L05j90K10j78k21M54M4k51L57m87J06J72k1Q3p1k65K00l8M8O0l7k25
$$ 85 -215 90 -100 110 -68 -289 165 209 -42 315 -172 -66 106 85 168 97 -168 32 -6 42 102 65 -160
6080a60K54l62K4K63o1j40K50J7m7O3p5J22j8k44n6P2M3k5j75L9J3K79j16K24
$$ -160 94 -268 -244 19 -42 -182 68 85 38 101 26 148 130 -114 -170 -98 -55 -80 -255 -216 -203 76 -40 184
6104A84k13K07k07J45k09L13l63n5K20j03L59l11K51n08K95J02j12K1n9K79j90
$$ 184 -29 178 -29 116 -93 220 -143 -198 22 -81 278 -33 218 -290 5 107 -5 16 -43 236 46
6125D6j24n3p5J83q0K66l28L27j80K42l01N3MJ51j17J71j45j64J51j02Q3K8m2
$$ 46 -78 -131 -206 -23 -103 163 -165 162 -18 224 -77 -24 -20 131 14 185 40 -124 27 -75 8 36 -6
6148fO4N2k24m6%mM4J2O4J21M1k85J80J04k50K02J24k38N0Jj60K78k59l8r6J91
$$ -6 58 110 -114 -160 -160 -164 -120 -108 -44 77 118 -167 13 117 -133 69 193 -45 5 6 -154 124 -135 -173 -269 -78
6174g8j47K44j36K13k44K30J35k56P2J8m4n0J08j51Q6j53OO5P1j07R9r4J38J16
$$ -78 -225 19 -117 96 -148 82 217 -39 33 51 7 -43 65 -86 0 -153 -147 -82 -11 -118 -19 -113 25 141
6198A41o5j26R1J3j56L6J55k05p5R1j82K19Q4p0q6K79L0j44o7rL8J70j55j51r3
$$ 141 76 -50 41 54 -102 -66 89 -116 -191 -100 -282 -63 21 -49 -135 144 174 30 -37 -46 -8 162 7 -144 -237
6223b37K36j61J56q7L9K1M02j20k61J16j82q6J25P1k81J23K50n2O6j97K40kk88
$$ -237 -1 -162 -6 -93 -54 -33 369 249 -12 104 -78 -164 -39 32 -249 -126 124 72 138 -59 181 179 -109
6246a09J01j23J11m9M8o8NJ49j06o0J53j78P5J7K37k13M0MNK06k76J18J42k80
$$ -109 -8 -131 -20 -69 -21 -89 -84 65 -41 -101 52 -126 -51 -34 203 -10 30 34 39 245 -31 87 229 -51
6270e1L6K25k56m1J36r2J77j12Ol1j4jJ47j21j04O4r0J54N5l7Q4Q2k89J69k39
$$ -51 -15 210 -46 -87 49 -43 134 22 28 -3 -17 -18 129 8 -96 -32 -122 32 87 50 134 216 -73 96 -143
6295a43J76j55L6k7J27J21q7k2l00M10k4r3k7J03M1k73P2K04K17n99Q1J29j53
$$ -143 33 -122 -86 -113 14 135 48 26 -274 136 112 19 -8 95 136 -137 -65 139 356 -243 -162 -33 -186
6318a86L79j35j69P8J95k03l1j46L39j87q5n6K17j43r8K18J65k74K23j74J54N3
$$ -186 193 58 -111 -33 162 -41 -72 -218 121 -66 -151 -207 10 -133 -231 -13 152 -122 101 -73 81 134
6340A34m4q0J16k63K40p5m8j01Q1J75j44J14q4o4JJ80N9k94J99n9Q7J06j76o0
$$ 134 90 10 126 -137 103 28 -20 -121 -40 135 -9 105 21 -43 -42 138 197 -97 102 43 130 236 60 0
6364@k0J6p1o0N1m0P4m4K58j94M7k22R2R2j31pJ83J05r9k06Q5M17n63K51J62L9
$$ 0 -20 -4 -75 -135 -84 -124 -50 -94 164 -30 17 -205 -113 -21 -152 -159 24 129 30 -176 -91 326 -237 14 176 215
6390B15k01J9J68j51J60l95K87j06J8k1R9n6J6K4q0J9J9k10L32j17o5P1J99l65
$$ 215 14 33 201 50 210 -185 102 -4 14 -7 92 36 52 76 -4 15 34 -176 156 39 -26 45 244 -121
6414a21L14k78P2q9j64J69r4J49p7J42L9j12QM7j07J53q6j49Q9q1n4J73j00p0
$$ -121 193 -85 -13 -102 -266 -97 -191 -42 -119 23 62 -50 -42 5 -102 51 -35 -184 -95 -176 -230 -57 -157 -227
6438b27K46kj31J22J62j55Q1j18op1J83J26l85P3L46k82K53k75q0K08j65k3J64
$$ -227 19 17 -114 8 170 15 96 -22 -28 -99 84 210 -175 -102 244 -38 215 -60 -140 68 -97 -120 44
6461D4j64K67j44J12j06K5J64n1j7l07J19N0J29j57K00k55j6K9p4J53J29J65j23
$$ 44 -120 147 3 115 9 34 198 147 130 -177 -58 -8 121 -36 164 -91 -107 -78 -152 1 130 295 172
6484A72Oj80J15j79Q1j99J48j09M01l17J55R7j75O7n9L03k43q9O4j6K13j58k60
$$ 172 178 -2 113 -66 15 -184 -36 -145 256 -61 94 191 16 83 24 327 84 -5 59 43 256 98 -162
6507a62K40j25J50j47j69N6L24l45M45m68N31m03J31N7k01K46l84L53k70J71J4
$$ -162 78 -47 103 -44 -213 -157 167 -178 267 -201 330 -73 58 115 -86 160 -224 129 -141 30 44
6528D4J10J14m25L33k34k4J80k46J02K44lp5j31j25K57j4j55r6L51l26Q9MJ44
$$ 44 154 268 -157 176 -58 -82 98 -148 -46 198 195 120 -11 -136 121 107 -48 -144 207 -119 -30 -26 118
6551A18k58J05K57k89K83k73J60k73k3N5Q6K49j67p0%Q1m36N03j24p2J29J04k71
$$ 118 -140 -35 222 -67 216 -57 103 -170 -193 -138 -52 197 30 -40 -40 41 -395 108 -16 -88 41 145 -126
6574a26j05J81K59m68n7L61r9J37p1J93l03J56j64J81l2L2J00m18K60k7j52Q0
$$ -126 -231 -50 209 -259 -316 45 -54 83 12 205 -98 58 -106 75 43 75 175 -243 17 -10 -162 -82
6596h2N8K92m09L3j1R0k4J84o9J51k45l1m6l6M10m37L7J97J4l57L37j95K41j93
$$ -82 -24 268 -141 -108 -119 -29 -53 131 62 213 -32 -63 -109 -145 265 -172 -135 62 76 -281 56 -139 102 -91
6620i1J86j05J50k34J58r4o2P3L6J29n5j18K06j48k9M4j40J34K3M1j20q6J87J59
$$ -91 95 -10 140 -94 64 -30 -92 -19 17 146 91 -27 179 31 2 46 -94 40 63 104 -16 -102 85 244
6644B44k71J94j83L67m64K58nk77J57n6K4j00j7J93q9R8k23J43M9j03J42j63O
$$ 244 -27 167 -16 351 -113 145 140 -137 20 -36 -12 -112 -129 64 -25 73 -150 -7 42 -61 81 -82 -76
6667g6l83M27M8q1l9J20J71k50k42K23K1L5L4L7p0J04j06Q2k91K91K88l49k8J3
$$ -76 -459 -32 16 -65 -104 16 187 -63 -305 -82 -61 -26 8 45 -25 79 -27 55 -236 55 343 -6 -34 -21
6691b1j62L40j26k09J37r9N1p2J73l7m2p3J02j2m8J27m2j75J26J16k22J9K80j72
$$ -21 -183 157 31 -178 -41 -140 -89 -161 12 -25 -67 -140 -38 -50 -98 29 -13 -188 -62 54 -168 -149 131 -41
6715d1j38L97m62J07J69N0j85M8m9J71k6j90K07N4Q4k81K51k21N2J2j1R4j39K4
$$ -41 -179 218 -244 -137 32 82 -103 -55 -104 67 41 -149 58 112 196 -85 166 -55 -3 9 -2 92 -47 -23
6739b3k6J26J30j01j93o8J43k6P8k62L46n4J74k52j01r4L8K39N5j01L20l15m9
$$ -23 -49 77 207 106 -87 -155 -12 -38 40 -222 124 70 244 -8 -109 -203 -165 74 129 28 348 33 -16
6762a6P9m1q5k12M53j23JJ27O5N1l51j47J94k0J46k46M73l42Q8K14n06j5J86p8
$$ -16 63 22 -63 -275 178 55 56 183 248 299 -52 -199 -5 -25 121 -125 348 6 94 308 -198 -213 -27 -105
6786a05M1K2J99J96k42L5k06L3l5k29L31j68o4J71J59j82J59j19Mr2o2L13K4j19
$$ -105 -64 -42 157 353 111 146 -60 -27 -62 -291 40 -128 -192 -21 138 -44 115 -4 0 -92 -154 159 183 64
6810F4p4j55j7J27l9J39m6m9Q7J2j51P3j81L62%k5m8j30l6J10pL2o1m2L3p4Q9
$$ 64 -10 -165 -182 -55 -94 45 -1 -50 37 49 -102 -29 -210 152 152 127 79 -51 -87 23 16 48 -13 -55 -22 -96 -7
6837gr0J38q6K06k74J72j49O4K2J55j91j0J9m3R9o3K46k56j19L81l19K29n8m53
$$ -7 -97 41 -45 161 -113 59 -90 -26 -4 151 -40 -50 -31 -74 25 -38 208 -48 -167 214 -105 124 66 -387
6861c87M76k95j0M00m82L79Qj04j67K66k66J31j32K33p2n3K29j91K32j89r7J25
$$ -387 89 -206 -216 184 -298 81 89 -15 -182 84 -182 -51 -183 50 -22 -75 154 -37 195 6 -91 34
6883C4J28k30K35k78N4l4L38j29r7P8L3j54Q5k40K64n6k06K08J66n89L38M3r1
$$ 34 162 -68 167 -111 -57 -91 247 118 21 99 132 -22 63 -177 87 31 -175 33 199 -390 -52 -9 -100
6906a00P2m2K61r1l9J70k21J31k7l1m11L92j9L4j06j3q5J17M1K6p9j38q4P8J12
$$ -100 -28 -70 191 100 61 231 10 141 114 83 -328 64 45 79 -27 -40 -125 -8 33 59 -20 -158 -242 -164 -52
6931e2Rj55J70K89k32P2k2l7j44J07j25J1l06J96J32J21k3l60M15p1J18j54l24
$$ -52 -43 -198 -28 261 29 101 79 42 -102 5 -120 -109 -415 -219 -87 34 11 -349 66 -5 113 -41 -365
6954c65K20k7P4J98j86M5K5J50j25k3o9L1K05l79M56k25l6k9K28M8j74k16M9J06
$$ -365 -145 -172 -98 100 -86 -41 -16 134 9 -14 -83 -52 153 -226 230 5 -31 -60 168 216 42 -174 -125 -19
6978a9K99l85J47J18j77J95k36M1O3J02m4p2Q9k23kM7Q0q3K52l15J82j85M0j52
$$ -19 280 -105 42 160 -17 178 -58 -17 46 148 104 32 121 -102 -104 -57 23 -60 192 -123 59 -126 -86 -238
7002b38J73J88k65J23j3l5N0k9n7l7R9n5J32j73J81j27j3Q3P6k32l9J04J39l0
$$ -238 -65 123 -142 -19 -32 -67 -17 -46 -103 -140 -41 -96 36 -137 44 -83 -96 -13 63 -169 -208 -104 35 5
7026EQ5r2j0l0j6M9M1n8Qj64P2P6r4Q6J62n3J51j69j14l4R5j85L28k89k4J92Q2
$$ 5 90 -2 -12 -42 -58 -9 32 -26 -18 -182 -110 -34 -128 -42 120 67 218 49 -65 -99 -4 -189 139 -150 -174 18 100
7053A00k96J14J40j28L72l91n2L4Q9k1J6qK38j32K7P6k6J1j40k24K17L2j41J52
$$ 100 -196 -82 58 -70 302 -89 -141 -107 -18 -39 -23 -31 207 75 102 178 152 163 23 -201 16 48 -93 59
7077E9j02Q3k9k25J84J01p8J05Jl0n7k57K76j18R8J75j04j73jK5M0K49o1jk07
$$ 59 -43 40 11 -214 -30 71 -7 98 99 69 12 -245 31 -87 11 186 82 -91 -92 -67 -27 222 161 160 -47
7102d7J49Q7l53O8K27P7j03L2Q8l35l3J30L5j6K89m68M01k69Q8j65P8k3r7J1J50
$$ -47 102 189 -164 -96 131 208 105 137 225 -110 -143 -13 22 6 295 -173 228 -41 47 -118 -40 -63 -160 -149 1
7127AJ85m3j34l6o2lL73m89K80j27J10l7p7J48Rj44o8J4q6kK41j77k25P6J67P6
$$ 1 186 143 9 -27 -89 -92 281 -208 72 -55 55 18 -59 89 98 -46 -114 -100 -186 -188 53 -124 -349 -273 -106 -30
7153c0J59j55K48j99M30l93p2L9P4j79m5lJ75j94j16J9M48k65r9J18J92N2j57
$$ -30 129 -26 222 23 453 60 -12 27 101 -78 -123 -126 49 -145 -261 -242 206 -59 -158 -40 152 204 47
7176D7J36k29J9K79j55r2j34Q3J51j38j65n4J21P6j37J34J19k4M6p9l8J08p4N5
$$ 47 183 -46 -27 252 97 5 -129 -46 105 -33 -198 -252 -131 -55 -192 -58 61 37 83 4 -34 74 0 55
7200E5n0J55M52q34K35l9n3R9P0J67l60K02k4p5l9MK5J40k97K32j45J45J08l2
$$ 55 5 160 612 -222 13 -26 -79 20 90 257 -103 99 75 0 -39 -35 -10 130 -167 65 -80 65 173 141
7224A41JL9o8n2j96pK12k72J05J75r0M5M3J2k47O8L01n92K73J39K09k42L9k8Q2
$$ 141 142 181 113 61 -135 -142 70 -202 -97 78 -12 33 76 88 -159 -91 210 -382 -109 30 239 -3 36 8 90
7249I0Q5KJ2k23l7J32N4p0K5J12n5j7p3J93p7o0j01m0K1J07k19J62o3o7R5p6J3
$$ 90 175 177 189 -34 -71 61 115 45 70 182 127 110 37 230 153 93 -8 -48 -27 80 -139 23 -40 -107 -12 -88 -75
7276g5K70k94K1M6O8J21j35K23m2k72J92k14j4J54j57J45P0j31M1m1N0J5J15j11
$$ -75 195 -99 -78 -32 36 157 22 245 203 -69 123 -91 -105 49 -108 37 107 -24 17 -24 26 41 156 45
7300D5K6k73M8K89k37K14k41J25p7k13L25l1j2P7k92L21r4J24m5m9j11J30r8o2
$$ 45 71 -202 -154 135 -102 112 -129 -4 -81 -294 31 0 -12 65 -227 94 0 124 79 30 -81 49 -49 -111
7324a11K15l00J40n6lJ24j69k32J28L55j23M1K9o5N3J32k87KK06j9j46J29k34
$$ -111 104 -196 -56 -112 -115 9 -160 -392 -264 91 -32 9 38 -27 26 158 -129 -127 79 60 -86 43 -191
7347a91J07l9k2L32j91K6m7k21L47j35R5q9K69l28K18m7j55K91n07K18k9J19l
$$ -191 -84 -123 -145 187 -4 22 -25 -246 101 -34 61 -28 241 -87 131 84 -71 220 -287 -69 -98 21 18
7370A8R9m5m5j35N3Q3PM6Q4k08J18J49m20K01r7K67J05m30K31k3o2j3Q3J3J0K8
$$ 18 117 72 27 -108 -55 28 35 81 165 -43 75 224 -196 5 -92 175 280 -150 81 58 -4 -17 66 79 89 117
7396A17k59M3J53r5l6l2L16m63Q3o1p3J91L70k01Q5r1R4j70J0J10j79o4K68lj15
$$ 117 -142 -99 54 -41 -77 -109 207 -256 -173 -234 -307 -116 254 53 138 47 141 -29 -19 91 -88 -152 116 113 -2
7421bL12n46L15l43J49L8K79l08M4J01K71j31j01j15KL28n65L69r1l61K9K14l
$$ -2 310 -236 79 -264 -115 -77 202 -106 -62 39 310 179 78 -37 -35 293 -272 97 6 -355 -326 -112 -115
7444a15LK80k90K71p4k40R0K7K39J45l18K18l42N6J23m4K22l39K54j48J82j35
$$ -115 -112 168 -122 149 75 -165 -75 -48 191 336 18 236 -106 -50 73 29 251 -88 166 18 200 65
7466F5j5R2j39p8M9j7q7K73l9j79N7j3O4Pp6j61L20j37q4mJ16Lj10J47k23p4L32
$$ 65 50 142 3 -75 -26 -43 -130 143 104 -75 -18 -31 33 40 -36 -197 123 -14 -98 -102 14 17 -93 54 -169 -243 89
7493H9l7j48J50l60K37J64n0j3K30j82J28k31m0N9K28l3j64J27k91M68k15j40
$$ 89 52 -96 54 -306 -69 95 45 32 262 80 208 -23 -63 -4 224 191 27 154 -137 331 116 -24
7515b4M6j33J23N2p6J10k18R3j99N17o1j85R6k14l4L15l87L91k81J92q8l03L97
$$ -24 22 -111 12 64 -12 98 -120 -27 -226 291 230 45 141 -73 -107 208 -179 212 -69 123 35 -268 129
7538A29j21P0l4j61J94o1J2J20j31o8K32k52K03k05J73k57L49k97J90N1R1j92
$$ 129 8 78 44 -117 77 16 28 148 17 -51 181 -71 132 -73 100 -157 192 -105 85 136 227 35
7560C5K48l13j60J02O2J30k38K28O8j09J17j73J17k28n4L20l42K61j25J85O6N1
$$ 35 283 -30 -190 -88 -26 104 -134 94 162 53 170 -3 114 -114 -168 152 -190 71 -54 131 197 248
7582B48j88R7j08j51K96l28Q6J11k58J06J52j46k21L58k80J96qoK6j10j14L59
$$ 248 60 157 49 -102 194 -134 -48 63 -195 -89 63 -83 -304 54 -226 -30 -38 -44 -18 -128 -242 117
7604A17k85NR9J48l30K28j23J03J63k24l33M93j33Q4j2j32L09m7m1k14kK16k3
$$ 117 -168 -163 -64 84 -246 -18 -141 -38 125 -99 -432 61 -72 12 0 -132 177 130 89 -125 -127 89 66
7627F6k62L19o7P9nk27L6o4P6P5O9K18l32p5K88l25J22j42j6K79m5J33k89j2L75
$$ 66 -196 123 56 135 130 -97 -61 -125 -49 26 95 313 -19 -94 194 -131 -9 -151 -167 112 67 200 -89 -101 274
7652B74k14q8p7L93k21q5M5J36j33QJ76k61j3J5L14l98L01j5j12k48K51O4j12
$$ 274 60 -28 -105 288 67 -18 27 163 30 38 214 -47 -60 -45 269 -129 172 157 45 -203 48 112 0
7675@Q8N3j36rk86L50R0p8j06J21p3J99k38m3m4pL9K25r0L3j24R9J34m28M27j45
$$ 0 88 141 5 -4 -290 60 150 72 -34 87 14 213 -25 -68 -112 -119 -80 145 55 88 -36 63 197 -231 196 51
7701E1n4K7j98K33K9kj75K48j12J95l19J67q0j60P7J96j4k90K36J45k89J76o5
$$ 51 -3 24 -174 59 88 86 -89 159 47 242 -77 90 10 -150 -73 123 109 -181 55 200 -89 87 22
7724B2q6n5m1J40O6J08k05q6J09K7m00M54Rk11K52j26J74o1K5n4K14n05N4J09
$$ 22 -64 -119 -160 -20 46 154 -51 -137 -28 -1 -401 53 62 -149 103 -23 151 90 115 61 275 -230 -176 -67
7748f7J68l69N61l26j8j5rK16l95M64j71m9Qj95K74k1n1K3p5M6j9K6j12K44l27
$$ -67 101 -268 293 -33 -51 -66 -75 141 -254 210 39 -10 -2 -197 77 56 5 28 -47 -1 -20 6 -106 138 -189
7773a89K74J52j13j24K22k35J65l0j69M7Q1j54K7J38J20j99k7j01K1J79j19q8
$$ -189 85 237 124 0 222 -13 152 122 -47 0 81 -73 -46 92 212 13 -14 -115 -94 85 -34 -122
7795a22J41m7L9J6N6N1j7o8j31n8L2O6P2K09j02J4l9N3j36P6kl17K24K80j95J64
$$ -122 19 -28 11 27 83 134 117 49 -82 -140 -108 -42 30 239 137 151 112 165 29 105 103 -214 10 290 95 259
7821B59m17K85o8j52K02n1o2J94P1l83l2L6K42j17J91l24J27L9N7o5l3r5K0l6
$$ 259 -158 127 59 -93 109 58 -4 190 261 -122 -154 -118 124 7 198 -126 1 40 97 32 -1 -96 -76 -112
7845a12J15J8Q1q1J06j34j1o1K52O9k36r6Rj2R2j32P2N4J48K3k48j8P9J95k33
$$ -112 3 21 102 21 127 -7 -18 -79 173 242 6 -90 -81 -93 -1 -133 -61 -7 141 164 -84 -102 -23 172 -61
7870f1j3J38p1o3K04k02J36m4J07M4R8j14k10J08K3R8k58K62l07J76l8j40J47
$$ -61 -74 64 -7 -70 134 -68 68 24 131 175 273 159 -51 57 80 178 -80 182 -125 51 13 -127 20
7893B0j49J12n2n6K98m4j46O9j78L33K4l71N7J52p0j92m4L82k26K0P5J96k04J76
$$ 20 -129 -17 -69 -125 173 129 -17 52 -126 207 231 -140 -83 69 -1 -193 -237 145 -81 -61 14 210 6 182
7917A82m29K06K77j70K25m68L40m2k45K88o9j05n9J05K0mj40N9j9k78L91J78j97
$$ 182 -247 -41 236 66 291 -177 163 121 -124 164 95 -10 -69 36 56 52 -88 -29 -48 -326 65 243 46
7940D6rJ65o1k46j2J17J75j14j04n0j70M74k47j44J58K0R5j21m6Q6j51N9pQ7p0
$$ 46 37 202 141 -105 -117 0 175 61 -43 -93 -263 211 -36 -180 -22 -2 93 -28 -74 12 -139 -80 -87 0 -70
7965g0J56k89J87r0J91J93m05O0j14J78n5j16R5O2j24K54k7L7j63r7O1L80k41
$$ -70 86 -203 -16 -106 85 278 -127 -67 -181 -3 -58 -174 -79 -17 -141 113 86 123 -40 -137 -76 304 63
7988F3L19n31p7K60K75j01j45m0L2J7qJ47l19J51m9N8l52L11jm0J11j21p7K14
$$ 63 382 -149 -226 34 309 208 63 23 55 72 64 211 -108 43 -6 52 -300 11 10 -30 81 -40 -117 97
8012I7j53P8j08J00j98K72q6J65J0q1J31j66m7p5O9%J34k34o9J64q5J75k3k22
$$ 97 -56 22 -86 14 -184 88 2 167 177 96 227 61 14 -61 8 8 142 -92 -161 3 -82 93 70 -152
8036a52Q2K36j15J15m8j9K2j38q9K32n5j93J41Q2p5J40l69J72q0J08%j3O7onL1
$$ -152 -70 166 51 166 118 99 121 -17 -106 126 71 -122 19 101 26 166 -203 -31 -111 -3 -3 -16 51 45 40 71
8062G1L6l57L28J65m88L77j98J56k65J50R7l8N3m69M02M3j6N5l9M5n9r3l6J18
$$ 71 107 -250 78 243 -245 132 -66 90 -175 -25 72 34 87 -382 20 63 47 102 63 108 49 -44 -80 38
8086C8j79J17l14K46O9KJ32j59o3n3N9L29m87K53j2K2R9k37J59j91K62o8J24p6
$$ 38 -141 -24 -338 -92 -23 -21 111 -48 -111 -164 -105 224 -263 -10 -22 0 99 -138 21 -170 92 24 148 72
8110G2j08m7N2r0O1J2n4J99k87R4K18J58m03R1P0K1P0j04k01L29k62L00j13lj8
$$ 72 -36 -83 -31 -121 -60 -48 -102 97 -190 -96 122 280 -123 -32 38 59 129 25 -176 153 -109 191 78 75 57
8135E7k67L13o2q8Q4L6M6k46J18L74n62L89j61k5N9m6m2J51J36j9Kl12J9K74M3
$$ 57 -210 103 41 -47 37 73 119 -127 -9 365 -197 192 31 6 65 19 -23 128 264 245 247 -65 -46 228 271
8160B71j76Np8K79l50q7o3L18q6n6J95k0pk11j74J76P2N8P2J7O6k02L3j71J09
$$ 271 95 100 22 301 -49 -136 -199 119 33 -23 172 152 145 -66 -240 -64 8 66 138 155 221 19 52 -119 -10
8185a0N1O2L3K6l9N8
$$ -10 41 103 136 162 123 181
8191A81
$$ Imaginary data points
##PAGE= N=2
##DATA TABLE= (X++(I..I)), XYDATA
0@%%%%%%%%%%qJ6j6J6k4L2l2M0n6O4p2Q8j04J28j52J76k08K40k72L12l60M10m65
$$ 0 0 0 0 0 0 0 0 0 0 0 -8 8 -8 8 -16 16 -16 24 -32 32 -40 48 -56 72 -80 96 -112 128 -144 168 -192 218 -247
33b47N26n95O72p55Q45r45J054j173J305j448J604j775J961k162K386k631K895
$$ -247 279 -316 356 -399 446 -499 555 -618 687 -761 843 -932 1029 -1133 1253 -1378 1517
50A517l188L512l870M268m714N216n785O438p191Q076r137J0426j2032J4101j6875
$$ 1517 -1671 1841 -2029 2239 -2475 2741 -3044 3394 -3797 4279 -4858 5568 -6464 7637 -9238
65i238K0802k6815L7220n9990J89886p4523k47045L27293k22687R370J61078j34364
$$ -9238 11564 -15251 21969 -38021 151865 77342 -169703 157590 -65097 -55727 105351 -29013
77b9013L3842M3102o2591K2041k1493N0212j1185k6706J8966j5057j3924K3676
$$ -29013 4829 47931 -14660 7381 -14112 36100 24915 -1791 17175 2118 -11806 11870
89A1870M149j4207L743p746j9312N5595j1878k4357O589k0175K3655j9604Q16
$$ 11870 16019 1812 5555 -2191 -21503 34092 22214 -2143 4446 -15729 7926 -11678 -10862
102a0862L2204l4812M4854m5464l4562R7358o8554O962N2318q2696N2385q030
$$ -10862 21342 -13470 31384 -14080 -48642 48716 -19838 -12876 39442 -43254 9131 1101
114A101m2386O3346l3033O439J3695l0180L8135k5959j5403L2916j8684J450L884
$$ 1101 -41285 22061 -10972 -4533 9162 -21018 17117 -8842 -24245 8671 -10013 -8563 -4679
127d679n877J4550K146j8788J676J8107j6352P261M159k1377K6991r911j4755
$$ -4679 -10556 3994 6140 -12648 -10972 7135 -9217 -1956 2203 -19174 7817 -2094 -16849
140a6849J8567p275J7104j7496O36K5803m4968J9914R110k7667M2274k1669p055
$$ -16849 1718 -5557 11547 -5949 -5313 20490 -24478 -4564 4546 -23121 19153 -2516 -9571
153i571K6046k6784J1000p135J434K1786k8319Q461Q25p230J6176j5205J3856
$$ -9571 16475 -10309 691 -6444 -5010 16776 -11543 -3082 -2257 -9487 6689 -8516 5340
166E340O95j4074J6403j6527J72J6789j4411o136J2898J842j3899K1209k171k3066
$$ 5340 6035 -8039 8364 -8163 -7991 8798 -5613 -11749 1149 2991 -10908 10301 8130 -14936
180a4936K7829k1863o291L2799k6776J0212L536j6659J9053j4741J3133R159k0032
$$ -14936 12893 -8970 -15261 17538 -9238 974 4510 -12149 6904 -7837 5296 14455 -5577
193e577J4638j4766J99J2727j1352J0004o579O506Q44j1810K4570j8040l068J7798
$$ -5577 9061 -5705 -5506 7221 -4131 5873 -706 5800 6644 -5166 19404 1364 -1704 16094
207A6094k7429J4616J0784j6060R971J026p729k148J4476m026p673J7001k3179
$$ 16094 -11335 3281 14065 -1995 7976 9002 1273 -875 13601 9575 1902 18903 -4276
220d276J110J5210k1044K1558j627q781J3808k1287J0330K435j1016J5442j3907
$$ -4276 -3166 12044 -9000 12558 10931 2150 15958 -5329 5001 7436 -3580 11862 -2045
233b045M555J410r143J3838j1548Q177o03j3171J9176j4855P90Q683j7810J1700
$$ -2045 2510 3920 -5223 8615 -2933 5244 4641 -8530 10646 -4209 -3419 5264 -12546 -846
247h46l328j459J0570p878M881q943l6K055n976J2756j2075P062N035j9835K0117
$$ -846 -4174 -5633 4937 -2941 1940 -7003 -7039 -4984 -10960 1796 -10279 -3217 1818 -18017 2100
262B100r625n212K0732j9694P860K802j3601J0357o447P261M21l646J1195j2656
$$ 2100 -7525 -12737 7995 -11699 -3839 -1037 -14638 -4281 -10728 -3467 -3046 -6692 4503 -8153
276h153O925k165q727J5302j1576N389L744j0479J5392q410l51N628p474Q949
$$ -8153 -1228 -3393 -12120 3182 -8394 -3005 739 -9740 5652 -2758 -3109 2519 -4955 3994
290C994o120L896j043p547J3540j3798O935R341j3731J8118j1921o211J1979j7275
$$ 3994 -2126 1770 727 -6820 6720 -7078 -143 9198 -4533 13585 1664 -4547 7432 -9843
304i843J5140J327r998J3096j0512K531J387l125O628n629Q789j0645n655J4683
$$ -9843 5297 6624 -3374 9722 -790 1741 3128 3 6631 1002 9791 -854 -6509 8174
318H174j3599J0616L304j4803J4206n155j580L574n748M474p312N857j710l801
$$ 8174 -5425 5191 8495 -6308 7898 2743 1163 4737 -1011 3463 -3849 2008 298 -3503
332c503J3982j1193M219j153j0416J7703j1217N079N332k1990J8854m498q022
$$ -3503 10479 -714 3505 2352 -8064 9639 -1578 3501 8833 -13157 5697 1199 -6823
345f823J8458j1660K779L227p745J393k313J0390o203k466O635j2145J2111K077
$$ -6823 11635 -25 2754 5981 -1764 -371 -2684 7706 1503 -963 5672 -6473 5638 7715
359G715r975Q062p166K750J377l084M754o917P308m422m315J1450r093Q408k799
$$ 7715 -2260 5802 -1364 1386 2763 -321 4433 -2484 4824 402 -3913 7537 -1556 6852 4053
374D053j0929J1023j2274J1194M612j7630J7573j0536l598J6195j7202N797M978
$$ 4053 -6876 4147 -8127 3067 7679 -9951 7622 -2914 -6512 9683 -7519 -1722 3256
387C256p850L342n130N413k100m56M862j0309P548K591o271K530m287J326j769
$$ 3256 -4594 -1252 -6382 -969 -3069 -3525 1337 -8972 -1424 1167 -5104 -2574 -6861 -5535 -7304
402g304M999J169q038J0220p330k50Q426j3084J1085l024n458J1644j6928J2683
$$ -7304 -2305 -1136 -9174 1046 -6284 -6534 1892 -11192 -107 -3131 -8589 3055 -13873 -1190
416a190M396j5592J8074j2750l48J6803j7152N583J501o069P930m287O120k283
$$ -1190 3206 -12386 5688 -7062 -7410 9393 -7759 -2176 -675 -6744 1186 -3101 3019 736
430G36k561O712r440O025L269o651N995r44l729m27M815J540k265K692o604N350
$$ 736 -1825 4887 -4553 1472 4741 -1910 4085 3141 -588 -1015 3800 5340 3075 5767 -837 4513
446D513K428p361Q679r341M244O042j5713J7930l341j0615J6334j7781M673J0370
$$ 4513 6941 -420 8259 -1082 3162 9204 -6509 11421 8080 -2535 13799 -3982 691 11061
460A1061j4367J1312l557l933M043q329J1601l130n030P680r642M358J160p050
$$ 11061 -3306 8006 4449 516 4559 -3770 7831 4701 -329 7351 -2291 2067 3227 -3823
474c823P811p01l534J55o5K428O3k948j674M372m076k96N054p811R963m355j2019
$$ -3823 3988 3287 -247 -92 -157 2271 2334 -614 -2288 2084 -1992 -2288 2766 -5045 4918 563 -11456
491a1456J8389r174j375J0545j6008J0566o35j0052J2976o929N181j084r228J4297
$$ -11456 6933 -2241 -3616 6929 -9079 1487 852 -9200 3776 -3153 2028 944 -8284 6013
505F013r200m16P371r826R095m163n279J0650o068J188J6l613P966l531m685M685
$$ 6013 -3187 -3603 3768 -6058 3037 -1126 -6405 4245 -1823 -635 -619 -4232 3734 203 -4482 203
521B03M71l634K873k69m055J0189p370o586J3746r062J165L942q046J0262p019
$$ 203 674 -2960 -87 -356 -4411 5778 -1592 -8178 5568 -3494 -2329 1613 -6433 3829 -3190
536c190j393P543r215R537o657m822J5672j2526J766L263p332J0963r219J707
$$ -3190 -4583 2960 -6255 3282 -3375 -8197 7475 -5051 -3285 -22 -7354 3609 -5610 -3903
550c903P555r911P906n754l363J3129q891j337N662k878j218Q93J980q97L032
$$ -3903 3652 -6259 1647 -4107 -7470 5659 -3232 -4569 1093 -1785 -3003 -2110 -130 -1027 2005
565B005l612l599Q042k029q25r50j38N864q451M581L101o131R834r520j198J1232
$$ 2005 -1607 -5206 2836 807 -18 -968 -1106 4758 -3693 888 3989 -2142 7692 -1828 -3026 8206
581H206r514O130k426k362P850j1864R069K333q879J0428r889J991R301j1929
$$ 8206 -1308 4822 2396 34 7884 -3980 5089 7422 -1457 8971 -918 1073 10374 -1555
595a555N628J837l109J916m575L685N77J14o15n420O700p88l880K506j055J164
$$ -1555 4073 5910 2801 4717 142 3827 4404 4518 3903 -1517 5183 4395 515 3021 1966 3130
611C130k519J337k84j236M111o985L054L101p224N970m154J938K280r706J0052
$$ 3130 611 1948 1664 428 4539 -2446 608 3709 -3515 2455 -1699 239 2519 -7187 2865
626B865k935m969Q821j1282N866N746j1430N674k33r46J627l640L754k838K391
$$ 2865 -70 -5039 3782 -7500 -1634 4112 -7318 -1644 -1877 -2823 -1196 -4836 -1082 -3920 -1529
641a529J64n854P715k526k892M549l801J695m33l85L032k261P86j445J095J265
$$ -1529 -1365 -7219 496 -2030 -4922 -373 -4174 -2479 -2912 -3297 -265 -2526 -1740 -3185 -2090 -825
657h25j638J205j882M190j647n370Q345l999K67M593q613N763J311m118L972l970
$$ -825 -2463 -1258 -3140 1050 -597 -5967 2378 -1621 -1354 3239 -5374 389 1700 -2418 1554 -2416
673b416L189j76k994N551n282L268J426n189M876l630N23L528l344K774l611N64
$$ -2416 773 597 -2397 3154 -2128 1140 2566 -2623 2253 -1377 -854 2674 -670 2104 -1507 -943
689i43M147m559K895j108j309K485j912k92r05L955j017l640M773m283J792M463
$$ -943 3204 -1355 1540 432 -877 1608 -304 -596 -1501 2454 1437 -2203 2570 -1713 79 4542
705D542p161L514m73j617L068k389K276j739P33K333n965N153l89k454M881n676
$$ 4542 -2619 895 422 -1195 1873 -516 1760 21 754 3087 -2878 2275 1886 -568 4313 -1363
721a363J441J996j498L879m316J615J294l470M001k598n50K959j776Q5n21J779
$$ -1363 78 2074 576 4455 139 1754 3048 -422 3579 981 431 3390 1614 1699 1178 2957
737B957l83j133L032m937J543L496m642K894j057k213L225j200M51j321J414M13
$$ 2957 2574 1441 4473 -464 1079 4575 -67 2827 1770 -443 2782 1582 2033 712 2126 2539
753B539l491K639k848J24L962m161K278q89j661L428m241K153j38k848M262l865
$$ 2539 -952 1687 -1161 -1037 2925 -1236 1042 153 -1508 1920 -2321 -168 -306 -3154 1108 -2757
769b757k2J753j962J984j697J058p2j624L146m296L97K227l109L429j017j051
$$ -2757 -2779 -1026 -2988 -1004 -2701 -1643 -1715 -3339 -193 -4489 -4092 -1865 -4974 -1545 -2562 -3613
785c613K130j893J059r43J92Q90j212J867j990P17O87j470L884k767P01K993n220
$$ -3613 -1483 -3376 -2317 -3260 -3068 -2178 -3390 -1523 -3513 -2796 -2109 -3579 305 -2462 -1761 1232 -3988
802c988L271l60k460M159j917J136M41r03J829k498K825j118j769M366l344O81
$$ -3988 -717 -1077 -3537 622 -1295 -159 282 -621 1208 -1290 1535 417 -1352 3014 -330 351
818C51J796k214K043n00Q14K25j138J649k263K55R96j622J774J90O79j112K60
$$ 351 2147 -67 1976 1476 2290 2515 1377 3026 763 1018 2014 392 2166 2356 3035 1923 2183
835B183J547m689L769N10m868N517k525k164L499k175J066K42L02j18l063L329
$$ 2183 3730 -959 2810 3320 -1548 3969 1444 -720 2779 604 1670 1912 2214 2096 -967 2362
851B362k317j406M043l934K059K024l202K046q45n32n11q10K206j713Q74Q19k230
$$ 2362 45 -1361 2682 -1252 807 2831 -371 1675 830 298 -213 -1023 1183 -530 344 1163 -1067
868a067J226O95k61l83J098j65l460K902j093j761M610k775J096J259k037R97
$$ -1067 159 854 593 210 1308 1143 -2317 585 -508 -2269 2341 -434 662 1921 -116 881
884H81j490J742r94k666N074l383K16L397n961M337O19l591L897k678L02M96l403
$$ 881 -609 1133 139 -2527 2547 -836 -620 2777 -3184 1153 1772 -1819 2078 -600 -298 198 -3205
901c205L246q69l52K472k359J024N52k480L81J357j679j068K819j422r5P51k202
$$ -3205 41 -828 -1180 1292 -1067 -43 509 -1971 -1590 -233 -1912 -2980 -161 -1583 -1678 -927 -3129
918c129K065P0m24M22k807L903k767k619N063l222K347J629m787M634k228j631
$$ -3129 -1064 -994 -1418 -996 -3803 100 -2667 -5286 -223 -3445 -1098 531 -4256 378 -1850 -3481
934c481L476m458L833l29l172N687l144q56L034k417K471R8l065K047P22r98r18
$$ -3481 -5 -4463 -630 -959 -4131 1556 -1588 -2444 590 -1827 644 742 -2323 -276 446 -552 -1470
951a470P69K709l31q60R02j090j8J767l315N21N241m767J130K952l928K924j009
$$ -1470 -701 2008 1677 817 1719 629 611 2378 -937 -416 4825 58 1188 4140 212 3136 2127
968B127o23L621m710K517j1l507N712m907n70P890n621K24J145l596M015k523
$$ 2127 1504 5125 415 2932 2921 -586 5126 219 -351 7539 1918 2142 3287 -309 3706 1183
984A183k131L419p05J647j989j743L528k073o91J879l262J974J028m709K839J014
$$ 1183 -948 2471 1766 3413 1424 -319 3209 1136 445 2324 -938 1036 2064 -2645 194 1208
1000A208l692L954J03j604J353m001K277J210m587L572j714R50M359p718K220
$$ 1208 -2484 1470 1573 -31 1322 -2679 -402 808 -3779 -207 -1921 -971 3388 -4330 -2110
1015b110M172m806K616j885m49L814m483J151R6o08M249l662P01L425n272J428
$$ -2110 2062 -2744 -128 -2013 -2462 1352 -3131 -1980 -1884 -2492 1757 -1905 -1204 2221 -3051 -1623
1031a623J374k910L074j534m70M372k718j932K165r11K193j454l320M971j366
$$ -1623 -249 -3159 -85 -1619 -2089 2283 -435 -2367 -202 -1113 1080 -374 -3694 1277 -89
1046h9j901K493m103M043K593n648L760n08k328K273l858K994N18k885M636k968
$$ -89 -1990 503 -3600 443 3036 -2612 1148 640 -1688 585 -3273 -279 239 -2646 1990 -978
1062i78L62K296n657M836R62n084L288r58J43J473l970K128L049k015Q78j568
$$ -978 -616 1680 -3977 859 1821 -3263 25 -933 -790 683 -3287 -1159 1890 -125 753 -815
1078h15q17L067l443o87L971k745K023J318l711L502j130k813L984j751L9O57
$$ -815 -1632 1435 -2008 -2695 1276 -1469 554 1872 -1839 1663 533 -2280 1704 -47 -8 649
1094F49j673L715k688p85L547k623L372j110m433M710j032k267K026q42K351k40
$$ 649 -1024 2691 3 -782 2765 142 3514 2404 -2029 2681 1649 -618 1408 566 2917 2677
1110B677j483J477j679Q10M47k673L060M11l311K186Q24k163J215O65j214J836
$$ 2677 1194 2671 992 1802 2249 -424 2636 3047 -264 1922 2746 583 1798 2463 1249 3085
1126C085j503j324N66q37J397j594Q14K785l780J392M40l500L615j865j799L587
$$ 3085 1582 258 824 -13 1384 -210 604 3389 -391 1001 1441 -2059 1556 -309 -2108 1479
1142A479k230j25M83j237K133j877M71J831k846J168o63k292K246J52r61J182
$$ 1479 -751 -876 -393 -1630 503 -1374 -903 928 -1918 -750 -1413 -3705 -1459 -1307 -2268 -1086
1158a086Q38r89o27K98r08K62M18l87O4L24R12j900J482J197k393J899L00k193
$$ -1086 -248 -1237 -1864 -1566 -2474 -2212 -1794 -2181 -2117 -1793 -881 -2781 -1299 -102 -2495 -596 -296 -2489
1176b489J921j734l34K017q67J629m85K46J248l129J826L42k152K894q60r40J876
$$ -2489 -568 -2302 -2636 -619 -1486 143 -342 -96 1152 -1977 -151 191 -1961 933 73 -867 1009
1193A009m76r19M74J147p21o1Q13j465rQ07n44K94P95P83r20j49L84j770R38L34
$$ 1009 533 -386 88 1235 514 453 1266 -199 -208 599 55 349 1144 1927 1007 858 1242 -528 410 744
1213G44j018J639o27KM10j012Q95p93J073K76k107J826j180r89J718p18r7J691
$$ 744 -274 1365 738 740 1150 138 1033 240 1313 1589 -518 1308 128 -861 857 139 42 1733
1231A733j28r88m23M95j283J32J657j905J258J286j451m1N74l78o78J741l81j792
$$ 1733 1605 617 194 689 -594 -462 1195 -710 548 1834 383 342 916 538 -140 1601 1220 -572
1249e72J455n71j097J708k70J0J380m91o64j298J089k34q91K061j031m41K003
$$ -572 883 312 -785 923 653 663 2043 1552 888 -410 679 445 -446 1615 584 143 2146
1266B146j108j301J068P0m65mP11k073N40J412j910R6J649m12k38K67r34j271
$$ 2146 1038 -263 805 875 410 406 1117 -956 -416 996 -914 -818 831 419 181 448 -486 -1757
1284a757P20Q22j488Q57O10m75L78q56J12m11M04O48j447Q2M59p05N13j18n5K79
$$ -1757 -1037 -215 -1703 -846 -236 -711 -333 -1189 -1077 -1488 -1084 -436 -1883 -1801 -1342 -2047 -1534 -1652 -1707 -1428
1304a428O69J2j684P14k96p53J807q84L87Q90n62L36o36j45J023m78K95k64k94
$$ -1428 -759 -747 -2431 -1717 -2013 -2766 -959 -1843 -1456 -566 -1128 -792 -1428 -1573 -550 -1028 -733 -997 -1291
1323a291J085l64J04J48K45P35R0k61j041q1J286o03L89L47P7N98k40k48o59P52
$$ -1291 -206 -570 -466 -318 -73 662 752 491 -550 -631 655 52 441 788 865 1463 1223 975 316 1068
1343A068K60k52Q93j400K08J166j160Q36p8l99J383j057O2q29q58K602j711k87
$$ 1068 1328 1076 1969 569 777 1943 783 1619 1541 1142 2525 1468 1530 701 -157 2445 734 447
1361D47J912j476Q36L77k018L50R44q73k72Q28l66j006R98P9j220J502N4j369
$$ 447 2359 883 1719 2096 78 428 1372 499 227 1055 689 -317 681 760 -460 1042 1096 -273
1379b73N90L27k344J126J595j972J137N30j352J390j546j18R35r09J714j832k34
$$ -273 317 644 -1700 -574 1021 -951 186 716 -636 754 -792 -910 25 -884 830 -1002 -1236
1396a236K112k257P87J093j402J785r96o76J040j826J442r35L52K159k570R61
$$ -1236 876 -1381 -594 499 -903 882 -114 -790 250 -1576 -134 -1069 -717 1442 -1128 -167
1412a67J520k759J242J81j783K164j24k005J731K79j069N98n40N10P87j519P48
$$ -167 1353 -1406 -164 17 -1766 398 274 -1731 0 279 -790 -192 -732 -222 565 -954 -206
1429b06o87n63J771k146J718J398k768J437m21q35J316k193J320J082j792J851
$$ -206 -893 -1456 315 -1831 -113 1285 -1483 -46 -467 -1302 14 -2179 -859 223 -1569 282
1445B82k128P12K230l112J192R80j441R84j178L5J377j238R06Q1j89J452k128
$$ 282 -1846 -1134 1096 -2016 -824 156 -1285 -301 -1479 -1444 -67 -1305 -399 -318 -507 945 -1183
1462a183l4K367k351j37K241j450Q80O02k378K215O88j991J270o05R80Qk104K397
$$ -1183 -1217 1150 -1201 -1338 903 -547 333 935 -1443 772 1460 -531 739 134 1114 1122 -982 1415
1480A415p92lJ591k615K665N98l666K911p11q30J522k186J876N38j702J071j056
$$ 1415 623 620 2211 -404 2261 2859 -807 2104 1393 563 2085 -101 1775 2313 611 1682 626
1497F26J081Q28l090K092J081k588J088J80r45J498q45j027J963q76j264Q1M30
$$ 626 1707 2535 -555 1537 2618 30 1118 1298 353 1851 1006 -21 1942 1066 -198 -117 313
1514C13J157k332Q41J397k628K179q92k839M537j421k488K788j453k03K07j140
$$ 313 1470 -862 -21 1376 -1252 927 35 -2804 1733 312 -2176 612 -841 -1044 -837 -1977
1530a977K166j164K88N12k031K569j147k641L541n14j795J668p95N72N66j483
$$ -1977 189 -975 -687 -175 -2206 363 -784 -3425 116 -398 -2193 -525 -1320 -748 -182 -1665
1546a665J62J052J63m34j262J489N22j718R54M63j133J954j252n36K074k264K04
$$ -1665 -1503 -451 -288 -722 -1984 -495 27 -1691 -737 -274 -1407 547 -705 -1241 833 -1431 -1227
1563a227J550q59J069j697L55K066k239J156l82o15K376k232k47J727j182R18
$$ -1227 323 -536 533 -1164 -809 1257 -982 174 -208 -823 1553 -679 -926 801 -381 537
1579E37l92p36J760r52l93N72j005J067l64n00R58k52r88J213o96q0O12j019Q55
$$ 537 145 -591 1169 217 -176 396 -609 458 94 -406 552 300 -688 525 -171 -251 361 -658 197
1598A97P44j619O38k25O85O89k187J514N84j639J755j633k8K215k059Q40J24n82
$$ 197 941 -678 -40 -265 420 1109 -1078 436 1020 -619 1136 -497 -525 1690 -369 471 595 13
1616A3Q56r59Q30L10j578J710k91q42J248j135M8J306o53o76N88M26n87K17k54
$$ 13 869 -90 740 1050 -528 1182 891 49 1297 162 210 1516 863 187 775 1201 614 831 577
1635E77PM95m8j61n01P51N7j350J213k07q91J616j299j63P86p44L87k81K67j92
$$ 577 584 1079 1031 870 369 1120 1177 -173 1040 833 -58 1558 259 96 882 138 525 244 511 319
1655C19o49J258q27j018J730j394K30P62j499O67M29p43k68K37J97l81J30J32
$$ 319 -330 928 101 -917 813 -581 -351 411 -1088 -421 8 -735 -1003 -766 -569 -950 -820 -688
1673f88o25K97K31n17NN23m56k94Q37n01n10J330r78j35O37m69L59n4n2p7k71
$$ -688 -1313 -1016 -785 -1302 -1297 -774 -1230 -1524 -687 -1188 -1698 -368 -1346 -1481 -844 -1313 -954 -1008 -1060 -1137 -1408
1694a408J057p79J89R01j121N52M57p67Q44k01J16k34J22O51p84L78K54m40M84
$$ -1408 -351 -1130 -941 -40 -1161 -609 -152 -919 -75 -276 -160 -394 -272 379 -405 -27 227 -213 271
1713B71J04J41l41K25K95o63Q54k44m38P63o91J72L72k23L58k53J54m1m63R27
$$ 271 375 516 175 400 695 32 886 642 204 967 276 448 820 597 955 702 856 815 352 1279
1733A279p01j30O33p30j4J98N2L1q2L45o08j30Q35r01J23M62m02q8J75Q1k46k7
$$ 1279 578 448 1081 351 337 535 587 618 536 881 273 143 978 77 200 662 260 172 347 428 182 155
1755A55L56q87N11K24p22O73k27m74M10P33n86k02N45l12n93Q49l38k52O55m41
$$ 155 511 -376 135 359 -363 310 83 -391 19 752 166 -36 509 197 -396 453 115 -137 518 77
1775G7k58L14L55k76O7M82j147N12P04j425M10O07o85L22L59n7o79O44M1j242
$$ 77 -181 133 488 212 279 761 -386 126 830 -595 -185 422 -263 59 418 361 -318 326 367 -875
1795h75R15J11r00J088m39n35P30k39kj64J51l99r9N47n67j35O12j32l97Q7M38
$$ -875 40 151 -749 339 -100 -635 95 -144 -146 -310 -159 -558 -657 -110 -677 -812 -200 -332 -729 -642 -204
1816b04q26M61L28j271L71Q22j205Q10M6l16L91k19J84m61N64P7r59N76M0n59
$$ -204 -1030 -569 -241 -1512 -1141 -319 -1524 -714 -668 -984 -593 -812 -628 -1089 -525 -448 -1407 -831 -791 -1350
1836a350J125k58o6L68k9k85j62N44j22m14Q93Pp70P35L66o87O59L35j020O53
$$ -1350 -225 -483 -549 -181 -210 -495 -657 -113 -235 -649 244 251 -519 216 582 -105 554 889 -131 522
1856E22L74r49P87l85N26M34p45O31m96J57N99j481R95L39r90J075k01k53O30
$$ 522 896 -53 734 349 875 1309 564 1195 699 856 1455 -26 969 1308 318 1393 1192 939 1569
1875A569o98J3J65j83J60q53J034j01j332J049M93r31O35p65l27R58q17m79P58
$$ 1569 871 884 1049 866 1026 173 1207 1106 -226 823 1316 385 1020 255 -72 886 69 -410 348
1894C48M7N56q87k31O92o63R3O71j821J625k28j676J550kj159J377n93J88J88
$$ 348 395 951 64 -167 525 -138 -45 626 -1195 430 202 -1474 76 74 -1085 292 -301 -113 75
1913G5j266Q63m34K23L0j227J805K08j609J388n89p6O77j504J009M36o08l3n78
$$ 75 -1191 -328 -762 -539 -509 -1736 69 277 -1332 56 -533 -609 68 -1436 -427 9 -599 -632 -1210
1932a210J064L37j265J130K52j147J156q25p73J829j398L7J751j185RJ14m95J208
$$ -1210 -146 191 -1074 56 308 -839 317 -508 -1281 548 -850 -813 938 -247 -238 -124 -619 589
1950E89j163J0Q13j175J229o91j277K800j245p39J603j515Q88l72j285J515n36
$$ 589 -574 -564 249 -926 303 -388 -1665 1135 -110 -849 754 -761 127 -245 -1530 -15 -551
1967e51K26M48p69J359m72j680J852l27p99O74p10N63Q38j711Q58N54l44N83j338
$$ -551 -325 123 -646 713 241 -1439 413 86 -713 -39 -749 -186 652 -1059 -201 353 9 592 -746
1986g46Q77Q62j815P14K31m81J753j477j33J799j359J70R6l41R09q19p7J255j250
$$ -746 131 993 -822 -108 123 -358 1395 -82 -215 1584 225 395 491 150 1059 240 163 1418 168
2005A68N67J4o18J973j322n44J344j025j69L89n41J292l17o54M43o30P90l75j147
$$ 168 735 749 131 2104 782 238 1582 557 388 777 236 1528 1211 557 1000 370 1160 785 -362
2024c62J352P7j231J334r62n7J001j458O52P08j287L17l78K27L54j554J393K39
$$ -362 990 1067 -164 1170 208 151 1152 -306 346 1054 -233 84 -294 -67 287 -1267 126 365
2042C65j063J361j404J6J149j625K63R63p12J88j94k17O17o32O33l60m25R63j133
$$ 365 -698 663 -741 -725 424 -1201 -938 25 -687 -499 -693 -910 -293 -925 -292 -652 -1077 -114 -1247
2061a247k71J090r10L27R12n44L14K15j161P13j29k04J06j53J180p39n21J159
$$ -1247 -1518 -428 -1338 -1011 -99 -643 -329 -114 -1275 -562 -691 -895 -789 -942 238 -501 -1022 137
2079A37m93k07J033j159L91N14j121P95J96k01L90n13P51l27l24M96n86J44P20
$$ 137 -356 -563 470 -689 -298 216 -905 -110 86 -115 275 -238 513 186 -138 358 -228 -84 636
2098F36o11K81N14q30p9N46n39P64L8n26K17l02L1o5m4R15o93O5N02o30n9K16
$$ 636 25 306 820 -10 -89 457 -82 682 720 194 411 109 140 75 31 946 253 318 820 190 131 347
2120C47q17O42J78rLj79K18l82j79Q00k6m77L15n65j10P12j92l86R86m45l18K05
$$ 347 -470 172 350 341 344 165 383 1 -178 622 596 119 434 -131 -241 471 279 -107 879 434 116 321
2142C21j3k33l21M88l38K55O23l58j49N20m04l97P01m60O3L20k94n14M73n0r8
$$ 321 308 75 -246 242 -96 159 782 424 275 795 391 -6 695 235 298 618 324 -190 283 233 135
2163A35M50L50o77k56L45n85K61L26n04Q7Q22p66m08O57L6m67K38r8m67L05n5
$$ 135 585 935 258 2 347 -238 23 349 -155 -68 754 -12 -420 237 273 -194 44 -54 -521 -216 -271
2184b71l70J34K70NJ1J44o62r5K32j21k68N52j46j63L33k13n21M27K46l46P9J46
$$ -271 -641 -507 -237 -232 -221 -77 -739 -834 -602 -723 -991 -439 -585 -748 -415 -628 -1149 -722 -476 -822 -743 -597
2206e97k32J54L1n98L28Q77l14k66M26k98l76O08k55KO65j21j43Q8j3j53N30j10
$$ -597 -829 -675 -644 -1242 -914 -37 -351 -617 -191 -489 -865 -257 -512 -510 155 34 -109 -21 -34 -187 343 233
2228B33n98M05K65j93L8K75k03j22M49J91j55j53K88o76J70K78k70O09J57k29
$$ 233 -365 40 305 112 150 425 222 100 549 740 585 432 720 44 214 492 222 831 988 759
2248G59k94J60j05r8N28l03k23K33k7k81K04L81k36O0k44k61J64J52l75k20M78
$$ 759 465 625 520 422 950 647 424 657 630 349 553 934 698 758 514 253 417 569 194 -26 452
2269D52k9O3K1j78l35K73k25l26N26j0k51K1P4j68j76L40J13m87M98k29m02M68
$$ 452 423 486 507 329 -6 267 42 -284 242 232 -19 2 76 -92 -268 72 185 -302 196 -33 -435 33
2291C3k12jL08j28nq1rk21k18O02j2l41J06K17j71J06j67j85O72k04j98N6j74
$$ 33 -179 -180 128 0 -5 -86 -95 -316 -534 68 56 -285 -179 38 -133 -27 -194 -379 293 89 -109 -53 -227
2314b27k70M02l4L01j61Q8K5n68K47q6l94O96k55k37O14k79j93l0j01J74j17L04
$$ -227 -497 -95 -129 172 11 99 124 -444 -197 -283 -677 19 -236 -473 141 -138 -331 -361 -462 -288 -405 -101
2336a01l03l00N69l91m31R37r0m82M68k17l11L82j49o5L8K38J6l10L60j41m84
$$ -101 -404 -704 -135 -526 -957 -20 -110 -592 -124 -341 -652 -270 -419 -484 -446 -208 -192 -502 -142 -283 -767
2357g67Q81j73m47P82q14J13P66p90J70N58j93N18n76K46k40k14N76k18l44J145
$$ -767 114 -59 -506 276 -538 -425 341 -449 -279 279 86 604 28 274 34 -180 396 178 -166 979
2377I79o57j46M70l64M72m72K23K81j30j35K3j60P67o13l02R27l67n96Q18q43
$$ 979 322 176 646 282 754 282 505 786 656 521 544 384 1151 538 236 1163 796 200 1018 175
2397A75L18N12n30L01K27m15J13o84Q25l33o79R38n69m16Q70j039L87O66r24L82
$$ 175 493 1005 475 776 1003 588 701 17 842 509 -170 768 199 -217 653 -386 1 667 -257 125
2417A25P1j61o6n78K66L35o99N23l31P2O32r26k5Q46o19k10N10k71j34O9j93M68
$$ 125 196 35 -31 -609 -343 -8 -707 -184 -515 -443 189 -737 -762 84 -535 -745 -235 -506 -640 -571 -764 -296
2439b96k75K80l7l69R44r03o62J270n20O8P59j111O51J28p56N33j00K84j19l79
$$ -296 -571 -291 -328 -697 247 -656 -1318 -48 -568 -500 259 -852 -201 -73 -829 -296 -396 -112 -231 -610
2459f10P79m13k26P48o94O06L39j288Q18J22n94K69p3J46K05k58J34Mj0L20p65
$$ -610 169 -244 -470 278 -416 190 529 -759 59 181 -413 -144 -217 -71 134 -124 10 14 4 324 -441
2480d41L08Q20j046j2R01q13N99l71l26J059p49P2j06k55N94m34q5J080j068L12
$$ -441 -133 687 -359 -371 530 -283 316 -55 -381 678 -71 1 -105 -360 234 -200 -285 795 -273 39
2500C9M77j128P56O0l59K19j3k3j66J09M92n35O2O22m07K90j85n03L47M54o40
$$ 39 516 -612 144 204 -155 64 51 28 -138 -29 463 -72 -10 612 205 495 310 -193 154 608 -32
2521c2K6O31k81K87m73J67K82l62L73j80l52O87p40L52M84p20K85j7j19O29p50
$$ -32 -6 625 344 631 158 325 607 245 618 438 86 773 33 385 869 149 434 417 298 927 177
2542A77j31K21j06O08r31J85R19r64K2K7l67N77j90l44L49j2j18j51K70j06k44
$$ 177 46 267 161 769 -162 23 942 -22 0 27 -340 237 47 -297 52 40 -78 -229 41 -65 -309
2563c09J96q5q8j93K34n33N60J97r74M28O15o99J18m35L39L98j98O7l36J94M48
$$ -309 -113 -198 -286 -479 -245 -778 -218 -21 -995 -567 48 -651 -533 -968 -629 -231 -429 -362 -698 -504 -56
2584e6j007Q98R3r74O08N8m14K10J45o0L19k32K31k47L80j21m28K15L43p6Q2J91
$$ -56 -1063 -165 -72 -1046 -438 -380 -794 -584 -439 -499 -180 -412 -181 -428 -48 -169 -597 -382 -39 -115 -33 158
2606A58l05K45J50n57L28K92l48L78j92k9J89o8L63m20R5K36n07K81K90l66M7
$$ 158 -147 98 248 -309 19 311 -37 341 149 120 309 241 604 184 279 515 8 289 579 213 260
2627B60RK8N1j03J83j03Q9r8l01M18j65j96J3K92k26OK47k06k61N51o05K34O0
$$ 260 269 297 348 245 428 325 414 316 15 433 268 72 85 377 151 157 404 198 -63 488 -117 117 177
2650A77N4k81J81L26l48L6J48j54j34j0l46M37N5k14LJ23J72r0J40q0l38L25j0
$$ 177 231 -50 131 457 109 145 293 139 5 -5 -351 86 141 -73 -70 53 225 135 275 195 -143 182 172
2673A72m91N93j40m4J91q0j62j86L35j84j94L82l12j20L46jm30L59N0j33k2M10
$$ 172 -319 274 134 90 281 201 39 -147 188 4 -190 192 -120 -240 106 105 -325 34 84 -49 -71 339
2695C39p47J98J50o25P05K13n23J46M4n0j51J3j7k81O45l25l35O63l87l45K00
$$ 339 -408 -210 -60 -685 20 233 -290 -144 -100 -150 -301 -288 -305 -586 59 -266 -601 62 -325 -670 -470
2716d70J4M6l8K34j26l59M77n21J81L23j61r5k03N34m38K67K39k65J59N8o34K73
$$ -470 -456 -410 -448 -214 -340 -699 -222 -743 -562 -239 -400 -495 -698 -164 -602 -335 -96 -361 -202 -144 -778 -505
2738e05L98q1k64N78j51k78K61J88l50M49q5j04L84m05p1L24n9Q9j64M06k03q9
$$ -505 -107 -188 -452 126 -25 -303 -42 146 -204 245 160 56 440 35 -36 288 229 318 154 560 357 268
2760B68K61l99j8L56m8m3J08j27J50l03M71k85J34J96m46J32O7k22O8k69J14O4
$$ 268 529 130 112 468 420 377 485 358 508 205 676 391 525 721 275 407 474 252 320 51 165 229
2782B29M08l08mL05l99J24k47R6M6k76J50R9l02L14l54L2J22k63L54p4j01k29
$$ 229 637 329 325 630 231 355 108 204 250 -26 124 223 -79 235 -119 -87 35 -228 126 52 -49 -278
2804b78nJ74j4j55M95o19j1M22k81j3L35j41j62R5K8l20L48K61l28o8j20j00J05
$$ -278 -283 -109 -123 -278 217 -402 -413 9 -272 -285 50 -91 -253 -158 -130 -450 -102 159 -169 -237 -357 -457 -352
2827c52N30r6n08N58l64R3N38p29p8N42m17%L82j40k0j54M85m26j07N27n83p4
$$ -352 178 82 -426 132 -232 -139 399 -330 -408 134 -283 -283 99 -41 -61 -215 270 -156 -263 264 -319 -393
2849c93P06o07R4K03j55J74l46J01M1j50M40m26L39K46n06q3O34l76k7J37p82
$$ -393 313 -294 -200 3 -152 22 -324 -223 -182 -332 108 -318 21 267 -239 -322 312 -64 -91 46 -736
2870g36P68q1l03O3J11M10r8n05N26k88l49P98o54J58K95o59O11L39o71N30k36
$$ -736 32 -49 -352 -289 -178 232 134 -371 155 -133 -482 316 -338 -180 115 -544 67 406 -265 265 29
2891B9K0K16m75N90k72j15O00p10N21K88p43L05K37j29J63k14MJ55l8J00j77n3
$$ 29 49 265 -210 380 108 -7 593 -117 404 692 -51 254 491 362 525 311 315 470 432 532 355 302
2913C02J32k96N6O99m72j76L35m33L40l28l69R16l96r7j12q9M63p17k7N75o60
$$ 302 434 138 194 893 421 245 580 147 487 159 -210 706 310 213 101 12 475 -242 -269 306 -354
2934c54L11L69o99P39k57n40N53p4j54n7j03K28k75qo6o2M34k87o36L28O84p13
$$ -354 -43 326 -373 366 109 -431 122 48 -106 -163 -266 -38 -313 -321 -387 -449 -15 -302 -938 -610 74 -639
2956f39J22K10l01L01l22J58K54k04K75l39k3R07j108P0Q57o45L11j21l77O73
$$ -639 -517 -307 -608 -307 -629 -471 -217 -421 -146 -485 -508 399 -709 -639 218 -427 -116 -237 -614 59
2976E9j48m83L54q4J09l86L34N30n07L20R0k54K17j17n59N89L67o31n1L24j3J80
$$ 59 -89 -572 -218 -302 -193 -579 -245 285 -222 98 188 -66 151 34 -525 64 431 -200 -251 73 60 240
2998B40l95L64q5J37N0m93L65L73o69K27J28j96N62p21K03Q0K1p8O5k20L57o48
$$ 240 -155 209 124 261 311 -182 183 556 -113 114 242 46 608 -113 90 170 191 113 178 -42 315 -333
3020c33N78Ko09M37n6Q9J71k08k39M09o0k7k86J36L02p6J8J03j65N9j38l77L94
$$ -333 245 247 -362 75 19 108 279 71 -168 241 181 154 -132 4 306 230 248 351 186 245 107 -270 124
3043A24J47m28N26j95j5K93k47N0R0k52J81k70K68Q1l30K73j4q2l9J49l55J20
$$ 124 271 -157 369 174 159 452 205 255 345 93 274 4 272 353 23 296 282 200 161 310 -45 75
3065G5R9j47J69K27n02KL76J03m64J96o9j24j8Jj73K36J71q35M25K28k76k83L96
$$ 75 174 27 196 423 -79 -77 299 402 -62 134 65 -59 -77 -76 -249 -13 158 -677 -252 -24 -300 -583 -187
3088a87N8m30K06Q8l22K56j59J05M02k36l78J76r5J28j18Q6K36k80N09k18j87
$$ -187 -129 -559 -353 -265 -587 -331 -490 -385 17 -219 -597 -421 -516 -388 -506 -420 -184 -464 45 -173 -360
3109c60J69J0l6nRK3k02R8j10M51O4j87J30ol03K08J3p6j07L71o4L6J45k03rQ6
$$ -360 -191 -181 -217 -222 -213 -190 -392 -294 -404 47 111 -76 54 48 -255 -47 -34 -110 -217 154 90 126 271 68 59 145
3135A45J86m54L81n5K55j70Rl98L91L87l83j08J09ljQ2k70m6K20K51m38J24K16
$$ 145 331 -123 258 203 458 288 297 -101 290 677 294 186 295 292 291 373 103 57 277 528 90 214 430
3158D30k00L9j04j2j08J82k11J97RJ22l38J1O9k45K24j48N7r8R8K10j51R2j39
$$ 430 230 269 165 153 45 227 16 213 222 344 6 17 86 -159 65 -83 -26 -124 -26 184 33 125 -14
3181a4l56L91j40m3L13k29M4O5Q3j84j56M53k00P6j95o7K14k53q4J15o9K75R8
$$ -14 -370 21 -119 -162 151 -78 -34 31 114 -70 -226 227 27 103 -92 -159 55 -198 -282 -167 -236 39 137
3204A37j41j0k58K88q4k1K54k91K12j64k3j13k2K87n7l29L12K0j65J75k5m15L02
$$ 137 -4 -14 -272 16 -68 -89 165 -126 86 -78 -101 -214 -236 51 -6 -335 -23 -3 -168 7 -18 -433 -131
$$ [...]
8191H6
##END NTUPLES=NMR FID
##END=
