##TITLE=1H_SL73(10-6)-f4
 CDCl3, 8 sc, 
 11.6.2020
##JCAMPDX= 6.0         $$ Bruker NMR JCAMP-DX V2.0
##DATA TYPE= NMR FID
##DATA CLASS= NTUPLES
##ORIGIN= UXNMR, Bruker Analytische Messtechnik GmbH
##OWNER= root
$$ XWIN-NMR		Version 3.5
$$ Thu Jun 11 10:21:13 2020 Russian Standard Time (UT+4h)  she@DPX200
##.OBSERVE FREQUENCY= 200.1315
##.OBSERVE NUCLEUS= ^1H
##.DELAY= (6, 6)
##.ACQUISITION MODE= SIMULTANEOUS
##.ACQUISITION SCHEME= undefined
##.AVERAGES= 8
##.DIGITISER RES= 18
##SPECTROMETER/DATA SYSTEM= spect
##.PULSE SEQUENCE= zg30
##.SOLVENT NAME= D2O
##.SHIFT REFERENCE= (INTERNAL, D2O, 0, 15.7039)
##AUDIT TRAIL= $$ (NUMBER, WHEN, WHO, WHERE, WHAT)
$$ ##TITLE= Audit trail, XWIN-NMR		Version 3.5
$$ ##JCAMPDX= 5.01
$$ ##ORIGIN= Bruker BioSpin GmbH
$$ ##OWNER= she
$$ F:/spectra/data/she/nmr/H-F/1/audita.txt
$$ ##AUDIT TRAIL=  $$ (NUMBER, WHEN, WHO, WHERE, WHAT)
(   1,<2020-06-11 10:20:21.71 +0400>,<she>,<DPX200>,
      <created by zg, POWCHK disabled, PULCHK disabled
       configuration hash MD5:
       00 E9 B6 7A A2 85 ED C7 34 08 36 98 17 FE 4E 26
       data hash MD5: 16K
       54 3A DD 19 66 11 09 19 EB BF AD 82 92 12 2A E2>)
$$ ##END=
$$ 
$$ hash MD5
$$ 48 73 47 7A DB 11 E2 1D 1D 5B 89 77 5F 70 A3 BC
##$RELAX= 
##$RELAX= 
##$RELAX= 
##$RELAX= 
##$RELAX= 
##$RELAX= 
$$ Bruker specific parameters
$$ --------------------------
##$DU= <F:/spectra>
##$EXPNO= 1
##$NAME= <H-F>
##$PROCNO= 1
##$TYPE= <nmr>
##$USER= <she>
##$AMP= (0..31)
100 100 100 100 100 100 100 100 100 100 100 100 100 100 100 100 100 100 
100 100 100 100 100 100 100 100 100 100 100 100 100 100 
##$AQSEQ= 0
##$AQ_mod= 1
##$AUNM= <au_zg>
##$AUTOPOS= <>
##$BF1= 200.13
##$BF2= 200.13
##$BF3= 200.13
##$BF4= 200.13
##$BF5= 200.13
##$BF6= 200.13
##$BF7= 200.13
##$BF8= 200.13
##$BYTORDA= 1
##$CFDGTYP= 0
##$CFRGTYP= 5
##$CHEMSTR= <none>
##$CNST= (0..31)
1 1 145 1 1 1 1 1 1 1 1 1 1 1 1 1 1 1 1 1 1 1 1 1 1 1 1 1 1 1 1 1 
##$CPDPRG= <>
##$CPDPRG1= <>
##$CPDPRG2= <>
##$CPDPRG3= <>
##$CPDPRG4= <mlev>
##$CPDPRG5= <mlev>
##$CPDPRG6= <mlev>
##$CPDPRG7= <mlev>
##$CPDPRG8= <mlev>
##$CPDPRGB= <>
##$CPDPRGT= <>
##$D= (0..31)
0 1.2 0 0 0 0 0 0 0 0.06 0 0.03 0 0 0 0 0.0002 0 0 0 0 0 0 0 0 0 0 0 0 
0 0 0 
##$DATE= 1591856421
##$DBL= (0..7)
120 120 120 120 120 120 120 120 
##$DBP= (0..7)
150 150 150 150 150 150 150 150 
##$DBP07= 0
##$DBPNAM0= <>
##$DBPNAM1= <>
##$DBPNAM2= <>
##$DBPNAM3= <>
##$DBPNAM4= <>
##$DBPNAM5= <>
##$DBPNAM6= <>
##$DBPNAM7= <>
##$DBPOAL= (0..7)
0.5 0.5 0.5 0.5 0.5 0.5 0.5 0.5 
##$DBPOFFS= (0..7)
0 0 0 0 0 0 0 0 
##$DE= 6
##$DECBNUC= <off>
##$DECIM= 24
##$DECNUC= <off>
##$DECSTAT= 4
##$DIGMOD= 1
##$DIGTYP= 9
##$DL= (0..7)
0 120 120 120 120 120 120 120 
##$DP= (0..7)
150 150 150 150 150 150 150 150 
##$DP07= 0
##$DPNAME0= <>
##$DPNAME1= <>
##$DPNAME2= <>
##$DPNAME3= <>
##$DPNAME4= <>
##$DPNAME5= <>
##$DPNAME6= <>
##$DPNAME7= <>
##$DPOAL= (0..7)
0.5 0.5 0.5 0.5 0.5 0.5 0.5 0.5 
##$DPOFFS= (0..7)
0 0 0 0 0 0 0 0 
##$DQDMODE= 0
##$DR= 18
##$DS= 0
##$DSLIST= <SSSSSSSSSSSSSSS>
$$ [...]
##$SUBNAM2= <"">
##$SUBNAM3= <"">
##$SUBNAM4= <"">
##$SUBNAM5= <"">
##$SUBNAM6= <"">
##$SUBNAM7= <"">
##$SUBNAM8= <"">
##$SUBNAM9= <"">
##$SW= 24.9337058887773
##$SWIBOX= (0..15)
0 0 2 0 0 0 0 0 0 0 0 0 0 0 0 0 
##$SW_h= 4990.01996007984
##$TD= 16384
##$TD0= 1
##$TE= 0
##$TE2= 300
##$TE3= 300
##$TEG= 300
##$TL= (0..7)
0 120 120 120 120 120 120 120 
##$TP= (0..7)
150 150 150 150 150 150 150 150 
##$TP07= 0
##$TPNAME0= <>
##$TPNAME1= <>
##$TPNAME2= <>
##$TPNAME3= <>
##$TPNAME4= <>
##$TPNAME5= <>
##$TPNAME6= <>
##$TPNAME7= <>
##$TPOAL= (0..7)
0.5 0.5 0.5 0.5 0.5 0.5 0.5 0.5 
##$TPOFFS= (0..7)
0 0 0 0 0 0 0 0 
##$TUNHIN= 0
##$TUNHOUT= 0
##$TUNXOUT= 0
##$USERA1= <user>
##$USERA2= <user>
##$USERA3= <user>
##$USERA4= <user>
##$USERA5= <user>
##$V9= 5
##$VALIST= <valist>
##$VCLIST= <CCCCCCCCCCCCCCC>
##$VD= 0
##$VDLIST= <DDDDDDDDDDDDDDD>
##$VPLIST= <PPPPPPPPPPPPPPP>
##$VTLIST= <TTTTTTTTTTTTTTT>
##$WBST= 1024
##$WBSW= 4
##$XGAIN= (0..3)
0 0 0 0 
##$XL= 0
##$YL= 0
##$YMAX_a= 151529
##$YMIN_a= -96084
##$ZGOPTNS= <>
##$ZL1= 120
##$ZL2= 120
##$ZL3= 120
##$ZL4= 120
##$ABSF1= 10
##$ABSF2= 0
##$ABSG= 5
##$ABSL= 3
##$ALPHA= 0
##$AQORDER= 0
##$ASSFAC= 0
##$ASSFACI= 0
##$ASSFACX= 0
##$ASSWID= 0
##$AUNMP= <proc_1d>
##$AZFE= 0.1
##$AZFW= 0.1
##$BCFW= 1
##$BC_mod= 2
##$BYTORDP= 1
##$COROFFS= 0
##$CY= 11.3945322036743
##$DATMOD= 1
##$DC= 2
##$DFILT= <>
##$DTYPP= 0
##$F1P= 16.9975609425685
##$F2P= -3.02152046262296
##$FCOR= 0.5
##$FTSIZE= 0
##$FT_mod= 4
##$GAMMA= 1
##$GB= 0.15
##$INTBC= 1
##$INTSCL= 1
##$ISEN= 128
##$LB= 0.24
##$LEV0= 0
##$LPBIN= 0
##$MAXI= 10000
##$MC2= 0
##$MEAN= 0
##$ME_mod= 0
##$MI= 1.114404
##$NCOEF= 0
##$NC_proc= 0
##$NLEV= 6
##$NOISF1= 3.799351
##$NOISF2= 2.8
##$NSP= 1
##$NTH_PI= 0
##$NZP= 0
##$OFFSET= 15.70392
##$PC= 1
##$PHC0= -9801.479
##$PHC1= 32.80088
##$PH_mod= 1
##$PKNL= yes
##$PPARMOD= 0
##$PSCAL= 0
##$PSIGN= 0
##$REVERSE= no
##$SF= 200.130013532006
##$SI= 16384
##$SIGF1= 3
##$SIGF2= 2
##$SINO= 400
##$SIOLD= 16384
##$SREGLST= <1H.CDCl3>
##$SSB= 0
##$STSI= 0
##$STSR= 0
##$SW_p= 3612.71676300578
##$SYMM= 0
##$S_DEV= 0
##$TDeff= 0
##$TDoff= 0
##$TI= <>
##$TILT= no
##$TM1= 0
##$TM2= 0
##$TOPLEV= 0
##$USERP1= <user>
##$USERP2= <user>
##$USERP3= <user>
##$USERP4= <user>
##$USERP5= <user>
##$WDW= 1
##$XDIM= 8192
##$YMAX_p= 0
##$YMIN_p= 0
$$ End of Bruker specific parameters
$$ ---------------------------------
##NTUPLES= NMR FID
##VAR_NAME=  TIME,          FID/REAL,        FID/IMAG
##SYMBOL=    X,             R,               I
##VAR_TYPE=  INDEPENDENT,   DEPENDENT,       DEPENDENT
##VAR_FORM=  AFFN,          ASDF,            ASDF
##VAR_DIM=   8192,          8192,            8192
##UNITS=     SECONDS,       ARBITRARY UNITS, ARBITRARY UNITS
##FACTOR=    0.0002004,     1,               1
##FIRST=     0,             0,               0
##LAST=      1.6414764,     0,               0
##MIN=       0,             -96084,          0
##MAX=       1.6414764,     151529,          0
$$ Real data points
##PAGE= N=1
##DATA TABLE= (X++(R..R)), XYDATA
0 0 0 0 0 0 0 0 0 0 0 8 -8 8 -8 8 -10 16 -16 23 -24 31 -32 40 -48 54 -62 71 -81 94 -106 118 -134 151 -169
33 -169 191 -213 237 -264 294 -326 361 -399 444 -490 542 -600 666 -740 823 -917 1026 -1155
51 -1155 1308 -1492 1722 -2014 2404 -2954 3785 -5194 8201 -29399 99696 129354 -74007 -94418
65 -94418 53026 85489 -57976 -92521 19099 68767 -13148 -48223 1436 23466 -12496 -14705
77 -14705 12703 9361 -17172 -10686 5632 -2620 -14148 515 16461 11095 -4258 -9996 -7238
90 -7238 254 3025 -2253 -947 13591 14529 -9611 -21616 -1416 13892 4461 1280 13268 6593
104 6593 -13071 -4285 15929 1617 -16144 11854 34468 -5736 -39656 4999 49219 5550
116 5550 -43636 -41 52384 7473 -52226 -13472 49600 22752 -32069 -9933 35120 10327
128 10327 -32686 -12414 24742 9487 -16221 874 18504 -4910 -21985 2293 20725 74
140 74 -17704 -1536 11269 -4204 -16965 -3939 10562 6324 -6203 -10995 -7030 -2366 -1917 -5992
154 -5992 -6607 1211 3805 -6367 -14871 -8893 -241 -1162 -4142 -4835 -7249 -9224 -4273 -3198 -12161 -12374
170 -12374 4737 9424 -14199 -25776 -1588 15324 -6262 -25118 -4252 16347 -3132 -24816
182 -24816 -9636 10487 487 -12539 -3777 2864 -8321 -10684 3218 3786 -10719 -6207 12930
195 12930 7004 -17302 -14915 10823 14194 -7450 -11597 6503 11679 -3036 -9885 -294 7321 6480
209 6480 3823 274 -2824 1947 10468 6824 -4363 -1665 11904 12768 -1858 -7848 4610 15244
223 15244 10443 -1725 -3337 6759 13767 6319 -5546 -2073 15070 18746 1068 -9792 4152
236 4152 17327 7174 -7220 128 14501 11098 -1281 -2439 5527 6879 4646 4803 2752 -745
250 -745 3315 9854 4630 -5554 -485 11965 8009 -7855 -8294 6185 10825 -327 -6471 1040
264 1040 7039 3555 -3545 -6030 -2761 4737 6315 -2777 -9207 -981 9239 2074 -12589 -8880 6278
279 6278 6377 -7454 -10713 226 5834 -398 -6267 -5741 -2682 418 47 -5311 -9235 -1677 7028 680
295 680 -12070 -9074 3706 3461 -9092 -10287 1345 6006 -1025 -6862 -5158 -1157 400 -852 -4616
310 -4616 -5963 -237 5487 262 -8317 -5506 4590 5426 -4215 -8856 -1324 6135 3905 -3959 -4684
325 -4684 3206 8193 1018 -9261 -5732 6777 8499 -2542 -5850 3444 8394 514 -5085 -175
339 -175 5356 4158 2283 1520 -912 -538 6065 7297 -1268 -4450 5404 11585 1132 -8354 66 12411
355 12411 7590 -4481 -3298 7208 8987 231 -3313 2400 7707 6029 420 -2712 -262 4733
369 4733 5220 952 -1574 2521 6946 4214 -2783 -4195 3129 8319 3470 -5198 -4254 5279 7447 -1809
385 -1809 -6742 1410 8930 2639 -7294 -5689 3572 4973 -606 -3077 -490 1436 1299 -581 -3604
400 -3604 -4634 649 5194 -770 -9909 -6604 5429 5197 -7125 -9459 2686 7643 -3835 -12588
414 -12588 -5037 5738 2309 -6782 -6359 828 1945 -3715 -6446 -4729 -1627 375 -435 -4366 -7145
429 -7145 -2667 3214 697 -7508 -7018 2341 4878 -5447 -11265 -2268 7502 2328 -8981 -8071 2515
444 2515 4698 -4046 -8276 -1859 5339 2790 -4037 -5213 -1041 2433 1814 -2008 -3926 -655 4453
459 4453 3398 -3679 -5377 2242 8490 1408 -7464 -3525 7556 7450 -2853 -4924 4441 8904 1419
474 1419 -5661 -1699 5522 6025 1834 -301 818 3484 4997 2661 -1807 -822 5857 8178 792 -4736
490 -4736 1555 10544 6931 -4472 -4528 6454 9325 -757 -6021 2185 10192 5184 -2955 -2196 3697
505 3697 5030 1622 -719 446 1881 3999 3338 -1233 -3472 1854 6968 2351 -5950 -3602 6031
520 6031 6092 -3418 -6451 2332 7506 707 -7421 -3997 4101 4136 -1960 -5347 -1503 2223 1021 -3299
536 -3299 -4662 -1428 1703 1251 -3818 -6184 -1826 3454 1416 -6047 -6963 121 3835 -2622 -9163 -3691
552 -3691 4813 2463 -6885 -7887 154 3158 -2526 -6123 -3026 943 -168 -2650 -3997 -4008 -1227 1820
568 1820 -445 -6324 -5458 2324 4274 -4118 -7808 44 6356 -428 -8325 -4370 4375 3853 -2934 -4961
584 -4961 -316 2923 867 -2673 -3138 327 4532 3214 -2359 -4814 890 5770 1957 -3870 -1488
599 -1488 5125 4990 -1794 -4400 692 5921 4330 -1042 -3553 685 5944 3880 -2462 -2260 4686 7540
615 7540 882 -5062 -757 6904 6222 -29 -2492 2050 5313 2882 -1994 -2450 3367 7701 3971 -3357
631 -3357 -2684 4767 6313 -788 -4132 2227 7262 3118 -3343 -2791 1673 3953 2783 -392 -2786 -580
647 -580 4524 3031 -4298 -4556 4626 7610 -2462 -8724 -721 7067 1915 -6109 -2951 3662 2135
662 2135 -3549 -4362 -1696 502 1106 50 -3144 -4796 -139 3185 -2016 -7064 -2431 4403 1651 -7053
678 -7053 -7218 1205 3947 -2156 -6496 -3018 1402 -61 -4337 -5584 -975 3273 934 -4694 -5912
693 -5912 -1261 1461 -1583 -4786 -2387 1075 1388 -2203 -4674 -3162 672 2459 -1485 -5416 -2909
708 -2909 3606 2693 -4155 -5386 2184 6236 -1467 -7547 -2253 5255 2814 -2912 -2213 2520 3000 -414
724 -414 -2243 -819 811 3365 3334 -335 -2840 664 5624 2216 -4168 -1494 6538 6020 -2445 -4239
740 -4239 3239 6954 1764 -1772 246 3476 3545 1518 -251 39 3741 6455 2640 -3505 -1502 6097
756 6097 5674 -1535 -2588 4453 7095 1061 -3300 -369 4036 4115 1819 -698 -1037 2216 4540 995
772 995 -3774 55 6309 4491 -3569 -4657 1817 4939 534 -2597 -781 1918 2316 -515 -4417 -3180
788 -3180 3082 5540 -1388 -6983 -1547 5056 835 -6489 -3142 3838 2455 -4101 -4401 -396 -178 -751
804 -751 298 -1457 -4523 -1655 2747 -1424 -7838 -3575 5928 3069 -7835 -7538 2184 3555 -4748
819 -4748 -6650 182 3520 -1225 -5343 -4305 -1400 434 1195 -1473 -4299 -1910 1942 -267 -4948
834 -4948 -3623 2785 3458 -2565 -5525 -1598 2362 1295 -1884 -3228 -257 2991 1330 -4280 -4504 2546
850 2546 6003 308 -5251 -1059 4686 2079 -3083 -1853 3448 4100 711 -1348 -1012 138 3307 4170
866 4170 274 -2367 2026 6039 493 -4944 -416 8011 5424 -3123 -2655 3960 5576 475 -2103
881 -2103 1213 3886 2854 561 -1299 -554 3371 5267 1689 -2180 334 4593 2677 -2484 -2361 4075
897 4075 5813 1581 -2710 -1307 2602 3271 216 -1883 272 3452 2623 -2381 -3985 768 4933 1733
913 1733 -3103 -2920 1693 2923 -950 -3555 -1160 2507 2168 -2123 -4196 -1739 2340 1483 -2438 -3431
929 -3431 176 2522 -1024 -5219 -3877 1656 3132 -1600 -4498 -2564 1079 224 -3421 -4070 -520 1597
945 1597 -570 -3861 -4530 -469 2118 -101 -4018 -3326 351 1259 -3053 -4978 -1185 2704 1049 -3171
961 -3171 -3681 -828 992 -609 -3331 -2374 1216 2742 -183 -4122 -3349 2427 3581 -1155 -3732 -248
977 -248 3546 648 -3612 -1814 3319 3797 221 -2614 -1166 1896 3206 1364 -1228 -234 3292 3643
993 3643 -1006 -2959 1747 5979 3260 -1790 -1083 3328 4158 1122 -1211 1080 4722 4423 398 -1445
1009 -1445 677 4940 4107 -699 -1027 3437 4999 1583 -1790 376 4280 4311 1322 -1341 259 3514
1025 3514 4028 181 -2258 1196 5531 2934 -3103 -2592 3073 4893 -365 -2723 634 3236 1326
1040 1326 -2001 -1450 493 2448 1712 -1380 -3107 -701 2678 955 -3387 -3370 1733 3102 -2138 -5440
1056 -5440 -1717 2575 913 -3332 -4072 -230 1546 -1169 -4304 -2993 822 1661 -1824 -4935 -2966
1071 -2966 699 372 -2337 -3788 -1482 813 -494 -3662 -4445 -1195 2143 -31 -4364 -4639 49 2189
1087 2189 -2284 -5134 -1253 2878 436 -4191 -3778 343 1770 -529 -2573 -1663 511 802 -229 -2612
1103 -2612 -1979 1456 2970 95 -3776 -1804 2989 2747 -1799 -2848 1839 4228 824 -2914 -940
1118 -940 3194 3459 -386 -2062 562 2935 2138 -103 -822 1173 3266 2193 -678 -1605 1707 3821
1134 3821 2316 -998 -671 2702 4119 193 -2545 -56 4209 3215 -1130 -1737 2359 3783 980 -1832
1150 -1832 -121 2634 2464 -187 -1790 -176 1832 2078 196 -1872 -906 2313 2241 -1068 -3383 100
1166 100 3790 1138 -3689 -3136 2041 3052 -1990 -3849 -579 2718 151 -3277 -2945 -72 981 -377
1182 -377 -2637 -2749 -602 1432 -271 -3457 -3257 683 1740 -2423 -4683 -2096 1618 753 -3434 -3956
1198 -3956 -256 1626 -1122 -4001 -3217 604 1534 -1734 -4420 -2136 1463 1458 -2740 -3751 -346 1756
1214 1756 -261 -2931 -2600 339 1551 -349 -2508 -2329 745 2308 -341 -3781 -1109 3171 2238 -2949
1230 -2949 -3076 1608 3279 -252 -2642 -868 2390 2053 -207 -1805 -608 2185 2763 389 -2111 -87
1246 -87 3987 2882 -2008 -1907 2935 4092 214 -2397 549 3582 2680 15 -434 937 2485 2929
1262 2929 480 -1438 1018 4191 2701 -1546 -1194 3433 4367 -241 -1908 1174 3620 1877 -543
1277 -543 -387 828 2335 1970 143 -1398 1020 3806 1752 -2079 -1149 2978 3412 -1236 -2400 1016
1293 1016 3360 1132 -1515 -1116 1070 2165 849 -982 -2062 799 2958 5 -3471 -1549 2594
1308 2594 1872 -2835 -3265 718 2170 -239 -2438 -1272 204 641 72 -1990 -2973 -279 2167 -229
1324 -229 -3836 -2336 1946 1223 -3485 -4177 587 2354 -1051 -3492 -1733 482 255 -1240 -2317 -1708
1340 -1708 -363 828 -980 -3466 -1725 1710 1471 -2881 -3819 230 2303 -648 -3431 -1373 1697
1355 1697 1137 -1139 -2176 -1120 1228 1473 -723 -2751 -862 2364 1545 -2165 -2582 1360 3140 55
1371 55 -2391 -534 2299 1797 -238 -1087 405 1876 2009 -375 -2031 154 3713 2192 -1879 -1582
1387 -1582 2424 3295 -199 -1674 1056 3421 1380 -264 -341 832 1937 2190 225 -1328 668 3648
1403 3648 2320 -2161 -1844 3398 4421 -859 -3157 906 3756 1058 -2039 -396 1916 2133 337
1418 337 -674 -1065 452 2414 764 -1606 -1425 1923 2596 -1302 -3163 295 3009 570 -2495 -1706
1434 -1706 807 1558 -299 -2355 -1807 607 1516 -1012 -3158 -1002 2442 1161 -2664 -2653 432 1364
1450 1364 -712 -2869 -1104 380 362 -867 -2227 -1749 205 1553 -930 -3825 -1330 2443 1327 -3026
1466 -3026 -3415 1140 2544 -1538 -3512 -905 1159 253 -1750 -1687 -338 965 656 -1104 -2342 -437
1482 -437 2102 1345 -1953 -2571 1058 2284 -207 -2268 -386 2482 1522 -1219 -2182 398 2222 1485
1498 1485 -990 -1608 676 2708 1010 -1177 -648 2180 2419 -583 -1778 120 2411 1846 -52 -531
1514 -531 829 1976 1906 54 -921 1350 3289 1466 -1621 -808 2352 3060 197 -1296 1185 3039
1530 3039 1702 -1359 -533 1424 2561 1173 -665 -242 1478 2418 1010 -748 -80 2292 2095 -300
1546 -300 -1956 220 2784 1330 -1073 -840 1239 2367 64 -1494 -618 1539 1682 -553 -2193 -630
1562 -630 1755 1510 -1168 -1978 541 2129 216 -2007 -1399 1108 1889 -630 -2137 -1373 1080 777 -1374
1579 -1374 -2496 -733 1196 553 -2381 -2415 -211 1344 -305 -2725 -2038 1042 1220 -1406 -2936 -1414
1595 -1414 1142 538 -2189 -2445 -704 1164 -303 -2622 -2477 359 1306 -1183 -3005 -1582 1222 787
1611 787 -1571 -2667 -507 1197 89 -2114 -2106 -88 1350 3 -2373 -1819 826 1876 -751 -2320
1627 -2320 -1000 2063 1475 -1633 -2187 299 2047 665 -1700 -1308 1292 2083 42 -1851 -353 2146
1643 2146 1893 -394 -1518 337 2246 1599 -882 -973 1128 2529 752 -1174 -879 1686 2739 274
1659 274 -1242 312 2501 1836 -396 -1005 795 2434 1280 -1033 -919 1055 2315 410 -1249 -295
1675 -295 1880 1889 -227 -1637 231 1920 1060 -1297 -1464 735 1896 287 -1559 -926 549 1256 -335
1692 -335 -1972 -897 1492 737 -1406 -2223 -69 1409 253 -1548 -2123 -34 1227 -374 -2368 -2132
1708 -2132 415 703 -1487 -2841 -830 1150 -113 -2501 -2765 -457 607 -581 -2523 -2016 -287 408
1724 408 -1099 -2455 -1694 308 585 -1682 -3269 -1218 1342 40 -2143 -2099 113 1192 -815 -2320
1740 -2320 -1288 392 833 -813 -2056 -962 1165 1019 -1076 -2053 173 1998 473 -1457 -1127 958
1756 958 1529 204 -1396 -492 2082 1907 -32 -1121 492 2460 1851 -537 -886 1420 2842 1287
1772 1287 -254 236 2327 2243 864 -596 82 2264 2367 627 -570 1008 2722 2126 -877 -671 2180
1789 2180 3262 756 -1188 282 2380 2103 -124 -510 1064 2547 1542 -772 -1127 869 2468 1442
1805 1442 -848 -679 1508 1926 -87 -1313 311 1807 1355 -818 -1771 295 1872 723 -1564 -1041
1821 -1041 857 1402 -474 -2214 -1160 1215 1186 -1168 -1792 -730 950 364 -1338 -1741 -265 928
1837 928 -88 -2103 -2069 276 1354 -398 -2498 -1035 1087 752 -2015 -2421 9 1219 -406 -2256
1853 -2256 -1876 65 556 -323 -1902 -1306 500 948 -885 -1725 -903 1130 953 -1370 -1943 -8 1482
1870 1482 90 -1669 -1069 959 1653 -174 -1714 -323 1210 995 -521 -864 636 1915 902 -1318
1886 -1318 -1062 1115 2302 901 -833 -576 1130 1775 421 -868 106 1981 1763 -452 -1267 795
1902 795 2540 1333 -959 -144 1969 1751 42 -1019 575 1397 1294 263 -443 -126 1658 1731 -233
1919 -233 -941 573 2624 1030 -1377 -845 1785 2185 -161 -1387 58 1555 527 -802 -763 651
1935 651 1564 728 -984 -1139 -189 1558 466 -1480 -870 1251 1309 -798 -1870 -18 1322 548 -1219
1952 -1219 -1458 56 723 76 -1387 -1298 434 1400 -642 -2579 -1207 933 893 -1348 -1816 -148 751
1969 751 -634 -2138 -1411 96 497 -154 -1710 -1670 -269 1007 -597 -2673 -1027 1099 267 -2460 -2231
1986 -2231 322 1163 -353 -2035 -1022 342 62 -758 -1376 -843 501 809 -1031 -2670 -815 1362
2002 1362 723 -1830 -1371 818 1457 -574 -1445 -538 1136 888 -334 -815 -410 616 863 -480 -1746
2019 -1746 339 2304 625 -1757 -690 1391 1945 -499 -1291 504 1710 1124 54 -444 287 1423
2035 1423 1294 -254 -1066 748 2353 1075 -1303 -278 2318 2070 -181 -1052 647 1585 1147 -93
2051 -93 -270 366 1819 1070 -728 -951 1131 2514 346 -1341 -419 1669 1288 -638 -901 543 1273
2068 1273 487 -774 -713 148 1006 697 -1253 -1057 706 1872 -204 -1845 -184 1638 1014 -1147 -1356
2085 -1356 199 973 -291 -1129 -1101 109 634 -243 -1262 -1385 256 805 -525 -2017 -778 868 142
2102 142 -1938 -1840 400 1077 -650 -1973 -1142 222 313 -750 -1280 -1124 12 521 -902 -2124 -604
2119 -604 915 833 -1554 -2211 230 730 -653 -1565 -622 1026 527 -812 -1317 -412 487 837 -579 -1566
2137 -1566 -247 1116 501 -1406 -1105 1043 1520 -335 -1250 73 1213 889 -380 -487 418 1364 920
2154 920 -462 -869 607 1832 876 -1169 -438 1452 1696 100 -784 638 2050 807 -582 -374 392
2171 392 1540 933 -232 -536 969 1647 558 -1059 -390 1954 2161 -411 -1228 597 1988 932 -870
2188 -870 -710 907 1438 368 -761 -381 1091 1700 -126 -1359 -633 1483 866 -944 -1340 628 1442
2205 1442 411 -1417 -977 678 1120 -214 -1260 -848 667 898 -536 -1626 -540 1196 721 -1635
2221 -1635 -1983 263 1265 -454 -1646 -620 310 229 -830 -1259 -718 205 435 -750 -2042 -739 907
2238 907 33 -1970 -1970 300 970 -845 -2022 -1091 721 107 -759 -1368 -463 532 90 -1209 -1529 86
2256 86 895 165 -1574 -1267 771 952 -530 -1537 -616 739 370 -880 -867 -241 735 597 -613 -905
2274 -905 560 1532 492 -1172 -343 1257 1091 -733 -1242 243 1380 881 -475 -229 422 1467 800
2291 800 -244 -263 866 1869 316 -872 191 1530 1626 -112 -446 804 1583 1075 -461 -252 726
2308 726 1701 891 -631 -201 1032 1442 351 -553 -112 1504 910 -720 -857 341 1589 253 -744
2325 -744 -573 818 964 33 -690 -308 898 929 -442 -1053 -318 1365 929 -743 -1141 486 1215 -111
2343 -111 -1137 -839 762 638 -510 -1606 -389 840 267 -1002 -1208 -526 585 112 -1454 -1282 60
2360 60 502 -562 -1957 -816 298 -80 -1163 -1547 -367 647 -34 -1200 -1411 -390 463 -38 -1405
2377 -1405 -1010 352 382 -910 -1727 -638 1055 581 -729 -1368 -414 763 65 -1158 -1085 228 1014 44
2395 44 -1563 -849 999 1461 -555 -1113 111 1205 715 -1010 -581 660 1237 576 -790 -628 909
2412 909 1226 46 -729 201 1393 1219 -544 -889 379 1811 715 -285 -359 853 1183 541 -795
2429 -795 -99 1391 1462 72 -703 116 1292 1046 -567 -568 974 1674 409 -527 -391 1119 1359 276
2447 276 -622 -25 876 623 -263 -481 380 1462 596 -588 -602 308 1254 267 -771 -377 604 486 -693
2466 -693 -1202 -264 1075 713 -622 -891 -241 502 -241 -1207 -1186 572 731 -669 -1552 -592 697 440 -484
2485 -484 -1396 -654 368 -239 -1367 -1276 192 910 -357 -1870 -1076 317 443 -1092 -1347 -411 307 21
2503 21 -1045 -1511 -289 781 -117 -1100 -1240 -148 427 -471 -1381 -760 915 914 -652 -1487 -450 888
2521 888 581 -723 -759 385 998 93 -1047 -664 680 1036 -25 -708 -115 1206 925 -70 -456 522
2539 522 1219 741 -786 -719 696 1333 406 -161 -564 1219 1291 44 -723 353 1556 1106 -263 -508
2557 -508 669 1491 522 -297 -185 1097 1401 223 -645 -25 1205 1396 167 -459 415 1497 1054 -574
2575 -574 -555 980 1668 405 -823 -430 1247 986 30 -594 216 1278 464 -695 -704 -83 1086 521 -1148
2594 -1148 -684 383 866 -510 -1172 -160 1074 493 -643 -1424 53 613 295 -1132 -1150 67 497
2611 497 -256 -1434 -1259 285 463 -647 -1475 -779 647 55 -1030 -1315 -84 623 -605 -1400 -1046 -95
2629 -95 465 -513 -1377 -806 491 216 -1084 -1339 -257 774 229 -1042 -1208 26 468 -401 -1021 -382
2647 -382 539 313 -302 -1094 -325 934 602 -521 -1037 252 965 -136 -720 -552 598 974 247 -752
2665 -752 -477 834 856 -37 -720 139 1232 701 -575 -641 531 1377 514 -465 11 817 1118 66 -716
2684 -716 558 1258 969 -245 -451 173 1073 919 -86 -575 825 1030 80 -580 33 1216 1161 -63
2702 -63 -600 -44 1054 476 -382 -470 102 845 182 -765 -870 468 964 -50 -1077 -414 705 407 -967
2721 -967 -915 37 690 279 -1358 -618 12 532 60 -1011 -712 292 327 -494 -1242 -695 853 340 -1223
2740 -1223 -1064 -84 245 -407 -1015 -933 338 313 -605 -1232 -701 384 325 -662 -1558 -244 476 -317 -1064 -877
2760 -877 270 705 -228 -1304 -846 132 203 -181 -702 -198 382 195 -831 -1102 133 1227 202 -943
2778 -943 -637 211 688 -234 -757 16 700 891 -221 -787 3 513 572 -213 -359 502 887 279 -822 -246
2798 -246 1076 1009 156 -427 -71 706 1058 -373 -382 641 1216 651 -523 -565 790 1133 29 -382 150
2817 150 1070 469 -339 -429 318 1275 709 -145 -302 326 909 481 -511 -25 1049 1044 23 -631 23 1221
2837 1221 889 -97 -555 402 787 347 -398 -422 716 982 -2 -845 -430 591 609 -524 -703 8 1024
2856 1024 -36 -924 -996 172 673 -241 -673 -625 200 250 -336 -859 -550 542 483 -578 -1211 -394 381 228
2876 228 -739 -620 151 502 -600 -621 -530 287 379 -517 -557 -321 37 -10 -583 -947 230 737 201 -751 -756 107
2898 107 447 -408 -1194 -319 428 320 -609 -1051 54 589 138 -634 -834 234 597 164 -1051 -657 406
2917 406 958 -421 -1005 -122 919 732 -135 -363 448 787 286 -625 -324 573 760 429 -689 36 765
2936 765 993 -73 -606 197 1241 412 -349 -215 339 1026 498 -147 -45 745 1204 281 -333 59 872
2955 872 1110 -386 -474 636 1053 153 -628 7 813 784 131 -573 -84 553 933 45 -704 -138 913 434
2975 434 -528 -841 380 870 -13 -677 -367 481 442 -114 -786 -108 276 382 -635 -916 -298 838 388
2994 388 -894 -995 388 518 -545 -1036 -462 312 233 -306 -1010 -344 486 273 -856 -865 -111 337 74 -965
3014 -965 -693 379 209 -628 -1252 -485 516 88 -847 -1004 -361 373 -121 -715 -527 -188 615 -410 -1214
3033 -1214 -720 409 230 -807 -838 102 880 63 -680 -647 15 875 -132 -672 -407 278 670 238 -794
3052 -794 -197 654 352 -338 -242 262 913 524 -379 -349 98 976 139 -259 -43 805 826 173 -290 78 1136
3073 1136 697 -229 -137 278 965 377 -238 4 370 827 127 -173 -150 886 360 65 -436 -85 743 735 -188
3094 -188 -549 559 937 81 -336 -349 429 594 -202 -643 -156 398 509 -240 -841 -86 692 198 -905 -467
3114 -467 410 840 -219 -800 -355 533 303 -503 -831 -378 452 8 -602 -737 60 690 208 -967 -1012 256
3134 256 402 -252 -1125 -681 386 93 -646 -806 -272 425 -170 -658 -616 259 613 -443 -1149 -613 347 391
3154 391 -548 -904 -224 470 61 -715 -962 60 129 -242 -806 -563 197 354 -55 -684 -354 579 674 -256
3174 -256 -657 490 581 303 -602 -204 270 493 12 -415 -121 467 908 328 -400 -124 740 678 -431 -367
3194 -367 359 1106 416 -361 -126 658 1065 -137 -484 16 820 555 -384 -443 225 1022 658 -596 -44 683
3214 683 938 18 -365 -46 678 765 180 -447 153 814 434 -266 -377 307 753 200 -642 -442 560 468
3234 468 221 -386 -96 396 507 -150 -399 -56 607 392 -603 -653 72 566 -106 -910 -612 510 567 -791
3254 -791 -1044 -269 385 -41 -556 -630 4 184 -200 -585 -819 -31 86 -388 -950 -660 226 450 -480 -1166
3274 -1166 -320 297 -180 -918 -671 -145 448 89 -565 -473 109 128 -26 -442 -200 208 118 -478 -651 36 500
3295 500 299 -560 -383 540 733 25 -574 19 294 792 -364 -664 -25 641 556 -246 -316 356 801 410
3315 410 -519 -191 377 513 385 -215 -11 783 566 48 -244 369 639 645 -431 -213 540 807 83 -338
3335 -338 127 677 546 77 -339 302 737 421 -82 -432 398 980 529 -394 -471 461 757 -98 -407 238
3355 238 914 768 -26 -212 54 820 394 -149 -428 210 682 61 -658 -533 507 707 -515 -797 -211
3374 -211 707 220 -423 -584 75 380 9 -642 -869 267 349 -199 -667 -470 344 371 -460 -1057 -335 464
3394 464 80 -530 -800 10 288 -44 -899 -527 -46 319 -643 -912 -223 460 128 -635 -536 -106 373 -315
3414 -315 -155 -571 0 344 -136 -381 -290 77 441 62 -447 197 604 133 -341 -474 573 439 203 -78
3434 -78 -64 391 276 -292 -436 -157 515 685 -154 -238 64 752 131 -276 -34 482 553 -111 -270 -311 517 150
3456 150 -220 -217 123 480 428 -204 -432 476 800 635 -86 -396 387 735 -117 -242 265 611 433 -43 -733
3477 -733 214 684 149 75 -281 90 544 27 -288 -126 462 481 -109 -538 37 546 201 -499 -387 -59 352
3498 352 -25 -602 -544 235 556 244 -559 -150 298 155 -323 -465 -256 444 114 -822 -731 -304 234 -98 -422
3519 -422 -228 35 197 -332 -866 -236 346 99 -711 -546 -256 277 -403 -590 -438 -89 296 -87 -902 -227
3539 -227 330 603 -216 -650 -107 212 71 -656 -689 200 577 -306 -408 -356 264 651 -334 -385 -242 482 216
3560 216 -372 -401 162 575 117 -164 -335 232 400 281 -605 -129 709 313 -233 -402 -107 617 408 -64
3580 -64 -349 344 451 245 -553 -433 444 734 241 -360 169 666 720 -285 5 193 1046 260 -374 -304 448
3601 448 741 -131 -436 29 515 613 -51 -545 25 389 410 -82 -206 336 500 218 -469 -429 453 477 112
3622 112 -546 -16 527 649 -317 -462 81 453 -3 -686 -237 172 304 -211 -603 -115 237 50 -187 -491
3642 -491 -160 338 268 -641 -761 108 270 81 -531 -534 -65 188 -105 -427 -163 -54 191 -633 -804 -86 218
3663 218 -63 -648 -337 194 232 -15 -541 -416 159 261 -189 -370 -129 257 216 -179 -444 164 400 -38 -552
3684 -552 -316 102 423 154 -229 -125 207 275 -381 -492 -66 744 630 -144 -676 182 704 614 -351 -281 518
3705 518 561 -178 -95 -178 590 259 18 -43 257 557 397 -252 -352 587 745 -14 -239 205 736 180 22
3726 22 -260 195 684 338 -187 -305 260 789 396 -345 58 229 723 -170 -237 -73 331 401 -54 -466 101
3747 101 595 298 -468 -271 382 437 -57 -373 -162 435 257 -237 -597 -154 264 76 -373 -610 -124 276
3767 276 27 -513 -515 91 155 -285 -813 -248 288 116 -470 -482 -29 142 50 -330 -377 -146 465 -257 -637 -401
3789 -401 -101 480 -426 -889 -424 95 349 -241 -565 243 342 -149 -517 -340 473 238 -235 -437 -298 16
3809 16 181 -357 -557 -95 522 65 -285 99 104 490 215 -53 -209 566 281 -134 -399 45 552 138 -294
3830 -294 -70 41 620 96 -357 -244 237 577 269 -155 172 508 508 -130 -223 161 617 396 -82 -270 472
3851 472 504 103 352 -107 663 443 -115 -376 81 319 436 74 147 311 191 146 -13 -194 385 262 -186
3872 -186 -402 163 403 251 117 -106 61 577 226 -183 -334 -46 281 89 -248 -440 124 219 -59 -519
3892 -519 -219 163 135 -299 -363 -58 328 -417 -325 -284 -3 384 97 -395 -336 146 264 -308 -423 -214 312 -44
3914 -44 -411 -583 -526 192 -253 -225 -329 -99 385 -177 -821 -345 256 202 -348 -431 351 376 7 -438 -479 43
3936 43 633 -6 -483 -172 232 217 -298 -299 -225 632 183 -172 -262 412 175 0 -3 -116 124 370 126 -294 51
3959 51 230 321 -107 -199 222 451 298 -465 -322 141 345 301 -236 -97 484 467 63 -262 304 925 506 -169
3981 -169 -299 -9 498 410 -182 -70 326 402 -170 -79 215 422 255 -353 -336 51 190 61 -239 111 167 495
4003 495 -14 -171 40 243 750 -62 -541 -65 423 257 -178 -269 -179 287 -89 -385 -450 53 179 -290 -733
4024 -733 -151 268 392 -173 -444 -217 -5 0 -510 -283 19 -78 -398 -354 -311 247 221 -80 -699 -283 357 88
4046 88 -280 -630 55 388 -176 -468 -347 1 -41 -245 -266 -236 13 -52 -239 -341 -177 471 472 -420 -450 123 383
4069 383 31 -248 -329 14 207 -8 -609 -65 131 126 -82 -336 191 534 192 19 -491 105 583 125 -40
4090 -40 -110 230 253 -80 -223 76 298 394 -104 -392 392 514 357 -185 -289 521 393 54 -200 403 590
4111 590 -67 -172 79 419 283 225 -228 74 586 630 -83 -113 201 351 669 -129 -304 170 414 192 -405
4132 -405 -70 56 508 44 -544 -73 222 340 -51 -357 -247 196 525 -164 -293 -71 176 63 -325 -246
4152 -246 -42 257 -234 -339 -364 195 166 -272 -675 -50 91 -121 -530 -296 -28 252 -114 -152 -251 -274 478 -129
4174 -129 -409 -124 320 75 -202 -529 -189 300 34 -309 -456 -63 304 -218 -301 -332 40 262 -133 -557 9
4195 9 -124 217 -234 -174 34 -81 31 -326 -729 532 114 -43 -198 -334 190 361 6 -164 -178 404 358
4216 358 -53 -123 170 435 115 -87 86 448 103 -197 -312 -86 567 102 -91 -26 264 300 404 35 84
4237 84 93 403 -54 27 92 443 251 29 -39 -16 549 -1 -138 -352 70 350 -261 17 185 296 504 -2
4259 -2 -200 -70 356 102 -204 -213 -35 180 194 -198 -131 -94 134 -58 -425 -2 187 449 -175 -449 65 181
4281 181 101 -486 -208 -148 227 160 -238 -468 -222 319 -272 -452 -52 -100 455 -429 -263 -148 255 144 -530
4302 -530 -478 -25 264 -27 -67 -74 167 60 69 -429 -77 124 213 -478 -322 -88 265 72 -292 -330 62 105 -83
4325 -83 -210 -202 538 162 -375 -443 -33 298 181 -96 -84 44 576 151 -265 -65 530 318 -187 -130 265 330
4347 330 -108 -137 68 153 272 16 -337 -126 359 535 323 -248 114 466 215 -125 -24 95 326 175 -398
4368 -398 -61 102 475 104 17 -67 535 613 201 -300 -1 451 357 -297 -88 239 269 297 -271 -251 227 128 -44
4391 -44 76 197 48 159 -282 -181 -72 142 290 -207 -318 62 250 127 -140 -247 207 -207 58 -452
4411 -452 -76 -115 503 -19 -445 -269 302 148 -107 -14 -124 370 -67 -157 -231 -16 33 -233 -358 -239 -27 53
4433 53 -393 -91 2 181 93 -329 -293 -94 -82 -28 -473 -493 173 201 -296 13 91 -17 -80 -249 -361 -19 111
4456 111 -31 -257 -453 349 437 -264 -260 -43 257 121 -184 -255 -52 544 336 -238 -31 276 246 165 -325 -132
4478 -132 225 313 6 -111 136 104 416 212 -62 242 221 -52 -194 123 145 574 -54 104 -185 278 462
4499 462 61 -33 137 477 179 -127 -108 384 187 182 -335 140 385 136 -50 -394 46 388 141 -106 -153 88
4521 88 338 198 10 -167 -169 201 188 -21 -56 187 158 -509 -109 175 65 44 -251 -129 -15 220 20 -30 -39
4544 -39 129 -57 -134 -527 -214 86 180 -373 -330 174 161 6 -274 -38 -30 195 -115 -230 -318 82 -75 53 2
4567 2 -125 91 -101 -318 -280 -172 94 -278 -373 2 170 28 -152 -445 -190 165 -52 35 -318 -68 311 25
4589 25 -141 -124 -42 374 191 -90 54 -123 -42 -340 -237 339 34 360 173 -135 186 185 19 -118 -171 136
4611 136 341 -87 -356 126 506 171 -88 -16 88 118 246 107 -154 398 528 -59 -252 -80 -4 343 178
4632 178 -13 293 84 34 -87 92 -20 352 84 -178 -146 385 269 4 -170 -92 462 74 -233 -190 -291
4653 -291 162 319 -217 -279 286 186 -125 -233 -188 341 18 -208 -228 -114 247 78 -469 -177 -317 193 -80
4674 -80 -602 -106 131 -45 -64 -218 -28 154 84 -200 -207 -198 -131 136 -277 -392 170 -105 36 -60 40 283 374
4697 374 -101 -115 -324 49 272 -157 33 80 -14 -422 -253 -9 156 -23 -106 -19 -98 157 176 -342 -201 183
4719 183 366 -22 -235 -131 471 -80 84 -326 152 53 133 51 -325 -61 428 236 -1 -345 185 256 152
4740 152 49 -34 260 376 327 -198 257 367 161 175 -106 194 363 33 -46 -96 77 444 188 -91 -155 255
4762 255 152 -276 -170 87 267 128 -44 -99 386 -155 -166 -64 198 324 119 -107 3 -115 135 297 -227
4783 -227 30 23 160 330 -166 -293 -59 -3 -86 -429 -305 0 -11 -106 -176 -142 -13 56 -502 -15 -204 -26 -7
4806 -7 -269 -123 -23 312 -419 -132 -34 250 -310 -106 -9 -124 107 -203 -151 -593 203 96 68 -187 -221 -65
4828 -65 155 -259 -216 -60 54 84 -269 -209 83 -53 -116 -142 -484 81 -278 -88 -296 50 374 154 18 -242
4850 -242 120 306 -62 -61 -113 -88 341 85 -256 70 336 416 -179 65 -167 84 -87 41 17 -51 166 -83
4872 -83 -5 -165 27 91 95 54 -324 258 211 81 -62 18 290 197 -202 -110 120 -18 376 -365 37 68 96 260
4896 260 -274 -8 297 -92 266 3 53 472 147 -136 -184 168 174 -299 -5 39 273 269 -10 -278 -77 32
4918 32 -109 -209 -257 -224 -7 -4 29 -55 177 -42 -237 -282 -141 269 -9 -199 -152 144 -62 47 -300 -173 -30
4941 -30 242 -120 -306 -284 -37 226 10 -273 -19 -128 -99 -194 -375 -212 247 75 -176 -205 109 223 -182 -218
4963 -218 -20 -52 167 -219 -173 -160 65 -14 -211 -136 331 520 186 -52 -318 24 -18 -233 -206 -87 348 121
4985 121 -17 -70 -14 90 -8 -58 -41 138 63 67 -366 170 145 182 -357 -188 186 41 251 -171 -242 45 295 51
5009 51 -211 138 -5 254 -112 120 -62 -29 451 238 172 68 210 -466 146 188 212 125 41 89 -139 103 704
5032 704 -275 -223 113 52 222 50 -306 251 50 -9 -212 217 -9 -16 -74 -221 -130 -62 215 -41 -153 -319 233
5055 233 -117 47 -289 221 55 -152 -250 -223 23 -100 69 -155 -127 187 3 -235 -244 -46 168 -115 -141 -70
5077 -70 4 -3 -45 -224 -121 345 -73 -28 188 104 253 -159 -10 52 237 -174 -176 -79 -241 118 -58 -23 -175 63
5101 63 -34 149 -90 -126 -116 115 -82 36 133 67 265 196 -155 -259 88 306 -38 153 157 217 163 -129 -242 215
5125 215 -19 90 47 -165 174 202 295 -229 -148 413 38 -34 -208 -41 196 40 -291 -27 127 -127 -9 5
5147 5 -201 256 -111 133 -486 0 381 -138 58 29 283 -163 -234 130 324 252 -55 -245 -142 64 104 333
5169 333 112 -281 119 113 -106 -98 24 173 -28 -174 -112 106 140 330 35 -157 133 -108 83 -307 -266 32
5191 32 124 99 -83 -262 -133 337 -400 -293 109 150 -303 -205 -257 174 -95 90 -123 43 93 247 124 -142
5213 -142 -5 142 136 -218 -56 105 320 -36 -93 -242 145 149 30 -40 -147 23 286 -192 -305 -172 202 176
5235 176 -58 -257 -184 -2 338 -251 -247 -12 94 162 1 -9 88 250 74 122 -265 285 287 15 -141 398 176
5258 176 65 61 242 -126 236 123 5 51 328 173 -88 16 -79 -87 102 -109 384 226 37 163 -18 158
5280 158 290 32 -151 -49 8 268 -119 -93 -376 24 360 -138 -20 -146 54 501 -124 -137 -116 -114 114 -112
5302 -112 -46 -46 136 -263 -129 -246 -35 -122 41 -164 -212 50 -135 -12 -249 33 18 12 -198 -163 191 -82 269
5325 269 116 -124 154 194 52 -285 -442 52 189 -147 -163 -142 63 234 -228 -69 -32 -46 -33 -358 212 219 174
5348 174 31 -201 -27 -14 272 -251 -88 12 233 167 -88 11 -185 107 -115 220 -191 -95 51 -60 -63 262
5370 262 -120 -204 -243 -207 69 -107 -152 -261 26 179 172 -19 -5 144 -82 299 -42 22 -38 169 67 -71 137
5393 137 22 -28 -266 -205 167 66 -171 -74 -124 76 142 19 -182 -1 -31 62 -328 -30 -188 147 -156 157
5415 157 -133 -111 240 71 11 -176 16 -189 -61 -91 32 40 -301 -172 69 37 285 -175 163 -264 98 -177
5437 -177 -106 -20 146 138 -8 -26 -197 103 90 -234 -4 -149 -227 150 78 71 -312 -194 312 -43 -357 -161 -116 93
5461 93 -149 40 -49 -182 -141 0 69 -124 -152 -30 28 29 167 149 188 -88 145 -77 -109 178 -274 65 230 31
5485 31 -54 -270 163 -22 162 -319 60 205 -9 -316 51 51 501 223 -113 -81 -42 368 -154 117 49 -74
5507 -74 77 67 -52 -21 164 31 40 -144 -82 -52 242 213 139 485 233 132 -290 -9 218 -99 181 340 -196
5530 -196 262 32 -159 102 98 286 183 -43 -52 227 198 -16 -18 84 163 214 100 65 -103 21 116 -24 -246 120
5554 120 -19 259 119 23 -111 -140 188 -569 43 56 -71 -43 -75 102 222 -291 -222 289 -63 -89 -5 81 -71
5577 -71 -160 -295 187 -104 -320 -167 165 -43 -66 40 143 -89 -434 -181 166 -79 -41 -74 6 80 -97 53
5599 53 -168 82 43 212 25 316 -91 12 -231 -208 131 -124 150 95 -283 -206 97 76 -118 -368 76 160
5621 160 56 -250 -314 81 -46 -35 165 -275 98 -112 -26 -5 -12 237 85 -85 -3 127 113 319 128 -102 263
5644 263 250 -327 -68 26 441 156 141 35 0 107 316 -32 5 -86 -156 102 161 -116 105 73 -204 -62 -40
5667 -40 -113 104 -24 -113 -99 59 236 -273 -393 -28 -130 -158 16 146 175 191 -43 -31 249 455 -96 -31 52
5690 52 6 198 -18 -81 -363 186 150 57 -135 62 -218 45 71 -9 115 130 177 8 -17 -199 140 4 36 -145
5714 -145 214 172 73 52 217 90 -133 -152 -47 46 68 -69 -68 -322 -37 -281 66 -104 105 112 83 -136 -185 24
5738 24 100 -343 -214 1 -40 85 -38 5 -147 36 -173 163 -388 -14 254 65 -267 32 214 -83 -19 -101
5760 -101 -133 106 -123 -131 -33 -225 1 -53 -86 77 159 266 -11 90 -66 -34 170 -289 169 112 -44 22 47 115
5784 115 261 106 -4 -152 16 -7 180 258 157 -66 84 19 48 -268 136 328 -211 -214 -23 70 136 41 -62
5807 -62 15 -88 119 -240 -104 65 79 194 -302 -60 23 -5 137 63 -154 145 44 10 -86 -254 21 187 108
5830 108 22 -276 -149 126 218 -242 -26 124 -153 -27 -374 151 -289 61 11 -211 81 249 85 -145 63
5851 63 118 -214 105 -389 -360 245 -42 202 -1 -131 -300 232 88 88 -2 -92 -329 -154 -5 -252 62 48 231
5874 231 169 -163 83 -215 -3 477 214 47 74 -9 62 -40 -146 -139 47 -2 156 -454 -143 97 11 132 -139
5897 -139 -65 279 -34 -125 -61 125 280 79 -217 102 204 -381 57 221 -157 -107 166 -134 -193 -5 53 51 -146
5920 -146 197 172 102 140 -92 -100 123 -35 67 185 -173 -14 -12 -149 62 119 184 123 -96 1 -70 316 -43 -284
5944 -284 254 -76 77 -99 134 -126 -142 132 64 -129 227 -144 -96 44 -188 -289 -314 -16 -48 -138 -116 47
5966 47 -52 116 -46 130 211 -131 -222 -199 134 -302 -117 -296 -118 -15 199 -77 -97 33 -290 -81 -97 9
5988 9 -69 -111 -162 -359 399 97 -411 -109 -99 237 -25 -59 -9 -22 347 -184 -173 -218 37 48 -171 131 -14 37
6012 37 241 55 120 117 -88 -79 -306 125 -7 -55 30 91 190 275 -118 359 -127 194 60 37 -170 -275 121 18
6036 18 -210 -108 125 -75 214 192 -54 192 181 -54 -5 12 -199 102 210 -143 -6 69 62 -123 -90 -299 -84
6059 -84 -24 -100 58 124 152 -2 -179 38 175 -116 108 7 -212 -200 115 -11 -61 131 -4 274 -28 -267
6081 -267 -264 177 95 106 64 -123 -17 -241 196 -128 192 177 111 -34 59 -217 187 9 -144 -291 -318 -82 -237
6104 -237 172 169 461 183 -290 95 226 171 12 -40 -370 131 4 -342 -191 50 -31 -191 65 -185 -125 -234
6126 -234 -53 44 53 167 228 48 -211 27 92 -14 -183 13 229 47 -24 161 -301 169 287 -369 -293 46
6148 46 -244 -156 40 -1 39 144 26 -70 -123 208 -259 -29 3 0 -130 -26 236 -72 -72 25 -42 -186 -204 -212 -20
6173 -20 -72 -306 6 35 -81 -226 -312 319 66 101 -146 160 -10 24 133 -44 -254 -126 221 -95 58 60 16
6196 16 126 -129 -300 191 74 -124 -99 -4 21 -112 -76 -268 -33 59 -156 -324 15 -41 94 -167 -92 -52 -126
6219 -126 -84 109 78 -142 55 203 -75 -437 -294 37 148 -165 -85 -92 160 178 -170 -372 173 190 -169 -95 227
6242 227 21 -121 40 -9 -82 14 188 -209 -122 -225 -55 -55 13 -231 -71 -177 54 -73 -264 178 -71 100
6264 100 159 -303 -62 13 -2 282 47 137 -108 -142 157 98 -119 -114 -249 361 -175 -65 -20 -268 201 164 260 13
6288 13 270 -35 -25 149 -170 19 -141 271 -400 54 9 115 1 30 180 113 151 455 21 35 -159 -135 -2
6311 -2 -110 10 65 144 -127 58 26 268 -171 -60 -169 181 80 -269 25 -38 22 -151 -177 -222 137 499 50
6334 50 -232 213 33 -27 -23 1 -89 154 168 -83 36 -25 97 -141 -116 -193 84 111 -24 -28 -16 -5 273 -138 -112
6359 -112 -372 -76 44 -264 -470 -70 -83 7 -149 10 -166 68 59 -13 175 -85 -92 96 225 187 137 -223 -315
6382 -315 83 37 36 -148 -167 -19 167 -312 334 81 0 382 27 32 -198 85 20 -103 -31 11 -161 -106 -38 184
6406 184 1 36 59 -14 -255 45 36 118 -39 29 157 -228 161 67 -51 -15 -61 54 124 -71 -133 143 -2 -195
6430 -195 280 236 148 66 -144 102 47 -174 -124 -406 -42 -128 125 102 -191 84 45 -270 -222 -210 15 138 -98
6453 -98 41 -138 260 69 -55 -49 43 36 75 -205 98 34 -24 31 -145 7 134 138 -167 -81 428 84 83 93 -244
6478 -244 206 192 179 -196 -32 109 -115 91 -153 60 176 89 -166 91 98 36 44 -92 -113 83 221 -172 -89
6501 -89 -66 228 365 71 -236 -80 -75 -198 -186 152 58 45 -265 -17 -199 241 -44 -81 -25 7 -248 48 -259
6524 -259 -21 130 -104 106 296 15 398 316 -69 167 -142 -151 -90 -84 47 93 -48 183 -141 155 161 -224 -104
6547 -104 -9 131 133 144 -89 -101 125 125 68 166 120 -167 14 -108 11 97 192 78 -295 -381 -98 -10 164 -165 75
6572 75 -53 25 -86 -106 268 123 122 -72 102 -214 445 370 -161 20 -157 504 246 0 8 -11 351 -91 -48
6595 -48 -149 123 179 -88 -115 -69 97 -27 -354 31 36 -89 5 88 -332 129 127 353 -201 52 270 -13 -151
6618 -151 -249 100 -1 164 73 98 116 -159 155 -179 -209 209 -48 63 326 148 178 -38 -162 -36 168 106
6640 106 54 311 -350 34 -84 63 -13 -17 111 38 28 -51 -50 -171 50 -35 -86 -324 251 172 -110 -176 53 -148
6664 -148 -17 46 43 246 -162 242 -119 -36 -48 -37 -451 -158 27 -71 -60 -225 -250 -49 163 -97 -247 221 -47
6687 -47 -223 79 -276 200 108 69 -350 -38 -20 -257 -348 -52 251 427 149 47 254 104 27 -8 124 -171
6709 -171 -62 -233 90 -287 123 49 -9 -62 -309 -128 -203 57 -48 7 -94 250 -97 -318 91 -243 55 110
6731 110 -122 -71 148 -72 53 -167 -129 -72 -43 -69 -222 -197 -163 77 -31 -60 174 -321 -329 -170 54 148 -99 72
6755 72 -89 -74 17 24 61 -218 187 173 -311 137 -228 417 -407 -154 126 -44 126 72 187 -51 -75 380 103
6778 103 -3 24 -133 55 -9 -322 80 -35 198 -23 -440 68 -2 -30 80 139 -89 -6 -240 -74 447 102
6800 102 13 126 45 39 -249 43 88 301 259 4 181 -192 225 252 145 -215 -240 266 72 142 -5 -43 -37 86
6824 86 -42 -94 -326 86 176 15 -213 32 87 -40 -20 -69 233 106 -237 -36 183 -199 44 -8 11 78 63
6847 63 -171 -307 214 -95 172 -212 -260 104 39 13 -255 -249 -140 86 252 191 -207 -148 83 -22 -109 48 -177
6870 -177 -275 -98 -255 -15 81 -37 -170 -24 -162 26 -98 -83 20 3 381 -182 -45 32 80 306 13 239
6892 239 306 27 53 3 -84 -88 -64 16 -84 -48 139 309 -148 83 8 199 201 -217 -87 -368 108 254 48 -454
6916 -454 -56 -180 -66 13 20 65 198 138 126 87 279 170 268 93 -91 -10 13 -185 211 190 109 -34 -62 -300
6940 -300 7 349 -110 -85 165 136 13 53 -167 -169 -26 44 -4 36 -155 -113 -355 -249 85 -415 150 95 -8
6963 -8 -155 -85 -203 -78 -94 328 105 -122 -50 -151 142 74 -64 -81 72 226 -197 59 -182 -88 42 5 103
6986 103 -285 -79 139 -71 -61 -89 -290 123 -73 -338 61 -83 -102 189 -138 -202 -4 137 -178 10 13 -183
7008 -183 84 5 32 -97 68 -232 53 -24 -60 328 -53 -22 220 48 97 94 246 -23 367 -251 -181 112 219
7031 219 51 -14 -41 -63 208 149 32 71 -116 289 269 -120 -143 -280 142 -3 -116 -165 211 58 -413 49 -92
7054 -92 86 -119 -26 -74 -88 -68 90 -127 24 258 67 183 10 -99 232 32 -59 -227 197 251 -130 -1
7076 -1 -113 295 -47 7 -181 -213 137 51 -252 128 -139 302 -103 -182 33 183 -42 -28 -206 -184 21 -37 -85
7099 -85 -190 140 82 -58 -109 -303 -205 -114 35 243 -115 134 -88 106 -115 -44 75 -65 -81 22 32 257 -194
7122 -194 -207 305 -103 197 -51 -121 306 61 -153 -132 -163 79 -141 136 57 -141 193 -77 171 50 -216 -5
7144 -5 -364 -46 -204 62 457 143 128 -361 388 249 267 27 -117 49 -259 -215 303 42 55 130 168 -128 40
7167 40 -299 -5 131 356 18 32 66 -233 120 14 0 -161 67 240 177 9 26 12 57 226 -40 -86 182
7190 182 68 46 -148 35 171 208 188 37 171 333 -83 250 -316 -64 28 -76 -29 149 -76 30 146 192
7212 192 58 -148 98 -146 -307 -121 110 -275 73 8 -12 -98 -40 -61 -32 184 88 -80 -74 -133 -115 373 158 -254
7236 -254 -67 -106 -143 -35 -83 38 -145 -6 -244 -150 195 152 -137 119 78 469 36 -64 -157 145 -188 -68
7258 -68 72 49 -310 217 -283 -220 -46 131 95 20 -143 -64 -131 248 300 -30 -9 341 82 282 -232 -111 260
7281 260 165 -114 -94 149 33 -20 -200 -60 131 97 36 133 -5 -20 -461 -240 221 66 293 202 -12 -411 -77
7304 -77 143 107 -133 163 127 186 -205 -48 37 173 -81 2 89 5 163 -45 -307 -179 -97 18 -143 -92 -229
7327 -229 103 -36 -138 14 -151 -133 282 100 3 -163 68 -225 -21 -176 -69 248 55 -166 -104 114 69
7348 69 122 93 -168 -121 -98 -207 -230 -88 56 35 6 -104 46 -138 92 -38 -54 22 249 -305 -30 -2 -28 46
7372 46 11 -56 -150 -61 79 -19 120 0 59 65 33 111 207 98 -63 -14 -36 -70 -45 35 104 -349 102 -210 -6 59
7398 59 200 12 -19 43 -53 -44 -110 250 -203 190 -12 31 -42 141 58 214 1 -68 -138 448 48 -205 -73 117
7422 117 155 -108 191 150 -104 238 -274 -74 -53 -270 -209 -8 98 -4 146 428 303 -67 -56 2 228 15
7444 15 42 -3 -7 134 -36 -34 88 24 -88 -218 -22 118 80 25 150 50 198 14 -28 -58 144 -99 -331 -54
7468 -54 10 121 33 -237 -215 42 97 16 -182 -75 -128 99 32 28 -128 -72 218 136 138 -147 10 -251 -161 -25 -49
7493 -49 -155 77 50 136 132 100 -31 -137 110 24 293 18 -347 119 163 -106 -88 197 96 -194 35 -255 -131
7516 -131 -74 -181 -413 -127 147 24 -176 -100 15 267 72 83 25 -63 158 -131 -42 -1 -6 235 120 -248 322
7539 322 463 230 104 -52 -462 339 213 491 59 167 190 -73 85 -142 75 204 65 -35 133 355
7559 355 22 281 -108 -112 -205 -30 -76 -262 332 204 15 -108 134 62 121 2 -194 7 152 264 85 -444
7581 -444 113 61 -126 -64 -156 87 31 51 197 6 239 202 -117 171 168 37 -14 40 -154 228 -53 -83 -162 -286
7605 -286 -339 95 107 -73 25 -104 100 -47 -162 -118 65 -3 -145 -89 188 96 -98 -273 -42 -101 -86 -470 134
7628 134 -199 185 192 2 -119 74 186 -222 15 266 -113 152 -18 48 -289 -19 -105 -223 152 -304 125
7649 125 -129 -190 -195 -198 91 72 35 -64 228 -91 -25 -167 169 130 160 -165 -107 154 103 63 -142 144 101 -59 -156
7674 -156 -6 -29 397 290 35 -89 4 -36 152 -37 81 -4 14 30 -168 -66 -77 37 -85 100 -28 89
7696 89 149 222 167 148 421 -5 241 189 227 101 37 64 -51 111 220 100 -25 85 8 223 -6 -46 -127 257
7720 257 -148 -174 -55 -286 202 92 -48 56 119 148 -256 -306 105 -25 269 -201 -271 112 -66 162 58 241
7742 241 -146 91 50 -205 -175 116 197 -158 -221 9 116 -85 -291 150 90 -236 -513 -93 147 226 255 -118
7764 -118 -130 -285 24 55 -65 -374 -41 165 141 103 -105 -150 185 113 -421 -35 331 -64 -56 -164 91 -71 7
7787 7 177 -112 -46 -24 297 -274 -39 55 286 13 132 217 328 335 215 -49 -57 31 -107 -334 -70 -32 -134 -125 222
7812 222 -2 17 55 214 -94 -159 181 -17 -241 -212 189 67 -163 -354 391 -122 221 -83 -207 -166 -33 145
7834 145 11 -130 -107 25 -109 22 113 273 -7 -72 -226 48 83 -63 -158 -60 80 286 -199 -328 -436 -85
7856 -85 107 22 97 133 305 78 -59 -229 -231 -158 -131 136 -125 -73 97 47 78 271 -116 25 -47 -181 75 -21
7880 -21 21 96 -136 -205 29 1 -12 -68 1 50 71 -112 -7 67 -42 173 -411 324 136 92 0 251 -13 -203
7904 -203 -111 -392 36 31 151 -55 -227 126 330 177 -80 -70 -4 -252 279 -32 85 -226 37 118 -105 26
7926 26 -208 85 -246 -99 32 27 235 -71 -91 179 -10 46 -248 -362 42 -77 198 -80 -34 -27 36 39 -84 137
7950 137 98 -273 -19 -11 289 98 -88 -87 -105 156 415 -116 47 79 187 86 -132 -57 281 275 -93 118 209 205
7974 205 79 -128 135 -155 -211 113 -96 259 20 130 -119 -97 40 0 -240 -105 -8 -253 -84 155 40
7995 40 -16 57 88 527 131 -348 4 293 -224 81 -404 60 43 -25 -68 -74 71 100 -224 -60 155 47 -103
8018 -103 -308 -11 66 195 255 12 87 89 252 53 80 149 -16 -113 -177 -87 51 188 -122 -63 -90 5 198 91
8042 91 -62 -183 -165 210 -121 -478 -133 -65 137 -267 91 419 52 207 -255 233 -228 158 0 221 87
8063 87 53 120 343 51 47 241 441 -38 -93 3 77 173 171 -73 80 16 -168 -95 -119 90 -50 388 -339 -37 -270
8088 -270 88 -383 -99 78 189 40 -85 -50 76 53 -207 115 -85 28 212 123 -66 278 61 212 -121
8109 -121 -21 29 -270 68 -227 150 -260 6 -2 -283 64 15 92 228 92 -76 64 69 195 2 -175 151
8131 151 -81 -236 51 174 334 -122 -468 -136 -120 -150 -242 343 -121 115 53 -59 -57 -9 157 -64 -362 98
8153 98 -107 95 281 -381 -124 -87 -44 -70 -96 48 66 66 231 6 -162 -216 -60 -6 -92 -36 108 -343 29 108
8177 108 -95 -137 -175 361 60 -154 322 61 -181 -20 -15 92 45 44
8191D4
$$ Imaginary data points
##PAGE= N=2
##DATA TABLE= (X++(I..I)), XYDATA
0 0 0 0 0 0 0 0 0 -8 8 -8 8 -9 16 -16 24 -24 32 -33 40 -48 57 -66 80 -89 105 -120 137 -153 175 -198 222
31 222 -248 279 -312 349 -387 431 -479 532 -590 654 -721 800 -885 981 -1088 1210 -1349
48 -1349 1509 -1693 1913 -2178 2504 -2914 3458 -4206 5308 -7096 10497 -19253 88272 151529
62 151529 -86776 -96084 61075 98092 -55408 -80687 43735 92349 -8655 -48868 11644
73 11644 43243 -1002 -10930 17467 17125 -12052 -5187 14766 9737 -4606 8488 20537 9046
86 9046 -9122 -9695 -1647 6570 7505 2584 660 9131 6918 -13203 -20168 4097 19298 5121 -5510
101 -5510 3562 220 -16414 -8980 11727 1563 -16961 3271 22042 -12630 -40794 2339 41618
114 41618 -3054 -50223 -6759 43397 -1062 -56681 -13656 48927 16000 -43856 -20933 27681
126 27681 4578 -39452 -15831 25457 8510 -22752 -7769 12972 -7383 -24145 843 18781
138 18781 -4093 -22714 -4774 10770 -4449 -16574 -1543 12177 3083 -11768 -12359 -3662 1823
151 1823 1242 -2852 -2916 2681 3655 -5984 -11457 -2698 6891 3805 -2585 -2839 -3144 -3547 268 2641 -3783
168 -3783 -4025 9104 11176 -10226 -18379 6002 21224 -1843 -19822 1146 20812 170 -20829
181 -20829 -2840 18262 6172 -10927 -2278 7470 -2049 -6160 6727 8268 -5671 -3737 12192
194 12192 6662 -15707 -11080 14849 15733 -8514 -12671 7218 11853 -4581 -10443 2345 9893 4657
208 4657 -1151 -3412 -3381 1113 7126 2782 -6996 -4251 8147 6885 -7384 -10545 3415 12528 3346
223 3346 -8804 -7365 3927 8315 -705 -9902 -3640 10699 10177 -8125 -15811 324 12689 900
237 900 -13093 -4391 10135 4520 -9583 -8730 1801 3403 -1230 -2378 -2692 -4319 -1096 3706 -1441
252 -1441 -9493 -4426 6461 2002 -12516 -10623 5024 8282 -4849 -10800 -1427 4628 -1476 -7674
266 -7674 -7253 -1591 3798 2533 -5789 -10225 -1399 6636 -1152 -13824 -7636 7148 5855 -8468 -10254
281 -10254 2152 6934 -2072 -8058 -4685 202 1637 35 -4034 -5426 1369 7453 256 -10943
295 -10943 -5902 7597 5956 -6358 -6551 5671 8599 -571 -6285 -2093 3513 3729 1262 -1619 -959
310 -959 3784 7413 1763 -5252 -1081 8527 7156 -2644 -5275 4005 10448 5641 -2079 -1422 6572 8965
326 8965 871 -6471 -504 11759 10807 -1054 -3999 6059 10336 1452 -3810 2472 8241 5449 1648
341 1648 1132 846 2061 6204 6425 -1166 -3452 5988 10256 -93 -8215 1727 12943 5633 -6905
356 -6905 -3760 7457 7364 -2448 -5119 1581 6494 2433 -3709 -4689 -332 4038 3163 -1893 -3694 359
372 359 3944 -183 -5729 -5154 1957 5369 -1419 -8626 -5937 3355 3953 -5243 -9060 -145 5545 -1919
388 -1919 -11047 -6742 3261 3331 -4038 -6497 -2663 -205 -1613 -3629 -5244 -4560 -42 2637 -3368 -10218
404 -10218 -4894 5711 3753 -8143 -9196 3068 6811 -5409 -12705 -2223 8109 2440 -7872
417 -7872 -5580 2902 2795 -3406 -5455 -1500 2006 2332 262 -2734 -3704 1184 5657 1926 -4944 -3452
433 -3452 5484 6475 -3406 -7508 2566 10969 3694 -7084 -4105 7048 8208 -1806 -4711 3084
447 3084 9167 4108 -2666 -2669 3229 5888 3377 -214 -737 2967 6790 4332 -2153 -2750 5181 9261
463 9261 1591 -6215 -240 10196 7601 -2862 -4116 5320 8565 -207 -6208 -136 7582 5630 124
478 124 -1798 692 2980 2919 470 -2725 -968 4333 5612 -1955 -6076 832 8143 2706 -7941 -6185
494 -6185 5088 6527 -4084 -8384 1157 7513 908 -7420 -5338 2112 2324 -2424 -3881 -2163 -136
509 -136 454 -1490 -4923 -5211 -14 3707 -1593 -8365 -4808 3887 2457 -6788 -8422 390 5095 -2914
525 -2914 -9565 -4406 3615 2676 -5594 -6866 -1588 1823 -673 -4975 -4724 -879 1800 -388 -4493 -4993
541 -4993 -480 3814 397 -5866 -5486 1825 4590 -2680 -7359 -716 6981 2942 -6403 -5756 3422 5744
557 5744 -782 -4267 221 4117 1958 -1170 -1374 452 2606 3927 885 -2824 -1448 6091 6653 -1422
573 -1422 -4407 3981 8691 1340 -5599 -34 8558 6295 -1562 -2334 3206 5997 2239 -787 228
588 228 4071 6516 3738 -1952 -2251 3950 7831 2920 -2864 552 6525 5283 -1725 -3265 2991 7221
604 7221 3812 -2088 -2708 2406 5901 2840 -3010 -1547 4371 5967 -1192 -5726 -341 6460 4107
619 4107 -3272 -4351 1306 3755 235 -4033 -2873 2543 4839 14 -6560 -4776 2862 3566 -3802
634 -3802 -6421 586 4552 -1240 -7014 -4727 807 1816 -1088 -4249 -4666 -1900 1525 -190 -6065
649 -6065 -5458 2876 4001 -5866 -10657 -1287 6035 -247 -8486 -4630 3158 593 -5706 -5514 -817 1035
665 1035 -109 -1605 -4230 -4375 72 2299 -2335 -6711 -1543 4954 1321 -7263 -5288 3514 5081
680 5081 -2401 -5788 -1069 3649 1391 -3219 -2700 2199 4558 1009 -3747 -3310 2207 3989 814 -1908
696 -1908 503 3925 2794 -600 -2097 553 3883 4353 215 -2507 511 6056 4786 -2236 -2647 5189
712 5189 7605 -260 -5066 1011 8209 4680 -2305 -931 4538 4372 43 -1386 1226 3134 3968 3185
728 3185 -447 -2175 1691 5742 2142 -3484 -508 6787 4783 -4068 -4260 3662 6098 -31 -4009
743 -4009 -621 3004 1744 -919 -2009 -775 2345 3384 -914 -5699 -2506 4459 3338 -4071 -4529
758 -4529 2541 4066 -2455 -6281 -2163 2629 1511 -2048 -3830 -2905 249 1448 -2237 -5760 -1905
773 -1905 3529 538 -6881 -6349 1174 3655 -2355 -5196 -2189 735 -107 -3437 -5009 -2758 2493 2876
789 2876 -3451 -7889 -1721 4604 -261 -7062 -2927 4091 1590 -5744 -5076 786 1327 -402 -583 -1257
805 -1257 -3092 -610 2653 -532 -5675 -1309 7191 3048 -7205 -5593 4967 6045 -3204 -4875 3143
820 3143 5442 -415 -3890 -945 2623 3520 2551 -241 -1516 831 4015 2257 -2068 -528 5589 4886
836 4886 -1587 -3287 2114 5382 3036 -651 -491 2441 4415 2083 -2142 -1214 4821 6801 348 -4129
852 -4129 820 6319 3161 -2734 -199 5142 4407 -677 -1826 98 1953 3760 3088 -359 -2506 1820
868 1820 4880 -20 -4787 153 7073 3167 -5063 -3909 3735 4659 -1676 -3956 262 2924 775
883 775 -1821 -2769 -1037 1679 2281 -1353 -4684 -1545 2660 74 -4615 -3154 2460 3365 -2455 -6157
899 -6157 -3133 1419 821 -2583 -3887 -1596 1094 -508 -4525 -4633 26 3159 -859 -5693 -4146 802
915 802 1322 -3143 -4585 -1601 1608 331 -3646 -4896 -1417 2102 379 -3416 -3604 311 1939 -1643
931 -1643 -5377 -2326 3412 3316 -2335 -4510 -1018 1950 856 -2416 -2068 1247 2502 31 -3127 -2323
947 -2323 2023 3678 331 -2874 -1216 2438 2724 -1245 -2486 1631 5084 2256 -2360 -1746 1824 3406
963 3406 1232 -806 844 3454 3624 238 -2514 -146 4502 4947 -236 -2879 1721 4551 1561 -2281
979 -2281 85 4955 4410 -559 -2200 272 3032 3674 951 -1234 -43 2944 2801 -1421 -2506 2201
995 2201 5481 1122 -3438 -2056 3300 3314 -733 -2151 300 3329 2078 -1850 -3219 -8 3393 1293
1011 1293 -2948 -2402 1577 2624 -1267 -3711 -896 2703 1514 -2262 -3409 -1324 1467 1244 -2154
1026 -2154 -3890 -299 3156 -187 -5403 -3666 2666 2875 -2670 -4870 -614 2443 -488 -3293 -2570
1041 -2570 321 1475 -379 -2628 -3243 -540 2273 198 -3948 -2936 1990 2851 -2494 -4785 -516
1056 -516 3423 982 -3559 -2859 915 2453 -693 -3115 -1154 2492 2454 -1587 -3413 -560 2702 2192
1072 2192 -1073 -1952 525 2488 916 -2008 -1433 1746 3968 1051 -3124 -1603 3104 4092 -536 -2933
1088 -2933 1108 4976 1862 -2550 -1052 3539 4008 322 -840 742 2598 2628 946 -351 258 2809
1104 2809 3871 406 -2417 500 4497 3753 -1122 -1431 3104 4723 139 -2606 277 4627 3561
1119 3561 -623 -1401 1402 3583 1922 -700 -460 1805 2875 977 -1322 -989 1839 3326 937 -2060
1135 -2060 -1038 2409 2569 -1399 -3321 50 3436 1765 -2644 -2660 1523 2702 -610 -3208 -981 2029
1151 2029 998 -2377 -2824 -628 1356 592 -1826 -3045 -1459 1033 69 -2808 -3592 -205 2523 -735
1167 -735 -4930 -3492 1621 1820 -3516 -4528 -680 2198 -1147 -4354 -2902 191 965 -1235 -3072 -2393
1183 -2393 -96 860 -1184 -3408 -2786 606 1343 -2769 -4372 -806 2927 250 -3603 -3151 753 1989
1199 1989 -1178 -3507 -1476 2076 1904 -1357 -3214 -424 2568 1541 -2231 -2603 1154 2605 -3
1214 -3 -2431 -792 2198 2218 88 -2042 -666 2383 2923 -106 -2503 367 4307 2527 -2543 -2144 3181
1231 3181 4307 234 -2137 398 3623 2400 -425 -391 915 2638 2638 25 -1396 798 3836 2261
1247 2261 -2222 -1259 3179 3918 -806 -2616 883 3731 1649 -836 -1010 1014 1919 1283 -998 -1989
1263 -1989 669 2771 856 -3289 -2000 2834 2838 -1734 -3358 233 2531 92 -2121 -1539 497 1065
1279 1065 -141 -2255 -2140 -243 1676 -923 -3918 -2281 1939 1292 -3088 -3893 -201 1558 -991 -3506
1295 -3506 -2400 160 246 -1077 -3073 -2678 -285 1285 -1583 -4263 -1993 2067 888 -3781 -3545 954
1311 954 1710 -1433 -3035 -1169 690 271 -810 -1993 -2022 374 2061 -493 -3587 -1312 2863 1654
1327 1654 -2773 -2587 2202 3406 -835 -3192 -251 2244 1502 -508 -970 13 1469 1946 9 -1280
1343 -1280 252 3581 2627 -1865 -1931 2065 3889 432 -1940 618 3338 2366 -320 -802 825 2571
1359 2571 2271 -154 -1065 1006 3609 2367 -1305 -624 3029 4104 27 -1756 489 3116 2249 -168
1375 -168 -255 1074 2579 1792 -849 -1480 1454 3744 1565 -2403 -1517 2650 3147 -1379 -2393 855 3075
1392 3075 532 -1627 -809 437 1038 619 -957 -1994 104 2491 569 -3295 -2172 2323 2722 -2491
1408 -2491 -4165 381 2705 -733 -3635 -1609 1210 462 -1484 -2011 -1632 -153 724 -826 -3289 -2146
1424 -2146 1202 948 -2659 -3731 -432 2131 -1125 -4026 -2621 597 685 -1806 -3141 -1939 689 1012
1440 1012 -2030 -3508 -981 1849 241 -3653 -3117 845 1514 -1787 -2843 -719 1048 381 -1293 -2127
1456 -2127 -1295 1101 1664 -834 -2758 -363 2773 1363 -2975 -2350 2290 2736 -1363 -2867 -21 2600
1472 2600 1043 -1163 -618 1197 1678 749 -82 -832 672 2842 1823 -1544 -1254 2694 3378 412 -1699
1489 -1699 693 3339 2105 -633 -755 1886 3136 1636 -802 -381 1788 2990 797 -1195 164
1504 164 2833 2624 -730 -1431 1411 2811 1650 -749 -353 1028 2092 1159 -947 -851 1510 2406 35
1521 35 -2052 -857 2347 2221 -1305 -2325 536 2245 94 -2333 -1044 1239 1432 -758 -1929 -1223
1537 -1223 743 903 -633 -2057 -1132 1149 967 -2582 -2874 -263 1790 6 -2866 -2223 299 852
1553 852 -1417 -2373 -1038 692 294 -1874 -2954 -844 1170 254 -2151 -2458 250 1313 -817 -3148
1569 -3148 -1579 1013 1230 -1159 -2562 -741 1263 690 -1763 -2197 55 2096 665 -2026 -2049 1280
1585 1280 2189 230 -1841 -15 2144 1860 -629 -1569 617 2438 1162 -951 -1027 1208 2771 973
1601 973 -946 -146 2507 2777 193 -1502 538 3068 2217 -286 -640 1660 3238 1117 -934 -408
1617 -408 1914 2682 977 -692 -194 2552 2675 341 -1201 690 2973 1953 -888 -993 1680 3006
1633 3006 1006 -1025 -400 2073 2080 -218 -1461 111 2353 1684 -734 -1392 702 1944 850 -1390
1649 -1390 -1478 1338 1578 -106 -2043 -933 1431 1252 -1149 -1921 -238 1675 251 -2002 -2045 2 1548
1666 1548 -349 -2393 -1926 316 815 -953 -2421 -952 1131 371 -1948 -2793 -490 1210 -106 -2438
1682 -2438 -2127 219 745 -997 -2511 -1537 509 802 -1535 -2721 -704 961 155 -1798 -2049 -117
1698 -117 1092 -406 -2339 -1678 144 998 -586 -2385 -1078 1169 608 -1139 -2214 -36 1532 241
1714 241 -2386 -1768 669 1672 53 -1827 -652 887 1041 -164 -1593 -404 1562 1021 -1328 -1639
1730 -1639 354 2161 757 -1687 -918 1715 1509 -401 -1764 -91 1675 1484 -252 -1453 329 1810
1746 1810 1093 -772 -1064 1039 2414 461 -1542 -662 1629 1835 74 -1065 121 1719 1308 -768
1762 -768 -1356 525 2159 836 -1252 -1204 1217 2021 2 -1403 -380 1610 1253 -990 -1521 -9 1550
1779 1550 1148 -656 -1490 340 1574 400 -1923 -1178 1165 1549 -925 -2493 -364 1490 868 -1500
1795 -1500 -1773 -14 984 -79 -1847 -1306 361 1249 -184 -1985 -1624 416 1215 -1362 -2166 -513 1009
1812 1009 240 -2153 -2411 -516 1365 40 -2030 -1836 405 1033 -1295 -2399 -600 1052 320 -1815
1828 -1815 -2312 -613 1191 -143 -1900 -1618 173 614 -713 -1926 -1134 816 1435 -688 -2350 -472
1844 -472 1412 681 -1677 -1588 644 1492 -228 -1971 -947 1477 1507 -304 -1012 -98 1507 1298 -440
1861 -440 -1234 708 2277 1365 -941 -1088 1165 2342 698 -881 149 1972 1713 -94 -807 690
1877 690 2244 1713 -170 -407 1271 1945 894 -791 28 2242 2168 623 -281 116 1807 2221 254
1894 254 -334 1204 2309 1776 -878 -658 1548 2446 978 -1117 13 1857 1558 -404 -953 744 1684
1911 1684 1138 -592 -767 120 1435 1028 -499 -1261 295 1825 -297 -2456 -861 1701 1583 -926
1927 -926 -1937 -103 1020 -189 -1694 -857 605 612 -410 -1863 -1589 -56 748 -483 -2160 -1384 364
1944 364 503 -1558 -2263 -85 1220 -274 -1919 -1716 -162 306 -370 -1594 -1107 217 655 -1092 -2362
1961 -2362 -777 1071 616 -1599 -2125 260 1059 -510 -1411 -634 769 1103 -495 -1436 -864 491 1193
1978 1193 -218 -1726 -87 1802 881 -1597 -1307 1265 2080 -202 -1216 73 1625 1053 20 -378
1994 -378 499 1319 1372 -344 -1072 970 2484 1246 -1037 -661 2009 2036 -14 -920 485 2072 1074 -75
2012 -75 -488 336 1563 1467 -125 -787 849 2195 757 -1388 -293 1963 2073 -465 -1176 638 1709
2029 1709 646 -670 -702 387 1229 892 -743 -1053 747 1714 -24 -1848 -772 1783 1004 -1446 -1903
2046 -1903 479 1390 -63 -1633 -1475 175 531 -164 -1642 -1329 347 994 -762 -2332 -763 909
2062 909 388 -2006 -1935 137 1003 -812 -1885 -1267 -109 532 -576 -1580 -1529 145 609 -1086 -2297
2079 -2297 -939 1412 98 -2062 -2185 163 795 -757 -1846 -1082 179 262 -809 -1300 -1157 531 1003
2096 1003 -647 -1534 -470 1442 253 -1672 -933 813 1384 -664 -1465 -366 1017 956 -198 -660 16
2113 16 540 989 -266 -1006 396 2039 755 -1274 -972 1241 1745 -132 -833 749 1693 972 -317
2130 -317 -493 589 1409 1274 -167 -634 642 2015 1098 -888 -506 1859 1841 -211 -1074 832 1968
2147 1968 874 -235 -143 915 1165 694 -433 -526 984 1718 673 -1273 -266 1629 1760 -667 -1502
2164 -1502 871 1744 224 -1040 -474 759 1091 372 -803 -694 333 1008 65 -1465 -614 1067 1096
2181 1096 -1360 -1748 283 1375 -27 -1873 -1038 324 513 -798 -1483 -938 418 371 -771 -2002 -922
2198 -922 862 288 -1701 -1576 318 724 -691 -1848 -990 591 259 -1085 -1542 -707 336 377 -982
2215 -982 -1778 -71 1150 -81 -1899 -1480 602 1076 -669 -1518 -443 832 431 -944 -1110 -1 498
2232 498 449 -723 -914 21 1268 503 -1156 -820 1057 1399 -301 -1304 88 1329 818 -493 -613
2249 -613 763 1368 226 -580 -449 1077 1508 448 -837 -216 1567 1434 -397 -824 379 1437 847
2266 847 -554 -395 812 1463 653 -752 -206 1052 1920 436 -772 -91 1616 1224 -462 -672 776
2283 776 1899 547 -204 -176 964 939 306 -297 -222 600 1120 -429 -997 -58 1278 744 -864 -1041 461
2302 461 1002 27 -1262 -745 708 815 -370 -1341 -901 469 717 -711 -1479 -424 869 103 -1572
2319 -1572 -1260 -13 776 -359 -1639 -1111 -28 376 -941 -1542 -791 652 79 -1413 -1695 -342 752
2336 752 14 -1403 -1575 -104 547 -881 -1666 -834 671 384 -953 -1689 -536 426 51 -889 -959 24
2354 24 799 -194 -1573 -801 1103 1395 28 -1308 -219 1036 720 -666 -1238 596 1102 473 -856
2371 -856 -673 843 1200 310 -851 -67 1212 1010 -336 -938 284 1276 944 -569 -753 518 1288 685
2389 685 -420 20 1260 1517 180 -1003 -79 1968 1410 -179 -608 659 1698 522 -537 -428 1157
2406 1157 1567 437 -610 -126 1283 1498 -31 -646 635 1319 721 -1100 -738 766 1456 445 -1067
2423 -1067 -563 783 687 -270 -698 -366 1058 913 -333 -1305 -126 870 367 -1241 -890 703 637 -800
2441 -800 -1457 -628 633 392 -276 -1421 -383 343 19 -1003 -1030 -129 823 -455 -1797 -1147 240 619
2459 619 -422 -1354 -634 256 23 -1147 -1571 -212 709 283 -1182 -1273 18 640 -676 -1538 -591 562
2477 562 526 -867 -1616 -216 408 388 -980 -1109 137 241 243 -1030 -546 398 922 -86 -1266 -796 870
2496 870 605 -301 -880 393 1044 173 -607 -366 746 1064 422 -288 -338 938 1024 180 -525 27 1547
2515 1547 811 -350 -674 799 1569 851 -157 -294 875 1281 243 -482 156 1203 1130 60 -527 53
2533 53 1107 1151 -433 -340 892 1506 297 -707 -404 764 1238 -14 -544 -382 930 742 -213 -852
2551 -852 435 1113 456 -915 -672 300 897 32 -855 -346 835 536 -685 -905 -184 686 448 -556
2569 -556 -1267 -157 855 105 -1247 -956 502 1063 -480 -1367 -547 663 276 -893 -1305 66 452
2586 452 120 -1283 -1093 107 1014 -10 -1524 -992 226 730 -566 -1435 -551 721 201 -1198 -1231 231
2604 231 875 99 -1127 -861 383 570 -365 -1238 -391 745 626 -762 -1031 -64 962 390 -936 -746
2622 -746 716 733 -68 -941 -599 583 1083 -2 -1051 -43 905 813 -588 -613 584 1511 334 -888
2640 -888 -332 630 924 71 -305 588 902 995 -107 -653 283 1543 980 -604 -395 613 1481 295 -320
2659 -320 280 1184 827 -34 -489 357 1052 1020 87 -348 501 1123 389 -583 -436 1036 1208 256 -718 53
2679 53 857 940 -20 -519 277 854 246 -476 -586 306 1085 364 -706 -756 477 1064 -290 -1166 -233 765
2699 765 203 -737 -1065 49 623 -56 -736 -387 21 405 -201 -1295 -688 171 749 -505 -1327 -707 333
2718 333 243 -1100 -1148 284 685 -430 -1292 -1055 208 498 -203 -1236 -1093 163 -246 -865 -1335 -229
2736 -229 769 52 -1268 -928 -414 285 -309 -1013 -690 200 520 -406 -1031 -502 919 646 -602 -1045 -75
2755 -75 1102 172 -1144 -547 659 1004 -368 -727 -375 900 577 -89 -491 -89 768 573 -570 -1026
2773 -1026 650 1148 153 -861 -177 982 926 -119 -258 510 1315 992 -433 -285 521 1100 866 -283
2791 -283 -429 897 1358 32 -1051 -152 1300 1136 -340 -676 385 1239 728 -672 -446 669 858
2808 858 60 -585 -106 707 912 -179 -937 261 766 222 -716 -549 458 587 -8 -589 -723 238 739
2827 739 -262 -920 -499 307 368 -829 -1269 -494 755 266 -1118 -801 204 333 -432 -1301 -550 151 17
2846 17 -652 -1247 -678 -45 253 -890 -1226 -209 595 -354 -948 -900 268 465 -292 -1138 -716 264 493 -697
2866 -697 -872 -83 314 75 -781 -573 63 775 237 -813 -561 607 191 -283 -476 -229 743 409 -238
2885 -238 -739 219 900 453 -102 -306 905 1028 112 -531 -59 748 899 237 -450 418 1074 105 -324 -211
2905 -211 923 1044 715 -124 -139 781 1389 346 -339 410 958 856 119 -405 711 1280 687 -305 -37
2924 -37 699 911 216 -548 -167 499 827 -130 -666 116 841 773 -299 -749 520 727 198 -786 -214 565
2944 565 980 93 -773 -337 399 732 -482 -959 -67 1002 170 -631 -706 338 691 -171 -890 -629 481
2963 481 330 -379 -646 -270 345 278 -888 -1048 -452 743 246 -1180 -1030 352 702 -383 -1066 -592 585
2982 585 291 -728 -883 -264 476 250 -865 -857 65 520 -131 -1046 -807 40 563 -297 -1086 59 276 164
3002 164 -559 -688 -14 548 55 -717 -757 208 739 -122 -729 -219 695 541 -349 -614 291 1049 308 -595
3022 -595 -466 750 718 189 -523 -126 807 1046 -39 -607 31 997 1002 -462 -520 542 1090 367 -701 -48
3042 -48 537 747 178 -214 -162 567 747 -116 -557 278 952 673 -254 -353 557 1047 249 -292 -261 851 882
3063 882 -34 -657 -205 488 393 -452 -728 -83 796 684 -459 -554 319 485 51 -759 -370 190 324 -176
3083 -176 -822 -424 76 380 -474 -603 -312 272 26 -605 -786 187 476 36 -869 -291 577 144 -546 -1090
3103 -1090 -241 -1 -197 -761 -755 23 367 8 -1159 -554 432 291 -250 -1208 -399 701 60 -920 -689 75
3123 75 537 89 -683 -769 417 546 -175 -946 -542 301 553 -442 -1002 31 670 398 -500 -477 156 530
3143 530 163 -431 -407 503 814 21 -410 -221 804 703 -40 -443 572 778 508 -300 -44 704 873 278
3163 278 -312 -38 923 755 105 -83 104 1179 746 -344 -495 648 1021 290 -372 -179 423 428 68 -584
3183 -584 -191 791 560 -6 -418 1 771 690 -488 -377 767 1024 -55 -780 -596 567 595 -250 -373
3202 -373 -63 649 101 -598 -686 2 574 171 -839 -561 502 643 -499 -968 -123 262 31 -651 -620 58
3222 58 337 -94 -659 -831 65 533 -169 -739 -445 407 451 -385 -940 -538 394 213 -792 -583 23 188
3242 188 -163 -714 -668 16 830 -294 -872 -287 619 306 -982 -616 -49 126 -344 -627 -797 -83 376 -200
3262 -200 -491 -315 258 570 -136 -680 -345 460 261 -206 -584 -70 697 135 -385 -324 362 337 229 -444 29
3283 29 548 652 -28 -459 -101 713 414 -539 -470 235 829 -83 -517 -258 573 768 120 -210 98 708 471
3304 471 -36 -401 234 1148 518 -453 -465 649 433 2 -341 -287 544 624 -155 -655 -72 577 505 -348 -492
3325 -492 296 756 413 -604 -351 516 823 -20 -853 -91 448 224 -380 -512 102 579 332 -525 -667 303
3345 303 477 -166 -641 -399 550 525 -378 -1009 -268 608 200 -465 -599 -179 349 -154 -534 -865 140 456
3365 456 -227 -724 -537 268 238 -857 -858 -86 504 -219 -899 -656 357 459 -53 -569 -408 165 364 -273
3385 -273 -961 -356 439 108 -505 -675 -163 684 210 -588 -698 446 181 -195 -533 -396 316 541 -139 -438
3405 -438 -184 818 399 -109 -211 292 312 143 -554 26 599 467 -171 -302 313 531 500 -104 -533 63
3425 63 903 424 -196 -320 157 1033 9 -146 295 599 581 104 -302 424 727 564 -161 -276 283 733
3445 733 522 -362 -209 643 652 59 -291 69 467 729 -39 -285 -20 702 64 -297 -270 483 743 114 -322
3466 -322 -160 191 417 -190 -509 -21 522 115 -64 -672 237 488 208 -539 -516 45 338 -204 -473 -289
3486 -289 76 151 -440 -584 -233 467 -74 -608 -621 36 199 -483 -851 -500 146 190 -427 -665 -254 340 79
3507 79 -437 -424 40 124 8 -694 -578 37 597 -109 -401 -489 414 111 -251 -739 -47 506 185 -458 -351
3528 -351 246 588 157 -217 -390 508 488 -109 -405 -38 760 401 -101 -323 200 746 409 -490 -100 513
3548 513 458 146 -380 74 549 543 -134 -188 238 540 507 -324 -12 455 678 311 -442 -143 793 665 301 -493
3570 -493 274 890 597 -382 -245 277 621 331 -31 -451 354 216 168 -536 -12 476 572 -202 -360 204 646
3591 646 134 -75 -177 121 341 211 -612 -503 214 236 63 -597 -390 240 -94 -510 -562 53 736 -97 -470
3612 -470 -563 -90 247 -432 -497 -291 384 123 -150 -778 -227 152 54 -666 -547 -279 415 -109 -730 -524 1
3633 1 402 -370 -794 -268 274 36 -579 -469 -152 411 24 -279 -230 -198 141 -75 -718 -132 286 449 -315
3654 -315 -242 394 550 618 -380 -511 -50 560 182 -57 -274 279 396 -81 -405 -83 779 443 -192 -306 98
3675 98 305 443 63 -291 771 683 136 -340 -42 510 544 -39 44 -296 586 389 23 -166 71 1159 239
3696 239 -302 -106 426 722 85 -322 -37 634 724 -70 -280 -167 718 96 -237 -110 254 719 256 -205
3716 -205 -224 377 339 -186 -511 -17 636 388 -342 -514 -145 297 88 -652 -72 199 428 -205 -391 -340 346
3737 346 359 -369 -746 -54 289 6 -418 -651 -57 212 -188 -633 -316 316 263 -15 -879 -267 186 -146 -696
3758 -696 -599 82 134 -9 -715 -273 454 175 -221 -490 -295 -27 361 -408 -598 54 517 130 -501 -315 -67
3779 -67 502 -111 -421 -454 152 554 -281 -579 -317 366 510 -243 -385 3 423 348 -115 -379 523 501 -88
3800 -88 -412 -88 12 394 -159 -183 96 248 368 -274 -37 519 179 -30 -468 -198 494 749 -102 -241 6
3821 6 345 477 -218 -196 355 539 275 43 135 357 478 101 -252 -2 569 139 -301 -315 67 280 422 -246
3843 -246 -255 172 499 153 -188 -205 141 399 -163 -328 -147 247 287 -134 -446 -451 204 136 -443 -684 -43 128
3865 128 200 -383 -410 -71 350 -295 -664 250 242 199 -350 -606 -329 343 -279 -484 -563 203 570 -170 -674 -142
3887 -142 423 29 -50 -358 -361 174 159 -479 -658 222 343 -118 -556 -495 -13 200 -335 -487 -311 193 349 -328
3909 -328 -289 188 177 277 -494 -173 121 473 -80 -280 -160 270 663 -79 -544 114 538 276 -92 -196 392
3930 392 373 -34 -161 191 601 540 35 5 73 627 328 -353 48 312 501 280 30 -177 157 482 187
3951 187 -245 -2 412 103 40 -115 143 572 349 -242 -377 450 406 19 -406 -106 271 110 -121 -416 -81
3972 -81 507 262 27 -304 121 456 260 -182 185 -25 503 53 -223 -291 -4 268 -45 -86 -165 192 231 -463
3994 -463 -226 -73 356 141 -374 -325 418 181 -106 -431 -468 1 374 -276 -808 211 130 -238 -263 -545 38
4015 38 202 -272 -269 -344 1 135 -426 -597 -245 197 79 -555 -467 30 584 -164 -157 -477 219 178 156 -362 90
4038 90 149 284 -221 -372 59 165 135 -170 -194 187 375 45 -276 202 268 1 8 -384 152 490 256 -189
4060 -189 -343 104 492 -58 -422 -118 321 480 12 -448 104 557 562 28 -179 201 113 267 -20 -86 -99 695
4082 695 233 85 -460 226 511 -158 -97 212 326 177 -23 -357 229 232 416 -392 -276 275 336 73 -361
4103 -361 34 11 304 81 -391 -180 71 -110 -202 -471 158 166 -74 -285 -207 -1 231 -490 -456 -244 32 130
4125 130 -362 -182 51 64 -206 -350 -101 79 373 21 -594 -258 394 163 -242 -605 -102 411 -37 -455
4145 -455 -370 -268 -40 -285 -514 -279 220 -46 -335 -566 -638 254 417 -263 -420 26 193 152 -450 -269 86
4166 86 520 -171 -117 -81 229 368 -165 -296 75 289 -53 -67 -97 17 535 54 -424 -117 420 156 17 -441
4188 -441 -234 179 232 16 -236 106 526 445 -279 -431 208 338 -5 70 144 331 415 -227 -471 118 445 428
4210 428 -289 -273 153 365 271 -116 -201 218 304 174 92 -46 504 280 79 -501 64 267 116 35 -424 293
4232 293 291 -92 -193 -364 132 59 -12 -258 -135 92 80 325 -420 -106 275 19 -220 -6 54 330 62 -273
4254 -273 -172 88 207 18 -371 -86 173 -117 -384 -216 8 -35 -6 -223 -388 -143 49 -98 -253 -237 -36
4275 -36 172 -274 -379 -491 250 184 -327 -258 -174 174 36 -320 -215 306 81 -218 -103 43 477 375 -440
4296 -440 -491 -8 262 195 -434 -11 -168 316 61 -335 -44 74 168 -26 -157 87 200 317 -120 -240 189
4317 189 163 -40 -442 -42 205 154 -37 -13 76 543 124 54 -151 247 440 86 -38 -189 169 491 169 -91
4339 -91 -240 389 586 203 -371 177 256 9 90 -505 156 -127 305 -245 -171 244 297 -243 -556 88 298 291
4361 291 -427 -386 284 469 468 -240 -276 31 80 138 -404 90 -50 -131 -133 -174 119 219 208 -184 -222 -383 518 -95
4385 -95 -150 -221 120 120 -135 -94 -269 15 244 -244 -303 141 291 21 -335 -362 -125 125 -152 -499 -359 -24 86
4408 86 154 -543 -252 -64 -48 -538 -46 37 327 -139 -455 -303 -3 266 -88 -133 -139 218 113 -248 -253 215 237
4431 237 49 -270 -219 151 533 -12 -83 -123 162 373 -35 -141 -28 239 21 -268 -45 35 215 208 -153 -250
4453 -250 243 550 -78 -54 113 413 122 322 -11 201 310 438 -179 -115 101 244 294 -24 231 153 21
4474 21 -204 -247 -110 173 243 -203 -176 -194 559 -141 -54 -61 296 499 145 -132 195 356 259 -185 -144 -160 168 181
4498 181 -480 14 -127 218 -127 -586 -537 490 334 42 -368 -130 73 122 -180 -280 -341 194 -462 -519 -93
4519 -93 -60 269 -109 -233 -416 -171 63 -270 -351 179 224 2 -198 -138 122 453 -119 -56 -133 165 -12 -79 -416
4542 -416 99 375 390 -345 -234 -209 -54 -371 -44 -265 -134 173 37 -118 179 279 158 -65 -112 116 219
4563 219 177 -78 -373 187 530 232 -48 -77 296 266 257 -69 -83 526 191 325 -35 273 261 172 -110 -66 236
4586 236 -42 -64 -322 99 464 405 -53 -241 -154 59 263 106 -151 9 44 65 -155 -236 405 272 125 -19
4608 -19 -223 279 120 -8 -137 157 237 208 -150 -395 134 185 261 124 112 265 149 -320 -48 -266 183 148
4630 148 -232 -67 -347 133 -98 -337 -120 132 -117 -91 -189 -28 -78 88 -131 -77 217 267 209 -484 -358 14
4652 14 45 -282 -297 -308 357 228 99 -427 12 260 151 -172 -139 98 377 -142 -247 -307 135 245 -157 -249
4674 -249 111 294 261 -40 -290 8 16 204 -401 -275 14 93 -85 122 -113 211 196 88 -519 164 168 362
4696 362 -99 168 -59 194 295 -58 -195 322 -21 22 -6 -263 631 334 -120 -106 -100 298 385 -333 -141 292
4718 292 161 402 -34 -352 25 243 -76 -207 -86 249 224 34 -4 360 604 95 -449 -42 48 13 -27 -261
4740 -261 -240 156 113 -397 -325 -63 463 142 -7 -80 232 57 136 -101 -147 142 21 111 -367 -32 344 198
4762 198 -313 -146 -8 204 -188 -269 -156 281 -18 -155 -208 -74 38 7 -81 -280 69 496 -95 -377 -281 -47
4784 -47 368 91 -160 -218 -85 307 -426 -266 -228 15 -306 -156 -598 -210 104 -79 -201 -403 191 238 -56
4805 -56 -366 341 114 50 -104 -160 103 -14 31 -242 -82 -17 354 -78 -428 -398 89 126 -156 -265 126 252
4827 252 143 -184 -189 173 426 274 92 -11 119 520 -26 -263 -281 199 219 102 -142 192 281 289 112 -16
4849 -16 11 -71 54 69 63 -43 101 -37 -202 232 112 177 9 -17 73 249 259 -217 81 360 -243 -29 -44 10
4873 10 143 206 -249 -138 167 192 -20 -115 -337 158 -12 -62 -257 14 78 50 -102 -223 64 -298 -210 -249 -103
4896 -103 -110 166 -48 -104 -104 32 -11 -23 -285 -136 -6 72 -60 -90 -111 264 199 -125 -261 -130 93 47 -278 -132
4920 -132 90 -228 -154 -150 -152 182 -84 -490 -245 -287 120 -269 95 -512 60 368 -108 -329 -295 159 51 -72
4942 -72 59 -107 283 -54 -48 -61 26 128 -139 -486 -117 -54 449 51 -133 21 -5 409 -226 -244 -14 161 76
4965 76 -165 25 172 20 131 -105 33 221 176 127 -180 117 293 -20 99 -63 86 215 -341 113 35
4986 35 242 170 -223 -205 -318 28 36 82 -246 99 322 205 -306 49 95 158 441 -262 36 255 189 -200 -146
5009 -146 244 2 -121 -132 -74 -74 -123 282 -401 -165 -202 57 62 131 -335 202 -42 0 -271 -428 297 102 -48
5032 -48 -274 -39 87 -31 -153 -46 -3 -107 -238 -111 -12 41 -224 -181 -197 -8 49 93 122 98 237 142 52 -328
5056 -328 -97 35 -11 -194 24 -214 270 81 -105 -136 -32 386 26 133 -55 -11 280 227 -196 -95 311
5077 311 158 -147 65 -104 8 73 -301 168 122 -34 232 -23 -120 293 300 30 -257 93 1 52 -128 -560
5099 -560 110 -39 -194 82 -74 -90 38 117 83 -96 -52 411 -5 -7 261 134 67 -290 97 4 45 136 -165
5122 -165 -167 -91 148 95 57 -102 62 327 133 207 -140 133 -110 -364 -56 -165 -66 11 -117 -40 276 -291 -44
5145 -44 -279 -123 -64 -3 133 291 -27 -153 -107 8 -322 128 50 -190 -80 27 272 169 -25 -206 181 16
5167 16 -139 -47 -31 167 64 -71 -189 -58 -105 -12 -465 -322 57 1 134 -167 -173 20 -76 74 -203 -36 85
5190 85 98 -54 -377 73 -6 76 -72 -80 62 54 50 -236 14 174 138 163 28 -14 79 181 -44 -390 209 -63 -32
5215 -32 -31 -49 116 203 267 -28 -172 90 100 -57 -124 30 116 -11 3 -106 10 281 150 -165 64 -69 154
5238 154 -195 -17 170 133 276 -76 126 271 123 -211 91 92 97 371 -2 71 -104 -242 162 -26 -331 -93
5260 -93 130 58 96 186 -100 -105 118 65 75 122 190 -43 -360 -242 -269 178 -40 -201 21 421 22 -97 -252 150
5284 150 119 -34 -29 -187 70 89 -105 -477 -46 -80 -282 -5 -212 107 -119 84 -255 13 -168 45 215 -213
5306 -213 -315 -5 64 136 -46 116 344 33 -13 -133 225 173 -100 -256 -108 33 155 -66 -42 75 -57 -177
5328 -177 52 -66 -84 107 -95 153 -124 -219 -125 70 39 -55 153 140 43 25 169 293 -75 -88 -25 220 251 15
5352 15 314 -76 -130 208 -7 -20 440 -91 306 17 -452 297 208 354 52 -89 291 223 134 -333 -105 193
5374 193 64 7 -242 -97 220 147 17 -22 -148 -120 110 185 -225 -111 -72 18 -390 -198 146 117 22 -251 -45
5397 -45 31 304 -289 102 154 173 -64 -84 28 -88 -225 -335 -357 88 -142 -30 -10 -66 125 73 270 -5 -213
5420 -213 -143 30 128 -283 -52 -28 -101 -201 -157 -183 36 -88 4 -9 -17 58 -69 -483 -105 56 -104 413 -191 208
5444 208 -7 110 -163 -62 -195 406 171 112 9 32 -7 -36 84 -124 95 34 41 -55 91 -121 -27 -90 -349
5467 -349 166 256 -259 -128 189 90 308 -77 -181 66 -31 197 45 -2 94 246 -9 -108 -225 332 215 187
5489 187 199 32 191 153 87 -7 139 125 53 -173 -246 317 -36 -330 -296 107 140 220 -359 -334 289 513 55 -101
5513 -101 53 -152 284 73 92 -51 -69 102 108 -301 -79 2 231 -145 -88 1 -143 24 96 219 147 240 217 -123
5537 -123 -307 -12 9 188 -78 197 28 219 17 -426 -155 124 -177 -209 -25 110 307 -259 -222 164 103
5558 103 -48 -124 -168 -196 166 -97 -159 23 152 -6 34 -163 190 -122 -78 -47 -250 -64 -119 184 -23 -90 72
5581 72 119 41 -28 236 -14 0 2 22 -165 -125 143 -34 39 123 -142 162 -131 211 243 79 112 -96 -95 107 205
5606 205 -82 157 108 305 234 -165 -166 57 -5 -155 -69 -27 23 361 48 -186 153 396 -47 -138 -123 32 117 83
5630 83 0 104 192 146 129 66 206 52 241 200 48 -190 -36 217 30 -16 65 130 208 -149 118 -30 27 -31
5654 -31 -50 147 360 4 -162 -120 49 -103 -13 -52 35 20 -9 -15 -237 -150 -211 -74 47 -131 27 26 29 168 -158
5679 -158 76 83 121 76 -10 176 -146 -86 -80 -39 -90 -44 -144 149 201 157 6 167 -71 51 241 -155 199 -107
5703 -107 220 -13 163 -212 36 111 172 -220 -240 184 203 90 137 -155 148 -56 73 171 -181 287 230 -174
5725 -174 -356 -22 109 56 40 57 85 155 -35 -4 6 -164 277 -396 -91 79 -197 65 204 -140 208 19
5747 19 147 -251 -4 237 196 202 9 -12 -30 225 -195 403 -69 131 43 -212 52 -256 124 -39 -192 183
5769 183 236 45 -79 -193 -63 180 -139 -36 -278 138 62 -224 -45 -271 -49 58 40 -141 -89 5 -223 277
5791 277 -58 -303 194 -151 256 -135 -209 -93 -171 -189 97 265 -27 -419 -54 -189 -17 -264 -85 -130 154
5812 154 145 78 -196 -316 82 -51 -124 -132 -46 111 103 127 -102 -299 -125 50 -35 -188 221 -103 112 -83 202 79
5836 79 -11 360 -38 -208 89 -149 -92 190 -404 -76 229 31 -60 154 -81 -50 -55 23 160 14 33 190 72
5859 72 236 123 -309 -248 -141 251 -223 98 -124 254 46 -5 261 -111 235 -138 -211 -20 253 96 -149
5880 -149 -103 109 297 -45 221 33 105 154 146 59 -54 120 -24 261 -319 80 -181 204 -149 -30 -172 -179 -126
5903 -126 22 -56 -325 219 43 -22 -370 -164 82 135 -114 -241 94 -45 -233 -292 -120 232 108 -261 -94
5924 -94 -25 195 -290 -122 -108 244 88 135 -120 -177 -130 15 -242 -23 -42 38 125 -222 18 -43 -23 179 -28 -96
5948 -96 -49 -206 152 45 -128 24 100 -103 121 -273 11 192 -373 117 -115 -121 44 -121 371 48 156 198
5970 198 -173 76 33 -210 -56 -33 -154 -35 55 102 -14 126 245 80 -264 -57 31 -192 -90 162 54 -72
5992 -72 74 138 -55 134 133 53 102 -166 40 157 143 18 -26 108 -133 71 -234 -54 186 199 -121 -211 106
6015 106 203 174 -117 53 373 64 42 -91 -179 -282 78 16 -281 -99 180 129 94 -6 4 202 -68 221 -217
6038 -217 6 -163 -172 120 5 275 -35 -241 26 -235 -258 -2 -155 -139 204 45 -68 -145 -44 173 112 -353
6060 -353 38 -1 -1 -222 -143 57 239 402 45 15 -73 210 226 -184 -162 4 -69 -101 77 -166 -150 206 125 77
6084 77 62 328 55 120 -203 -56 -259 192 106 -79 -98 -61 14 96 1 192 137 2 -62 259 93 185 -88 -151
6108 -151 -24 11 226 169 -85 110 92 -89 -61 -52 29 -175 270 110 -39 44 151 -17 168 -96 -142 111 -128
6131 -128 -96 14 238 -105 -89 -111 91 279 -67 -320 236 35 -43 -42 -33 -96 85 -36 -29 -82 310 -89 -137 288
6155 288 24 81 -193 22 -134 -170 284 -42 -222 -249 -94 277 -158 -181 127 -198 -182 -67 40 -186 88 -68
6177 -68 -315 -272 -265 -89 59 -106 53 -9 69 -47 -122 -82 -206 -250 -227 -112 0 132 -137 109 -14 -99 297 135
6201 135 230 -115 15 -251 10 52 131 34 -198 44 -263 118 -4 -8 -268 -37 -281 255 84 256 18 171
6223 171 155 37 26 -77 35 80 140 -65 -1 138 -15 98 203 303 121 58 -309 122 209 98 104 53 50 146
6247 146 215 -206 86 -2 257 -8 -21 -125 -138 353 -113 54 -34 -21 4 -275 -225 212 134 -16 -306 -30 -129
6270 -129 139 -167 58 -197 177 49 -318 30 67 222 -174 -205 -75 -69 -47 37 -276 131 33 -113 -111 -277 184
6293 184 -323 -77 -160 156 132 42 38 -67 -27 -43 247 -6 -79 270 -49 301 -192 -179 -235 -31 -80 -310 -110 169
6317 169 79 -178 -89 152 2 -24 -217 -266 11 112 -94 -99 -149 -164 132 57 18 -21 -45 61 -141 -87 185 289
6341 289 -96 71 -176 49 7 339 -303 8 293 16 223 -283 -96 144 110 272 -20 13 263 127 11
6362 11 -44 -7 -127 113 -148 65 18 22 89 -82 43 165 168 191 -188 144 112 133 -102 0 -57 92 -93 -60 246
6387 246 19 90 115 -69 198 -26 -132 -45 10 273 144 8 -93 -327 198 270 -202 -231 52 230 16 -134
6409 -134 -42 129 -51 119 -13 -191 207 267 -135 -43 -307 -62 70 -167 -56 -72 -46 79 -2 -143 -12 -28
6431 -28 185 -195 51 -126 273 161 -7 145 -1 234 -10 -319 -83 23 -42 140 -37 52 229 -216 235
6452 235 37 -131 8 67 -242 -192 -12 125 -9 -34 16 -1 0 84 -61 -185 286 131 -70 -305 -51 -42 -59 41
6476 41 -215 224 -63 -70 220 15 -31 -75 -312 -51 87 164 72 -188 -101 116 43 -49 192 -4 170 201 -176 49
6500 49 -68 -127 140 84 -9 67 58 3 139 -161 11 112 -379 -246 94 81 91 -77 -129 396 33 -108 105 113
6524 113 240 238 -363 190 11 15 195 -111 -285 20 286 -272 106 -23 393 158 -111 71 176 91 32 -136
6546 -136 -144 22 72 -73 -181 9 67 -124 100 -208 21 -54 -148 -253 -515 -8 320 311 -306 -80 288 -131 74
6569 74 -197 -1 7 -50 172 -84 -269 -25 -107 -176 -21 316 235 -92 188 283 84 -10 -147 -197 -44 358 205
6592 205 -69 -189 -22 244 248 174 -156 148 -69 153 -106 18 236 -129 79 219 233 116 19 -220 -42 -54
6614 -54 284 87 -253 -46 366 364 -158 -76 18 321 205 36 66 -72 218 -53 -30 147 14 22 -54 -192 -46
6637 -46 136 27 101 46 -75 64 -27 51 48 169 -71 -213 -240 -72 205 82 -406 85 198 187 -134 -303 -138
6660 -138 -154 6 -21 162 13 66 -286 38 -165 -20 140 18 -162 -175 -169 -26 287 340 -17 188 -333 59
6682 59 53 -223 -155 272 -193 -120 188 -203 -269 -60 -186 -42 479 -4 282 -362 53 231 -217 -327 -35 -154
6704 -154 94 -179 -173 131 317 -81 -206 269 -65 269 234 -324 -99 47 -355 27 -161 44 -20 17 121 100
6726 100 123 -142 318 -165 148 -292 224 124 -228 -156 74 73 82 -412 -315 117 149 150 -236 93 -162 -178 -31 -126
6750 -126 136 -209 84 -275 66 -282 -82 -220 -153 110 -173 47 -248 73 79 61 -60 313 -169 22 -115
6771 -115 -137 260 -53 -15 52 -32 -137 131 217 285 33 -67 -88 80 80 -37 -114 85 132 -199 128 121 -56 -99 -23
6796 -23 -345 -205 -74 59 -35 224 91 18 29 -73 -104 -126 -5 -179 107 4 238 0 -7 -95 222 -26 56
6819 56 -180 -119 78 183 144 -170 115 -143 -269 -263 104 158 -69 130 -122 -24 57 -99 68 -272 38 166 175
6842 175 -30 -99 -281 80 -220 -266 197 -64 195 -90 -382 56 77 62 -410 176 63 -21 -78 -102 -106 67 54
6865 54 -60 80 -212 110 164 98 19 31 -232 80 -9 -9 1 156 252 -193 -16 -157 146 67 -107 -61 -110 291
6889 291 -38 -230 -94 22 -21 -30 -21 -14 117 9 9 53 269 -152 -5 8 -125 -71 119 -137 -138 162 132 70 -264
6914 -264 -316 -143 1 -17 -264 155 -273 133 90 4 164 -197 348 -66 -183 -109 183 228 285 128 -120 152
6936 152 -21 -19 -43 -134 23 -46 -263 -32 80 -121 -121 111 12 -233 18 -144 -15 -319 -133 -103 -179 79 25 57
6960 57 -207 -2 175 -60 -26 -22 -105 324 -107 -151 -31 263 -104 -95 218 -202 -135 108 93 -110 -3 -76 301 3
6984 3 -21 -83 -52 -90 -120 140 309 -132 54 -68 -341 85 347 66 -57 -179 -130 -181 91 -135 -275 103 -10
7007 -10 35 -116 -8 42 -149 171 -347 17 50 -86 146 -108 85 155 -10 -151 76 116 31 131 -97 -147 -164
7030 -164 99 11 52 57 -101 38 -154 86 74 209 -117 -122 -187 170 -172 -423 -122 13 235 -7 -158 -17 288
7053 288 22 -69 -99 277 356 274 149 4 275 33 -59 -6 -51 83 136 -49 97 -225 107 348 -85 -217 -108
7076 -108 -145 296 -96 37 192 -70 -10 -192 -187 -61 -245 -276 -68 95 8 31 -229 -235 -186 262 -120 -314 -151
7099 -151 -108 155 -93 -243 103 46 261 -159 22 -108 33 7 -92 -10 147 -46 18 -306 171 -23 -103 21
7121 21 -49 33 477 45 -158 -172 -432 180 59 -169 222 83 -16 -7 183 477 -6 76 220 72 62 26 -173
7144 -173 213 -151 -151 -105 2 42 -122 213 -61 4 -119 -145 168 -11 -154 2 168 64 65 78 -9 147 88 -86
7168 -86 85 -312 -53 -65 -75 19 -151 125 -103 -240 -186 114 311 161 29 -67 148 204 -83 -20 221 148 -178
7191 -178 -230 -141 121 54 -340 -117 321 232 -195 104 -143 -253 -124 -90 -234 -63 -217 34 77 -60 123 -113
7213 -113 -57 -260 -404 -225 -483 146 -119 -157 -260 -25 160 -254 -74 77 46 18 -269 15 237 199 122 -55
7235 -55 -118 -65 124 19 -72 29 104 5 267 0 234 390 136 55 184 31 60 -10 -61 42 223 207 -66 -10
7259 -10 -87 52 -142 97 132 254 -108 -144 48 67 44 -143 163 -160 -77 122 92 7 45 -41 152 59 -130 -310
7283 -310 154 52 325 155 -212 154 136 4 -124 229 415 -36 -226 49 4 103 359 35 -9 78 162 -90
7305 -90 -160 65 260 176 20 -49 -51 -39 113 -140 166 69 88 -10 -107 -78 -23 44 -155 -215 10 6 -117 -72 -47 457
7331 457 366 30 -45 5 22 160 -411 11 -139 -355 -283 -111 26 -33 -223 -14 -108 -91 116 45 -56 80 -1
7354 -1 -82 223 -107 -275 268 3 60 -59 -200 59 -145 46 53 -40 79 -20 380 -19 -48 33 114 16 83 -190
7378 -190 -8 -2 60 -85 232 32 44 -182 47 -261 89 -24 -27 -190 169 69 133 191 274 300 -197 -349 41
7401 41 266 128 296 -238 -110 -42 140 37 47 225 171 68 54 -273 -119 269 145 -19 -39 155 -86 85
7423 85 -88 109 14 -100 112 -91 -51 -118 -32 -162 -285 -246 -110 303 -248 120 181 317 -140 -122 -159 48 334
7446 334 -76 130 -76 171 -125 -299 -171 -123 -50 -60 98 4 135 91 -393 -355 123 254 -194 19 -56 -99 184
7469 184 2 -51 70 4 -5 93 -81 281 188 63 2 -244 -28 39 -137 -122 96 71 327 258 15 109 109 91 -28
7494 -28 -347 19 123 155 -121 -150 -14 170 -103 -114 -205 189 -66 -19 -298 150 19 89 -116 207 -210 252
7516 252 40 -5 192 -110 205 -32 -111 122 75 -30 72 -38 -140 150 -86 -123 16 57 78 47 -49 -55 -2 34
7540 34 -96 -11 -27 294 167 15 -114 110 -262 82 -86 376 149 70 56 -382 -207 -351 -181 226 153 67
7562 67 85 28 -2 -154 61 98 8 -150 -26 181 37 -168 -244 204 -120 37 83 -86 -155 -204 99 -161 -192 146
7586 146 -207 39 -69 -140 14 -130 -10 -222 -40 -385 -99 -20 18 154 305 51 -338 -16 153 306 17
7607 17 34 -247 73 -195 261 39 26 -11 103 111 104 -107 163 19 -212 -140 -27 297 -195 -244 -477 304 307 128
7631 128 -113 -14 -167 43 -232 -173 127 80 102 -24 -50 331 135 38 41 159 -139 184 4 -361 -14 -47 -26
7654 -26 -34 -78 196 193 92 -73 -86 -125 -10 230 12 166 415 -126 -108 30 200 75 -106 217 -2 105 97 69
7678 69 -23 43 297 -51 -56 364 -156 20 351 -50 -38 208 -2 11 40 -172 222 -10 -108 91 -61 101 29
7701 29 -84 73 -10 -38 228 201 76 357 -182 212 -125 150 190 -47 38 -75 145 338 52 107 36 -29 -4
7724 -4 -58 209 9 -45 84 -206 96 -175 25 162 -256 1 28 -52 48 -289 95 149 -82 -46 -5 -45 276
7747 276 15 -69 -212 -55 6 57 -6 19 16 -16 -177 -62 -148 221 194 -146 6 15 178 327 69 156 163 176 52
7772 52 110 119 17 116 -125 67 165 -122 296 -134 -174 252 89 -54 -7 186 -32 -306 36 180 -90 82 207
7795 207 134 47 45 119 241 25 120 111 166 365 -41 111 -24 -39 121 -120 -217 306 69 -43 -66 -19 241 -234
7819 -234 105 119 50 -89 130 41 282 -29 328 -137 -177 165 250 251 -78 -245 84 -19 -58 -116 -160 131 -143
7842 -143 -86 -163 15 1 -128 -111 -351 -3 -167 -130 31 -43 -82 95 278 -263 -313 29 145 -25 -60 62 -143
7865 -143 -220 -225 -116 -43 -168 3 -435 -140 211 103 147 -3 -101 84 137 -153 -199 122 1 231 -75 7 -64
7888 -64 160 132 52 -279 224 333 34 -292 -62 -50 -24 -185 106 -226 -80 -44 -160 -206 256 -52 12 183 -150
7911 -150 100 233 -150 320 -116 -76 -64 15 319 -19 116 -269 258 54 -87 108 413 -42 141 29 -384
7932 -384 -190 92 180 207 -37 -67 -72 378 117 62 318 126 -126 254 46 -87 76 -3 -127 214 237 -43 125
7955 125 -105 -66 7 -95 -84 -283 -153 24 -14 -232 -114 -288 310 -128 -165 -104 -152 -122 -163 -50 -289 16 -77
7978 -77 83 181 -326 88 -184 -120 54 -176 -35 172 39 -63 123 14 -13 -50 -166 162 120 150 115 11 20
8001 20 193 257 204 -1 -27 91 157 -42 37 -108 -260 -185 243 -108 142 9 58 97 130 271 200 -81 41 -105
8025 -105 -25 29 62 164 82 175 -288 -64 -39 229 205 106 -24 61 8 -69 -22 6 23 -98 -112 -2 -6 108 168 123
8051 123 48 -59 164 147 -79 -40 152 -9 209 39 270 136 37 71 -26 6 230 23 159 0 112 56 19
8074 19 -49 -70 -143 -317 1 -295 -7 -29 163 -121 22 82 -296 -150 74 59 -114 226 -261 -39 105 90 -27
8097 -27 -109 138 64 91 -8 129 -202 -92 -88 186 -341 -87 98 -201 27 123 107 147 74 -165 135 -170 263 -274
8121 -274 -327 53 -71 24 76 215 52 67 251 -195 -47 -28 6 155 -66 -8 -21 188 8 -100 72 84 -96
8144 -96 12 -268 -112 92 -167 108 -73 166 -16 -72 76 290 219 162 224 19 83 106 118 46 52 37 30 -34 36
8169 36 -221 149 -100 -93 6 -275 65 223 10 -85 -21 159 221 -36 152 332 -33 -164 75 17 25 132
8191A32
##END NTUPLES=NMR FID
##END=
