##TITLE=1H_SL73(10-6)-f3
 CDCl3, 8 sc, 
 11.6.2020
##JCAMPDX= 6.0         $$ Bruker NMR JCAMP-DX V2.0
##DATA TYPE= NMR FID
##DATA CLASS= NTUPLES
##ORIGIN= UXNMR, Bruker Analytische Messtechnik GmbH
##OWNER= root
$$ XWIN-NMR		Version 3.5
$$ Thu Jun 11 10:38:41 2020 Russian Standard Time (UT+4h)  she@DPX200
##.OBSERVE FREQUENCY= 200.1315
##.OBSERVE NUCLEUS= ^1H
##.DELAY= (6, 6)
##.ACQUISITION MODE= SIMULTANEOUS
##.ACQUISITION SCHEME= undefined
##.AVERAGES= 8
##.DIGITISER RES= 18
##SPECTROMETER/DATA SYSTEM= spect
##.PULSE SEQUENCE= zg30
##.SOLVENT NAME= D2O
##.SHIFT REFERENCE= (INTERNAL, D2O, 0, 15.7039)
##AUDIT TRAIL= $$ (NUMBER, WHEN, WHO, WHERE, WHAT)
$$ ##TITLE= Audit trail, XWIN-NMR		Version 3.5
$$ ##JCAMPDX= 5.01
$$ ##ORIGIN= Bruker BioSpin GmbH
$$ ##OWNER= she
$$ F:/spectra/data/she/nmr/H-F/1/audita.txt
$$ ##AUDIT TRAIL=  $$ (NUMBER, WHEN, WHO, WHERE, WHAT)
(   1,<2020-06-11 10:37:48.42 +0400>,<she>,<DPX200>,
      <created by zg, POWCHK disabled, PULCHK disabled
       configuration hash MD5:
       00 E9 B6 7A A2 85 ED C7 34 08 36 98 17 FE 4E 26
       data hash MD5: 16K
       A3 F3 BC A6 CA 22 76 B4 CD 9C 3C 81 4D 8E BD 5C>)
$$ ##END=
$$ 
$$ hash MD5
$$ 25 80 A3 D6 8D 05 CA 61 45 EB 4D 64 99 E1 C2 98
##$RELAX= 
##$RELAX= 
##$RELAX= 
##$RELAX= 
##$RELAX= 
##$RELAX= 
$$ Bruker specific parameters
$$ --------------------------
##$DU= <F:/spectra>
##$EXPNO= 1
##$NAME= <H-F>
##$PROCNO= 1
##$TYPE= <nmr>
##$USER= <she>
##$AMP= (0..31)
100 100 100 100 100 100 100 100 100 100 100 100 100 100 100 100 100 100 
100 100 100 100 100 100 100 100 100 100 100 100 100 100 
##$AQSEQ= 0
##$AQ_mod= 1
##$AUNM= <au_zg>
##$AUTOPOS= <>
##$BF1= 200.13
##$BF2= 200.13
##$BF3= 200.13
##$BF4= 200.13
##$BF5= 200.13
##$BF6= 200.13
##$BF7= 200.13
##$BF8= 200.13
##$BYTORDA= 1
##$CFDGTYP= 0
##$CFRGTYP= 5
##$CHEMSTR= <none>
##$CNST= (0..31)
1 1 145 1 1 1 1 1 1 1 1 1 1 1 1 1 1 1 1 1 1 1 1 1 1 1 1 1 1 1 1 1 
##$CPDPRG= <>
##$CPDPRG1= <>
##$CPDPRG2= <>
##$CPDPRG3= <>
##$CPDPRG4= <mlev>
##$CPDPRG5= <mlev>
##$CPDPRG6= <mlev>
##$CPDPRG7= <mlev>
##$CPDPRG8= <mlev>
##$CPDPRGB= <>
##$CPDPRGT= <>
##$D= (0..31)
0 1.2 0 0 0 0 0 0 0 0.06 0 0.03 0 0 0 0 0.0002 0 0 0 0 0 0 0 0 0 0 0 0 
0 0 0 
##$DATE= 1591857467
##$DBL= (0..7)
120 120 120 120 120 120 120 120 
##$DBP= (0..7)
150 150 150 150 150 150 150 150 
##$DBP07= 0
##$DBPNAM0= <>
##$DBPNAM1= <>
##$DBPNAM2= <>
##$DBPNAM3= <>
##$DBPNAM4= <>
##$DBPNAM5= <>
##$DBPNAM6= <>
##$DBPNAM7= <>
##$DBPOAL= (0..7)
0.5 0.5 0.5 0.5 0.5 0.5 0.5 0.5 
##$DBPOFFS= (0..7)
0 0 0 0 0 0 0 0 
##$DE= 6
##$DECBNUC= <off>
##$DECIM= 24
##$DECNUC= <off>
##$DECSTAT= 4
##$DIGMOD= 1
##$DIGTYP= 9
##$DL= (0..7)
0 120 120 120 120 120 120 120 
##$DP= (0..7)
150 150 150 150 150 150 150 150 
##$DP07= 0
##$DPNAME0= <>
##$DPNAME1= <>
##$DPNAME2= <>
##$DPNAME3= <>
##$DPNAME4= <>
##$DPNAME5= <>
##$DPNAME6= <>
##$DPNAME7= <>
##$DPOAL= (0..7)
0.5 0.5 0.5 0.5 0.5 0.5 0.5 0.5 
##$DPOFFS= (0..7)
0 0 0 0 0 0 0 0 
##$DQDMODE= 0
##$DR= 18
##$DS= 0
##$DSLIST= <SSSSSSSSSSSSSSS>
$$ [...]
##$SUBNAM2= <"">
##$SUBNAM3= <"">
##$SUBNAM4= <"">
##$SUBNAM5= <"">
##$SUBNAM6= <"">
##$SUBNAM7= <"">
##$SUBNAM8= <"">
##$SUBNAM9= <"">
##$SW= 24.9337058887773
##$SWIBOX= (0..15)
0 0 2 0 0 0 0 0 0 0 0 0 0 0 0 0 
##$SW_h= 4990.01996007984
##$TD= 16384
##$TD0= 1
##$TE= 0
##$TE2= 300
##$TE3= 300
##$TEG= 300
##$TL= (0..7)
0 120 120 120 120 120 120 120 
##$TP= (0..7)
150 150 150 150 150 150 150 150 
##$TP07= 0
##$TPNAME0= <>
##$TPNAME1= <>
##$TPNAME2= <>
##$TPNAME3= <>
##$TPNAME4= <>
##$TPNAME5= <>
##$TPNAME6= <>
##$TPNAME7= <>
##$TPOAL= (0..7)
0.5 0.5 0.5 0.5 0.5 0.5 0.5 0.5 
##$TPOFFS= (0..7)
0 0 0 0 0 0 0 0 
##$TUNHIN= 0
##$TUNHOUT= 0
##$TUNXOUT= 0
##$USERA1= <user>
##$USERA2= <user>
##$USERA3= <user>
##$USERA4= <user>
##$USERA5= <user>
##$V9= 5
##$VALIST= <valist>
##$VCLIST= <CCCCCCCCCCCCCCC>
##$VD= 0
##$VDLIST= <DDDDDDDDDDDDDDD>
##$VPLIST= <PPPPPPPPPPPPPPP>
##$VTLIST= <TTTTTTTTTTTTTTT>
##$WBST= 1024
##$WBSW= 4
##$XGAIN= (0..3)
0 0 0 0 
##$XL= 0
##$YL= 0
##$YMAX_a= 247270
##$YMIN_a= -151160
##$ZGOPTNS= <>
##$ZL1= 120
##$ZL2= 120
##$ZL3= 120
##$ZL4= 120
##$ABSF1= 10
##$ABSF2= 0
##$ABSG= 5
##$ABSL= 3
##$ALPHA= 0
##$AQORDER= 0
##$ASSFAC= 0
##$ASSFACI= 0
##$ASSFACX= 0
##$ASSWID= 0
##$AUNMP= <proc_1d>
##$AZFE= 0.1
##$AZFW= 0.1
##$BCFW= 1
##$BC_mod= 2
##$BYTORDP= 1
##$COROFFS= 0
##$CY= 11.3945322036743
##$DATMOD= 1
##$DC= 2
##$DFILT= <>
##$DTYPP= 0
##$F1P= 16.9975609425685
##$F2P= -3.02152046262296
##$FCOR= 0.5
##$FTSIZE= 0
##$FT_mod= 4
##$GAMMA= 1
##$GB= 0.15
##$INTBC= 1
##$INTSCL= 1
##$ISEN= 128
##$LB= 0.24
##$LEV0= 0
##$LPBIN= 0
##$MAXI= 10000
##$MC2= 0
##$MEAN= 0
##$ME_mod= 0
##$MI= 1.114404
##$NCOEF= 0
##$NC_proc= 0
##$NLEV= 6
##$NOISF1= 3.799351
##$NOISF2= 2.8
##$NSP= 1
##$NTH_PI= 0
##$NZP= 0
##$OFFSET= 15.70392
##$PC= 1
##$PHC0= -9792.326
##$PHC1= 16.60088
##$PH_mod= 1
##$PKNL= yes
##$PPARMOD= 0
##$PSCAL= 0
##$PSIGN= 0
##$REVERSE= no
##$SF= 200.130013532006
##$SI= 16384
##$SIGF1= 3
##$SIGF2= 2
##$SINO= 400
##$SIOLD= 16384
##$SREGLST= <1H.CDCl3>
##$SSB= 0
##$STSI= 0
##$STSR= 0
##$SW_p= 3612.71676300578
##$SYMM= 0
##$S_DEV= 0
##$TDeff= 0
##$TDoff= 0
##$TI= <>
##$TILT= no
##$TM1= 0
##$TM2= 0
##$TOPLEV= 0
##$USERP1= <user>
##$USERP2= <user>
##$USERP3= <user>
##$USERP4= <user>
##$USERP5= <user>
##$WDW= 1
##$XDIM= 8192
##$YMAX_p= 0
##$YMIN_p= 0
$$ End of Bruker specific parameters
$$ ---------------------------------
##NTUPLES= NMR FID
##VAR_NAME=  TIME,          FID/REAL,        FID/IMAG
##SYMBOL=    X,             R,               I
##VAR_TYPE=  INDEPENDENT,   DEPENDENT,       DEPENDENT
##VAR_FORM=  AFFN,          ASDF,            ASDF
##VAR_DIM=   8192,          8192,            8192
##UNITS=     SECONDS,       ARBITRARY UNITS, ARBITRARY UNITS
##FACTOR=    0.0002004,     1,               1
##FIRST=     0,             0,               0
##LAST=      1.6414764,     0,               0
##MIN=       0,             -151160,         0
##MAX=       1.6414764,     247270,          0
$$ Real data points
##PAGE= N=1
##DATA TABLE= (X++(R..R)), XYDATA
$$ plain form
0 0 0 0 0 0 0 0 0 0 -8 8 -8 8 -16 16 -16 24 -26 32 -40 48 -56 64 -74 84 -98 114 -130 146 -166 188 -212
31 -212 238 -267 298 -334 372 -414 461 -512 568 -628 696 -771 853 -945 1046 -1162 1292 -1442
49 -1442 1613 -1815 2055 -2344 2705 -3165 3778 -4638 5939 -8152 12862 -44498 153088 214096
63 214096 -88950 -133873 74852 130042 -76094 -137796 11166 92238 -3171 -53766 -7966
74 -7966 19578 -5832 -16 8741 -15054 -31288 -2768 9143 -7905 -6360 22700 27844 8330
87 8330 -9235 -19772 -21379 265 17533 7225 2858 24861 12717 -42671 -52201 8664 38163
100 38163 5520 609 36666 23667 -24540 -12600 28821 6828 -30101 560 27349 -20233
112 -20233 -33875 44643 69378 -26443 -68063 23991 64457 -29524 -68607 32310 83018 -5455
$$ packed form
0@%%%%%%%%qJ6j6J6k4L2l2M0n0N8p2Q8j04J20j38J58j82K12k44K76l12L54m00
31b12M50n05N65o32P06p86Q75r73J080j196J324j467J624j798J991k208K454k734
49a442L055l428L870m399N049n870O943q416J0577j4091K1014n7360J97586O1008
63B14096l03046m4923K08725N5190k06136o1702J48962Q1072r5409n0595M5800
74g966K7544k5410N816Q757k3795j6234K8520J1911j7048J545K9060N144j9514
87H330j7565j0537j607K1644J7268j0308m367K2003j2144n5388r530O0865K9499
100C8163l2643m911L6057j2999m8207J1940M1421k1993l6929L0661K6789m7582
112b0233j3642P8518K4735r5821m1620R2054M0466r3981l9083J00917N0708q8473
$$ plain form
124 -5455 -55449 18243 56927 -14028 -53276 2421 36086 -2769 -24841 2057 10322 -9381
136 -9381 -6011 13698 10612 -1648 2553 2864 -11321 -9648 9110 8201 -14609 -23868 -10004 3976
150 3976 6043 -2258 -12971 -9121 6761 2987 -21548 -19685 14030 18417 -20451 -31824 4221
163 4221 19902 -8517 -23079 -6413 -4758 -21050 -14397 2307 -9098 -20431 3157 19910 -6219
176 -6219 -21861 7476 19906 -19177 -40792 -6506 15779 -11188 -28934 -1150 19275 860
188 860 -16602 -7693 -160 -7437 -10339 -2630 5717 10327 9191 -3096 -13028 -4142 6121 -3269 -14407
203 -14407 -3644 10378 3389 -7703 -1484 10576 9805 -411 -6942 -1651 15639 24802 7361
216 7361 -12366 672 20770 574 -30529 -11559 30089 23442 -10878 -2366 31508 22551 -13218
$$ packed form
124e455m9994P3692L8684p0955l9248N5697L3665l8855k2072K6898Q265j9703
136i381L370J9709l086j2260M201L11j4185J673J8758r09k2810r259J3864J3980
150C976K067q301j0713L850J5882l774k4535J863L3715M387l8868j1373L6045
163D221J5681k8419j4562J6666J655j6292O653J6704j1405j1333K3588J6753k6129
176f219j5642K9337J2430l9083k1615L4286K2285k6967j7746K7784K0425j8415
188H60j7462Q909P533p277k902P709Q347M610j136j2287r932Q886J0263r390j1138
203a4407J0763J4022o989j1092O219J2060p71j0216o531N291J7290R163j7441
216G361j9727J3038K0098k0196l1103J8970M1648o647l4320Q512L3874q957l5769
$$ plain form
229 -13218 -14749 8187 10891 4184 13931 18976 5939 3136 13951 4181 -16485 -7313 15944 8205
243 8205 -10906 2555 26701 16707 -2896 3594 12844 517 -5793 7061 9607 -2064 1880
256 1880 14149 607 -18941 -6490 14236 4268 -11405 4060 22794 8728 -12001 -9050 1754
269 1754 2166 587 -268 -4783 462 12882 4254 -21555 -17597 10899 6757 -25563 -20565 18227
283 18227 21400 -9840 -10114 15182 9230 -19008 -17382 -186 -6135 -14173 1126 8837 -9249 -12087
297 -12087 7117 2654 -20853 -11204 16823 6203 -21988 -8954 19564 4938 -22884 -8353
309 -8353 15821 727 -20737 -6949 9417 -2355 -12482 248 5487 -6131 -5455 6133 3419
322 3419 -3012 5284 11590 -1109 -9589 -1108 -342 -9825 -4924 8693 4746 -4297 5131 12161 -1969
$$ packed form
229a3218j531K2936K704o707R747N045j3037k803J0815r770k0666R172K3257p739
243H205j9111J3461K4146r994j9603O490R250j2327o310J2854K546j1671L944
256A880J2269j3542j9548J2451K0726r968j5673J5465J8734j4066k0729K951J0804
269A754M12j579q55m515N245J2420q628k5809L958K8496m142l2320M998L8792
283A8227L173l1240k74K5296n952k8238J626J7196n949q038J5299P711j8086k838
297a2087J9204m463k3507R649K8027j0620k8191J3034K8518j4626k7822J4531
309h353K4174j5094k1464J3788J6366j1772j0127J2730N239j1618O76J1588k714
322C419o431Q296O306j2699q480Q481P66r483M901J3617l947r043R428P030j4130
$$ plain form
337 -1969 -6653 12117 13580 -11206 -12463 15735 17503 -10325 -9448 20107 19418 -10933 -13979 8547
351 8547 8843 -7017 -1844 10990 6128 3896 15495 11127 -9177 -4244 20330 13057 -16087 -11785
365 -11785 16383 12764 -12666 -8214 15981 14592 -3447 -4008 5167 5117 4339 7931 2924 -4163 3142
380 3142 9000 -4293 -10698 7029 15159 -3858 -12484 4725 9647 -8715 -11089 7345 8855 -4040
394 -4040 -47 11390 2244 -9022 2553 8684 -10707 -18928 653 8080 -11281 -13637 10031
407 10031 14023 -7670 -11726 4344 3538 -10843 -6577 5246 -1963 -9979 887 6150 -7382 -11393
421 -11393 1680 414 -15816 -13275 6275 6676 -8951 -7372 5404 2265 -8141 -5978 1134 -101
435 -101 -1706 -1498 -8257 -10947 291 5177 -10954 -15912 4240 13104 -6401 -14274 8059 16046
$$ packed form
337a969m684J8770J463k4786j257K8198J768k7828Q77K9555o89l0351l046K2526
351H547K96j5860N173J2834m862k232J1599m368k0304M933K4574p273k9144M302
365a1785K8168l619k5430M452K4195j389j8039n61R175n0p78L592n007p087P305
380C142N858j3293o405J7727Q130j9017q626J7209M922j8362k374J8434J510j2895
394d040L993J1437r146j1266J1575O131j9391q221J9581P427j9361k356K3668
407A0031L992k1693m056J6070q06j4381M266J1823p209q016J0866N263j3532m011
421a1393J3073j266j6230K541J9550M01j5627J579J2776l139j0406K163P112j235
435a01j605K08o759k690J1238M886j6131m958K0152Q864j9505p873K2333P987
$$ plain form
449 16046 -5256 -15243 -530 3819 -8115 -5172 9129 5587 -5099 1909 6265 -9768 -15852
462 -15852 4302 13995 -3735 -9261 11731 17007 -3195 -9295 7761 11079 -5556 -9570 1775
475 1775 4295 272 5146 8037 774 -1730 4973 3884 -3386 1944 13933 9888 -2124 -863 5018
490 5018 1136 -1324 4673 5439 280 3612 8620 170 -6907 5440 13970 -1812 -10115 6970 17903
505 17903 1557 -6793 9957 14288 -6492 -14512 1215 6687 -3784 -485 12219 5211 -7038
518 -7038 1129 9126 -4453 -10778 7510 14841 -6519 -15577 4870 13981 -4745 -12975 2355 7316
532 7316 -7430 -10276 2208 5709 -1709 -2287 -162 -4116 -5477 357 1831 -1509 376 1387 -7107
547 -7107 -12343 -4192 -145 -6342 -4801 6158 3162 -9878 -5864 6352 -552 -11735 -1818 9117
$$ packed form
449A6046k1302r987J4713M349j1934K943J4301l542j0686P008M356j6033o084
462a5852K0154R693j7730n526K0992N276k0202o100J7056L318j6635m014J1345
475A775K520m023M874K891p263k504O703j089p270N330J1989m045j2012J261N881
490E018l882k460N997P66n159L332N008q450p077J2347Q530j5782q303J7085J0933
505A7903j6346q350J6750M331k0780q020J5727N472j0471L299J2704p008j2249
518g038Q167P997j3579o325J8288P331k1360r058K0447R111j8726q230J5330M961
532G316j4746k846J2484L501p418n78K125l954j361N834J474l340J885J011q494
547g107n236Q151M047o197J541J0959k996j3040M014J2216o904j1183R917J0935
$$ plain form
561 9117 -6031 -18441 -569 13973 -3263 -16461 574 10083 -8896 -17287 2415 11472 -3976
574 -3976 -8608 4377 2512 -10256 -4646 10165 4162 -8171 -483 6701 -7285 -15488 667 11285
588 11285 -718 -6832 6470 10218 -4277 -8538 4141 8050 -1159 -3679 1490 1922 861 3289
602 3289 2688 -1159 1795 5561 -2250 -7825 2472 12510 5368 -2736 3457 7404 -1612 -3743 5476
617 5476 6386 236 3719 9169 -1251 -10388 967 11350 438 -6622 9047 16912 -1070 -9937
631 -9937 6145 13118 -3595 -9465 5182 8792 -3422 -3930 8563 6717 -4384 -1098 5758 -2577
645 -2577 -10009 2073 13116 2356 -7463 1958 9953 -1543 -11849 -3425 7209 4061 -4231 -4523
659 -4523 -131 1462 -1812 -5114 -2860 3637 4024 -3630 -6010 738 2734 -3768 -6162 -489 -985 -6495
$$ packed form
561I117j5148j2410J7872J4542j7236j3198J7035R509j8979q391J9702R057j5448
574c976m632J2985j865j2768N610J4811o003j2333P688P184j3986q203J6155J0618
588A1285j2003o114J3302L748j4495m261J2679L909r209k520N169M32j061K428
602C289o01l847K954L766p811n575J0297J0038p142q104O193L947r016k131R219
617E476R10o150L483N450j0420r137J1355J0383j0912p060J5669P865j7982q867
631i937J6082O973j6713n870J4647L610j2214n08J2493j846j1101L286O856q335
645b577p432J2082J1043j0760r819R421P995j1496j0306Q424J0634l148q292k92
659d523M392J593l274l302K254O497L87p654k380O748J996o502k394N673m96n510
$$ plain form
675 -6495 -4048 2816 -770 -5491 520 2992 -8552 -13476 1183 8470 -5424 -10650 5421 10380
689 10380 -8813 -17189 52 8774 -5106 -11995 55 5262 -4675 -7735 1197 2950 -3493 -2799
703 -2799 1318 -2000 -5762 -662 3848 -295 -5260 -2670 169 -1509 -2033 138 2162 3066 783 -5056
719 -5056 -5056 2169 5319 -1634 -2760 7295 8054 -5583 -9128 4874 9344 -2946 -6370 6032 7667
734 7667 -4216 -3571 7989 6157 -3102 459 7967 -88 -6989 5282 13432 -84 -8591 4706
748 4706 10728 -4199 -8581 9177 15784 -574 -7666 4624 7837 -3052 -3846 6654 8390 1668
762 1668 1158 2434 -1723 -1101 5762 4316 -4526 -1794 7696 5074 -4763 -1866 8183 5885 -2914
777 -2914 -3720 -1353 -831 2574 6377 581 -5007 2108 5653 -6272 -13493 2661 14790 1784 -11671
$$ packed form
675f495K447O864l586m721O011K472j1544m924J4659P287j3894n226J6071M959
689A0380j9193q376J7241Q722j3880o889J2050N207r937l060Q932J753o443O94
703b799M117l318l762N100M510m143m965K590K839j678n24K171K024R04k283n839
719e056%P225L150o953j126J0055P59j3637l545J4002M470j2290l424J2402J635
734G667j1883O45J1560j832r259L561P508q055o901J2271Q150j3516q507J3297
748D706O022j4927m382J7758O607j6358p092J2290L213j0889p94J0500J736o722
762A668n10J276m157O22O863j446q842K732R490k622r837K897J0049k298q799
777b914q06K367N22L405L803n796n588P115L545j1925p221J6154J2129j3006j3455
$$ plain form
792 -11671 -1834 6862 -3023 -9706 753 5933 -2461 -4262 1962 -2256 -8439 794 8671 -4044
806 -4044 -14652 -960 9703 -4669 -14759 2045 14631 -1040 -16138 -6026 4319 -2022
818 -2022 -7688 614 5195 -1010 -5169 -4158 -5795 -5074 2724 5864 -2385 -7142 -1259 976 -4134
833 -4134 -4053 2935 2914 -3141 -3764 -2005 -2662 -209 4989 1949 -5424 -2715 4127 -1018 -8648 296 11671
850 11671 4008 -9156 -3370 6967 501 -7983 729 11298 4693 -4722 -1707 2105 -972 134
864 134 6822 5189 -2601 -1772 4457 1445 -3869 2448 10076 4500 -4793 -2493 4484 4520 1186 1685
880 1685 2642 2104 1664 780 -656 1499 5271 4137 -1577 -867 4549 3535 -2342 -1015 5955 5488 -88
897 -88 -751 1187 -190 -427 2555 2817 98 504 3219 -833 -5079 273 6700 2103 -5600 -1795 5155
$$ packed form
792a1671R837Q696r885o683J0459N180q394j801O224m218o183R233P877j2715
806d044j0608J3692J0663j4372j0090J6804J2586j5671j5098J0112J0345o341
818b022n666Q302M581o205m159J011j637P21P798L140q249m757N883K235n110
833d134Q1O988k1o055o23J759o57K453N198l040p373K709O842n145p630Q944J1375
850A1671p663j3164N786J0337o466q484Q712J0569o605r415L015L812l077J106
864A34O688j633p790Q29O229l012n314O317P628n576r293K300O977L6l334M99
880A685R57n38m40q84j436K155L772j134n714P10N416j014n877J327O970m67n576
897h8o63J938j377k37K982K62k719M06K715m052m246N352O427m597p703L805O950
$$ plain form
914 5155 1821 -4047 -1625 2979 -298 -4333 -2001 1409 475 -1454 -1638 -2077 -836 1046 402 -3751
930 -3751 -4090 529 896 -3593 -2886 1505 531 -4920 -5961 -1741 -259 39 233 -2528 -5312 -2021 2493
947 2493 -1902 -8051 -2085 5918 626 -8244 -4600 4044 959 -6837 -5082 1631 862 -3326 -2660 -1373
963 -1373 -1460 1194 3052 -1211 -5899 -1653 2788 -1708 -4871 2059 7064 -681 -7904 -2795 3749 1876
979 1876 -1793 -341 776 131 1126 1260 -939 -284 4883 3680 -3995 -3836 5413 6765 -1995 -4025
995 -4025 3300 5328 -183 -1516 2531 3110 2065 4136 3524 -125 260 4627 2905 -3290 19 7546
1011 7546 4990 -3326 -1502 6365 4988 -1842 -428 4343 2785 -397 2052 4698 2753 1848 2828
1026 2828 145 -2869 1951 6391 1317 -4708 288 6049 1916 -3028 1391 5769 1256 -3103 -72
$$ packed form
914E155l334n868K422M604l277m035K332L410r34j929j84m39J241J882o44m153
930c751l39M619L67m489P07M391r74n451j041M220J482K98J94k761k784L291M514
947B493m395o149N966Q003n292q870L644Q644l085p796J755O713p69m188O66J287
963a373q7K654J858m263m688M246M441m496l163O930N005p745p223N109O544j873
979A876l669J452J117o45R95J34k199O55N167j203p675J59R249J352q760k030
995d025P325K028n511j333M047N79j045K071o12l649L85M367j722o195L309P527
1011G546k556q316J824P867j377o830J414M771j558l182K449K646j945r05R80
1026B828k683l014M820M440n074o025M996N761m133m944M419M378m513m359L031
$$ plain form
1041 -72 3022 1120 590 1261 -1350 -2727 522 2417 -1961 -3434 1949 3790 -2497 -4736 925 2922
1057 2922 -2390 -3820 1070 2638 -1369 -2935 -1558 -1505 -1531 -312 -2311 -5322 -3003 1503 -577 -4255
1073 -4255 -797 4590 -53 -6715 -4372 1297 43 -3915 -1730 -440 -2978 -3723 -385 -619 -3273
1088 -3273 -1363 2522 -1863 -6093 -1304 4148 -220 -5449 -502 4708 -450 -5925 -2230 2917 466
1103 466 -3586 -2126 447 -30 -675 310 262 835 3640 2640 -1941 -2661 2034 3625 -668 -2619 690
1120 690 3039 1156 -621 216 2197 3655 2734 -443 -1200 3307 5986 1217 -2457 2296 7200 2026
1136 2026 -3649 14 5634 2229 -3092 -681 3718 3058 627 2259 2738 1840 2772 3791 563 -2463
1152 -2463 1606 5417 923 -4957 -635 5885 3328 -3701 -2189 3753 3932 -936 -2842 881 3159
$$ packed form
1041g2L094j902n30O71k611j377L249J895m378j473N383J841o287k239N661J997
1057B922n312j430M890J568m007j566J377N3k6J219j999l011K319M506k080l678
1073d255L458N387m643o662K343N669j254l958K185J290k538p45L338k34k654
1088c273J910L885m385m230M789N452m368n229M947N210n158n475L695N147k451
1103D66m052J460K573m77o45R85m8N73K805j000m581p20M695J591m293j951L309
1120F90K349j883j777Q37J981J458r21l177p57M507K679m769l674M753M904n174
1136B026n675L663N620l405n321K411M399o60k431J632M79q98R32J019l228l026
1152b463M069L811m494n880M322O520k557p029J512N942J79m868j906L723K278
$$ plain form
1167 3159 1691 -1606 -2550 554 2718 575 -3337 -2481 863 154 -3585 -3896 -581 560 -165 -972
1183 -972 -1381 -457 1053 322 -3646 -5095 -349 1422 -4060 -7483 -2085 3655 -954 -6663 -3454 2056
1199 2056 -104 -5462 -4490 -68 653 -1610 -2493 -2628 -2401 -897 -788 -3374 -4599 -1616 67 -2122
1215 -2122 -5047 -2170 1365 481 -2153 -1794 609 1290 -769 -3177 -2631 -75 668 -2533 -4458 -516
1231 -516 3029 58 -3130 -6 4073 1205 -3464 -1612 2634 1907 251 833 1525 6 770 1689
1247 1689 -491 -2179 943 3566 69 -3166 1011 5665 3084 -702 1712 4670 2389 -769 271
1262 271 2319 1271 429 730 505 579 2343 2845 435 896 4272 3858 -1282 -1967 3472 4484 618
1279 618 -450 2866 3057 -351 -1534 756 526 277 1347 332 -2096 -97 4713 3820 -1628 -344
$$ packed form
1167C159j468l297r44L104K164k143l912Q56L344p09l739l11L315J141p25q07
1183i72m09R24J510p31l968j449M746J771n482l423N398N740m609n709L209N510
1199B056k160n358R72M422P21k263q83j35K27J504J09k586j225K983J683k189
1215b122k925K877L535q84k634L59K403O81k059k408N46K556P43l201j925L942
1231e16L545k971l188L124M079k868m669J852M246p27j656N82O92j519P64R19
1247A689k180j688L122K623l497l235M177M654k581l786K414K958k281l158J040
1262B71K048j048q42L01k25P4J764N02k410M61L376m14n140o85N439J012l866
1279F18j068L316J91l408j183K290k30k49J070j015k428J999M810q93n448J284
$$ plain form
1295 -344 4738 2466 -4276 -3156 2551 2139 -2960 -2828 531 267 -1347 -59 1081 -102 -341 1231
1311 1231 -1197 -4187 -913 3356 647 -4449 -1791 2759 -1204 -5673 -3300 1570 412 -3688 -3665
1326 -3665 -864 -89 415 873 -670 -1324 455 -23 -4297 -4957 -404 2221 -2455 -5258 -1653 1348
1342 1348 -814 -2188 181 1282 -286 -1620 -1676 -2252 -1013 2140 1589 -3078 -2642 2131 1429 -4380
1358 -4380 -4405 2591 3650 -3035 -4629 2102 4287 413 -1122 2309 3693 404 -1446 -1370 -345 -429
1374 -429 1691 997 -1460 -1209 2492 3703 210 -957 2703 4595 976 -2354 -276 3693 3483 62
1390 62 -948 1873 3557 914 -1962 -1184 2656 3073 -79 -676 2212 4388 2384 712 1711 2674 1553
1407 1553 991 -664 -1300 -709 1281 1581 -754 -313 2793 3536 -178 -1922 1842 4069 543 -2753
$$ packed form
1295c44N082k272o742J120N707m12n099J32L359k64j614J288J140j183k39J572
1311A231k428k990L274M269k709n096K658M550l963m469K373M870j158m100K3
1326c665K801P75N04M58j543o54J779m78m274o60M553K625m676k803L605L001
1342A348k162j374K369J101j568j334n6n76J239L153n51m667M36M773p02n809
1358d380k5O996J059o685j594O731K185l874j535L431J384l289j850P6J025q4
1374d29K120o94k457K51L701J211l493j167L660J892l619l330K078L969k10l421
1390F2j010K821J684k643k876P78L840M17l152n97K888K176k004j672R99R63j121
1407A553n62j655o36N91J990L00k335M41L106P43l714j744L764K227l526l296
$$ plain form
1423 -2753 -402 2363 253 -2340 -597 2478 829 -2215 -2448 -482 -432 -1698 -396 901 771 -230
1439 -230 1 165 -1119 -1441 417 58 -3683 -5092 -1572 233 -2563 -3614 791 3239 -824 -5147
1455 -5147 -1862 2257 107 -3303 -1866 779 -1231 -4324 -2038 660 -446 -1620 -1355 -1617 -4003
1470 -4003 -3445 47 1178 -848 -619 1687 648 -3219 -2132 2110 2239 -2511 -4496 -1678 -54 -2198
1486 -2198 -3072 756 4608 2482 -2077 -2316 979 2398 579 -322 1173 1358 -900 -1965 423 1662
1502 1662 1272 1478 1804 -1134 -3315 -250 4131 2417 -397 2669 5801 1315 -3483 379 6574 3526
1518 3526 -3161 -1818 3122 1473 -3500 -428 6104 5324 307 -176 1983 996 178 2383 3413 735
1534 735 -810 1940 1752 -1570 -1397 4448 5298 -981 -4501 -477 3668 1527 -1515 1404 5138 2888
$$ packed form
1423b753K351K765k110k593J743L075j649l044k33J966N0j266J302J297j30j001
1439b30K31J64j284l22J858l59l741j409L520J805k796j051M405K448m063m323
1455e147L285M119k150l410J437K645k010l093K286K698j106j174K65k62k386
1470d003N58L492J131k026K29K306j039l867J087M242J29m750j985K818J624k144
1486b198q74L828L852k126m559k39L295J419j819r01J495J85k258j065K388J239
1502A662l90K06L26k938k181L065M381j714k814L066L132m486m798L862O195l048
1518C526o687J343M940j649m973L072O532p80n017m83K159r87q18K205J030k678
1534G35j545K750j88l322J73N845Q50o279l520M024M145k141l042K919L734k250
$$ plain form
1550 2888 -1890 -2560 1632 3070 152 -2459 -1104 248 -1542 -2001 463 2418 1893 368 644 -596
1566 -596 -2156 -771 1876 572 -2968 -1550 1914 -112 -4312 -1899 3357 2229 -4075 -4612 736
1581 736 1924 -2243 -2527 2166 2983 -1009 -2725 -464 78 -1148 -1397 -1152 -2238 -2605 -814 133 -918
1598 -918 -1027 1834 2912 -851 -3135 -542 2059 -166 -3293 -1546 1992 813 -2479 -2574 1174 2428
1614 2428 -899 -2995 -603 1768 -141 -989 932 2319 1066 322 1058 275 -1154 -34 1147 -607
1630 -607 -2892 -1151 2789 1788 -1694 358 4519 3231 -1505 -1522 2704 2499 -1272 -1649 1868 2054
1646 2054 -705 -794 1768 1796 413 110 884 752 304 906 1836 1327 1238 2164 2173 469 -891 321 1273
1665 1273 -169 -1549 -820 1526 1535 -149 -404 2349 3553 455 -1060 272 1874 2 -1771 -159
$$ packed form
1550B888m778o70M192J438k918k611J355J352j790m59K464J955n25j525K76j240
1566e96j560J385K647j304l540J418L464k026m200K413N256j128o304n37N348
1581G36J188m167k84M693Q17l992j716K261N42j226k49K45j086l67J791R47j051
1598i18j09K861J078l763k284K593K601k225l127J747L538j179l292r5L748J254
1614B428l327k096K392K371j909q48J921J387j253p44P36p83j429J120J181j754
1630f07k285J741L940j001l482K052M161j288m736j7M226k05l771l77L517J86
1646B054k759q9K562K8j383l03P74j32m48O02R30n09q9R26Rj704j360J212R52
1665A273j442j380P29K346Rj684k55K753J204l098j515J332J602j872j773J612
$$ plain form
1681 -159 1178 437 -1153 -220 726 33 -345 336 -570 -1705 -457 1436 364 -1525 401 2755 650
1698 650 -3208 -2054 1308 -309 -4018 -3432 206 704 -1813 -1915 710 1187 -435 -684 -674 -1232 -1381
1715 -1381 -800 -1429 -2737 -1680 -146 -483 -2272 -2049 94 263 -1510 -2790 -1275 731 59 -2017
1731 -2017 -1470 1036 1304 -1708 -3119 -1098 446 -1544 -3888 -2390 534 169 -1641 -1213 284 1056
1747 1056 339 -450 -875 -1232 -107 237 -1680 -2681 -497 1979 330 -2006 -927 1967 1080 -1583
1763 -1583 -1257 1563 1436 55 -149 859 1390 1115 364 78 -420 -274 -402 -491 -461 764 2385 1342
1781 1342 702 821 2224 2326 554 -171 1254 1732 28 -1432 -383 2263 2047 441 -21 1560 1768
1798 1768 64 -644 1123 2299 1017 616 803 1267 775 550 1232 628 -309 -608 -410 -1083 -1211 1321
$$ packed form
1681a59J337p41j590R33R46o93l78O81r06j135J248J893j072j889J926K354k105
1698F50l858J154L362j617l709N86L638M98k517j02K625M77j622k49J0n58j49
1715a381N81o29j308J057J534l37j789K23K143J69j773j280J515K006o72k076
1731b017N47K506K68l012j411K021J544j990k344J498K924l65j810M28J497P72
1747A056p17p89m25l57J125L44j917j001K184K476j649k336J079K894q87k663
1763a583L26K820j27j381k04J008N31k75p51k86m98J46j28q9L0J225J621j043
1781A342o40J19J403J02j772p25J425M78j704j460J049K646k16j606m62J581K08
1798A768j704p08J767J176j282m01J87M64m92k25O82o04r37k99J98o73j28K532
$$ plain form
1816 1321 1744 588 -312 1036 2156 240 -1805 -208 1839 222 -2733 -2308 132 921 -481 -1170
1832 -1170 -19 301 -415 -1262 -1892 -451 877 539 -736 -1610 -970 454 -10 -1573 -2192 -1090 -147
1849 -147 -1553 -3315 -2003 869 1327 -836 -1493 510 1281 -1036 -2267 -500 572 -1252 -2575 -1726
1865 -1726 -83 -234 -775 -246 -296 9 -72 -559 -1031 -100 1008 711 -615 -922 965 1402 -177 -1337
1883 -1337 -267 576 43 -1474 -656 1359 2248 1242 98 846 2181 2229 58 -351 877 1756 97
1900 97 -1470 483 2197 2033 943 363 939 1819 1703 859 156 728 2996 2361 -338 -797 2448 4048
1918 4048 711 -1743 337 2388 1058 -1260 -223 2584 3110 899 -270 557 2023 2595 1100 -808
1934 -808 -455 1046 417 -1478 -1242 1579 2480 589 -1406 -515 1160 952 44 -789 -656 912 639 -1197
$$ packed form
1816A321M23j156r00J348J120j916k045J597K047j617k955M25K440P89j402o89
1832a170J151L20p16q47o30J441J328l38j275q74O40J424m64j563o19J102R43
1849a47j406j762J312K872M58k163o57K003P71k317j231J767J072j824j323Q49
1865a726J643j51n41N29n0L05q1m87m72R31J108k97j326l07J887M37j579j160
1883a337J070Q43n33j517Q18K015Q89j006j144P48J335M8k171m09J228Q79j659
1900I7j567J953J714j64j090n80N76Q80j16q44p03N72K268o35k699m59L245J600
1918D048l337k454K080K051j330k318J037K807N26k211j169Q27J466N72j495j908
1934h08L53J501o29j895K36K821R01j891j995Q91J675k08r08q33J33J568k73j836
$$ plain form
1952 -1197 -2078 533 2442 -373 -3358 -1891 911 -467 -3072 -1565 1830 1086 -1679 -1462 281 0
1968 0 -896 -835 -684 -1561 -2011 -1125 -1251 -1925 -754 1361 -70 -2798 -1684 803 -125 -1992 -1505 1007
1986 1007 234 -2321 -2061 283 930 -563 -1624 -1429 -650 -791 -1133 -1382 -151 1265 519 -787 -578
2003 -578 677 734 -399 -587 -131 -859 -993 -98 -14 -445 314 2190 766 -1552 -590 2168 1823 -1237
2021 -1237 -876 2181 1761 -1492 -1030 2331 2466 -295 -345 811 545 -542 286 1625 1081 216 1827
2038 1827 2403 -104 -617 2135 2636 -247 -1721 484 2211 295 -1734 906 3825 1817 -1154 -714
2054 -714 1792 2043 236 -369 818 1747 259 -893 -254 1466 1176 -14 -596 -181 -415 -486 -122 19
2072 19 120 812 1230 -333 -1521 -462 1606 361 -1850 -1491 631 -37 -2722 -2048 1672 2381 -994
$$ packed form
1952a197q81K611J909k815k985J467K802j378k605J507L395p44k765K17J743k81
1968@q96O1J51q77m50Q86j26o74J171K115j431k728J114K487r28j867M87K512
1986A007p73k555K60K344O47j493j061J95P79j41l42k49J231J416p46j306K09
2003e78J255N7j133j88M56p28j34Q95Q4m31P59J876j424k318R62K758l45l060
2021a237L61L057m20l253M62L361J35k761n0J156k66j087Q28J339n44q65J611
2038A827N76k507n13K752N01k883j474K205J727j916k029K640K919k008k971M40
2054g14K506K51j807o05J187R29j488j152O39J720k90j190n82M15k34p1L64J41
2072A9J01O92M18j563j188J059K068j245k211L59K122o68k685O74L720P09l375
$$ plain form
2089 -994 -2578 -177 643 -1100 -2017 -190 670 -772 -1661 -1513 -904 -544 -169 232 -992 -2283 -1033
2106 -1033 -286 -847 -1973 -8 1955 433 -2818 -2182 1188 861 -2136 -2627 533 1197 -2170 -3583
2122 -3583 -44 1676 301 -857 -9 370 -1070 -1309 53 417 -781 124 901 -568 -2281 -507
2138 -507 2216 1364 -1644 -1571 1458 1008 -1436 -1482 2227 2570 434 -755 198 1245 516 -274 394 809
2156 809 580 -208 58 475 920 1167 1544 873 105 22 992 1046 240 622 1456 1999 -675 -1523 1387 3186
2176 3186 912 -1048 848 2744 407 -2006 444 3526 1819 -1048 482 1900 279 -1103 209
2191 209 1418 189 -395 421 211 -1158 199 2136 913 -1544 -419 1662 410 -2471 -1063 2295
2207 2295 1864 -1648 -1863 569 779 -1112 -1260 -85 558 -222 -924 -992 -1008 432 758 -291 -1264 -699
$$ packed form
2089i94j584K401Q20j743r17J827Q60j442q89J48O09L60L75M01j224j291J250
2106a033P47n61j126J965J963j522l251O36L370l27k997m91L160O64l367j413
2122c583L539J720j375j158Q48L79j440k39J362L64j198R05P77j469j713J774
2138e07K723q52l008P3L029m50k444m6L709L43k136j189R53J047p29p90O68M15
2156H09k29p88K66M17M45K47L77o71p68q3R70N4q06L82Q34N43k674q48K910J799
2176C186k274j960J896J896k337k413K450L082j707k867J530J418j621j382J312
2191B09J209j229n84Q16k10j369J357J937j223k457J125K081j252k881J408L358
2207B295m31l512k15K432K10j891j48J175O43p80p02o8j6J440L26j049r73N65
$$ plain form
2225 -699 -366 -823 -1375 -1197 -194 435 -799 -1718 -1768 -353 1089 -275 -1770 -522 711 -643 -3109
2242 -3109 -1545 1833 842 -2180 -1668 361 125 -1582 -1021 518 -96 -797 -586 -592 -1302 -236 1692 842
2260 842 -1392 -1051 1018 247 -2283 -1125 1735 1618 -1307 -1555 673 1521 187 -483 738 1140 238
2277 238 -724 -528 182 937 1520 707 -285 111 904 722 -444 70 1535 1480 287 -1011 171 1673
2295 1673 1769 230 -295 942 1627 -24 -1372 99 2356 1783 -463 -670 1127 1062 282 -113 1211
2312 1211 1113 501 -154 -317 -375 965 1888 364 -925 -233 1247 406 -1081 -498 1790 1254 -893 -1449
2330 -1449 231 951 -14 -424 233 608 -270 -572 -1042 -414 443 557 -227 -1457 -678 303 38 -877 -814
2349 -814 119 140 -528 -1560 -839 299 366 -913 -1432 -226 139 -924 -1411 -618 374 -352 -1389 -820 421
$$ packed form
2225f99L33m57n52J78J003O29j234r19n0J415J442j364j495J248J233j354k466
2242c109J564L378r91l022N12K029k36j707N61J539o14p01K11op10J066J928q50
2260H42k234L41K069p71k530J158K860j17k925k48K228Q48j334o70J221M02r02
2277B38r62J96P10P55N83q13r92L96P93j82j166N14J465n5j193j298J182J502
2295A673R6j539n25J237O85j651j348J471K257n73k246k07J797o5p80l95J324
2312A211r8o12o55j63n8J340R23j524j289O92J480q41j487N83K288n36k147n56
2330a449J680P20r65m10O57L75q78l02m70O28Q57J14p84j230P79R81k65r15O3
2349h14R33K1o68j032P21J138O7j279n19J206L65j063m87P93R92p26j037N69J241
$$ plain form
2368 421 -188 -986 -999 -161 -178 -404 -723 -799 -1003 -401 495 -930 -1582 -218 1265 -281 -1848 -410 717
2387 717 55 -1247 -1046 775 539 -485 -908 47 662 209 -308 -24 315 441 -37 -531 117 986 1160
2406 1160 194 -636 225 878 497 77 -30 812 1123 272 -602 293 1449 1603 243 -30 677 1408 279
2425 279 -571 563 1743 1143 -304 -78 860 981 390 493 812 127 520 1005 210 -279 1005 1819 563
2444 563 -918 309 1462 280 -1149 -47 1630 862 -879 -775 501 786 -20 -387 -163 358 737
2461 737 -377 -747 -311 694 794 -595 -870 -318 388 -138 -1016 -781 -39 291 -882 -1358 -708 343
2479 343 558 -1017 -1439 -92 589 -705 -1873 -772 591 -254 -1453 -920 -172 -66 -1264 -794 -560
2496 -560 -302 -143 -160 -798 -1199 -97 826 -600 -1836 -77 1025 -372 -1999 -735 939 393 -940
$$ packed form
2368D21o09p98j3Q38j7k26l19p6k04O02Q96j425o52J364J483j546j567J438J127
2387G17o62j302K01J821k36j024m23R55O15m53n17K84L39J26m78m94O48Q69J74
2406A160r66q30Q61O53l81m20j07Q42L11q51q74Q95J156J54j360k73P07P31j129
2425B79q50J134J180o00j447K26R38J21n91J03L19o85L93M85p95m89J284Q14j256
2444E63j481J227J153j182j429J102J677p68j741J04J276K85q06l67K24N21L79
2461G37j114l70M36J005J00j389k75N52P06n26q78K35P42L30j173m76O50J051
2479C43K15j575m22J347O81j294j168J101J363q45j199N33P48J06j198M70K34
2496e60K58J59j7o38m01J102R23j426j236J759J102j397j627J264J674n46j333
$$ plain form
2513 -940 -1168 -208 401 -187 -616 -433 122 674 227 -663 -417 711 642 -436 -890 43 752 -130 -784 -124
2533 -124 694 1061 462 -170 -375 819 948 -19 -530 804 1225 409 -1006 -14 1459 902 -337 17
2551 17 956 1065 141 -302 496 1045 1142 314 318 -100 356 585 75 -448 85 1485 457 -607 -247 1266
2571 1266 1176 -69 4 628 967 397 -399 -33 727 986 184 -488 -85 783 346 -526 193 604 967 -277
2591 -277 -801 59 699 112 -194 -352 163 170 -202 -1056 -805 21 612 -177 -1151 -373 428 11 -805 -458 760
2612 760 343 -438 -1282 -486 -53 -269 -813 -679 -61 138 -290 -884 -788 268 535 -636 -987 -293 315 -69
2632 -69 -708 -595 148 149 -186 -1096 -1110 -13 449 -31 -750 61 640 158 -888 -634 810 1012 -416 -909
2652 -909 175 433 -213 -685 -174 521 753 63 -823 -516 652 1068 258 -16 449 1133 252 -420 -30
$$ packed form
2513i40k28R60O09n88m29J83N55N52m47q90K46J128o9j078m54R33P09q82o54O60
2533a24Q18L67n99o32k05J194J29r67n11J334M21q16j415R92J473n57j239L54
2551A7R39J09r24m43P98N49R7q28Mm18M56K29n10n23N33J400j028j064L60J513
2571A266r0j245P3O24L39n70p96L66P60K59q02o72M03Q68m37q72P19M11L63j244
2591b77n24Q60O40n87l06j58N15Pl72q54K51Q26N91p89r74P78Q01m17q16L47J218
2612G60m17p81q44P96M33k16n44J34O18J99m28n94R6J056K67j171l51O94O08l84
2632f9o39J13P43Jl35r10j4J097M62m80p19Q11N79m82j046K54J444K02j428m93
2652i09J084K58o46m72N11O95K32o90q86L07J168M16q10k74M65O84q81o72L90
$$ plain form
2671 -30 1182 998 268 -410 101 335 454 65 404 1006 1268 700 -413 -47 762 1056 34 170 759
2690 759 1089 166 -585 225 698 805 349 334 -30 226 846 734 262 694 1730 842 -724 -694 699 1379
2710 1379 -173 -390 305 822 -358 -925 415 1009 805 337 -328 -50 13 41 -98 -177 94 354 164 -1319
2730 -1319 -691 381 521 -418 -463 -503 -210 -269 -523 -345 195 50 -547 -1458 -1518 -505 -224 -535 -931 -264
2750 -264 56 -473 -1390 -515 417 331 -740 -875 -489 -508 -765 -829 -721 -278 -159 -424 -1184 -924 242 538
2770 538 -429 -1224 -376 214 -939 -1303 -14 620 427 -819 -570 -122 208 -443 -318 -254 20 69 -15 -406
2790 -406 257 822 991 -412 -336 277 178 -8 -94 -91 299 798 -260 -562 280 1066 798 -28 -262 369 786
2811 786 354 -76 453 1296 782 -399 -577 401 716 234 242 296 985 406 93 242 951 1360 718 -128 -278
$$ packed form
2671c0J212j84p30o78N11K34J19l89L39O02K62n68j113L66Q09K94j022J36N89
2690G59L30r23p51Q10M73J07m56j5l64K56O20j12m72M32J036q88j566L0J393O80
2710A379j552k17O95N17j180n67J340N94k04m68o65K78O3K8j39p9K71K60j90j483
2730a319O28J072J40r39m5m0K93n9k54J78N40j45n97r11o0J013K81l11l96O67
2750b64L20n29r17Q75R32q6j071j35L86j9k57o4J08M43J19k65p60K60J166K96
2770E38r67p95Q48N90j153l64J289O34j93j246K49M48L30o51J25O4K74M9q4l91
2790d06O63N65J69j403P6O13r9j86q6LL90M99j058l02Q42P86k68q26k34O31M17
2811G86m32m30N29Q43n14j181j78R78L15m82QN4O89n79l13J49P09M09o42q46j50
$$ plain form
2832 -278 243 305 94 -432 353 386 229 -272 -499 371 1056 648 -448 -214 658 439 -425 -270 361 932
2852 932 191 -1093 -841 176 -83 -523 -649 -282 -98 183 -570 -465 236 671 85 -815 -1046 -419 -271
2871 -271 -649 -1056 -393 -24 -209 -1328 -1271 -157 437 -120 -819 -596 -212 -117 -1209 -1081 -341 462 -250 -1126
2891 -1126 -645 -272 -826 -761 -260 39 94 76 12 -408 -284 872 351 -465 -766 -141 337 -563 -1090 -331 1167
2912 1167 453 -533 -329 873 498 -319 -433 1254 1106 276 -14 52 453 626 395 -53 171 309 335 306
2932 306 -347 640 1445 970 55 18 998 1147 540 -74 367 823 235 -257 -113 790 1378 425 194 374
2952 374 868 414 -339 160 648 722 336 336 55 301 444 570 -62 -426 -15 321 137 -409 205 1211 457
2973 457 -588 -285 760 523 -562 -709 608 356 -672 -1049 9 352 -189 -336 -128 -77 -257 -437
$$ packed form
2832b78N21O2k11n26P85L3j57n01k27Q70O85m08j096K34Q72k19q64J55O31N71
2852I32p41j284K52J017k59m40j26L67J84K81p53J05P01M35n86r00k31O27J48
2871b71l78m07O63L69j85j119N7J114N94n57o99K23L84R5j092J28P40Q03p12q76
2891a126M81L73n54O5N01K99N5j8o4m20J24J156n21q16l01O25M78r00n27P59J498
2912A167p14r86K04J202l75q17j14J687j48q30k90O6M01J73k31m48K24J38K6k9
2932C06o53R87Q05m75r15l7R80J49o07o14M41M56n88m92J44R03N88r53k31J80
2952C74M94m54p53M99M88P4l86%k81K46J43J26o32l64M11L36j84n46O14J006p54
2973D57j045L03J045k37j085j47J317k52j028l77J058L43n41j47K08N1j80j80
$$ plain form
2991 -437 -218 -191 -164 306 -209 -848 -900 -66 241 -718 -972 -298 292 -10 -1054 -591 317 588 -267 -1077 -290
3012 -290 669 -272 -874 -604 -175 8 -845 -1253 -264 275 127 -19 -147 -234 46 61 -586 -683 -173 530 336
3033 336 -717 -807 657 372 -519 -808 166 533 -476 -929 -99 887 579 41 190 341 403 30 1 -302
3053 -302 -43 199 63 -46 42 855 1047 544 -149 451 683 405 -306 -266 680 875 49 -449 463 671 544
3074 544 18 -30 795 769 -3 -53 408 756 332 152 164 195 426 183 -114 -689 -113 260 -68 -305 99 1049
3096 1049 635 35 -265 340 704 -25 -360 -80 592 70 -233 -369 246 266 -523 -648 -216 153 -85 -486
3116 -486 -71 -111 131 86 -16 -227 -125 14 -164 -950 -861 -443 -31 -882 -845 -60 545 222 -543 -506 34 -226
3138 -226 -853 -797 -432 257 54 -497 -392 -116 -409 -477 -534 -380 206 -108 -309 -442 161 453 95 -489 -268
$$ packed form
2991d37K19K7K7M70n15o39n2Q34L07r59k54O74N90l02j044M63R08K71q55q10P87
3012b90R59r41o02K70M29J83q53m08R89N39j48j46j28q7K80J5o47r7N10P03j94
3033C36j053r0J464k85q91k89R74L67j009m53Q30R86l08n38J49J51O2l73k9l03
3053c02K59K42j36j09Q8Q13J92n03o93O00K32k78p11M0R46J95q26m98R12K08j27
3074E44n26m8Q25k6p72n0M61L48m24j80J2L1K31k43k97n75N76L73l28k37M04R50
3096A049m14o00l00O05L64p29l35K80O72n22l03j36O15K0p89j25M32L69k38m01
3116d86M15m0K42m5j02k11J02J39j78p86Q9M18M12q51L7P85O05l23p65L7N40k60
3138b26o27N6L65O89k03n51J05K76k93o8n7J54N86l14k01j33O03K92l58n84K21
$$ plain form
3159 -268 125 225 -563 -582 -557 157 -404 -650 -280 578 1106 213 -187 162 777 432 -97 -257 95 483 -44
3180 -44 -299 -104 398 472 97 -227 -17 502 184 280 -122 883 1042 450 179 175 807 608 -273 -380 299
3201 299 715 -140 37 161 1264 897 496 425 342 609 511 -91 -203 632 584 331 -82 58 420 403 -317
3222 -317 -573 -340 285 175 25 151 568 605 135 -552 -348 105 9 -369 -711 -224 377 -557 -628 -167 541
3243 541 239 -244 -147 265 117 -313 -350 -555 -52 -181 -151 -781 -59 -38 180 -582 -919 -567 -122 -438 -786
3264 -786 -425 404 247 -314 -664 -479 218 -722 -1110 -672 -580 59 -283 -575 -237 423 31 -251 -549 -138
3284 -138 248 -140 -511 -357 -20 162 -183 -419 7 434 -102 -436 -404 -19 413 127 -102 285 745 461
3304 461 165 36 328 521 -94 -465 -287 210 158 172 669 550 203 463 53 -289 417 853 471 -261 -90
$$ packed form
3159b68L93J00p88j9K5P14n61k46L70Q58N28q93m00L49O15l45n29j60L52L88n27
3180d4k55J95N02P4l75l24K10N19l18R6m02J005J59n92k71mO32j99q81j07O79
3201B99M16q55J77J24J103l67m01p1q3K67r8o02j12Q35m8k53m13J40L62j7p20
3222c17k56K33O25j10j50J26M17L7m70o87K04M53r6l78l42M87O01r34p1M61P08
3243E41l02m83R7M12j48m30l7k05N03j29L0o30P22K1K18p62l37L52M45l16l48
3264g86L61Q29j57n61l50J85O97r40l88M38R2O39l42k92L38O60l92k82k98M11
3284a38L86l88l71J54L37J82l45k36M26M27n36l34L2L85M32k86k29L87M60k84
3304D61k96j29K92J93o15l71J78M97n2J4M97j19l47K60m10l42P06M36l82p32J71
$$ plain form
3325 -90 607 386 2 -74 586 649 -60 -321 130 620 286 371 139 306 565 644 -423 3 41 403 130 -498
3347 -498 -39 528 329 -134 -86 503 605 367 -729 -339 443 309 -118 -433 -272 -159 101 -514 -381 273
3367 273 388 -356 -632 -113 50 -302 -365 -173 101 99 -104 -522 -374 -313 115 -389 -833 -518 -40 -55 -699 -187
3389 -187 291 338 -554 -791 -160 -302 -540 -395 -613 -138 -305 -90 -178 -416 -415 -34 -196 -343 -476 442 -270
3410 -270 -448 -715 301 534 -216 -629 -14 242 -333 -649 -311 256 224 -161 -144 120 285 124 -150 195
3430 195 -58 109 142 -594 -552 58 218 713 -103 -83 105 410 160 -374 216 998 350 -392 -75 763 698
3451 698 98 -138 371 270 -211 -172 350 695 495 215 299 360 84 597 684 238 255 380 352 -360 -445 467
3473 467 521 424 -206 216 652 240 -364 81 862 653 -175 -203 226 627 132 -93 331 373 -297 -470 -69
$$ packed form
3325i0O97k21l84p6O60O3p09k61M51M90l34Q5k32J67K59P9j067M26L8L62k73o28
3347d98M59N67j99m63M8N89J02k38j096L90P82j34m27l15J61J13K60o15J33O54
3367B73J15p44k76N19J63l52o3J92K74kk03m18J48O1M28n04m44L15M78j5o44N12
3389a87M78M7q92k37O31j42k38J45k18M75j67K15q8k38JL81j62j47j33R18p12
3410b70j78k67J016K33p50m13O15K56n75l16L38N67l2l85J7K64J65j61k74L45
3430A95k53J67L3p36M2O10J60M95q16K0J88L05k50n34N90P82o48p42L17Q38o5
3451F98o00k36N09j01m81L9N22L45k00k80Q4O1k76N13Q7m46J7J25k8p12q5R12
3473D67N4r7o30M22M36m12o04M45P81k09q28k8M29M01m95k25M24M2o70j73M01
$$ plain form
3494 -69 -249 -304 149 258 207 -506 36 460 -94 -353 -150 919 4 -827 -311 500 466 -370 -515 83 362
3515 362 -745 -769 -47 216 -351 -315 -133 -175 -530 -87 113 -194 -374 -27 -296 -842 -454 -194 533 121 -444
3536 -444 -185 232 -18 -583 -458 369 116 -725 -700 -83 554 -203 -434 40 242 7 -466 -15 149 96 -14
3557 -14 -49 415 -168 259 298 448 -90 -208 693 122 -633 -263 839 706 -299 -50 939 622 -214 -260 285
3578 285 658 318 -486 220 -45 280 275 599 559 150 251 290 -12 -106 490 725 91 -134 -3 554 522 -256
3600 -256 -24 681 314 -644 -331 367 941 166 -49 161 515 505 -422 -233 344 148 -370 145 -3 -167
3620 -167 -134 126 149 -265 -242 223 -75 -446 -422 229 505 -591 -742 229 436 -752 -616 -193 217 -176 -633
3641 -633 -334 -9 -196 -238 -143 -80 -218 -394 -275 -344 -278 -433 -206 -253 -617 -202 84 150 -662 -189 -68 -80 -338
$$ packed form
3494f9j80n5M53J09n1p13N42M24n54k59K03J069r15q31N16Q11l4q36j45N98K79
3515C62j107k4P22K63n67L6J82m2l55M43K00l07j80L47k69n46L88K60P27m12n65
3536d44K59M17k50n65J25Q27k53q41K5O17O37p57k31M74K02k35m73M51J64n3j10
3557a4l5M64n83M27L9J50n38j18R01n71p55L70J102j33j005K49R89l17q36m6N45
3578B85L73l40q04P06k65L25nL24m0m09J01L9l02r4N96K35o34k25J31N57l2p78
3600b56K32P05l67r58L13O98N74p75k15K10L54j0r27J89N77j96n18N15j48j64
3620a67L3K60K3m14K3M65k98l71K4O51K76j096j51R71K07j188J36M23M10l93m57
3641f33K99L25j87m2R5O3j38j76J19o9O6j55K27m7l64M15K86O6q12M73J21j2k58
$$ plain form
3664 -338 -691 -235 198 -40 -364 -236 381 116 -563 -543 65 -158 -386 -184 131 -53 93 -94 283 55
3684 55 -131 178 210 -282 -489 548 471 -180 -363 302 515 -69 -320 247 647 134 -192 -145 162 37 -41
3705 -41 124 441 580 111 -161 330 333 389 107 53 304 368 324 60 497 72 90 177 74 -441 175 820 -117
3728 -117 -110 506 381 308 64 -96 305 474 154 -8 135 425 317 89 -109 199 346 341 -240 88 -42 96
3750 96 -35 -440 -86 197 266 -70 -545 -87 367 -19 -506 -272 239 -74 -179 -250 274 -57 170 -370 -252
3771 -252 102 -85 -11 -535 -424 50 -14 -292 -609 -57 -311 -56 -342 -486 -240 -36 -101 -399 -215 317 50
3792 50 -458 -217 111 189 -319 -321 -11 -186 -304 -134 -183 -46 -72 218 -191 -427 -51 296 -203 -295 -135 188
3814 188 280 -229 -135 390 406 -445 28 288 386 196 -53 306 163 217 207 345 38 541 356 41 -167 176
$$ packed form
3664c38l53M56M33k38l24J28O17k65o79K0O08k23k28K02L15j84J46j87L77k28
3684E5j86L09L2m92k07J037p7o51j83O65K13n84k51N67M00n13l26M7L07j25p8
3705d1J65L17J39m69k72M91LN6k82n4K51O4m4k64M37m25J8Q7j03n15O16O45r37
3728a17PO16j25p3k44j60M01J69l20j62J43K90j08k28j98L08J47nn81L28j30J38
3750I6j31m05L54K83O9l36m75M58M54l86m87K34N11l13j05p1N24l31K27n40J18
3771b52L54j87P4n24J11M74o4k78l17N52k54K55k86j44K46K04o5k98J84N32k67
3792E0n08K41L28P8n08kL10j75j18J70m9J37k6K90m09k36L76L47m99r2J60L23
3814A88R2n09R4N25J6q51M73K60R8j90k49L59j43N4j0J38l07N03j85l15k08L43
$$ plain form
3836 176 361 149 -98 -181 340 342 196 153 283 379 500 244 113 328 242 337 151 198 337 248 25 -137 108
3859 108 290 320 -7 10 550 39 138 -205 -13 346 420 -221 -283 228 364 -112 -485 -46 -141 361 -487 -353
3881 -353 68 -26 -352 -186 56 109 -307 -221 -47 -310 -15 88 -268 -244 -86 363 -146 -702 -368 -199 58
3902 58 -241 -543 50 -247 -32 -215 -519 -118 -80 -196 -408 -102 283 18 -434 -271 160 223 132 -334 -204
3923 -204 -235 -214 -230 -291 -79 -16 -59 -388 -368 37 -52 -190 -658 43 530 51 -381 -144 162 366 -63 -203 336
3946 336 235 244 28 99 76 470 537 52 -18 120 587 196 -207 -145 431 84 -42 447 112 196 353 81 339
3969 339 541 433 188 46 274 322 323 -137 -75 383 352 59 -113 354 78 204 85 -23 204 30 505 -167
3991 -167 -183 147 772 -91 -159 68 211 297 -196 -137 164 -163 196 -18 -2 101 249 221 -188 -137 122 96 96
$$ packed form
3836A76J85k12k47q3N21Kj46m3J30R6J21k56j31K15q6R5j86M7J39q9k23j62K45
3859A08J82L0l27J7N40n11R9l43J92L59P4o41o2N11J36m76l73M39r5N02q48J34
3881c53M21r4l26J66K42N3m16Q6J74k63K95J03l56K4J58M49n09n56L34J69K57
3902E8k99l02N93k97K15j83l04M01L8j16k12L06L85k65m52J63M31O3r1m66J30
3923b04l1K1j6o1K12O3m3l29K0M05q9j38m68P01M87m79m32K37L06K04m29j40N39
3946C36j01Rk16P1k3L94O7m85p0J38M67l91m03O2N76l47j26M89l35Q4J57k72K58
3969C39K02j08k45j42K28M8Jm60O2M58l1k93j72M67k76J26j19j08K27j74M75o72
3991a67j6L30O25q63o8K27J43Q6m93N9L01l27L59k14J6J03J48k8m09N1K59k6%
$$ plain form
4014 96 -165 248 348 -431 -605 48 155 173 -311 -312 -141 -112 -198 -312 -180 45 188 -207 -296 -328 55 106 -12
4037 -12 -90 80 -184 -232 -234 -77 -199 -18 -108 -160 -196 -320 25 -147 -375 293 134 -118 -448 170 444 -28 -270
4060 -270 -139 44 164 -297 116 140 40 149 -21 -482 -389 281 293 -217 -241 218 361 -30 -156 275 398
4081 398 1 -30 83 302 331 -169 -62 524 -197 -46 176 178 -53 27 322 138 66 452 262 9 49 272
4103 272 43 328 21 150 245 209 121 116 111 519 192 103 -86 337 265 90 -187 165 612 -172 -45 282 -3
4126 -3 327 201 -16 265 164 224 241 -175 -364 366 -33 -409 -586 2 438 -299 -426 -179 92 -59 -272
4147 -272 -421 216 61 -328 -89 -57 -250 -75 -254 -386 -348 80 100 -257 -226 -3 150 150 -713 -540 -20 -80
4169 -80 -92 -52 85 406 -116 -516 -227 -78 50 -78 -192 -151 134 -88 -342 23 60 -129 102 -193 -147 8
$$ packed form
4014I6k61M13J00p79j74O53J07J8m84jJ71K9q6j14J32K25J43l95q9l2L83N1j18
4037a2p8J70k64m8kJ57j22J81r0n2l6j24L45j72k28O68j59k52l30O18K74m72k42
4060b70J31J83J20m61M13K4j00J09j70m61R3O70J2n10k4M59J43l91j26M31J23
4081C98l97l1J13K19K9n00J07N86p21J51K22Kk31Q0K95j84p2L86j90k53M0K23
4103B72k29K85l07J29R5l6q8nnM08l27q9j89M23p2j75k77L52M47p84J27L27k85
4126cL30j26k17K81j01O0J7m16j89P30l99l76j77N88M36p37j27K47K71j51k13
4147b72j49O37j55l89K39L2j93J75j79j32L8M28K0l57L1K23J53%q63J73N20o0
4169h0j2M0J37L21n22m00K89J49J28j28j14M1K85k22k54L65L7j89K31k95M6J55
$$ plain form
4191 8 10 239 -23 -98 -14 377 -242 -227 142 164 -94 -202 73 293 -182 -461 -86 -166 301 -64 -10 234 430
4214 430 212 -3 181 163 36 257 145 97 207 460 443 112 -246 -76 511 395 -15 163 854 -101 -329
4235 -329 -50 501 478 -109 -110 452 407 -126 -75 82 278 157 97 15 227 165 219 306 183 54 549 153 54 -346
4259 -346 -140 231 -111 -268 -22 55 -110 -175 313 177 138 -227 -328 -7 -72 -64 -218 -400 180 108 -333 -23
4281 -23 -249 -178 -80 -206 -155 -240 -111 -66 6 -372 -319 265 -101 -808 -443 275 141 -100 -325 18 282 37 -346
4304 -346 285 56 33 -296 -388 -123 348 117 128 -58 -73 5 -148 -213 -555 -5 292 15 -292 117 313 -79
4326 -79 -33 74 243 105 99 -184 98 274 115 -183 7 92 421 -187 -99 444 317 132 55 87 166 172 35 311
4350 311 171 392 62 34 -66 -28 229 412 -104 33 306 314 222 -34 -150 412 316 -166 -227 265 129 57 -128
$$ packed form
4191HKK29k62p5Q4L91o19J5L69K2k58j08K75K20m75k79L75q0M67l65N4K44J96
4214D30k18k15J84j8j27K21j12m8J10K53j7l31l58J70N87j16m10J78O91r55k28
4235c29K79N51k3n87jN62m5n33N1J57J96j21o0q2K12o2N4Q7j23j29M95l96r9m00
4259c46K06L71l42j57K46P7j65o5M88j36l9l65j01L21o5Qj54j82N80p2m41L10
4281b3k26P1R8j26N1q5J29M5P2l78N3N84l66p07L65P18j34k41k25L43K64k45l83
4304c46O31k29k3l29r2K65M71k31J1j86j5P8j53o5l42N50K97k77l07M09J96l92
4326g9M6J07J69j38ok83K82J76j59k98J90Q5L29o08Q8N43j27j85p7L2P9Oj37K76
4350C11j40K21l30k8j00L8K57J83n16J37K73Qr2k56j16N62r6m82o1M92j36p2j85
$$ plain form
4373 -128 127 30 -69 317 -202 143 460 324 132 22 93 220 -151 73 -155 -52 -4 -312 -306 -99 417 -123
4395 -123 -230 -57 -14 105 77 -256 -332 318 298 -457 -267 126 7 -212 3 130 298 -223 -81 -54 33 -156
4417 -156 106 -91 -188 -82 197 -133 -770 -140 -51 -172 -330 -21 -180 74 -152 -576 -247 392 -58 -325 -402
4438 -402 -154 19 14 -437 -150 -152 -188 26 29 -12 -33 -87 114 -107 -252 316 -333 -260 -294 -164 194 -46 -239 -123
4462 -123 116 54 -184 -338 -120 165 -92 80 -48 482 158 -140 183 -164 -2 255 -69 -30 200 43 197
4483 197 -129 104 385 402 371 -174 229 345 -85 -236 220 62 99 -95 -142 83 286 -91 -45 -130 317 28
4505 28 -313 152 295 407 152 241 185 137 -175 30 -111 -306 -334 538 -107 -152 -194 283 178 -193 -190 -4 62
4528 62 -274 -211 9 -20 -385 -204 -131 -281 -80 -68 -302 93 -34 29 -198 -149 -194 -204 -249 -319 -311 83 32 -55 -482
$$ packed form
4373a28K55r7r9L86n19L45L17j36j92j10P1J27l71K24k28J03M8l08OK07N16n40
4395a23j07J73M3J19k8l33p6O50k0p55J90L93j19k19K15J27J68n21J42K7Q7j89
4417a56K62j97r7J06K79l30o37O30Q9j21j58L09j59K54k26m24L29O39m50k67p7
4438d02K48J73nm51K87kl6K14Lm1k1n4K01k21j45N68o49P3l4J30L58k40j93J16
4462a23K39o2k38j54K18K85k57J72j28N30l24k98L23l47J62K57l24L9K30j57J54
4483A97l26K33K81J7l1n45M03J16m30j51M56j58L7j94m7K25K03l77M6q5M47k89
4505B8l41M65J43J12k55Q9n6m8l12K05j41j95k8Q72o45m5m2M77j05l71LJ86O6
4528F2l36O3K20k9l65J81P3j50K01J2k34L95j27O3k27M9m5j0m5p0QL94n1q7m27
$$ plain form
4553 -482 -94 -173 -115 -231 -262 12 -42 -131 -490 -176 -1 -128 -287 -460 93 -54 -228 86 -215 -327 -403 -263
4575 -263 162 -116 -70 211 -27 260 -56 397 31 -269 -27 288 310 -72 -137 142 207 -253 98 35 258 384
4597 384 105 -56 -16 171 209 390 265 140 197 274 -13 1 -25 47 185 228 214 310 173 -4 61 280 175 180
4621 180 -156 -146 298 159 -112 34 472 48 187 65 186 250 -130 -34 144 -155 -32 -80 166 -276 135
4642 135 170 -190 -161 -250 129 -109 -306 -231 -19 -37 -134 -329 139 86 -99 -87 -318 0 -26 295 -207 68 -298
4665 -298 2 75 -122 140 16 95 -363 -191 -19 80 -214 -317 -126 356 61 -88 -196 -319 90 -283 -45
4686 -45 -89 47 24 -143 -91 75 83 -63 -200 -3 -253 -44 -128 -208 -76 -73 -40 212 20 56 28 82 -38 -475 191
4711 191 216 -173 -273 -47 70 295 47 313 -7 -143 -83 -181 338 334 125 -192 315 -61 23 133 -64 34
$$ packed form
4553d82L88p9N8j16l1K74n4q9l59L14J75j27j59j73N53j47j74L14l01j12p6J40
4575b63M25k78M6K81k38K87l16M53l66l00K42L15K2l82o5K79O5m60L51o3K23J26
4597C84k79j61M0J87L8J81j25j25N7P7k87J4k6P2J38M3j4R6j37j77O5K19j05N
4621A80l36J0M44j39k71J46M38m24J39j22J21O4l80R6J78k99J23m8K46m42M11
4642A35L5l60K9q9L79k38j97P5K12j8r7j95M68n3j85J2k31L18k6L21n02K75l66
4665b98L00P3j97K62j24P9m58J72J72R9k94j03J91M82k95j49j08j23M09l73K38
4686d5m4J36k3j67N2J66Qj46j37J97k50K09q4q0J32LL3K52j92L6k8N4j20m37O66
4711A91K5l89j00K26J17K25k48K66l20j36O0r8N19mk09l17N07l76Q4J10j97R8
$$ plain form
4733 34 -74 383 53 -131 -146 204 413 101 168 -61 184 -92 -224 -1 454 128 -97 -174 141 169 -73 -38
4755 -38 41 182 294 574 70 57 204 350 297 77 77 119 338 31 -24 252 242 131 -186 166 -124 -153 31
4778 31 -122 193 -76 -145 -39 64 212 -42 -278 -288 246 -56 -230 -367 4 -121 -361 43 -131 -217 78
4799 78 -14 -41 -249 -166 -22 -70 -417 -272 -3 -317 -398 -304 20 -83 -172 200 41 0 -143 -137 -236 -41 3 -12 -125
4824 -125 -10 67 -185 -12 -360 -314 -6 54 -380 -210 -133 406 175 213 -61 234 -127 -159 -54 255 -108 110
4846 110 -150 210 477 -13 193 111 30 -23 121 -116 -38 261 272 6 -99 49 294 230 68 -56 208 463
4868 463 335 -85 117 135 108 60 -7 -86 243 -83 10 32 130 166 241 -23 291 241 -53 300 209 -33 -204 323
4892 323 -101 -278 73 382 197 -203 -71 144 145 -33 -169 44 198 -92 -110 117 161 -78 -184 67 55 -131
$$ packed form
4733C4j08M57l30j84j5L50K09l12O7k29K45k76j32K23M55l26k25p7L15K8k42L5
4755c8P9J41J12K80n04j3J47J46n3k20%M2K19l07n5K76j0j11l17L52k90k9J84
4778C1j53L15k69o9J06J03J48k54k36j0N34l02j74j37L71j25k40M04j74q6K95
4799G8r2k7k08Q3J44m8l47J45K69l14q1R4L24j03q9L72j59m1j43Or9J95M4j5j13
4824a25J15P7k52J73l48M6L08O0m34J70P7N39k31L8k74K95l61l2J05L09l63K18
4846A10k60L60K67m90K06q2q1n3J44k37P8K99J1k66j05J48K45o4j62j24K64K55
4868D63j28m20K02J8k7m8o7p9L29l26R3K2R8L6P5k64L14n0k94L53r1k42j71N27
4892C23m24j77L51L09j85m00J32K15Jj78j36K13J54k90j8K27M4k39j06K51j2j86
$$ plain form
4914 -131 -52 -236 -144 -214 151 -326 2 -502 -22 -289 345 -123 14 -77 -208 -332 -478 -246 159 -28 -345
4935 -345 -168 332 31 -83 103 -150 -83 -206 -86 98 122 -262 90 -16 -145 -138 -283 -277 -180 -4 148 -100
4957 -100 121 128 250 70 -126 -220 274 337 -195 -216 -132 189 -165 -226 56 198 0 37 -118 187 214 -13 359
4980 359 273 -51 81 -44 4 -151 280 85 354 -277 -113 480 18 -178 -200 116 251 -42 -81 -58 508 158
5002 158 -278 -341 54 329 253 -103 -58 372 253 79 382 78 -81 164 267 -260 283 253 464 -162 -176 118
5024 118 410 -41 -257 -59 35 -32 -70 157 97 -195 -136 -62 88 -49 -4 -123 106 228 93 167 -154 125 -160
5047 -160 295 -71 -275 -115 -5 -98 -439 -40 -281 278 -241 -170 25 151 50 -350 -114 -101 178 -322 -75
5068 -75 120 -329 -7 -148 -110 -133 104 72 63 53 -158 -121 -33 -331 -141 -193 -10 -154 -124 -126 288 -46 -350 -135
$$ packed form
4914a31P9j84R2p0L65m77L28n04M80k67O34m68J37r1j31j24j46K32M05j87l17
4935c45J77N00l01j14J86k53O7j23J20J84K4l84L52j06j29Pj45OR7J76J52k48
4957a00K21PJ22j80j96r4M94O3n32k1Q4L21l54o1K82J42j98L7j55L05K7k27L72
4980C59q6l24J32j25M8j55M31j95K69o31J64N93m62j96k2L16J35k93l9K3N66l50
5002A58m36o3L95K75p6l56M5M30j19j74L03l04j59K45J03n27N43l0K11o26j4K94
5024A18K92m51k16J98R4o7l8K27o0k92N9P4J50j37M5j19K29J22j35P4l21K79k85
5047a60M55l66k04J60J10r3l41L99k41N59n19P1J95J26j01m00K36J3K79n00K47
5068g5J95m49L22j41L8k3K37l2rj0k11L7Q8k98J90n2J83j44L0kM14l34l04K15
$$ plain form
5092 -135 31 -25 -114 -257 -50 178 140 -299 -109 104 58 170 125 109 93 155 38 109 -467 248 325 245 20 3
5116 3 208 184 163 -135 202 105 118 -109 225 271 -144 -138 191 -28 16 195 -41 112 -103 179 199 47 59 285
5140 285 142 -99 217 5 232 56 -17 -321 71 -34 106 -202 71 403 -45 122 -147 72 -46 -168
5160 -168 -19 -37 102 -311 -71 147 32 23 -268 96 -60 -150 -42 -95 -215 159 9 18 -184 -75 8 3 -259
5183 -259 20 200 29 87 -352 9 165 88 -445 -241 92 3 -256 -90 -91 -31 -114 62 151 -131 -106 49 10
5206 10 -278 -346 5 -137 -330 -121 -67 -103 -145 31 13 250 124 102 -335 79 178 -198 -217 50 378 -188 -26
5229 -26 -14 49 -126 162 -223 308 18 -47 159 80 -203 311 -131 -69 49 221 222 47 -115 135 481 173 -6
5252 -6 290 149 -45 173 65 130 -72 321 43 83 195 34 48 1 96 -37 88 5 221 -142 -64 -67 -212 318
$$ packed form
5092a35J66n6q9j43K07K28l8m39J90K13m6J12m5j6j6O2j17P1n76P15P7q0k25j7
5116CK05k4k1k98L37r7J3k27L34M6m15OL29k19M4J79k36J53k15K82K0j52J2K26
5140B85j43k41L16k12K27j76p3l04L92j05J40l08K73L32m48J67k69K19j18j22
5160a68J49j8J39m13K40K18j15rk91L64j56r0J08n3j20L74j50Rk02J09Q3nk62
5183b59K79J80j71N8m39L61J56p7n33K04L33q9k59J66jO0q3J76Q9k82K5J55l9
5206A0k88o8L51j42j93K09N4l6m2J76j8K37j26k2m37M14R9l76j9K67L28n66J62
5229b6J2O3j75K88l85N31k90o5K06p9k83N14m42O2J18J72Jj75j62K50L46l08j79
5252fK96j41j94K18j08O5k02L93k78M0J12j61J4m7R5j33J25q3K16l63P8lj45N30
$$ plain form
5276 318 -24 -64 293 -345 -191 -161 -234 -138 129 -11 406 232 -66 72 -128 -98 29 -141 20 324 -294 82
5298 82 -237 75 -105 93 92 -156 107 216 -197 -54 -38 -192 -22 -381 -43 -117 -158 -137 -170 69 -45 -96 35
5321 35 -183 -199 95 -14 -56 -62 125 24 -90 -43 -172 -113 144 10 -242 -81 -233 -48 145 141 168 -10 -66 22
5345 22 -120 -102 132 119 -115 199 47 -125 -151 -74 283 31 -166 -106 -195 128 -303 223 -185 178 -24 26 16
5368 16 155 123 -44 79 315 247 -135 -18 88 29 33 187 -18 56 325 50 177 -8 -99 199 41 11 -131
5391 -131 2 -73 84 15 -21 91 321 -13 -8 -85 197 229 118 -172 -36 323 -209 -70 29 -84 130 -235 -121
5414 -121 72 103 113 -25 188 -86 34 -32 342 -91 37 147 -102 -204 50 97 -190 136 -39 -73 228 -288
5436 -288 -149 98 6 -267 -32 -137 -203 52 -34 -135 139 161 -86 -248 -37 -192 -73 -175 -323 -16 -125
$$ packed form
5276C18l42m0L57o38J54L0p3R6K67j40M17j74k98J38k00L0J27j70J61L04o18L76
5298H2l19L12j80J98jk48K63J09m13J43J6j54J70l59L38p4m1K1l3K39j14n1J31
5321C5k18j6K94j09m2oJ87j01j14M7j29N9K57j34k52J61j52J85J93mK7j78n6Q8
5345B2j42J8K34j3k34L14j52j72k6P7L57k52j97O0q9L23m31N26m08L63k02N0j0
5368A6J39l2j67J23K36o8l82J17J06n9MJ54k05P4K69k75J27j85r1K98j58l0j42
5391a31J33p5J57o9l6J12K30l34Np7K82L2j11k90J36L59n32J39R9j13K14l65J14
5414a21J93L1J0j38K13k74J20o6L74m33J28J10k49j02K54M7k87L26j75l4L01n16
5436b88J39K47r2k73K35j05o6K55q6j01K74K2k47j62K11j55J19j02j48L07j09
$$ plain form
5457 -125 -100 -49 -131 -8 62 -110 -247 120 -128 311 -169 -157 8 182 -120 -265 70 91 116 -207 286 -41
5479 -41 -300 -171 125 349 6 71 -210 90 -307 -18 186 -178 -509 107 125 183 289 153 250 22 30 -36 41
5502 41 44 59 -47 113 223 304 6 -52 279 104 86 -5 219 40 263 513 31 274 -118 184 144 -60 -124
5525 -124 212 79 138 -101 36 325 251 -331 242 248 -167 -114 -38 27 -118 -129 -53 39 90 13 180 254 -198 31
5549 31 71 25 -87 -76 247 113 -82 52 -52 10 57 -339 88 395 -226 28 -112 -27 56 1 -197 -143 194
5572 194 -40 -253 -23 -69 -45 -150 23 143 83 274 53 177 -126 275 224 -160 -206 121 303 -115 -398 -247
5594 -247 51 -16 -266 -1 169 29 -420 -140 -306 180 -95 13 161 -88 -7 1 -240 -7 52 -69 76 -140
5616 -140 61 35 48 -113 -14 -106 -147 3 -184 284 337 -152 -95 34 298 197 92 -10 -15 155 -19 -51 360
$$ packed form
5457a25K5N1q2J23P0j72j37L67k48M39m80J2J65J74l02j45L35K1K5l23M93l27
5479d1k59J29K96K24l43O5k81L00l97K89K04l64l31O16J8N8J06j36R7k28Qo6P7
5502D1LJ5j06J60J10Q1k98n8L31j75j8r1K24j79K23K50m82K43l92L02m0k04o4
5525a24L36j33N9k39J37K89p4n82N73Om15N3P6O5j45j1P6R2N1p7J67P4m52K29
5549C1M0m6j12J1L23j34j95J34j04O2M7l96M27L07o21K54j40Q5Q3n5j98N4L37
5572A94k34k13K30m6K4j05J73J20o0J91k21J24l03M01n1l84m6L27J82m18k83J51
5594b47K98o7k50K65J70j40m49K80j66M86k75J08J48k49Q1Qk41K33N9j21J45k16
5616a40K01k6J3j61R9r2m1J50j87M68N3m89N7J29K64j01j05j02nJ70j74l2M11
$$ plain form
5639 360 447 188 24 -6 133 -29 291 187 -33 -227 246 34 -195 -86 143 331 0 -194 -123 320 -78
5660 -78 17 97 292 15 247 -59 149 73 37 111 -67 -27 -312 30 77 -41 -15 207 -61 17 -161 -197 178 -41
5684 -41 -186 -25 -292 331 -309 -67 123 92 244 -236 -87 29 -153 37 215 -87 37 -90 77 -159 4
5705 4 -185 173 28 -152 -472 71 -89 -116 47 -208 2 -267 -9 -49 -198 -325 -249 13 -231 -176 -53 203
5727 203 6 200 311 -206 -22 141 -236 -182 155 -164 282 -64 -260 -197 -154 -32 -39 112 40 276 204 46
5749 46 151 -8 181 252 -337 106 123 -191 -23 -33 51 13 -159 112 -154 2 -52 70 -145 -70 -78 -121 33 161
5773 161 195 106 140 -122 145 40 -124 188 -57 355 197 -7 158 302 217 137 97 94 141 222 -177 -253 16 172
5797 172 -33 227 -265 2 52 -44 41 18 -10 -184 -44 -222 -125 172 -28 -323 -342 -13 397 3 25 -144 21
$$ packed form
5639C60Q7k59j64l0J39j62L20j04k20j94M73k12k29J09K29J88l31j94P1M43l98
5660g8R5Q0J95k77K32l06K08p6l6P4j78M0k85L42M7j18K6K22k68P8j78l6L75k19
5684d1j45J61k67O23o40K42J90l1J52m80J49J16j82J90J78l02J24j27J67k36J63
5705Dj89L58j45j80l20N43j60k7J63k55K10k69K58m0j49j27P6K62k44N5J23K56
5727B03j97J94J11n17J84J63l77N4L37l19M46l46j96O3M3J22pJ51p2K36p2j58
5749D6J05j59J89P1n89M43J7l14J68j0Q4l8j72K71k66J56n4J22k15P5qm3J54J28
5773A61L4q9L4k62K67j05j64L12k45M12j58k04J65J44q5q0m0lM7Q1l99p6K69J56
5797A72k05K60m92K67N0r6Q5k3k8j74J40j78R7K97k00k95j9L29M10l94K2j69J65
$$ plain form
5820 21 61 -19 -254 -79 134 21 9 -163 -195 -135 171 -15 -37 107 -36 -108 14 -148 -104 43 -183 138 -40
5843 -40 -43 94 -187 -166 -83 215 268 -322 -293 167 250 88 67 95 76 -58 14 73 -7 -38 108 -10 54 -18 11 2 -185
5870 -185 -75 216 146 100 106 -46 -167 -149 -134 55 170 -90 46 165 24 -41 -5 -1 -138 36 87 -13 55 70
5894 70 356 -73 302 -157 226 150 -37 343 168 -15 161 9 -25 180 56 49 -23 -94 134 257 -96 -372
5916 -372 176 -238 -125 63 32 298 153 311 -235 -129 236 197 -7 167 73 59 -24 193 59 93 58 49 49 -441
5940 -441 143 -133 -159 37 195 -21 -97 -243 -121 111 -86 81 -105 47 -129 -260 -309 -96 102 215 -102
5961 -102 69 161 -36 -267 188 35 -320 -24 -295 -11 -64 -39 126 60 74 123 -140 -70 99 171 -206 -240 326
5984 326 79 330 348 347 -88 -170 92 -121 185 104 -164 228 -211 -323 119 -47 -29 -150 -42 99 11 -129
$$ packed form
5820B1M0q0k35J75K13j13j2j72l2O0L06j86k2J44j43p2J22j62M4J47k26L21j78
5843d0lJ37k81K1Q3K98N3n90K9M60Q3j62k1K8j9j34P2N9q0l1J46j18O4p2K9rj87
5870a85J10K91p0m6Oj52j21J8J5J89J15k60J36J19j41o5L6Mj37J74N1j00O8J5
5894G0K86m29L75m59L83p6j87L80j75j83J76j52l4K05j24pp2p1K28J23l53k76
5916c72N48m14J13J88l1K66j45J58n46J06L65l9k04J74r4j4q3K17j34L4l5r%m90
5940d41N84k76k6J96J58k16p6j46J22K32j97J67j86J52j76j31m9K13J98J13l17
5961a02J71R2j97k31M55j53l55K96k71K84n3K5J65o6J4M9k63P0J69P2l77l4N66
5984C26k47K51J8jm35q2K62k13L06q1k68L92m39j12M42j66J8j21J08J41q8j40
$$ plain form
6006 -129 -56 -23 149 122 132 306 197 72 55 -15 10 -170 -95 88 84 58 172 148 31 160 1 16 124 -101
6030 -101 160 19 169 258 -35 8 23 127 -211 -48 171 123 -49 -111 244 78 174 -124 198 103 91 136 265
6053 265 120 174 50 40 -36 100 -9 92 50 20 -87 29 -187 -196 72 -86 40 40 -213 185 -149 -85 -281
6076 -281 -227 -207 527 167 -231 87 79 -7 30 85 87 116 -64 -28 -192 -57 37 -8 -125 -300 16 -88 28 15 -141
6101 -141 71 98 -54 -243 234 -50 -56 -80 12 188 -226 157 60 -62 14 -175 183 11 -102 -61 203 -314 119
6124 119 274 38 61 126 -22 -18 -230 -114 -44 90 97 -10 313 51 22 -34 105 -311 -38 -47 395 203 273 79
6148 79 -38 139 228 -149 62 349 -15 109 371 119 -2 -121 83 104 -99 -118 -62 101 -49 96 14 -127
6170 -127 -47 -32 -302 74 23 238 47 -418 178 123 -291 -17 -123 22 291 -99 193 80 -4 18 -43 86
$$ packed form
6006a29P3L3J72k7J0J74j09j25j7p0K5j80P5J83mk6J14k4j17J29j59J5J08k25
6030a01K61j41J50Q9k93M3J5J04l38J63K19m8j72o2L55j66R6k98L22r5j2M5J29
6053B65j45N4j24j0p6J36j09J01m2l0j07J16k16rK68j58J26%k53L98l34O4j96
6076b81N4K0P34l60l98L18qq6L7N5KK9j80L6j64J35R4m5j17j75L16j04J16j3j56
6101a41K12K7j52j89M77k84ok4R2J76m14L83r7j22P6j89L58j72j13M1K64n17M33
6124A19J55k36K3O5j48Mk12J16P0J34Pj07L23k62k9n6J39m16K73rM42j92P0j94
6148G9j17J77Q9l77K11K87l64J24K62k52j21j19K04K1k03j9N6J63j50J45q2j41
6170a27Q0J5k70L76n1K15j91m65N96n5m14K74j06J45K69l90K92j13q4K2o1J29
$$ plain form
6192 86 -84 193 -107 -46 -129 -99 84 -213 -259 -241 -172 -61 61 -67 -202 -160 -124 141 -32 -90 -102 -186 -63 -199
6216 -199 40 110 1 -288 77 184 -254 47 167 -123 -57 -305 102 -252 -357 13 -287 62 -270 -179 -426
6237 -426 -101 100 -263 -166 31 -58 -154 49 -212 87 -209 43 30 73 -221 195 61 249 282 -262 234 -179
6259 -179 32 -81 48 35 89 157 75 -207 -45 9 -173 -49 -12 109 111 -76 -125 376 -41 37 -135 234 -217
6282 -217 -32 -189 61 195 131 -74 -261 -100 265 -142 73 284 -85 -75 -169 130 152 -33 99 -59 203
6303 203 286 -100 136 101 157 -147 63 161 2 29 6 106 123 26 209 -114 -179 -189 189 46 153 -82 -157 -34
6327 -34 58 -25 -134 215 -4 245 -241 -145 67 -31 288 -84 -243 -69 53 116 77 -178 282 -66 -192 -177 -177
6350 -177 -3 -84 -88 104 165 49 -159 280 143 105 -352 -202 115 82 180 -54 -218 4 22 47 -127 196 -254
$$ packed form
6192H6j70K77l00O1q3L0J83k97m6J8O9J11J22j28j35M2L6K65j73n8j2q4J23j36
6216a99K39P0j09k89L65J07m38L01J20k90O6k48M07l54j05L70l00L49l32R1k47
6237d26L25K01l63R7J97q9r6K03k61K99k96K52j3M3k94M16j34J88L3n44M96m13
6259a79K11j13J29j3N4O8q2k82J62N4j82J24L7J21Kj87m9N01m17P8j72L69m51
6282b17J85j57K50J34o4k05j87J61L65m07K15K11l69J0r4K99K2j85J32j58K62
6303B03Q3l86K36l5N6l04K10R8j59K7k3J00J7r7J83l23o5j0L78j43J07k35p5J23
6327c4R2q3j09L49k19K49m86R6K12r8L19l72j59J74J22O3l9k55M60l48j26J5%
6350a77J74q1mJ92O1j16k08M39j37l8m57J50L17l3R8k34j64K22J8K5j74L23m50
$$ plain form
6373 -254 -96 98 -251 -16 -52 -38 150 -134 -84 -68 -106 -127 52 151 -198 165 168 -51 61 -92 126 98 144 -28
6397 -28 249 -14 -357 248 -43 176 -163 118 143 -151 -233 220 -24 141 -35 -217 -40 51 182 -103 82
6418 82 165 101 95 58 193 64 27 177 57 12 183 64 198 67 39 -361 -125 -61 -36 -88 105 -103 -122 50
6442 50 282 -9 -291 5 -132 -192 -170 27 30 -28 155 145 115 381 129 84 -173 176 221 -288 227 8 -97
6465 -97 71 54 39 -83 75 116 38 -234 192 -21 -162 -226 -5 75 65 -135 -135 107 235 11 -411 -114 22
6488 22 -190 -244 37 67 81 71 135 -233 -49 -183 -162 -127 -43 -164 -11 116 -350 -21 -282 -236 -82 86 -129
6511 -129 57 -144 -62 59 -32 269 -65 -281 -2 -6 60 290 -29 -149 -134 1 -187 12 63 -19 93 302 146
6534 146 -91 66 -150 -113 201 147 -4 -100 -18 -15 -88 -160 -139 -103 -71 23 93 -53 39 -81 230 141 -68 33 41 -24
$$ packed form
6373b54J58J94l49K35l6J4J88k84N0J6l8k1J79R9l49L63Lk19J12j53K18k8M6j72
6397b8K77k63l43O05k91K19l39K81K5k94q2M53k44J65j76j82J77R1J31k85J85
6418H2Q3o4ol7J35j29l7J50j20m5J71j19J34j31k8m00K36O4K5n2J93k08j9J72
6442E0K32k91k82K96j37o0K2J97Ln8J83j0l0K66k52m5k57L49M5n09N15k19j05
6465i7J68j7j5j22J58M1p8k72M26k13j41o4K21Q0j0k00%K42J28k24m22K97J36
6488B2k12n4K81L0J4j0O4l68J84j34K1L5Q4j21J53J27m66L29k61M6J54J68k15
6511a29J86k01Q2J21r1L01l34k16K79mO6K30l19j20J5J35j88J99N1q2J12K09j56
6534A46k37J57k16L7L14n4j51r6Q2Lp3p2K1L6L2R4P0j46R2j20L11q9k09J01Qo5
$$ plain form
6560 -24 -162 -77 -213 122 164 302 90 -80 -138 20 67 36 -289 -56 159 143 -203 -117 -157 -153 69 52 89 -31
6584 -31 372 155 -1 -49 3 48 12 -328 -295 -7 100 330 -105 -243 -19 54 -165 141 -10 41 103 -238 -90
6607 -90 8 220 -281 154 -63 58 -189 -167 187 19 215 -300 -145 49 196 -57 142 -371 -20 -262 208
6628 208 3 -51 -176 116 61 -89 102 18 234 74 -22 56 232 41 -17 -123 329 170 45 -268 8 -106
6650 -106 -36 -78 -214 91 -47 -86 324 311 -167 -189 -235 -116 -245 -2 123 -26 -211 -28 336 -94 -166 -77 163
6673 163 -53 -90 105 -162 18 -300 48 274 28 59 -76 114 -79 49 75 156 -289 -73 -126 -61 -75 33
6695 33 -267 -29 -9 -37 38 57 368 171 -139 198 169 -232 -75 138 127 -194 50 96 -201 -22 -28 -263 -362 200
6719 200 -36 -2 -172 -413 119 339 20 -112 137 293 -46 287 -133 -158 -193 347 -140 -58 -79 26 -24 101
$$ packed form
6560b4j38Q5j36L35M2J38k12j70n8J58M7l1l25K33K15j6l46Q6m0MK22j7L7j20
6584c1M03k17j56m8N2M5l6l40L3K88J07K30m35j38K24P3k19L06j51N1O2l41J48
6607i0R8K12n01M35k17J21k47K2L54j68J96n15J55J94J47k53J99n13L51k42M70
6628B08k05n4j25K92n5j50J91q4K16j60r6P8J76j91n8j06M52j59j25l13K76j14
6650a06P0m2j36L05j38l9M10j3m78k2m6J19j29K43J25j49j85J83L64m30p2Q9K40
6673A63k16l7J95k67J80l18L48K26k46L1j35J90j93J28K6Q1m45K16n3O5j4J08
6695C3l00K38K0k8P5J9L11j97l10L37k9m01J57K13j1l21K44M6k97J79ok35r9N62
6719B00k36L4j70k41N32K20l19j32K49J56l39L33m20k5l5N40m87Q2k1J05n0J25
$$ plain form
6741 101 248 7 -102 48 -20 -284 -283 -240 -200 -23 82 178 -90 -150 4 -271 -210 -156 -68 -92 -82 65 129 -105
6765 -105 -74 1 -37 156 147 -60 -79 48 -283 -105 278 74 -33 459 42 58 -151 -181 25 -236 -194 381 118
6788 118 -2 -281 91 98 162 -23 19 -8 1 68 55 80 -30 56 -336 -17 165 -213 98 -3 34 91 274 -4
6812 -4 156 19 -69 -26 -299 -273 45 -103 91 -179 -134 161 70 214 -425 123 -141 -39 50 -214 196 55 45
6835 45 23 191 -49 116 -199 62 149 96 57 -48 -55 -224 11 7 -130 79 -26 53 84 -16 -257 -139 -8 -125
6859 -125 27 -169 -104 60 -103 270 -29 -145 248 46 210 -9 83 224 59 -80 -16 264 -20 -7 -42 -225
6881 -225 -146 -22 -214 323 45 75 153 82 -99 -216 134 -56 -23 -130 -203 -93 -70 -114 -218 84 -21 -181 89
6904 89 -126 -133 -18 431 100 -167 -19 235 97 -74 197 200 -63 112 -134 335 84 -219 -216 135 77 462 157
$$ packed form
6741A01J47k41j09J50o8k64JM3M0J77J05R6k68o0J54k75O1N4Q8k4J0J47O4k34
6765a05L1P5l8J93rk07j9J27l31J78L83k04j07M92m17J6k09l0K06k61M2N75k63
6788A18j20k79L72PO4j85M2k7RO7j3K5j10Q6l92L19J82l78L11j01L7N7J83k78
6812dJ60j37q8M3k73K6L18j48J94k70M5K95r1J44o39N48k64J02Q9k64M10j41j0
6835D5k2J68k40J65l15K61Q7n3l9j05pj69K35mj37K09j05P9L1j00k41J18J31j17
6859a25J52j96O5J64j63L73k99j16L93k02J64k19R2J41j65j39O4K80k84J3l5j83
6881b25P9J24j92N37k78L0P8p1j81j17L50j90L3j07p3J10K3m4j04L02j05j60K70
6904H9k15pJ15M49l31k67J48K54j38j71K71Lk63J75k46M69k51l03LL51n8L85l05
$$ plain form
6927 157 -45 188 -77 -18 -195 -143 -24 -28 -86 136 165 -20 -174 15 -9 7 144 232 -20 77 250 -127 -100 79
6951 79 7 260 -16 -364 -76 27 209 -227 -146 113 -178 -44 -4 -299 -59 126 224 -8 120 135 191 -64
6973 -64 158 -73 -110 140 -99 192 -65 242 -105 80 -44 -69 77 -91 -86 -97 368 136 -145 40 -163 190
6995 190 -107 -212 -129 -25 28 215 136 83 -145 81 -88 -52 10 -93 82 -112 -109 24 -54 -197 122 -114 246
7018 246 150 -82 72 72 -224 44 -38 4 -284 -157 169 118 -228 -157 0 -38 -87 -117 -249 -26 7 52 146 -42
7042 -42 48 216 -27 -23 -109 34 129 40 -40 1 222 81 -11 22 -73 -29 -106 128 -56 8 -22 82 -190 -62 48
7067 48 71 -103 -61 -111 -83 -8 11 21 -181 -7 186 68 140 230 -39 -127 -296 -245 280 92 -72 -66 -23 -215 112
7092 112 133 -84 118 -232 15 253 -79 46 38 -49 179 122 115 19 -230 -33 4 218 -160 -1 -54 103 -17
$$ packed form
6927A57k02K33k65N9j77N2J19mn8K22K9j85j54J89k4J6J37Q8k52R7J73l77K7J79
6951G9p2K53k76l48K88J03J82m36Q1K59k91J34M0k95K40J85R8k32J28J5N6k55
6973f4K22k31l7K50k39K91k57L07l47J85j24k5J46j68Nj1M65k32k81J85k03L53
6995A90k97j05Q3J04N3J87p9n3k28K26j69L6O2j03J75j94LJ33p8j43L19k36L60
7018B46r6k32J54%k96K68q2M2k88J27L26n1l46P1J57l8m9l0j32K23L3M5R4j88
7042d2R0J68k43Mq6J43R5q9q0M1K21j41r2L3r5M4p7K34j84O4l0J04k72J28J10
7067D8K3j74M2n0K8P5J9J0k02J74J93j18P2R0k69q8j69N1N25j88j64OM3j92L27
7092A12K1k17K02l50K47K38l32J25qq7K28n7pr6k49J97L7K14l78J59n3J57j20
$$ plain form
7115 -17 -325 39 93 -13 129 -120 99 -103 53 -169 -3 142 17 60 -2 130 11 127 101 -131 -221 95
7137 95 -64 -12 52 207 140 -110 25 -313 18 162 -86 -135 -4 60 120 -135 -6 -166 -205 -58 64 -52 59
7160 59 -133 293 -27 278 11 -192 -260 -65 -71 -8 -61 -42 6 -47 360 116 -26 112 -127 -76 -21 33 235 284
7184 284 167 27 -117 136 69 -93 143 -140 -101 36 62 -73 87 -101 -67 71 173 33 -240 -183 -56 201
7206 201 -70 248 -108 142 -105 53 -225 -232 377 -130 -109 196 -5 181 -153 -148 25 18 -126 -47 -33 -220 -77
7229 -77 29 209 -105 -133 -32 9 -186 -223 -49 -175 -12 60 -33 60 68 28 38 -124 126 -36 -150 -114 13 140
7253 140 302 6 46 -199 -18 -7 80 -97 15 172 8 -19 171 82 -220 -348 -21 111 -91 89 -280 -15
7275 -15 -49 -160 -273 105 -533 91 123 40 10 -120 216 254 -51 -279 206 -163 142 -152 -117 250 -150 61
$$ packed form
7115a7l08L64N4j06J42k49K19k02J56k22J66J45j25M3o2J32j19J16k6k32r0L16
7137I5j59N2O4J55o7k50J35l38L31J44k48m9J31O4O0k55J29j60l9J47J22j16J11
7160E9j92M26l20L05k67k03o8J95oO3n3J9M8n3M07k44j42J38k39N1N5N4K02M9
7184B84j17j40j44K53o7j62K36k83L9J37K6j35J60j88L4J38J02j40k73N7J27K57
7206B01k71L18l56K50k47J58k78pO09n07K1L05k01J86l34NJ73pj44P9J4j87J43
7229g7J06J80l14k8J01M1j95l7J74j26J63P2r3R3Qm0J0j62K50j62j14L6J27J27
7253A40J62k96M0k45J81J1Q7j77J12J57j64k7J90q9l02j28L27J32k02J80l69K65
7275a5l4j11j13L78o38O24L2q3l0j30L36L8l05k28M85l69L05k94L5L67m00K11
$$ plain form
7297 61 213 79 19 -60 146 342 148 -163 116 -165 -37 -214 54 -17 -73 -123 -86 -194 81 14 0 -194 82
7320 82 93 260 -69 -6 -120 -33 -46 -37 328 -91 -71 352 174 37 -125 -35 -85 -172 118 -101 -60 -35 78 108 223
7345 223 153 -193 49 150 40 -93 -19 63 308 -158 16 248 158 125 -125 42 61 -216 46 -109 -158 -146 -38
7368 -38 -290 -159 -51 -165 127 -317 -124 -145 -31 3 4 -106 -68 -14 -203 -414 -111 -80 70 -38 -241 25 77
7391 77 120 -167 35 -36 65 -105 13 100 139 -294 -95 -89 -56 -38 55 8 -27 -67 -254 15 -75 -130 44 -71 -27
7416 -27 81 120 -45 -115 -210 -188 -47 -229 -113 81 160 108 89 -16 -95 151 9 114 82 -114 -25 -323 5 -279
7440 -279 95 -152 -53 18 262 127 52 167 168 -40 182 -11 -51 56 193 184 -56 -26 -107 -66 -190 190 276 24
7464 24 107 -117 -125 147 168 -213 117 -10 56 -48 -184 121 -126 59 -260 15 -96 -91 349 38 87 106 -251
$$ packed form
7297F1J52j34o0p9K06J96j94l11K79k81J28j77K68p1n6n0L7j08K75o7j4j94K76
7320H2J1J67l29O3j14Q7j3RL65m19K0M23j78j37j62R0n0q7K90k19M1K5J13L0J15
7345B23p0l46K42J01j10j33P4Q2K45m66J74K32r0l3k50J67J9k77K62j55m9J2J08
7368c8k52J31J08j14K92m44J93k1J14L4Jj10L8N4j89k11L03L1J50j08k03K66N2
7391G7M3k87K02p1J01j70J18Q7L9m33J99OL3J8R3m7l5m0j87K69r0n5J74j15M4
7416b7J08L9j65p0r5K2J41j82J16J94P9n2j9j05p9K46j42J05l2j96Q9k98L28k84
7440b79L74k47R9P1K44j35p5J15Jk08K22j93m0J07J37rk40L0q1M1j24L80Q6k52
7464B4Q3k24qK72K1l81L30j27O6j04j36L05k47J85l19K75j11NM40l11M9J9l57
$$ plain form
7487 -251 -148 198 197 -46 -170 -310 -387 243 153 2 -46 -67 111 -399 -123 -26 -27 -190 -161 -23 -214 18 -61 31
7511 31 57 32 -119 -173 -100 -101 -161 66 -235 139 75 -261 -245 -136 -63 -18 -242 -81 -27 130 -87 51 -69 34
7535 34 65 80 -17 184 109 -6 299 143 350 -14 -254 -55 141 152 73 -203 48 27 26 -134 -177 66 -119 -80
7559 -80 45 -135 -135 12 105 29 59 -191 9 8 -98 314 -321 51 -102 -118 141 83 -12 276 186 -83 21 -182
7583 -182 129 189 -84 69 -37 -7 58 112 -150 -114 324 -69 208 -64 -173 261 -64 -180 43 -110 101 43
7605 43 -63 110 212 -95 -49 -406 -117 33 -36 -135 125 237 -68 -50 -28 -159 27 -1 -193 99 -23 95
7627 95 -53 87 -8 -306 -45 -12 -179 172 48 -179 -150 -117 118 -273 -128 -74 -322 -88 62 -75 437 212
7649 212 -266 -162 151 142 9 -38 -153 -20 -176 -202 119 -78 27 -246 -161 57 -169 -1 -41 -63 162 10
$$ packed form
7487b51J03L46jk43j24j40p7O30r0j51m8k1J78n10K76R7jj63K9J38j91K32p9R2
7511C1K6k5j51n4P3jo0K27l01L74o4l36J6J09P3M5k24J61N4J57k17J38j20J03
7535C4L1J5r7K01p5j15L05j56K07l64k40J99J96J1p9k76K51k1jj60m3K43j85L9
7559h0J25j80%J47R3p6L0k50K00jj06M12o35L72j53j6K59n8r5K88r0k69J04k03
7583a82L11O0k73J53j06L0O5N4k62L6M38l93K77k72j09M34l25j16K23j53K11n8
7605D3j06J73J02l07M6l57K89J50o9r9K60J12l05J8K2j31J86k8j92K92j22J18
7627I5j48J40r5k98K61L3j67L51j24k27K9L3K35l91J45N4k48K34J50j37N12k25
7649B12m78J04L13rj33m7j15J33j56k6L21j97J05k73Q5K18k26J68m0k2K25j52
$$ plain form
7671 10 109 -67 204 64 -264 98 -219 -216 -248 40 171 239 70 332 -210 -119 183 0 20 -6 68 -168 36
7694 36 24 170 117 -51 -1 105 124 -14 -38 194 -198 12 -38 224 71 -65 -38 5 -45 -123 23 -88 216 -32
7718 -32 142 351 46 -91 -34 163 238 -156 -36 -44 56 -61 132 -66 -56 -425 96 8 40 271 139 246 59
7741 59 -211 -116 96 -354 -140 16 -40 272 110 -164 -149 13 -37 -87 71 48 -171 17 -338 -77 166 -144
7763 -144 188 139 -72 -184 58 -78 -228 -105 4 218 215 -45 299 134 -48 -220 210 -136 -197 -44 -16 217
7785 217 137 -194 11 -99 -2 373 47 -212 119 170 10 36 -336 2 -49 11 145 -159 -20 -50 286 -137
7807 -137 59 -96 -79 -141 -181 147 -227 -232 -72 121 50 37 288 113 195 38 -3 41 -91 11 166 -174 437
7830 437 113 -163 78 -209 84 107 84 19 -96 -241 -146 57 4 -71 -142 106 -93 36 -60 70 127 -94 -45
$$ packed form
7671A0R9j76K71j40l28L62l17Ll2K88J31O8j69K62n42R1L02j83K0k6P4k36K04
7694C6j2J46n3j68N0J06J9j38k4K32l92K10n0K62j53j36K7M3n0p8J46j11L04k48
7718c2J74K09l05j37N7J97P5l94J20qJ00j17J93j98J0l69N21q8L2K31j32J07j87
7741E9k70R5K12m50K14J56n6L12j62k74J5J62n0n0J58k3k19J88l55K61K43l10
7763a44L32m9k11j12K42j36j50J23J09K14lk60L44j65j82j72M30l46o1J53K8K33
7785B17q0l31K05j10R7L75l26k59L31N1j60K6l72L38n1O0J34l04J39l0L36m23
7807a37J96j55J7o2m0L28l74nJ60J93p1j3K51j75Q2j57m1M4j32J02J55l40O11
7830D37l24k76K41k87K93K3k3o5j15j45R5K03n3p5p1K48j99J29r6J30N7k21M9
$$ plain form
7853 -45 99 -79 -55 106 142 -137 -23 -155 -178 48 -208 -173 307 14 -89 2 264 -106 -17 -353 -72 44
7875 44 138 -146 157 -122 -153 170 -12 -31 9 123 -244 51 -17 173 -35 -89 283 -196 43 -7 -156 -61 -126
7898 -126 -192 -15 143 181 11 -142 21 -183 -279 -234 241 -87 104 -190 -35 95 -148 -5 -47 -200 -180 81
7920 81 251 196 34 112 -172 -231 18 13 199 -104 89 19 -107 -238 -32 -96 -228 210 207 -7 101 133 136 256
7944 256 -246 194 76 -74 119 -56 -96 -126 208 155 -31 -76 309 214 9 -12 -107 199 -163 381 64 -151
7966 -151 -5 105 44 -162 -192 -145 82 -37 77 52 37 -90 28 32 161 69 49 194 -10 19 3 95 9 117
7990 117 -261 71 -214 -94 69 -58 -128 303 -373 32 280 -32 94 98 -221 -51 -90 261 -76 145 -40
8011 -40 -184 -18 156 -28 42 -187 -121 -55 70 122 304 -233 1 275 -19 -42 -273 -152 -245 184 -217 -206 49
$$ packed form
7853d5J44j78K4J61L6k79J14j32k3K26k56L5M80k93j03R1K62l70Q9l36K81J16
7875D4R4k84L03k79l1L23j82j9M0J14l67K95o8J90k08n4L72m79K39n0j49R5o5
7898a26o6J77J58L8j70j53J63k04r6M5M75l28J91k94J55J30k43J43m2j53K0K61
7920H1J70n5j62P8k84n9K49nJ86l03J93p0j26j31K06o4j32M38lk14J08L2LJ20
7944B56n02M40j18j50J93j75m0l0L34n3j86m5L85r5k05k1r5L06l62N44l17k15
7966a51J46J10o1k06l0M7K27j19J14k5j5j27J18MJ29r2k0J45k04K9j6R2q6J08
7990A17l78L32k85J20J63j27p0M31o76M05K48l12J26Ml19J70l9L51l37K21j85
8011d0j44J66J74j84P0k29O6O6J25N2J82n37K34K74k94k3k31J21r3M29m01J1K55
$$ plain form
8034 49 -274 -288 -104 83 -139 101 0 -195 50 -43 -285 61 98 -18 -64 119 -34 -125 39 70 -131 -11
8056 -11 -46 305 -86 -88 -85 73 171 -142 -336 -46 -23 -22 -22 43 168 -78 100 -133 34 24 -91 18 210 34 -214
8081 -214 -220 176 122 -126 33 -42 99 -47 60 110 -263 -138 12 -105 -114 171 3 -167 -68 -123 -204 52 306
8104 306 -215 122 -44 199 -17 -131 -26 -28 76 350 -118 124 46 299 -200 225 -5 -109 127 -119 121
8125 121 -303 118 -10 -16 269 -183 92 -198 49 15 -265 -268 -83 -49 -75 -62 -104 -2 134 -78 35 137 -294
8148 -294 -49 94 -66 -5 48 -100 -88 -20 -102 126 77 273 -272 -153 -9 133 9 -110 3 -59 -165 217
8170 217 48 -100 140 58 -66 102 -80 -55 51 -95 51 -360 -84 37 -287 -69 -60 246 -58 -121 -4
$$ packed form
8034D9l23j4J84J87k22K40j01j95K45r3k42L46L7j16m6J83j53r1J64L1k01J20
8056a1l5L51l91kLJ58R8l13j94K90K3J%O5J25k46J78k33J67j0j15J09J92j76k48
8081b14oL96n4k48J59p5J41j46J07N0l73J25J50j17rK85j68j70R9n5q1K56K54
8104C06n21L37j66K43k16j14J05kJ04K74m68K42p8K53m99M25k30j04K36k46K40
8125A21m24M21j28oK85m52K75k90K47l4k80lJ85L4k6J3m2J02J36k12J13J02m31
8148b94K45J43j60O1N3j48J2O8q2K28m9J96n45J19J44J42j24j19J13o2j06L82
8170B17j69j48K40q2j24J68j82K5J06j46J46m11K76J21l24K18RL06l04o3J17
8191d
$$ Imaginary data points
##PAGE= N=2
##DATA TABLE= (X++(I..I)), XYDATA
$$ plain form
0 0 0 0 0 0 0 0 7 -8 8 -8 16 -16 24 -24 32 -40 48 -56 64 -76 88 -104 120 -139 158 -180 208 -235 267 -302
30 -302 338 -381 426 -476 533 -591 660 -732 812 -900 996 -1102 1221 -1351 1498 -1662 1848
47 1848 -2060 2302 -2587 2922 -3327 3823 -4454 5285 -6432 8121 -10865 16093 -29581 135445
61 135445 247270 -118046 -151160 74739 138538 -81234 -126761 46741 130505 2375 -60286
72 -60286 1720 45077 7139 -517 10778 -2640 -16643 14564 29223 9812 2992 26091 22792
85 22792 -5386 -21722 -16414 -6970 13976 25483 9809 -5070 6455 -827 -39390 -34247 30727
98 30727 54654 8028 -13334 16248 7365 -36946 -25512 20329 4218 -35236 -8041 25212
110 25212 -11433 -29606 32214 48929 -42106 -76941 17992 61145 -29978 -67905 30899 74604
$$ packed form
0@%%%%%%Pj5J6j6K4l2M0m8N6p2Q8j04J20j40J64j92K24k59K97l38L88m43N02n69
30c02O40p19Q07r02J009j124J251j392J544j712J896k098K323k572K849l160L510
47A848l908M362m889N509o249P150q277R739j1717J4553j8986K6958m5674J65026
61A35445J11825l65316l3114K25899O3799k19772m5527J73502Q3764j28130o2661
72f0286O2006M3357l7938p656J1295j3418j4003L1207J4659j9411o820K3099l299
85B2792k8178j6336N308R444K0946J1507j5674j4879J1525p282l8563N143O4974
98C0727K3927m6626k1362K9582q883m4311J1434M5841j6111l9454K7195L3253
110B5212l6645j8173O1820J6715r1035l4835R4933M3153r1123l7927R8804M3705
$$ plain form
122 74604 -22541 -75567 3923 46791 -25774 -63812 1443 39861 -6487 -34059 -1621 14050
134 14050 -7748 -8930 10813 5863 -11989 -9412 -4069 -13077 -11739 5316 3289 -18158 -20894 -287
148 -287 13052 7784 -3732 -11036 -5574 7410 3955 -15614 -12002 17174 17779 -19060 -27269 10855
162 10855 24766 -8279 -24624 -2498 6724 -8171 -3720 13807 6227 -7419 10455 23451 -3005
175 -3005 -20551 5241 17892 -17043 -33433 5128 29169 -164 -19088 8543 26924 2939
187 2939 -17006 -4421 8530 1417 -2020 6912 12116 9301 2452 -8197 -13522 -2380 8528 228
201 228 -9699 1156 14932 6271 -6320 -57 11871 7175 -4522 -7018 1417 13531 14184 -4901
215 -4901 -21642 -6963 12574 -3271 -26809 -4649 33820 21731 -17093 -11187 21187 10268
$$ packed form
122G4604r7145n3026P9490M2868p2565l8038O5255L8418m6348k7572L2438J5671
134A4050k1798j182J9743m950j7852K577N343r008J338J7055k027k1447k736K0607
148b87J3339n268j1516p304N462J2984l455j9569L612K9176O05l6839q209L8124
162A0855J3911l3045j6345K2126R222j4895M451J7527p580j3646J7874J2996k6456
175c005j7546K5792J2651l4935j6390L8561K4041k9333j8924K7631J8381k3985
187B939j9945J2585J2951p113l437Q932N204k815o849j0649n325J1142J0908q300
201B28r927J0855J3776q661j2591O263J1928m696j1697k496Q435J2114O53j9085
215d901j6741J4679J9537j5845k3538K2160L8469j2089l8824N906L2374j0919
$$ plain form
227 10268 -25415 -21473 9375 13361 -467 3166 7310 -6293 -11742 -854 -5001 -19802 -8509
240 -8509 15712 8797 -11865 -1077 20173 6901 -16822 -10408 3101 -5939 -13485 -46 4900
253 4900 -7784 -7432 4263 -5600 -21278 -6465 15450 5043 -12808 -394 15570 -1020 -22059
266 -22059 -13892 2740 2247 -3135 -3834 -5404 -2702 4979 -3074 -22408 -15277 12771 10472 -18931
280 -18931 -13173 23480 23055 -13392 -17666 8443 4486 -22513 -18253 5767 4042 -6831 4612
293 4612 12247 -5432 -10851 7339 6551 -13786 -5890 20433 9849 -18428 -6850 21731 6994
306 6994 -21261 -6947 19414 4745 -17632 -2080 17140 4894 -8107 4356 12295 457
318 457 -1337 10296 9035 -830 3734 9360 -2651 -10434 530 6598 -1180 1787 15181 11136
$$ packed form
227A0268l5683L942L0848L986j3828L633M144j3603n449J0888m147j4801J1293
240h509K4221o915k0662J0788K1250j3272k3723O414J3509r040p546J3439M946
253D900j2684L52J1695r863j5678J4813K1915j0407j7851J2414J5964j6590k1039
266b2059Q167J6632m93n382o99j570K702P681q053j9334P131K8048k299k9403
280a8931N758L6653m25l6447m274K6109l957k6999M260K4020j725j0873J1443
293D612P635j7679n419J8190p88k0337P896K6323j0584k8277J1578K8581j4737
306F994k8255J4314K6361j4669k2377J5552J9220j2246j3001J2463P939j1838
318D57j794J1633j261r865M564N626j2011p783J0964O068p778K967J3394m045
$$ plain form
332 11136 -1031 4971 12658 142 -5874 10094 12919 -8875 -10106 16865 19065 -9709 -10322 18290
346 18290 16129 -14350 -15627 11597 14315 -3956 -798 13704 8399 45 6581 4599 -12116 -7365
360 -7365 14361 7827 -18843 -13116 16567 12573 -13322 -9204 15691 12325 -9378 -9338 4046 4277
374 4277 -1295 196 -2717 -8599 -2412 3395 -6721 -11844 4030 10904 -7757 -16600 1206 7897
388 7897 -9136 -12569 6775 9103 -6683 -6083 5250 -2357 -15186 -4995 3384 -11914 -18353 2517
402 2517 11526 -7396 -11642 10095 12695 -11379 -15982 2678 4511 -10243 -7085 6365 408 -9351
416 -9351 -590 5648 -6503 -11564 2110 4228 -9830 -6589 12207 11709 -6154 -6170 7396 4974
430 4974 -7451 -4557 4931 3174 -1706 -1114 -3575 -4448 5499 9389 -3531 -8071 11068 18409 -1731
$$ packed form
332A1136j2167O002P687j2516o016J5968K825k1794j231K6971K200k8774o13K8612
346A8290k161l0479j277K7224K718j8271L158J4502n305q354O536j982j6715M751
360g365K1726o534k6670N727K9683l994k5895M118K4895l366k1703M0J3384K31
374D277n572J491k913n882O187N807j0116n123J5874O874j8661q843J7806O691
388G897j7033l433J9344K328j5786O00J1333p607j2829J0191Q379j5298o439K0870
402B517R009j8922m246K1737K600k4074m603J8660J833j4754L158J3450n957r759
416i351Q761O238j2151n061J3674K118j4058L241J8796m98j7863j6J3566k422
430D974j2425K894R488j757m880N92k461q73R947L890j2920m540J9139P341k0140
$$ plain form
445 -1731 -10244 10078 17170 -5581 -15278 3093 11420 -1160 -1020 12399 8395 -4598 -369 6596
459 6596 -4372 -8934 10591 19631 799 -7026 11676 16184 -5208 -12129 5901 10504 -5723
472 -5723 -8853 5184 9500 3096 3877 6614 -237 -3559 3379 4268 -2606 1263 10577 4854 -8287
487 -8287 -6299 2640 828 -3043 2202 3757 -2064 -1224 3615 -2479 -8577 2230 9444 -4036 -12312
502 -12312 4050 13786 -4046 -14271 1299 6848 -12632 -18703 1273 9210 -2685 -3555 7267
515 7267 1109 -11838 -5282 5108 -5356 -12007 3856 10040 -10289 -18548 2829 11827 -7966
528 -7966 -16702 669 7087 -7366 -10792 3351 6769 -3201 -6103 -1787 -3379 -4963 731 2475
542 2475 -2368 -3162 -1511 -7078 -9625 -112 5809 -372 -1643 6998 4369 -8139 -5049 7551 2475
$$ packed form
445a731q513K0322P092k2751r697J8371Q327j2580J40J3419m004j2993M229O965
459F596j0968m562J9525R040j8832p825J8702M508k1392o921J8030M603j6227
472e723l130J4037M316o404P81K737o851l322O938Q89o874L869R314n723j3141
487h287J988Q939j812l871N245J555n821Q40M839o094o098J0807P214j3480q276
502a2312J6362R736j7832j0225J5570N549j9480o071J9976P937j1895q70J0822
515G267o158j2947O556J0390j0464o651J5863O184k0329q259K1377Q998j9793
528g966q736J7371O418j4453l426J4143L418r970k902M316j592j584N694J744
542B475m843p94J651n567k547R513N921o181j271Q641k629j2508L090J2600n076
$$ plain form
557 2475 -9571 -1225 10391 -2228 -13659 3653 17192 -389 -14289 2861 13754 -3533
569 -3533 -12006 8635 17346 -302 -7466 5979 7091 -5062 -1129 13321 6548 -7462 -1099 8731
583 8731 -2130 -8952 7566 17670 3474 -4723 7330 10845 -3422 -6711 6786 10982 75
596 75 -3441 3815 5330 2278 3183 3404 -318 1526 5405 79 -4522 5326 13431 4010 -5684 194
612 194 5237 -2301 -4611 4836 6712 -1748 -1272 4032 -3609 -10348 1244 12192 961 -7954 5156
627 5156 11578 -6282 -14792 1680 9369 -6801 -13302 2992 8089 -5195 -7480 4659 3613 -8926
641 -8926 -6805 2400 -2923 -9654 1399 10928 -1588 -12412 -3194 5224 -5509 -14497 -3648 7538
655 7538 1475 -8074 -6927 -513 568 -3181 -5266 -2249 2765 1607 -5790 -7153 -473 1996 -4777
$$ packed form
557B475j2046Q346J1616j2619j1431J7312J3539j7581j3900J7150J0893j7287
569c533q473K0641Q711j7648p164J3445J112j2153L933J4450o773j4010O363R830
583H731j0861o822J6518J0104j4196q197J2053L515j4267l289J3497M196j0907
596G5l516P256J515l052R05K21l722J844L879n326m601R848Q105r421r694N878
612A94N043p538k310R447J876q460M76N304p641o739J1592J0948j1231q915J3110
627E156O422j7860q510J6472P689j6170o501J6294N097j3284k285J2139j046j2539
641h926K121R205n323o731J1053R529j2516j0824R218Q418j0733q988J0849J1186
655G538o063r549J147O414J081l749k085L017N014j158p397j363O680K469o773
$$ plain form
670 -4777 -6881 -358 761 -4562 -2452 3938 1135 -4942 -926 2435 -6120 -8862 4779 11582 -2555
685 -2555 -9353 5252 9846 -8203 -14431 4531 13271 -1849 -9749 3779 9772 -1205 -5414 4356
699 4356 6835 -815 -1658 3707 1929 -1819 2246 6657 1770 -3232 357 4416 3100 1656 3430
714 3430 4588 3538 1052 -2196 -1066 6259 7798 969 -1463 6341 7057 -5147 -7075 6768 11362
729 11362 -2021 -6153 6649 9119 -3113 -4095 7825 6700 -4408 -2130 6368 339 -6745 3812
743 3812 11259 -2431 -11103 2178 9460 -4238 -8772 7633 12456 -5458 -12747 1803 6586 -4417
757 -4417 -6255 4799 5761 -3674 -5070 -1834 -3415 -3728 2252 757 -6844 -4515 4691 1871 -7843
772 -7843 -4926 4932 1758 -8192 -7815 -1632 -300 254 1986 -3011 -8063 -2578 2759 -6934 -11763 3601
$$ packed form
670d777k104O523J119n323K110O390k803o077M016L361q555k742J3641O803j4137
685b555o798J4605M594j8049o228J8962Q740j5120p900J3528N993j0977m209R770
699D356K479p650q43N365j778l748M065M411m887n002L589M059j316j444J774
714C430J158j050k486l248J130P325J539o829k432P804P16j2204j928J3843M594
729A1362j3383m132J2802K470j2232r82J1920j125j1108K278Q498o029p084J0557
743C812P447j3690q672J3281P282j3698m534J6405M823j7914p289J4550M783j1003
757d417j838J1054R62r435j396L236j581l13N980j495p601K329R206k820r714
772g843K917R858l174r950L77O183J332N54J732m997n052N485N337r693m829J5364
$$ plain form
788 3601 13260 -1895 -15674 -4476 6471 -2543 -9917 853 6780 -3113 -7140 244 -522 -6368
802 -6368 709 7620 -3636 -12675 896 11434 -1957 -12038 3718 14337 -2184 -16550 -3641
815 -3641 10325 3037 -4489 2589 7467 -714 -5663 -1955 224 1192 6294 7430 -1237 -5701 1489
830 1489 5289 374 -272 5559 4851 -1381 -1977 2022 2566 3513 6493 3144 -3429 -1057 6439 3029
846 3029 -3867 3202 12965 3993 -8783 -2353 9730 4194 -5135 2683 12185 3845 -6721 -2392
860 -2392 4700 2367 1081 6157 4412 -3558 -2617 4590 2694 -2661 1939 8075 1943 -7323 -3310
875 -3310 5105 4434 -858 -1222 826 -50 -1024 -793 -1130 353 2908 1111 -4294 -3262 2089 1359 -4327
892 -4327 -3014 2919 2412 -4394 -5169 -1415 -1423 -2555 -255 316 -3239 -2994 -696 -2741 -6209 -1203 4384
$$ packed form
788C601R659j5155j3779J1198J0947r014p374J0770N927r893m027P384p66n846
802f368P077O911j1256r039J3571J0538j3391j0081J5756J0619j6521j4366J2909
815c641J3966p288p526P078M878q181m949L708K179R68N102J136q667m464P190
830A489L800m915o46N831p08o232n96L999N44R47K980l349o573K372P496l410
846C029o896P069R763q972j2776O430J2083n536r329P818R502q340j0566M329
860b392P092k333j286N076j745p970R41P207j896n355M600O136o132r266M013
875c310Q415o71n292l64K048q76r74K31l37J483K555j797n405J032N351p30n686
892d327J313N933n07o806p75L754qj132K300N71l555K45K298k045l468N006N587
$$ plain form
909 4384 -846 -8379 -4035 3585 -299 -6936 -3941 1253 -1651 -6211 -2789 1453 -708 -3394 -2905
924 -2905 -1884 -1582 -204 -773 -4486 -3688 1157 1323 -3170 -3188 1653 330 -4644 -4096 1070 2756 811
941 811 100 -2005 -3367 450 4431 42 -5037 50 7628 2078 -6948 -2508 6580 3073 -5055 -2451
957 -2451 5270 4142 -1222 -245 2312 2536 3112 3953 70 -3503 1063 5607 1397 -1915 3867 7754
973 7754 -285 -6301 594 7597 4395 -645 720 2639 2185 1779 2368 466 835 4436 2717 -3762
989 -3762 -2665 5785 6421 -2595 -4709 3477 5711 -767 -2494 2030 3051 898 1252 1304 -2190 -2035
1005 -2035 2026 1107 -4414 -1455 5391 2297 -6132 -3792 4448 2686 -5303 -3836 2396 863 -3161
1020 -3161 -950 1734 -718 -2928 -1672 -2780 -4668 -723 3049 -2060 -6873 -1801 4568 -175 -6021
$$ packed form
909D384n230p533M344P620l884o637K995N194k904m560L422M242k161k686M89
924b905J021L02J378n69l713P98M845J66m493j8M841j323m974N48N166J686j945
941H11p11k105j362L817L981m389n079N087P578n550r026M440R088l507q128K604
957b451P721j128n364R77K557K24N76Q41l883l573M566M544m210l312N782L887
973G754q039o016O895P003l202n040J365J919m54m06N89j902L69L601j719o479
989c762J097Q450O36r016k114Q186K234o478j727M524J021k153L54N2l494J55
1005b035M061r19n521K959O846l094q429K340Q240j762p989J467O232j533m024
1020c161K211K684k452k210J256j108j888L945L772n109m813N072O369m743n846
$$ plain form
1035 -6021 -1763 3021 -1951 -5970 -2393 1470 -962 -2878 -1642 -3000 -4062 -715 1487 -2263 -3794
1050 -3794 1044 2713 -3617 -5198 906 3028 -2200 -3690 1163 2471 -2298 -3530 -637 149 -615
1065 -615 289 -387 -2532 -170 3866 2230 -1841 643 4858 590 -5712 -2018 4350 3032 -1516 -173
1081 -173 2477 205 -809 2337 2759 -54 1505 3966 1162 -2482 1962 6898 2362 -3186 1158
1096 1158 6179 1348 -4354 450 6264 2783 -1637 469 3790 2991 1513 2681 2537 2372 3298 2116
1112 2116 -1639 -1548 3279 4438 -309 -1979 2203 4409 1849 -353 849 2718 2835 1319 -884 -1005
1128 -1005 2660 4649 3 -3306 976 5072 -154 -5570 -1368 4904 1170 -4195 -934 4027 2613
1143 2613 -941 224 1390 -349 -776 215 -2259 -3917 -410 3195 -1217 -6251 -1519 4749 1189
$$ packed form
1035f021M258M784m972m019L577L863k432j916J236j358j062L347K202l750j531
1050c794M838J669o330j581O104K122n228j490M853J308m769j232K893P86p64
1065f15R04o76k145K362M036j636m071K484M215m268o302L694O368j318m548J343
1081a73K650k272j014L146M22k813J559K461k804l644M444M936m536n548M344
1096A158N021m831n702M804N814l481m420K106L321p99j478J168j44j65R26j182
1112B116l755R1M827J159m747j670M182K206k560k202J202J869J17j516k203j21
1128a005L665J989m646l309M282M096n226n416M202O272l734n365L261M961j414
1143B613l554J165J166j739m27R91k474j658L507L605m412n034M732O268l560
$$ plain form
1158 1189 -5330 -3679 3376 2374 -3315 -4006 91 2029 -514 -3497 -3637 -158 1543 -1442 -4270
1173 -4270 -3104 580 130 -3015 -2838 797 1496 109 -1343 -1538 -818 42 -1114 -3943 -4022 71 2098
1190 2098 -2662 -5182 16 5235 -14 -5070 -1821 3794 1141 -4277 -2167 2748 2502 -874 -1743
1205 -1743 -929 -287 620 538 -1484 -1861 1203 2843 97 -2042 1098 4248 2257 -986 15 2276
1221 2276 2066 -757 -2037 -756 1802 2248 -448 -1666 2556 5339 1580 -1866 1179 4441 1675
1236 1675 -3043 -583 4131 3485 214 247 1394 258 167 1294 307 -1284 1477 4130 974 -2220
1252 -2220 1916 6027 2452 -2475 -11 3026 226 -3335 -1084 1301 211 -976 104 403 107
1267 107 1377 1561 -629 -810 1826 898 -3393 -3196 1984 2801 -2201 -3471 248 395 -3382 -3614 -657
$$ packed form
1158A189o519J651P055j002n689o91M097J938k543k983j40L479J701k985k828
1173d270J166L684m50l145J77L635O99j387j452j95P20Q60j156k829p9M093K027
1190B098m760k520N198N219n249n056L249N615k653n418K110M915k46l376q69
1205a743Q14O42R07q2k022l77L064J640k746k139L140L150j991l243J001K261
1221B276k10k823j280J281K558M46k696j218M222K783l759l446L045L262k766
1236A675m718K460M714o46l271L3J147j136r1J127r87j591K761K653l156l194
1252b220M136M111l575m927K464L037k800l561K251K385j090j187J080K99k96
1267A07J270J84k190j81K636r28m291J97N180Q17n002j270L719J47l777k32K957
$$ plain form
1284 -657 -401 -1065 -614 -734 -2653 -337 3199 1408 -4182 -3440 1141 -845 -6450 -4874 1557 1062 -4330
1301 -4330 -4009 450 354 -1949 -982 303 -1440 -1978 -938 -1964 -4081 -909 2986 -380 -5102 -2484
1317 -2484 1730 -1149 -5488 -2185 3084 1157 -3159 -2293 1299 2004 1005 519 -665 -1626 -629 -362 -2964
1334 -2964 -2879 1907 3759 -806 -3455 839 4150 1603 -786 1314 2457 374 -716 -215 -9 1569
1350 1569 3606 2156 -1415 -1269 2976 2844 -2306 -1949 4848 5388 -1137 -2495 4294 6803 1474 -1122
1366 -1122 2262 3158 -331 -2480 -147 1387 1542 2503 2140 -32 93 3482 3837 494 -579 2405
1382 2405 3705 -741 -2962 -6 3724 2677 -1411 -1754 687 2285 -101 -2918 -671 2912 2508
1397 2508 -510 -1750 1493 3108 351 -1674 -646 211 -821 -2143 -2322 -2215 -902 1156 960 -1292
$$ packed form
1284f57K56o64M51j20j919K316L536j791n590P42M581j986n605J576O431m95n392
1301d330L21M459r6k303R67J285j743n38J040j026k117L172L895l366m722K618
1317b484M214k879m339L303N269j927m316Q66L592P05r99m86j184r61R97K67k602
1334b964Q5M786J852m565k649M294L311k547k389K100J143k083j090N01K06J578
1350A569K037j450l571J46M245j32n150L57O797N40o525j358O789K509n329k596
1366a122L384Q96l489k149K333J534J55R61l63k172J25L389L55l343j073K984
1382B405J300m446k221K956L730j047m088l43K441J598k386k817K247L583m04
1397B508l018j240L243J615k757k025J028Q57j032j322j79J07J313K058j96k252
$$ plain form
1413 -1292 -1317 1566 1388 -2106 -3613 60 2028 -1915 -4472 -1723 1276 -628 -3778 -1732 1186 -796
1429 -796 -4017 -3315 -386 34 -1215 -468 771 -10 -1468 -1389 -1319 -1914 -2061 -735 -929 -4168 -4056 -289
1447 -289 2016 -477 -2110 1807 3158 -1179 -4962 -1265 3105 680 -3146 -1489 980 -750 -2966
1462 -2966 -268 2567 648 -1563 -1013 -248 -1386 -433 2851 3249 635 -20 1643 909 -2502 -1183
1478 -1183 2540 2301 -2202 -3595 916 2939 614 -164 2884 5387 2006 -2843 -1695 2001 3451
1493 3451 1037 -821 1129 1679 -552 -1049 1609 2851 1602 675 403 -862 -1606 1794 5504 3075
1509 3075 -929 1155 3385 -207 -4774 -324 5282 1582 -5090 -3154 3227 2108 -2242 413 5758
1524 5758 3856 -2257 -2793 535 525 -1255 620 1513 -1619 -2730 -328 810 -1720 -1937 2894 2445
$$ packed form
1413a292k5K883j78l494j507L673J968l943k557K749K999j904l150K046K918j982
1429g96l221P02K929M20j249P47J239p81j458P9P0n95j47J326j94l239J12L767
1447b89K305k493j633L917J351m337l783L697M370k425l826J657K469j730k216
1462b966K698K835j919k211N50P65j138R53L284L98k614o55J663p34l411J319
1478a183L723k39m503j393M511K023k325p78L048K503l381m849J148L696J450
1493C451k414j858J950N50k231m97K658J242j249r27k72j265p44L400L710k429
1509C075m004K084K230l592m567M450N606l700o672J936O381j119m350K655N345
1524E758j902o113n36L328j0j780J875Q93l132j111K402J138k530k17M831m49
$$ plain form
1540 2445 -3305 -6168 -627 4062 1098 -2518 -491 2490 250 -4874 -4491 307 1306 -2145 -4146
1555 -4146 -2302 -172 -846 -1492 329 2026 286 -2148 -1799 -1914 -2621 -1514 748 -602 -3484 -2472
1571 -2472 1025 -283 -4197 -1751 3302 1150 -4453 -4266 1878 3008 -1762 -2142 2117 2604 -1873 -3391
1587 -3391 -827 565 -951 -1091 -383 -480 -499 1178 2347 819 659 2487 2580 -942 -2234 411 2934
1604 2934 773 -2226 113 3562 2258 -904 -521 3431 3830 158 -1493 1708 3582 1926 578
1619 578 2471 3262 1601 112 722 843 -145 916 2212 1348 -730 1708 5189 3389 -213 1156
1635 1156 4950 3053 -2272 -1580 3100 2547 -1184 -1217 2435 2629 -497 -770 1925 2196 77 -216 688
1652 688 907 178 853 1505 859 -225 608 85 -1379 -1950 -854 538 -837 -2058 -749 1724 1459
$$ packed form
1540B445n750k863N541M689k964l616K027K981k240n124L83M798R99l451k001
1555d146J844K130o74o46J821J697j740k434L49j15p07J107K262j350k882J012
1571b472L497j308l914K446N053k152n603J87O144J130m770l80M259M87m477j518
1587c391K564J392j516j40P08r7j9J677J169j528j60J828R3l522j292K645K523
1604B934k161k999K339L449j304l162L83L952L99l672j651L201J874j656j348
1619E78J893P91j661j489O10J21r88J061J296q64k078K438L481j800l602J369
1635A156L794j897n325O92M680n53l731l3L652J94l126k73K695K71k119k93R04
1652F88K19p29O75O52o46j084Q33n23j464n71J096J392j375j221J309K473k65
$$ plain form
1669 1459 -603 -1140 1387 1570 -1949 -3433 -1262 17 -1286 -2806 -1499 265 -663 -2121 -1318 -46
1685 -46 -762 -1707 -887 -1099 -1794 -811 857 -312 -2382 -780 1296 -942 -4176 -2682 1001 -435 -3571
1702 -3571 -2095 2008 2018 -1164 -1091 1275 1355 -766 -1303 -1170 -929 -1171 -500 -304 -890 -16 1129 908 -904
1721 -904 -784 1402 1469 -232 -1311 641 2545 1457 -434 102 2383 1939 -919 -1771 636 2493 354
1738 354 -1643 905 3523 2997 545 553 2415 2384 1098 -55 -222 143 1093 1249 34 -360 1470 3401
1756 3401 1346 -1034 122 2947 1738 -1118 -365 2270 2239 288 -655 599 1400 222 -860 -476
1772 -476 -291 -33 67 -502 -216 844 1983 899 -656 -588 941 265 -1674 -1945 -227 251 -1453 -2481
1790 -2481 -945 1436 868 -1104 -1936 -100 -52 -1747 -1820 40 487 -778 -2092 -1285 -642 -981 -1459 -1168
$$ packed form
1669A459k062n37K527J83l519j484K171J279j303j520J307J764r28j458Q03J272
1685d6p16r45Q20k12o95R83J668j169k070J602K076k238l234J494L683j436l136
1702c571J476M103J0l182P3K366Q0k121n37J33K41k42O71J96n86Q74J145k21j812
1721i04J20K186O7j701j079J952J904j088j891N36K281m44k858q52K407J857k139
1738C54j997K548K618n26k452QJ862l1j286j153j67L65R50J56j215l94J830J931
1756C401k055k380J156K825j209k856P53K635l1j951r43J254Q01j178j082L84
1772d76J85K58J00n69K86J060J139j084j555O8J529o76j939k71J718M78j704j028
1790b481J536K381n68j972q32J836M8j695p3J860M47j265j314Q07O43l39m78K91
$$ plain form
1808 -1168 -1325 -1900 -1850 -1248 -1269 -880 611 848 -976 -2018 -685 383 -1501 -3420 -1673 1086 -784
1825 -784 -3485 -2334 629 1272 -505 -1425 -474 221 -551 -1433 -1305 249 1281 410 -1123 -1748 -710
1842 -710 702 157 -1655 -1643 105 525 -473 -1445 438 2825 2545 -110 -1018 720 1441 -1068 -2005 11
1860 11 1220 38 -1405 35 1922 1378 731 698 1065 1033 692 439 423 707 1652 1423 94 -279 1261
1879 1261 1617 -38 -1017 111 1319 601 -291 507 2553 2383 1073 73 520 1589 1516 -1221 -1031
1896 -1031 506 1039 -31 -1277 417 2369 1460 -270 -556 665 723 741 -406 -970 75 1137 673
1913 673 -1561 -1476 1680 2166 -1139 -3291 -801 2021 223 -2017 -313 2318 1750 -1087 -1755 -859 725
1930 725 301 -1230 -2573 -1708 13 -215 -1431 -1107 1188 1432 -878 -2603 -1068 132 41 -940 -1746
$$ packed form
1808a168j57n75N0O02k1L89J491K37j824j042J333J068j884j919J747K759j870
1825g84k701J151K963O43j777r20R51O95p72q82J28J554J032q71j533o25J038
1842g10J412n45j812J2J748M20r98r72J883K387k80k655r08J738P21k509r37K016
1860A1J209j182j443J440J887n44o47l3L67l2l41k53j6K84R45k29j329l73J540
1879A261L56j655r79J128J208p18q92P98K046j70j310j000M47J069p3k737J90
1896a031J537N33j070j246J694J952r09j730k86J221N8J8j147n64J045J062m64
1913F73k234Q5L156M86l305k152K490K822j798k240J704K631n68k837o68Q96J584
1930G25m24j531j343Q65J721k28j216L24K295K44k310j725J535J200r1r81q06
$$ plain form
1947 -1746 -756 180 -435 -1495 -2027 266 1559 -938 -3929 -1707 1368 463 -2564 -291 2615 1144
1963 1144 -2007 -1670 555 521 -950 -1238 -510 -957 -1002 218 118 -129 904 1798 413 -2046 -596 2125
1981 2125 860 -1351 -288 1891 761 -1497 -836 1555 1533 -214 -987 -121 883 406 367 718 1545
1998 1545 2262 1033 -297 444 1343 1067 -37 -53 542 280 270 1202 1627 978 1325 2403 1056 -1017
2016 -1017 -144 2665 2027 -1087 -424 2453 2203 -1362 -751 2349 2465 -683 -907 817 920 -427 550
2033 550 1980 1133 -96 985 1454 -513 -1005 912 1314 -1421 -2707 237 2079 -277 -1596 579
2049 579 2854 423 -2182 -1499 968 905 -1067 -1789 153 489 -749 -1725 -624 654 178 -1263 -1696
2066 -1696 -647 -656 -671 -336 -234 -98 151 -10 -1293 -2120 -665 660 -394 -3176 -2076 407 163 -2362
$$ packed form
1947a746R90R36o15j060n32K293J293k497k991K222L075r05l027K273K906j471
1963A144l151L37K225l4j471k88P28m47m5J220j00k47J033Q94j385k459J450K721
1981B125j265k211J063K179j130k258O61K391k2j747p73Q66J004m77l9L51Q27
1998A545P17j229j330P41Q99k76j104j6N95k62j0R32M25o49L47J078j347k073
2016a017Q73K809o38l114O63K877k50l565O11L100J16l148k24J724J03j347R77
2033E50J430q47j229J081M69j967m92J917M02k735j286K944J842k356j319K175
2049E79K275k431k605O83K467o3j972p22J942L36j238r76J101J278m76j441m33
2066a696J049rj5L35J02J36K49j61j283q27J455J325j054k782J100K483k44k525
$$ plain form
2084 -2362 -1542 1764 1825 -1663 -2903 -385 1226 -1178 -1938 -101 1003 -791 -1617 -1042 33 39 139
2101 139 323 -992 -1504 -229 833 -44 -805 545 2346 399 -2826 -1600 2109 1638 -1630 -1753 1678
2118 1678 2024 -1341 -1828 1844 3412 1260 -820 288 1442 -357 -662 1141 1200 80 538 1203 232
2135 232 -1016 887 3142 1591 -1414 -940 1802 1844 -638 -224 2526 2529 -185 -1167 79 1401 391
2152 391 -70 626 1111 634 150 363 885 1211 1214 569 -237 -622 -413 561 590 -255 -71 858 914 -1378 -1573
2173 -1573 780 1971 -187 -2159 -58 1637 -550 -2451 -122 2795 650 -2377 -1150 718 -866
2188 -866 -2267 -588 874 -321 -1526 -338 -151 -1173 -178 1184 117 -2380 -1582 698 -341 -2826
2204 -2826 -1272 2076 601 -2558 -2437 614 815 -1207 -1633 149 470 -506 -1477 -1418 -348 652 692
$$ packed form
2084b362Q20L306O1l488j240K518J611k404p60J837J104j794q26N75J075OJ00
2101A39J84j315n12J275J062q77p61J350J801j947l225J226L709m71l268j23L431
2118A678L46l365m87L672J568k152k080J108J154j799l05J803N9j120M58O65r71
2135B32j248J903K255j551l005M74K742M2k482M14K750Lk714r82J246J322j010
2152C91m61O96M85m77m84K13N22L26Lo45q06l85K09R74K9q45J84R29N6k292j95
2173a573K353J191k158j972K101J695k187j901K329K917k145l027J227J868j584
2188h66j401J679J462j195j205J188J87j022R95J362j067k497P98K280j039k485
2204b826J554L348j475l159J21L051K01k022m26J782L21r76r71N9J070J000M0
$$ plain form
2221 692 -443 -1549 -719 -77 -298 -892 -315 559 708 -390 -942 -456 914 1570 -189 -1430 102 1345
2239 1345 -153 -1738 -66 2682 1058 -1412 -977 1256 1042 -738 81 1579 1013 -99 120 616
2255 616 53 911 2067 1252 -964 -585 1522 1148 -1134 -106 2870 2162 -1077 -1034 1446 2330 508
2272 508 -345 1217 1351 182 -356 226 1034 1436 1233 140 -359 268 1241 841 -365 330 1690 1107
2290 1107 -547 -1085 572 1765 1283 -492 -841 212 789 -502 -1545 538 2307 1015 -1957 -1455
2306 -1455 764 615 -762 -455 28 -34 -1168 -918 -796 -535 501 814 -575 -1809 -1201 244 -157 -1683
2324 -1683 -1217 1076 305 -1953 -2101 96 604 -1001 -1690 -841 -204 -513 -1127 -942 -367 407 -11 -850
2342 -850 -1362 -666 525 -54 -1068 -934 -93 33 -850 -1637 -296 888 660 -578 -875 -171 682 -525
$$ packed form
2221F92j135j106Q30O42k21n94N77Q74J49j098n52M86J370O56j759j241J532J243
2239A345j498j585J672K748j624k470M35K233k14j780Q19J498n66j112K19M96
2255F16n63Q58J156q15k216L79K107l74k282J028K976p08l239M3K480Q84j822
2272E08q53J562J34j169n38N82Q08M02k03j093m99O27R73m00j206O95J360n83
2290A107j654n38J657J193m82j775l49J053N77j291j043K083J769j292k972N02
2306a455K219j49j377L07M83o2j134K50J22K61J036L13j389j234O08J445m01j526
2324a683M66K293p71k258j48K197N08j605o89Q49O37l09o14J85N75P74m18q39
2342h50n12O96J191n79j014J34Q41J26q83p87J341J184k28j238k97P04Q53j207
$$ plain form
2360 -525 -1216 -261 1075 -31 -1065 -497 1122 649 -423 -483 319 141 -73 334 126 140 531 959 90
2379 90 -542 611 1565 416 -1250 367 1686 713 -490 86 1509 1264 -532 -418 970 1548 603
2396 603 194 332 600 923 603 86 857 906 1215 380 -243 258 1195 759 93 433 581 1074 164 -455
2416 -455 95 1404 1256 -325 -919 503 969 180 -794 534 1611 500 -1118 -679 590 311 -8
2433 -8 -200 -204 -579 -194 -77 -534 -676 343 1069 -648 -1843 -558 907 -81 -1790 -661 927 194 -1606
2452 -1606 -1493 444 391 -626 -884 -662 -183 -266 -547 -1127 -522 331 242 -1370 -1368 -436 354 -402 -1560 -874
2472 -874 174 134 -777 -1466 -652 687 195 -873 -1570 135 671 -636 -1691 8 1102 315 -997
$$ packed form
2360e25o91R55J336j106j034N68J619m73j072o0Q02j78k14M07k08J4L91M28q69
2379I0o32J153R54j149j666J617J319r73j203N76J423k45j796J14J388N78r45
2396F03m09J38K68L23l20n17P71M9L09q35o23N01R37m36o66L40J48M93r10o19
2416d55N50J309j48j581n94J422M66p89r74J328J077j111j618M39J269k79l19
2433hj92ml75L85J17m57j42J019P26j717j195J285J465r88j709J129J588p33j800
2452a606J13J937n3j017k58K22M79q3k81n80O05Q53q9j612KR32P90p56j158O86
2472h74J048m0r11o89Q14J339m92j068o97J705N36j307j055J699J094p87j312
$$ [...]
8191B7
##END NTUPLES=NMR FID
##END=
