##TITLE=1H_SL72(28.09)-Ag-f1
 CDCl3, 8 sc, 
 29.9.2020
##JCAMPDX= 6.0         $$ Bruker NMR JCAMP-DX V2.0
##DATA TYPE= NMR FID
##DATA CLASS= NTUPLES
##ORIGIN= UXNMR, Bruker Analytische Messtechnik GmbH
##OWNER= root
$$ XWIN-NMR		Version 3.5
$$ Tue Sep 29 10:05:12 2020 Russian Standard Time (UT+4h)  she@DPX200
##.OBSERVE FREQUENCY= 200.1315066352
##.OBSERVE NUCLEUS= ^1H
##.DELAY= (6, 6)
##.ACQUISITION MODE= SIMULTANEOUS
##.ACQUISITION SCHEME= undefined
##.AVERAGES= 8
##.DIGITISER RES= 18
##SPECTROMETER/DATA SYSTEM= spect
##.PULSE SEQUENCE= zg30
##.SOLVENT NAME= CDCl3
##.SHIFT REFERENCE= (INTERNAL, CDCl3, 0, 15.7039)
##AUDIT TRAIL= $$ (NUMBER, WHEN, WHO, WHERE, WHAT)
$$ ##TITLE= Audit trail, XWIN-NMR		Version 3.5
$$ ##JCAMPDX= 5.01
$$ ##ORIGIN= Bruker BioSpin GmbH
$$ ##OWNER= she
$$ F:/spectra/data/she/nmr/H-F/1/audita.txt
$$ ##AUDIT TRAIL=  $$ (NUMBER, WHEN, WHO, WHERE, WHAT)
(   1,<2020-09-29 10:04:03.93 +0400>,<she>,<DPX200>,
      <created by zg, POWCHK disabled, PULCHK disabled
       configuration hash MD5:
       00 E9 B6 7A A2 85 ED C7 34 08 36 98 17 FE 4E 26
       data hash MD5: 16K
       8F F3 2D F1 9E 64 88 29 C2 73 12 1F BF 37 4A AB>)
$$ ##END=
$$ 
$$ hash MD5
$$ 6C F8 A0 5C 5C 24 A4 E1 F4 C8 17 03 E1 C2 73 AA
##$RELAX= 
##$RELAX= 
##$RELAX= 
##$RELAX= 
##$RELAX= 
##$RELAX= 
$$ Bruker specific parameters
$$ --------------------------
##$DU= <F:/spectra>
##$EXPNO= 1
##$NAME= <H-F>
##$PROCNO= 1
##$TYPE= <nmr>
##$USER= <she>
##$AMP= (0..31)
100 100 100 100 100 100 100 100 100 100 100 100 100 100 100 100 100 100 
100 100 100 100 100 100 100 100 100 100 100 100 100 100 
##$AQSEQ= 0
##$AQ_mod= 1
##$AUNM= <au_zg>
##$AUTOPOS= <>
##$BF1= 200.13
##$BF2= 200.13
##$BF3= 200.13
##$BF4= 200.13
##$BF5= 200.13
##$BF6= 200.13
##$BF7= 200.13
##$BF8= 200.13
##$BYTORDA= 1
##$CFDGTYP= 0
##$CFRGTYP= 5
##$CHEMSTR= <none>
##$CNST= (0..31)
1 1 145 1 1 1 1 1 1 1 1 1 1 1 1 1 1 1 1 1 1 1 1 1 1 1 1 1 1 1 1 1 
##$CPDPRG= <>
##$CPDPRG1= <>
##$CPDPRG2= <>
##$CPDPRG3= <>
##$CPDPRG4= <mlev>
##$CPDPRG5= <mlev>
##$CPDPRG6= <mlev>
##$CPDPRG7= <mlev>
##$CPDPRG8= <mlev>
##$CPDPRGB= <>
##$CPDPRGT= <>
##$D= (0..31)
0 1.2 0 0 0 0 0 0 0 0.06 0 0.03 0 0 0 0 0.0002 0 0 0 0 0 0 0 0 0 0 0 0 
0 0 0 
##$DATE= 1601359443
##$DBL= (0..7)
120 120 120 120 120 120 120 120 
##$DBP= (0..7)
150 150 150 150 150 150 150 150 
##$DBP07= 0
##$DBPNAM0= <>
##$DBPNAM1= <>
##$DBPNAM2= <>
##$DBPNAM3= <>
##$DBPNAM4= <>
##$DBPNAM5= <>
##$DBPNAM6= <>
##$DBPNAM7= <>
##$DBPOAL= (0..7)
0.5 0.5 0.5 0.5 0.5 0.5 0.5 0.5 
##$DBPOFFS= (0..7)
0 0 0 0 0 0 0 0 
##$DE= 6
##$DECBNUC= <off>
##$DECIM= 32
##$DECNUC= <off>
##$DECSTAT= 4
##$DIGMOD= 1
##$DIGTYP= 9
##$DL= (0..7)
0 120 120 120 120 120 120 120 
##$DP= (0..7)
150 150 150 150 150 150 150 150 
##$DP07= 0
##$DPNAME0= <>
##$DPNAME1= <>
##$DPNAME2= <>
##$DPNAME3= <>
##$DPNAME4= <>
##$DPNAME5= <>
##$DPNAME6= <>
##$DPNAME7= <>
##$DPOAL= (0..7)
0.5 0.5 0.5 0.5 0.5 0.5 0.5 0.5 
##$DPOFFS= (0..7)
0 0 0 0 0 0 0 0 
##$DQDMODE= 0
##$DR= 18
##$DS= 0
$$ [...]
##$SUBNAM2= <"">
##$SUBNAM3= <"">
##$SUBNAM4= <"">
##$SUBNAM5= <"">
##$SUBNAM6= <"">
##$SUBNAM7= <"">
##$SUBNAM8= <"">
##$SUBNAM9= <"">
##$SW= 16.880792210976
##$SWIBOX= (0..15)
0 0 2 0 0 0 0 0 0 0 0 0 0 0 0 0 
##$SW_h= 3378.37837837838
##$TD= 16384
##$TD0= 1
##$TE= 0
##$TE2= 300
##$TE3= 300
##$TEG= 300
##$TL= (0..7)
0 120 120 120 120 120 120 120 
##$TP= (0..7)
150 150 150 150 150 150 150 150 
##$TP07= 0
##$TPNAME0= <>
##$TPNAME1= <>
##$TPNAME2= <>
##$TPNAME3= <>
##$TPNAME4= <>
##$TPNAME5= <>
##$TPNAME6= <>
##$TPNAME7= <>
##$TPOAL= (0..7)
0.5 0.5 0.5 0.5 0.5 0.5 0.5 0.5 
##$TPOFFS= (0..7)
0 0 0 0 0 0 0 0 
##$TUNHIN= 0
##$TUNHOUT= 0
##$TUNXOUT= 0
##$USERA1= <user>
##$USERA2= <user>
##$USERA3= <user>
##$USERA4= <user>
##$USERA5= <user>
##$V9= 5
##$VALIST= <valist>
##$VCLIST= <CCCCCCCCCCCCCCC>
##$VD= 0
##$VDLIST= <DDDDDDDDDDDDDDD>
##$VPLIST= <PPPPPPPPPPPPPPP>
##$VTLIST= <TTTTTTTTTTTTTTT>
##$WBST= 1024
##$WBSW= 4
##$XGAIN= (0..3)
0 0 0 0 
##$XL= 0
##$YL= 0
##$YMAX_a= 441485
##$YMIN_a= -380680
##$ZGOPTNS= <>
##$ZL1= 120
##$ZL2= 120
##$ZL3= 120
##$ZL4= 120
##$ABSF1= 10
##$ABSF2= 0
##$ABSG= 5
##$ABSL= 3
##$ALPHA= 0
##$AQORDER= 0
##$ASSFAC= 0
##$ASSFACI= 0
##$ASSFACX= 0
##$ASSWID= 0
##$AUNMP= <proc_1d>
##$AZFE= 0.1
##$AZFW= 0.1
##$BCFW= 1
##$BC_mod= 2
##$BYTORDP= 1
##$COROFFS= 0
##$CY= 11.3945322036743
##$DATMOD= 1
##$DC= 2
##$DFILT= <>
##$DTYPP= 0
##$F1P= 16.9975609425685
##$F2P= -3.02152046262296
##$FCOR= 0.5
##$FTSIZE= 0
##$FT_mod= 4
##$GAMMA= 1
##$GB= 0.15
##$INTBC= 1
##$INTSCL= 1
##$ISEN= 128
##$LB= 0.24
##$LEV0= 0
##$LPBIN= 0
##$MAXI= 10000
##$MC2= 0
##$MEAN= 0
##$ME_mod= 0
##$MI= 1.114404
##$NCOEF= 0
##$NC_proc= 0
##$NLEV= 6
##$NOISF1= 3.799351
##$NOISF2= 2.8
##$NSP= 1
##$NTH_PI= 0
##$NZP= 0
##$OFFSET= 15.70392
##$PC= 1
##$PHC0= -9973.639
##$PHC1= 17.40089
##$PH_mod= 1
##$PKNL= yes
##$PPARMOD= 0
##$PSCAL= 0
##$PSIGN= 0
##$REVERSE= no
##$SF= 200.130013532006
##$SI= 16384
##$SIGF1= 3
##$SIGF2= 2
##$SINO= 400
##$SIOLD= 16384
##$SREGLST= <1H.CDCl3>
##$SSB= 0
##$STSI= 0
##$STSR= 0
##$SW_p= 3612.71676300578
##$SYMM= 0
##$S_DEV= 0
##$TDeff= 0
##$TDoff= 0
##$TI= <>
##$TILT= no
##$TM1= 0
##$TM2= 0
##$TOPLEV= 0
##$USERP1= <user>
##$USERP2= <user>
##$USERP3= <user>
##$USERP4= <user>
##$USERP5= <user>
##$WDW= 1
##$XDIM= 8192
##$YMAX_p= 0
##$YMIN_p= 0
$$ End of Bruker specific parameters
$$ ---------------------------------
##NTUPLES= NMR FID
##VAR_NAME=  TIME,          FID/REAL,        FID/IMAG
##SYMBOL=    X,             R,               I
##VAR_TYPE=  INDEPENDENT,   DEPENDENT,       DEPENDENT
##VAR_FORM=  AFFN,          ASDF,            ASDF
##VAR_DIM=   8192,          8192,            8192
##UNITS=     SECONDS,       ARBITRARY UNITS, ARBITRARY UNITS
##FACTOR=    0.000296,      1,               1
##FIRST=     0,             0,               0
##LAST=      2.424536,      0,               0
##MIN=       0,             -380680,         0
##MAX=       2.424536,      441485,          0
$$ Real data points
##PAGE= N=1
##DATA TABLE= (X++(R..R)), XYDATA
$$ [...]
1880E73l27L74O2m40j97M6k84K08j5l07J055k83k38J65n68J065p63p83J268j227
1900f16P62l46q85J865m73o77J121j052L76M8j481J288L5l19O25m84O61n73j079
1919a204J628r64j35Q14j050Q80P1j370J466K76n99O16r36N38M17j436K80R70
1937B62j16P00q61q2J046j479r0O88r9J006j219o65J528o02RR9p3J552j369q76
1957f41J034j066O28K58p88J998r98n10O67m13J31n65o11J656m98k47N3k64R16
1976G40o35q99J403k14o68m5o23R06K02n82P03K70o03j9r68Q12K41j072P61M61
1996A71l50K57q60N97O46q01L13j96kK99j469Q30J207r19P23k34%P65k115N85
2016e53Q86o27P07p41L74J284j727k0J202p07O40r07j73J341j347k99R73m01J535
$$ y = [573, 246, 620, 682, 242, 45, 91, -193, 15, 0, -307, 748, 465, 227, 392, -176, 889, 126, -657, 611, -616, 146, -200, -1085, 780, 307, -370, 751, -301, 75, 123, -1358, -70, -35, -354, 271, -213, 448, -125, -1204, 424, -540, -675, 139, -911, -31, 40, -1330, 136, 412, -187, 429, -507, 31, 448, -988, -708, 262, 146, 846, -15, -97, 949, -530, -620, 68, -31, 975, -244, -909, 619, 17, 26, 125, 52, 1604, 235, -641, 393, -673, -45, 213, -575, 1423, 425, -85, 582, 169, 300, -265, -876, 780, 282, 35, 88, -176, 740, 105, -794, 609, 395, -273, -318, -941, -35, 167, -415, 288, 558, -45, -64, -1032, -220, 21, -1051, -290, 171, -179, 78, -782, -185, 461, -340, -27, -223, -225, 74, -1395, -565, 642, -277, 446, 212, 212, 977, -1138, -553, 333, -294, 413, -328, 46, 1330, -397, -417, 785, 78, 718, -189, -362, 979, -368, -667, 306, -95, 1440]
2035A440n05j094J163j563j01P16o52J217m16r31J791o61l41L09o13Q53k45j423
2053a056J155l19j54K76m72J313K79j733Q48n85l23P74j146P21Q20p25N20k34
2071d1j63M95j377J058K64o15N63m40l40P82m77M65O09r49O48q51j59O92p81M19
2091a98P58k46L63m83n95R61o61o9N48o26O09j78n00R47l23N09q0r77P55n66n22
2112e74Q68o90N05N77l87P27m28q07O13p84K12L62p76R00l92n53O71J63j99M12
2132D20o82J79J83j085O23k12N05L58o80P97k62p82M87n04j25J198r61K62M33
2151A52n28J87J18j89M58k47j12J04n66M72J69k83Q61k20j34L81p82O4j18j84
2171c97O31o3o7N26q13K00J22k30L97k4j91K04p17J12N44n13P28J16j57k0m93
$$ y = [1440, 935, -159, 1004, -559, -660, 56, -596, 621, 205, -726, 1065, 404, 63, 372, -241, 612, 367, -1056, 99, -220, -374, -98, -570, 743, 1022, -711, 137, -448, -771, 3, -1143, -422, 398, -327, 193, -41, -204, 291, -1086, -28, 236, -379, 184, -256, -596, 186, -291, 174, 783, -166, 482, -369, -528, 164, -617, -198, 560, 314, 677, 194, -401, 560, -101, -170, 378, -248, 361, 183, -317, 630, 307, 816, 736, -241, 514, -52, -574, 294, -396, 109, 686, 299, 1026, 598, -209, 404, -380, -168, 194, -582, 318, -74, -627, 44, 207, 8, 420, -262, -83, 100, -985, -362, -574, -69, 289, -391, 406, 144, -638, -151, -655, -780, 418, -543, -281, 152, -376, -189, -71, -260, 198, -49, -161, -57, -623, -151, 18, -265, 596, 376, 242, 623, -159, -95, -213, -397, 234, 171, 104, 630, -183, 17, 139, -91, 306, 282, 91, 295, -422, -310, 234, -279, 449, 565, 408, 388, -105]
2192a05J04j90rM90k87J42K24n27J0J87k53L13k7l23qj26J71K92m63M35M16m60
2214FK28p93l2M29k07j72M59J84q2k10j58L48m05M20k8l21N28n11K7L89k47J31
2236a7O49o42J8l20k6J43N4J1M18NL3L8l97K01k42m6K09k29L44n0O7m42O85J49
2260F13k24k04m5N4l67j23K17M8M60j73N9K32o60o1K99n18K30L37k24Q2l92Q6
2282b74K48P2J71l15J38j07o55M14k84m2R54l13Q7J64o59j17J08q0J18N79l25
2303a18K09j12k76K27J11p2M9L77l92j31k28J82K58L17j15n4J30j99j75P7n83
2324e18O54M93o22N54j77j50J2l14L85J50k72J07n90M28j17r9N72j95k53N03o17
2345f6j22L58r31N79J84n4J84M9m45K99O1j03O3j68j99K28j5l24L77J06l30O13
$$ y = [-105, -1, -191, -200, 290, 3, 145, 369, -158, -148, 39, -214, 99, 72, -251, -259, -385, -214, 78, -385, 50, 466, 6, 234, -559, -591, -162, -369, -541, -82, 102, 20, -190, -348, 0, -405, 15, -13, -334, 194, -317, -290, 99, -148, -17, 632, -10, 8, -312, -338, -195, -141, -130, 288, 293, 326, 364, -33, 168, -74, -120, 89, -140, 204, 154, 221, -221, 464, 613, 389, 185, 140, 194, -173, -296, -79, -31, 429, 256, 315, 547, -113, -174, 125, -393, -163, 174, -50, 32, -360, -274, -26, 46, 217, -98, 40, -67, -722, -308, -592, -634, 320, 7, 94, 258, -401, -518, -410, -490, -372, 207, -118, 91, -21, -297, -70, 41, -31, 18, 395, 3, -128, -356, -174, 84, 401, 286, 232, 362, 163, -12, 65, -518, 136, 629, 7, 561, 384, 234, 246, -68, 317, 467, 195, 302, -288, 140, 23, -76, 496, 301, 48, 551, -66, -188, 170, -761, -182, 2, -52, 132, 181, -264, 35, 96, -7, 56, -112, -311, -83, -98, -422, -45, 61, -269, 344]
2367C44j90m03k73K81J56o4l56M50P86n66n00J65k6J89j5l38K81p0J13k55K75
2388a6J06j29L93J45m65J33m95j05J075o67P2M05k14L09m67n97P62K3m38J66N5
2409E1L61k70l37N36k58K50n6m79P43o58p45J073j29L5M40n47J37K71j244K67
2429e59P28n07M01k65k63Q34o43OJ35L7M98r31K10N83p51Q2M40k70O81p80jR35
2451F00r27O7m1j96J197q30n72R03m53K80l35J38Q13o12j76M11l92J33l51L55
2471A2Q80m59l66l9m78J002k84r23J061N5m49L43m69K61L28j191J088r3m73K96
2491A02o16N60N86j192J081n21p6R05j677Q44N00j268R75j94j33O66j108M2J165
2510F41q83L96m98k15Q78q49L34M32n34O03m25j84P75j103n8Q61l63K28K86j038
$$ y = [344, 154, -249, -522, -241, -85, -149, -505, -55, 731, 165, -335, -170, -196, -7, -22, -360, -79, -149, -36, -291, -16, 90, -39, 354, 499, 34, 167, -328, -433, 642, -25, 47, 452, 238, 547, 80, -517, 245, 268, -170, -4, 51, 412, 142, -195, 341, 83, 333, 277, -202, 541, -117, -862, 211, 82, 117, 557, 10, 147, 418, -826, -559, 169, -338, 63, -202, -465, 369, -274, -268, -133, -96, 402, -529, -319, 264, -487, -405, 35, -235, 446, -334, -335, 600, -327, -260, -301, -497, 700, -130, -702, 201, -252, 28, -307, -169, 644, 32, -144, 267, -125, 8, -343, 12, 892, 433, 67, 28, -450, 552, 268, -655, 406, 461, 12, 355, -114, 147, 475, -716, 372, 279, -194, 102, -514, 46, 632, -560, 521, 0, -76, 829, -848, -4, 496, -772, 203, 9, -124, 542, -566, -524, 641, -242, 154, -344, -559, 319, -530, -196, 236, -298, 305, -120, -304, 471, -632, -690, 171, -192, 36, 322, -716]
2530g16J250l67q31R52m18L22L8p82R27j08o46R15o61L63N28j258Q85m8o87N27
2550A85k78M49J91j087O75J29m05M47o34N82M00r52K60K84j80M06n51L17J59k82
2570A15p3p6m75L51l39N78K75o11L16j78k18P55n05l44O50n39K11K9m30P99k51
2591D0m32O50m27J09J24q38P32l2j03M15o62M62m9m22Q39m25K3M62p25N54k16
2612G9l80M49o6m66P71n44M52M9m27j34M48k22K43k43K66k30l14L84L41l84K37
2633C09j52j89L31l83R9J2m07N59o3m82N87k61m39O11m33J58O5k75M44j57l23
2654c89M22k60K14J98l56O7RK8k91J25L05k7j6Rj14l27K19K66l61L48k50j96P85
2677D08l87j03J10j76K82n3k25L25j35L8k04OQ3P9N2L4j37J88K8j28o9l0J46M2
$$ y = [-716, 534, 167, -664, 288, -130, 192, 230, -552, 375, 267, -379, 536, -125, 238, 766, -492, 393, 345, -342, 185, -93, 356, 547, -540, 135, 264, -141, 306, -328, 254, 654, -298, -38, 246, 66, 472, -79, 238, 397, 115, 42, -34, -509, -158, -497, 81, 356, -255, 61, -117, -335, 420, -85, -429, 221, -318, -107, -78, -508, 291, 40, -392, 258, -169, -60, 64, -774, -42, -74, -177, 238, -424, 38, -11, -433, 406, -19, 4, 466, -259, 295, 79, -301, 148, 82, -384, 387, -157, 295, 344, -83, -217, 231, 9, 252, 9, 275, 45, -269, 115, 456, 72, 309, 157, -32, 299, -84, 15, 27, -380, 179, 116, -366, 221, -40, -479, 132, -301, -143, -78, -353, 91, -66, -389, 33, -227, -13, 185, -171, -104, -95, -67, -358, -233, 72, 45, 29, 38, -76, -403, -184, 82, -279, 69, -181, -377, 408, 21, -82, 28, -148, 134, 81, -144, 181, 46, 84, -120, -114, -31, 48, 100, 134, -3, 185, 213, 85, 16, -14, 132, 174]
2701A74k1q1J32o0n3K12j79j19J41m1J0k54n0K65j84j59J67O9J42j09j1r6p0L04
2725A29l35r8M05j82K7Rl84L28J3k68L65p5qj26J3k0J19R6M6k3k59K15J41j02
2749B6l80M15j33K6P9lQn7K33k71j94M50J07m07L53m40K15J09j15M0k20M30Lm02
2773a28L77l05J54K19m64K98M2j49L56m27P3q6L39j61k85K51k28%J30j28J82j3
2795D7K63k06k08J50j25K1K26n18J34K78l52N54n30L43r0l10K40k25K52p0r9L03
2817G8k06o8L78k72J06P3k43r0K08q9J40J13k36M3K77o2n2o1k6j13k8K64Nk09
2841g0L89k55M3K49l34K14J22o17O05m37J08K01m47O05l16k12N86o31L71R8m90
2862b18K83m6j09K85m20M63K6o51L32L9j26N8k91L21K88n47L13j18J15L24p83
$$ y = [174, 153, 72, 204, 144, 91, 303, 124, 5, 146, 105, 115, -139, -189, 76, -108, -267, -100, -31, 111, 2, -9, -105, -175, 129, -206, -304, 101, -81, -54, -45, -429, -101, -88, -356, 9, -66, -74, -200, -187, -207, -88, 8, 54, 31, -228, -13, 128, 26, -354, 61, -72, -46, 33, 30, 38, -19, 214, -57, -251, 199, 306, -101, 252, -188, 27, 136, 21, 61, -159, 271, 274, -128, 249, -56, 98, 317, -147, 151, 193, 44, 400, -27, 46, -40, 299, 138, -147, 104, -124, -124, 6, -122, 60, 47, 310, 104, -104, 46, -79, -58, 168, -350, -216, 62, -290, 264, -266, 77, -13, -323, -83, -308, -56, -126, -225, 78, -128, -196, 182, -90, 16, 89, -154, -244, -36, -125, 15, 128, -108, -65, 212, 150, 98, 37, 11, -102, -130, 134, 139, -70, 319, 64, 107, 356, 22, 236, 358, -259, 346, -91, 17, 218, -229, 376, 60, -152, 434, -197, 174, 272, -218, 65, 19, -90, 195, -225, 238, 264, -387, -55, -16, -142, -84, -375, -54, 234, -313, 0, -118, -3, 321, -462]
2883d62J56M16m29r4O62o40N04l98K03L17n19O0L58k94K65k5m57Q26n22L31K5
2904B83q83R41k63l65M27n21O92L7o74N42n6m05M01k47M98j04o00N43j07k81L63
2925B21k4m2L09n03m3J90j69N8l17J28O92m33K47J20n66L22m57m0N95m62j84L60
2947Bn78P50l28j35Q46r67J45J94o44R98l59k61N20m87M55n57k2R00n04l49L94
2968A3o81Q74j65n79R12j46k03J41r7n3J22n09K72N31n83M57l39J97L92j076N58
2989C8K88n76K78q3K3N87o62K09K83l97N70q51m6P60o29J25J38j72N58m21q0N15
3011D55o10J26J01k56K43k29R0J31j49J96k07k8N76m66m37K80Q1j42j5P1K30J59
3033B00l50P9M4j77M9k15L80N9k24J27j33j8K12p0m6M98o77L01J11l90O23n43
$$ y = [-462, -306, 110, -319, -413, 249, -391, 113, -285, -82, 235, -284, -224, 134, -160, 105, 80, -377, 449, -73, 258, 283, -600, 341, 78, -287, 140, -381, 311, 348, -326, 216, 160, -245, 156, -91, 407, 303, -297, 246, 139, -142, 221, 197, 155, 464, -39, -82, 108, -61, -3, -320, -192, 500, 67, 314, 434, -132, 190, -267, -307, 288, -174, -358, 2, -576, 174, -154, -289, 557, -410, -265, -71, -715, 283, -76, -337, 183, -304, 151, -406, -428, 472, -32, -381, 13, -668, 206, 41, -538, 374, 228, 25, 166, 69, 16, 138, -371, -99, 432, -151, 306, -33, 164, 556, -520, 38, 326, -250, 28, -55, -32, 555, -107, 102, 385, -12, 558, -293, -339, 421, -208, -83, 55, -117, 441, 20, -60, 455, -155, -29, 72, -184, 59, -170, -80, 51, -98, 98, -109, -137, 439, -27, -464, -184, -103, -245, -260, -189, 41, 200, -150, -71, -27, -204, -155, -370, 10, 69, -155, -28, -161, -179, 33, -37, -83, 415, -262, 39, 150, -240, 383, -160]
3055a60M12J00k20J62n77K83J10m37N20m7j84J68k20J40L04j48P9m27J18K15m58
3076b67L89j5K1K33k62K93n9n10L09k77N7k1R0K48O1j70l22J24K18l04K22j92
3098a34J15J71k39p1q2J97M01m76L11l60k12K61j70J32K23k35L34q8j53j49J43
3119h1M5n3o2L20j38K5nK5K10l56K06j70O2K76m24J91P4j30M51n10L32l56o7J28
3143gJ04L1ll05L85j92LK66j80P8j01j00M7Mq9L3m9L51m09M07j31m36M60m37K42
3168b8j05l6K54l63K01J75k36L52m00K98j53q6j26P7k26L89j04K41J90m80K42
3189G6l22j21K69L6j03K13Pp2q6J05o7K9K32k13K0j39J89K9j63L17JL6K11o35
3213a51J45m5k82O13l61K57J40l17L01j74R4j61q4J98k27p7L14q8r2j15K04K4
$$ y = [-160, 252, 352, 132, 294, -283, 0, 110, -327, 193, 146, -38, 130, -90, 50, 354, 206, 285, -142, -24, 191, -267, 122, 107, 128, 361, 99, 392, 333, -177, 132, -145, -88, -109, -19, 229, 290, 120, -202, -78, 140, -164, 58, -134, -19, 152, -87, -158, -240, -43, 358, -118, 193, -167, -379, -118, -288, -156, 67, -168, 166, 78, -75, -224, -81, -36, -89, -151, 169, 31, 56, 51, 76, 286, -70, 136, -34, 28, 304, -120, 71, 145, 15, 466, -44, 288, -68, -135, -7, 97, 128, 125, -180, 205, 13, 16, 282, 102, 180, 79, -21, 26, 30, -59, -26, -75, 276, -133, 274, 143, -293, 167, -270, -28, -133, -169, 85, -278, -77, 98, -138, 214, -186, 112, -41, -127, -253, -176, -402, -13, -117, 124, 314, -166, 76, -246, -367, -98, -62, -165, 48, 55, -17, -103, 2, -65, -36, 196, -17, 3, -136, 53, 82, -81, 236, 237, 273, 484, -151, -6, -51, -333, 280, -81, 176, 316, -1, 300, 126, 220, 59, -25, 173, -54, -131, 183, 95, 3, -112, 92, 116]
3235A16p8M3k1l68J29j05M29k02K68k84j31K03qj51L06k88J43j15o9J01j72J1
3257b43K76j70K31j15k01PJ77j90J07n1L56n4K18l57j14K52j75O7p1J56K0K16
3279C42o35L73l24M84k65o8K18k01R9M7j41J33j66N49m50J51j25j52L84l16J05
3300D2m9k84N98m19q2O88o48K56J35l80K99l84j2O21p28L93O6k01L34o40K91q2
3322a86J33J41k33OL34l62P6p3j92M35m83J83M38m02lJ75n6K27K41o81K08J10
3344C6k70Q3P5Q9J06k47J10J71l7N2k06J29K0l80N73k29j11L06k16j4M88n54L63
3367C37l19j98Q31q72L03L70m93L95m24j53N53k84o4J55j43J56n23J91K15j14
3387h1O2j2O4j28j22j58K91K69j95J32l17J43K35n54J51L22k56J23l31J94N13
$$ y = [116, 38, 81, 60, -308, -179, -284, 145, -57, 211, -73, -204, -1, -9, -160, 146, -142, 1, -114, -183, -82, -254, -243, 33, -137, 94, -21, -222, -215, -38, -228, -121, -172, 184, 130, 348, -9, -123, 129, -46, 21, -50, 106, 126, 342, -293, 80, -244, 240, -25, -93, 125, -76, 23, 70, -71, 62, -104, 445, -5, 146, 21, -131, 253, -63, 42, -7, -291, 307, -112, -194, 494, -154, 102, 237, -143, 156, -228, -240, 381, -347, 46, 112, -89, 245, -395, -104, -186, -53, 88, -145, -139, 195, -167, -91, -164, -356, 79, -404, -221, 217, -185, -188, -13, -69, 158, 399, -282, -74, 36, -234, -151, -76, 13, 119, -128, -18, 153, 116, 168, -38, 91, 111, -269, 304, 75, -36, 270, 54, 40, 528, -26, 337, 18, -180, 651, -221, 82, 452, -41, 354, -70, -223, 330, 46, -18, 137, -6, 150, -373, -182, 33, -81, -19, -31, 33, -95, -217, -375, -84, 185, -10, 122, -195, -52, 183, -371, -220, 102, -154, -31, -362, -168, 345]
3408C45q22N04J7l91O96o30K55J55l88N33l26R5L30o39L22M7j90k4n1K62L03o59
3430b56J77M08l71J21k47KN65m70p2J45l12M03r3k06N92m08L3J41j93L5J86m73
3452b93O42k70k01K33k32L77j51l05M88j50k28J98l90L26%m57O30m37J86M9k11
3473a96L33k78q2J85j33K83j78n11M24J7J25J64m01M89m8n67M7L36k5k24K45L59
3495C64k52k73Q3J2Q3K38k10k10L89k68m0K94j54J94p8l65K84J20l67L86j24P3
3517A79p9r4J73k06j30K77j68M42m27R1J94m42M84l41q8J87M8j98J0o7L04m42
3539b93L22L1k43K92k85j05L04J21Kj31J18j52j20K61r9p9q1J02P6j12J34k16
3561a53o0M50o20M03L00l41J22l29nM28l79Q0J76q7L52n61J68K25m42M39J02k06
$$ y = [345, -477, 27, 44, -347, 349, -281, -26, 129, -259, 274, -52, 43, 373, -266, 56, 103, -87, -111, -162, 100, 403, -256, -79, 329, -42, 79, -168, -166, 399, -71, -143, 2, -310, 93, 0, -206, 386, -22, 11, 152, -41, -6, 180, -293, 349, 79, -122, 111, -121, 256, 105, -200, 288, 138, -90, 108, -282, 44, 44, -413, 217, -220, -34, 15, -196, 137, -141, -223, -38, -171, 112, -66, -577, -153, -136, -11, 153, -248, 241, 193, -374, -327, 9, -16, -240, 5, 364, 112, -161, -78, -66, 17, 255, 45, -165, 224, -44, -84, 210, 56, 250, 172, -193, 91, 211, -156, 230, 106, 179, 100, 6, 179, -27, -157, 120, -48, 394, -33, 58, 252, -190, 294, -47, -135, 52, 100, -98, -88, -155, 149, -293, 29, 60, -183, 109, -176, -281, 23, 144, 146, 15, 133, -19, -139, 122, 23, -56, -137, -35, 41, -71, 63, -153, -213, 237, -383, 20, 320, -21, 101, -228, -233, 195, -184, -104, 72, -15, 337, -224, -56, 169, -273, 166, 268, 62]
3583F2K71k67k9j0j34M67m91K69R1j05j96k0L43j94K5R4k40J94k14j23L47k74
3605a34J65j21n3N10o43J76k1o1M21m24K68nk24L39l59J63K03k19K8l6o1N2k28
3628b64J77K62k09r2J96q1R5l72K63Nj28O1r1K98j93m8M67k95p8p3J01K33l57
3651a23L36j96j77M30k74P1J87k93Pm9J36M7J66j74m5n1m5j6L48l20J7J00j69
3674h7j10J43P4R3n2n6j76q5L94j42q0J47j67O5J00j40P2J11j44P7rj90n5K5P2
3699a20L9l9Lk6p5J9K30k32m2K95o4J28k64k6M17n25N00Qk01J13k90N69m65k38
3723b86L40p1P8P2k14L27j68J52p9l43M14r2j52L42j43j73J1q2J81J09r8J09o5
3746A69m54K01L59k02j28L64l45J17l0q9J65k50J33j60J72J27m4j0k98L51l60
$$ y = [62, 333, 66, 37, 27, -107, 360, -131, 138, 229, 124, -72, -92, 251, 57, 82, 176, -64, 130, -84, -207, 140, -134, 31, -90, -143, 367, -276, -100, -121, -182, 239, -185, 83, 78, -146, 193, -166, -3, 200, -19, 9, -27, -88, -36, -264, -87, 175, -34, -126, 70, -11, 84, -288, -25, -20, -148, -87, -178, 120, -73, -121, 346, 51, -27, -100, 1, 234, -123, 213, 17, -160, 270, -4, 67, 254, -39, -32, -81, 55, 102, 268, 94, 49, -2, -47, -63, 285, -35, -18, 82, -87, -197, -54, 20, 113, 61, 5, -171, -256, 138, -4, -84, 63, -104, -39, 61, -79, -7, 104, -40, 37, 28, -162, -217, -192, -120, -81, -120, -117, -143, -218, -199, 31, -201, -243, 52, -12, 116, -148, -174, 243, -282, 218, 226, 25, 138, -152, 417, -48, -286, 54, -17, 61, 133, -81, 246, 78, 230, 151, -192, 222, 130, -22, 320, 177, 4, 15, -67, 114, 223, 125, 234, 169, -285, -84, 275, 73, -55, 309, -36, 81, 51, -38, 127, -123, 10, -150, 22, 149, 105, 95, -203, 148, -212]
3767b12J55K45l18kP2kJ42Q6l73J15p2K2K53l02K35lj59M96o20L34j8k14K75K7
3791A62k48L90j17l55N0O6J13l7k5L7K55n5k33J10n0L9P1p8k82Q2J09J26k30O8
3815c2K44k31J52j50J63m3k73M16m42K18J38k98K34j42K14J63m72J60k40j37N17
3836A59o0k98J94k25J64J18k33J71q4J91k4j67J34J27k65R9n7L2R7q5j62J33k03
3859b44L55J45M4j96k01J73r0k4kJ46j85J34qK1J87l52n8L66k33K15m69L18J53
3882A95k19M6J24q2K91l14j13K15l49N30k32l33N42n85J20K32k29N39l30O5J23
3903B36j05j38O6j34M7K96l15J52L9j25J19n40J57L35j09r2L58n36L27l01K54
3924iK22n41L69j50P3K37k77q5M81n58J40n2P6K06m07K67N3j97K35j39k8L18l18
$$ y = [-212, -57, 188, -130, -132, -60, -62, 80, 166, -207, -92, -164, -142, 111, -191, 44, 41, -118, 378, -242, 92, 74, -140, 135, 162, -86, 304, 187, -168, -118, -52, 61, 24, -1, 36, 291, 236, 3, 113, 63, 102, 173, 95, -187, -105, 4, 130, -100, -32, 212, -19, 133, -17, 146, 103, -170, 246, -196, 22, 160, -138, 96, -46, 168, 331, -141, 19, -221, -358, 159, 99, -199, -5, -230, -66, 52, -181, -10, -94, 97, 73, -94, 40, 167, -98, 1, -56, -24, 73, -12, -174, -41, -244, 111, 256, 300, 104, -97, 76, -14, -38, -40, 106, -79, 55, 47, 68, 255, -97, -155, 211, -22, 193, -276, 42, 195, -24, 22, 146, 64, 355, 41, -72, 143, -206, 324, 92, -241, 301, -284, -164, 68, -161, 378, 48, 113, 236, 131, -7, 59, -75, -28, 268, -47, 105, 144, 19, 138, -402, -245, 90, -19, -111, 247, -289, 38, -263, -9, 213, -328, 41, -109, -36, 201, -76, -161, 320, -238, -98, -150, -74, 132, -275, -8, 45, -152, 83, -56, -84, 234, -84]
3947h4M2Q1q6m6l6j08L56q0M6n9Q5O0J60m98M17j32j16k44J61K75j53j79L89k45
3971Fj55O4q5Q9Q8k67N07j62l9P3j83lL18o11K31K9J5L61o05L00O6j73r1Q4Q3
3996f0J42j53l0j35K6K60p8N0p0K89k45P3m7J13j03k11L77p8k31k3J31L3O6j43
4020d7J88n9j1K7l62L38O8l60L79Jj73L1j44L41O4m11K36l6J51O7j23j46j27L26
4044B18j69k51K30J45K7k96j25N8L70k26J17l2N5n46K06J41J13R8k97J87oj85
4066a68O0K4j54J72k38K50m2N3L35m20Q4P5j48K82l30N2K05q8J57o7j42K36j98
4089a0N2j66kK93l71J60J10Km7j50J36J85k0J0j62j22Q7K7j5k10K17J25r5K16
4113B50o9K2m21J61O2jJ93j34p6O7N9k19J69r1r9Q4k66L21K78l33l2o1L1r3K75
$$ y = [-84, -42, 39, -47, -93, -129, -237, 119, 39, 85, 26, 111, 171, 331, -167, 250, 118, 2, -242, -81, 194, 41, -138, 251, 6, -149, -85, -170, -81, 7, -260, 247, 85, 46, 119, -64, -67, 251, -360, -129, -100, -85, 276, -329, -29, 37, -136, -227, -143, -60, 82, -71, -101, -236, -210, 50, -28, 22, -48, 241, -4, 69, 22, 135, 32, -179, 198, 120, -111, -134, -3, 30, 96, -47, 141, 82, 71, 98, -264, 74, 142, -218, 161, 162, -11, 20, -124, 217, 281, -130, 106, 70, 221, 288, 165, 19, -108, 218, 49, -202, 28, 173, 200, -96, -221, -163, 207, -19, 98, 66, 121, -425, -219, -78, 35, 133, -164, 23, 17, -168, -108, -84, -238, -66, -304, -54, -96, -43, 292, -128, -44, 31, -117, 165, -165, -113, 92, 4, 161, 94, -48, 188, -10, 42, -124, -126, 167, -204, -44, 66, 68, 21, -129, 7, 192, 172, 182, 20, -102, -15, 12, -3, -213, 4, 129, 34, 250, 181, 203, -218, -57, 5, 4, 197, 63, -13, 54, 113, -106, 63, -28, -127, -43, -309, 12, 290, -43, -75, -136, -105, -198, 77]
4138G7m2k13K80k39L8J95l98J65L25j33j59N4J61k20J9J40l57K26k5j2J98o3j04
4161h7M06j73j84J06j26j35K06L1K36l40J70r1K4J78k61J1k26L86j66J42j23J65
4183A49j44O1p8j52J77J46j15k00L43l19M6J81j98N1j41J55o8p1M3M5M3J59o1
4206E2J31k29K24j76j50L7j03L72j89l3J16j41ML2k31L57J0j5n2q2p0M2J71j64
4230h7R5j2kP8j49m7P7j83K68k15L16M8j77j50L15J45n43J38K52j32k6o5pK65
4254B02j69j7J24k39K47MJ9p1k18R2K06j30P7r1k33J1L04j5J67m67K63N4l11L54
4278A63k45J17J02r3j92k0m8k16L50o5K53k00M8K60l70K37k16J76N7j69oK08j99
4301f8M2K09k95J64k04M3R4j43K22On1l8J42l07J26J34k37M20k68J78o5m82O30
$$ y = [77, 35, -178, 102, -137, -99, 96, -302, -137, 188, 55, -104, -50, 111, -109, -90, 50, -307, -81, -106, -118, 80, 17, -87, 319, 146, -38, 68, -58, -193, 13, 44, 280, -60, 110, 19, 43, 221, -40, -29, -255, 131, -35, 107, -16, 149, 5, 66, -12, -164, 13, 159, 44, -156, 187, -132, -86, 95, -103, -52, -193, -38, -106, -177, -134, -89, -46, 113, 52, 183, -46, 178, 2, -148, -111, -214, 158, -31, -64, 52, -89, -85, -53, -284, 73, 83, 68, 16, -66, -136, -94, 77, -87, 8, -4, -6, 72, -77, -124, -47, -230, 38, -177, 139, 187, 10, -140, 175, 320, -223, -85, 167, 35, 9, -56, -63, 202, 33, 16, 140, -99, 148, 152, 171, 100, -118, -26, 180, 50, 127, 36, -197, -186, 118, 103, 270, -197, 66, 120, -191, 163, -82, 35, 137, 44, -148, -168, -216, -432, -82, -147, 106, -94, -46, 214, -156, 81, -135, 41, 98, -71, -77, 131, -68, -26, 183, -112, 52, -152, -109, -15, -158, 64, 70, 19, -19, 123, -184, -58, 76, -161, 259, -9, 169, 104, -378, 252]
4324B52j35R7j01k89L74j97p1J4l4K0K97l37N57m60j03O7Lj01J80l09K61P6l7
4347B4o5r7J97j33pJ29j7l12K34j31K50k48J50o9R3N0N8j79k00K71L7k16J82Q8
4371H9n8k23K7L56j92o5Kk19L36N6l69Q5K56k99J36l14M09j63N0K69l55N21o7
4394B68l91K83o9Mr8k40M50k2k48J63j21K7l5K7k4K65l62M18k34q6J99k48J71
4417I7J40j23Pj27J98k88J13k7L1j14k28N71k54J92j40q8J84q3k4n1k80L53j96
4440a37O6J70m11N72k74k14K86k69J21Q3j48p4P8J15P4n9m4L9K5L22l59j16L19
4463A65l88K26jJ31k67J39j45J62N6M0k9J02n5K32l65J30o6K3J63k78n1K13n5
4486H2j74J43j38J9J55j77K61k08n6J00l6L72n10K54j33j8N4j38Q2l6K32m70L58
$$ y = [252, 117, 214, 113, -176, 198, 1, -70, -56, -90, -70, 227, -110, 447, -13, -116, -49, -46, -147, 33, -276, -15, 61, 24, -41, -138, 59, -74, -81, 48, 31, -281, -47, -178, 72, -176, -26, -95, -2, 48, 106, -73, -273, -2, 35, -181, 1, 89, 31, -192, -165, 191, -1, -66, -64, -283, 53, 109, -260, -175, 81, -218, -82, -396, 13, -150, -100, 169, -186, 335, 268, -123, 160, 91, 95, -3, -243, 207, 185, -63, 100, -21, 6, -29, -2, -26, 239, -123, 295, 61, -25, 174, -74, 97, 237, 114, 121, -6, 192, -96, 17, -10, 21, -93, -321, 250, -4, 188, 48, -40, 144, 61, 37, -14, -294, 59, -137, -71, 99, -312, 260, -14, -228, 58, -211, -90, -7, -155, -229, -151, -36, 38, -21, -65, -26, -1, 321, -38, -154, 165, -223, 3, 2, 133, -134, 5, -140, 22, 78, 118, 89, 191, 136, 368, 3, 133, 67, 90, 253, -25, -76, 137, 82, -92, 51, -87, -68, 87, -90, 171, -37, -93, 7, -29, 343, -167, 87, -46, -64, -10, -148, -66, -102, 130, -340, 18]
4509A8nm5J09j61R3j17k27J71R2P8k0p9n6J17J68k51j24M41k29j1k20K99n0P4
4533F5j45M0J34k88N8j8L09k98R7J27k15j54N47k95J43J23k01j05R9o8j31Q3L13
4556B20k21J45r8k6r3J54k45M55k07l46J59P5M4R7j60J56r1J9l29L62J6j90L42
4579B38k58J26np7o0j61K85j04P2O5k82K29K3j47K30k17N4l05K93O1j69N6j08
4602a61L61l16K55j96R3Q6j7j55p7jK03l4l24J81J5J82m6o4l7L1O6r3j01K39m85
4627c95N27K0Q3j88J61l50O7J41j14j99L18Rj97J69j00J77j95J39l14N82p1l33
4649f3R7J59k87K9Q4k11J72k3J52l75K04M8j59J36K2k7J48l77q8K26r4K27p5K39
4673A64q7k68JJ15P5J37k43K31j47K66j33J67k39n9Q8k4j46q4L06N6k4k54M11
$$ y = [18, 13, -32, 77, -84, 9, -108, -335, -164, -72, 6, -14, -93, -149, -32, 136, -115, -239, 202, -27, -38, -258, 41, -9, 65, -80, -40, 94, -194, -136, -154, 155, -143, -46, 81, -134, -288, 259, -36, 107, 230, 29, -76, 23, -45, -176, -93, 220, -1, 144, 46, 20, -73, 81, -164, 291, 84, -262, -103, -28, 16, 113, -47, 109, 18, 37, -292, 70, 86, -104, 238, -20, 106, 101, 24, -36, -197, 88, -16, 56, 121, -161, 68, 91, -56, 174, -43, 11, -294, -1, 60, -109, -53, -161, 200, -116, 139, -57, 36, 122, 105, -50, -127, -128, 75, 41, -283, -102, -87, 95, 49, -15, -52, -21, 45, -48, -149, 90, -395, 132, 152, 235, 47, 208, -142, -75, 66, -48, -247, 71, 80, -117, 52, -48, 129, -66, 73, -241, 341, 270, -63, 34, 193, -94, -65, 19, -192, -20, -43, 109, -266, -62, -14, -173, -37, -15, -42, 106, -271, -359, -133, -227, 0, -75, 164, 77, -191, -190, -75, 0, 137, -106, 125, -22, 244, 111, 278, 39, -20, 68, 44, -102, -186, 120, 176, 152, -102, 309]
4696C09l31R6K7l62M09j1p4K6n0J21j96K27o3P1J3j31k81J00J20j52K71N6k00
4719el0O3j04J21J84l56P5J25k11Q8j64M10Ok15J68k27k67M43k05K76m90J95q2
4742b02J84n4m5j33M10j30q4J41o2R9k75K41m2j46J9K18m26L67k07j10J25J35
4764B3j66L87l5R8k93n8k95M66l38J41J05J9r4J53j76K71k54J75j00o0J60k42
4786a13J09J52l11K71m6k03K28J3k58K79j14pL00n73M92l83j64M61j52p7Nj19
4808b10K12R3j2j78J17O2P1l22K28Q2j78N9k82K21QJ38j27J52K03k81k09MJ46
4831cj11J41j61K15N9j81K4N1Oj95J63JK37l50J38j53j93M11l57K91J16j07j40
4854i8K01l5Q3k43j42M91j90L8R4j76L3j60J37J26j43K58k07l87O13j15l17K88
$$ y = [309, -22, 74, 101, -261, 148, 137, 63, 89, 39, 160, -36, 191, 128, 199, 212, 81, -200, -100, 20, -132, 139, 195, -5, -35, 28, -76, 45, 229, -127, -52, 73, -138, -50, -214, 196, 202, -13, 155, -72, -339, 104, -101, 175, -315, -120, -202, -18, -72, -117, -250, 160, 30, -54, 87, 25, 124, -151, 90, 48, -98, -79, 139, -287, 80, -127, -237, -112, 23, -143, 244, 209, 307, 14, -44, -339, 127, -211, -70, 35, 54, -40, 113, -63, 208, -46, 129, 29, -31, 129, -113, -4, 148, -163, 108, 62, -141, 87, 100, -158, 121, 7, 0, 300, -273, 219, -164, -328, 133, -19, -96, -91, -210, 2, 95, 83, -95, 22, 84, 155, -167, 61, 143, -35, 24, -258, -37, -29, 109, -18, 134, 337, 56, -153, -149, -3, -114, 27, -134, 81, 140, -41, -17, 34, 40, -155, 8, 9, 246, -104, 34, -119, -312, 99, -258, 33, 149, 42, -98, 103, 68, 151, -92, -234, 257, 67, 105, 199, 23, 56, -104, 33, 159, 16, 274, 67, -320, 293, 178, -139, 149]
4876A49j51j97L00k39j50M22p9R5k51J95j67j87J31K60k36k0j13J44N5o9k2J56
4898B6J99j12j13q0K06k32J88l6o2r4n0L05r7m2%L49m34J40j12RK93j29j09K26
4922B39r9j28O5j07N8L2J26k87K36n3k40k6K80j47P1J35k54J04k60K13K71k82
4944e3M4rk68L47J4k48K31p8o3J1J06l6M2j60K01k48L68j63m41N27n6j70K20m5
4968G3l2j05Q3R3o9m5q5K97j62k5m15N09J84l24P7j37M5lj5J37j60K7K1J07k84
4993b08K45k58J48J20q3K7j65J54O0j03J82M0j4j73O6j69M07m47K21N6p2PJ46
5016A87k41k5J02J36m2J8j92Nl6kj47J67P0j35m2j5K45j98O2P9P0k89J80K20k0
5041A57lj62R1m6q8l8k76K51L15k73J93P8j99Q2n7k96J19L65k21N4j95L80k27
$$ y = [149, -2, -199, 101, -138, -288, 134, 55, 150, -101, 94, -73, -260, -129, 131, -105, -125, -238, -94, -39, -108, -130, 26, 225, 113, 0, -80, 126, -106, 82, 46, -16, -110, -160, 145, 48, 6, 6, 355, -79, 61, -51, -42, 251, 122, 13, 239, 140, 12, 77, -30, 28, 60, 186, -101, 135, 82, -158, -184, 96, -51, 20, 155, -99, 5, -255, -42, 229, -53, -9, -18, -286, 61, 75, -173, 58, -20, -83, -72, 34, -2, 40, -120, 81, -167, 201, 38, -403, 124, 68, -102, 118, 73, 41, -64, 19, 112, 43, -2, -87, 210, 48, 23, -392, 117, 301, -23, 54, -83, -38, -41, -56, 81, -79, -52, -31, 76, -208, 37, -221, -73, 47, -36, -9, -174, -20, 40, -63, 119, 159, 145, -28, 38, -131, 276, -171, 50, 106, 34, 41, 187, -54, -79, 23, 159, 117, 135, -57, -52, -88, -90, -237, -70, 0, -135, -177, -192, 53, -145, -83, -4, 66, -223, -43, 177, 157, 154, -8, 83, 37, -51, -89, -365, -114, 201, -72, 121, 199, 0, 82, 25, -271, -152, 213, -8, 46, -149, 231, 4]
5064Dj26L5K42J6k78J34j40K89j10QL9j18K00l00J15j41J18j43R3J80O8j26k27
5087a68K47PN6j00n0J49k67K1J25q4O6Lk1O0J28r3j66j3J68j96J0J15J82m39R5
5112a65L3K31l08J24J03j28j05j0J92j79J66J31j29J23J05q1j78K3j59M1J61m7
5134e6N3J98j76N7k74L44o0J62m53M07L7r9p9L9l5j37M7K96j61J55k75J23J15
5157B28k15n1R2J36j75kj49J61j92L84Jk37n6J73j17j95K66j50j15r6K44M6l9
5180e8R5k2mJ39q5k86J38j85J43K07j21r9J62j37K19l01J55J14P1Lj17j14rR8
5204FJ83K6m17L86j23Q7qj30j66J79Q2r5j54J3L54J0j15K8m04L16j08J12P0o5
5228F7q9j3L03k65Q0j52L6k16K59m8j07K18N4k47N5nL9j0J85j01P7r0k44K46k4
$$ y = [4, -122, -87, 155, 171, -107, 27, -113, 176, 66, 74, 113, -5, 195, -105, 10, -131, -13, -156, -63, 117, 185, 59, -168, 79, 86, 142, 42, -8, 141, -126, -105, 20, -64, 2, 5, -16, 44, 172, 79, -87, -100, 68, -128, -118, -3, 179, -260, -165, -132, 99, -209, -85, 18, -110, -215, -225, -33, -212, -46, 85, -44, 79, 184, 103, -75, -52, -211, -170, -9, -56, -3, 195, 19, 76, -198, 146, 86, 248, -205, 202, 239, 140, 61, 100, 65, -72, -25, 271, 110, 265, -10, 113, 228, 13, -38, 54, 190, 15, 13, -136, 25, -167, 217, 218, -19, -75, 98, -19, -214, 52, -98, -213, -309, -65, -19, -58, 37, 15, 11, 150, 65, -221, -83, -268, -125, 82, -39, -138, 24, -113, 106, -195, -40, 74, 145, 148, 31, -83, -92, 6, 189, 215, -202, 184, 61, 148, 140, 10, -156, 23, 105, 10, -144, -131, 223, 233, 118, 146, -258, 58, -50, 62, 132, 67, -22, -35, 268, 3, 83, -69, -33, -249, 10, -38, -145, 73, 127, -120, -65, -70, -31, -41, 144, 43, 120, 30, -214, 32, 8]
5253Hj16L3kj07Q1j29J62P0n5j98k2L28n0j36L7L23l82M8K78j30N6j93P1J58J18
5278B51o1K8j92K00k75K53O6P0k19j68QQ1j69M4l0J41j14J24Q3l11K55K8J7j08
5302Bj54J58J88l53J10J84j29j71K49J20k70m6M6l0K2o2K19l40L37j24r5K28k18
5325a29M30p40M70q7o4J73K06m49L60j3k94J68j00M4p6JO9L2O2N4k10k03L85L7
5349A26J4k49J09J10r3k43K68q9J67M3j31P6k16k5J35k65L56P6k59J07L5j30P5
5372cK78o2j77j46J10j75N5L97Q9l84J22J13o1R9k39m1J38J6l97K93J3k91L53
5395A00J3o8o9Ll7p9j93K85N9j0p5Ql7J8k41L17Q2o5q8L19l25J64k5k00J33N1
5421D0k26J27r1J96J22l19K01k62K46j06J63J0j81j44K76n8o9L50l27O4PQM7q8
$$ y = [8, -108, -75, -77, -184, -103, -232, -70, 0, -55, -253, -275, 53, 3, -133, -96, 227, -155, -107, 171, 41, 97, -96, -25, 133, 251, 190, 218, 26, 226, -49, 204, 270, 340, 121, -47, -39, 42, -127, -83, -113, 28, -86, 38, 121, -190, 65, 93, 110, 2, -152, 6, 194, -159, -49, 135, 6, -165, 84, 204, -66, -112, -66, -96, -74, -136, 83, -257, 80, -44, -139, 89, -129, 301, -439, 31, -56, -120, 53, 259, -190, 170, 157, -137, 31, -69, -25, -101, -100, -31, 1, 63, 117, -93, -296, 89, 126, 140, -109, 0, 110, 17, -226, 42, -47, 120, 163, 32, 108, -108, -133, 2, -263, 93, 169, -90, 17, 52, -78, -3, 275, 213, 36, -110, 0, -175, -120, 277, 366, -18, 104, 217, 156, 255, 16, -25, 113, 129, -268, 25, 38, -253, 100, 113, 45, -24, -21, -58, -137, -330, -45, 14, 4, -71, -63, -100, -82, -323, -6, 76, 11, -77, 242, -83, 81, 56, -144, -11, 40, -186, -59, -150, 46, 168, -151, 50, -212, 34, -72, 91, 101, -80, -224, 52, -6, -75, 275, -52, 12, 19, 27, 74, -14]
5445a4O1j20L3J72j15o8o4K16rN8q7lj78q3L02J20r7L5l51M34j96J34k16pp2K86
5471A71l50jJ36J06L3l80J58K22k8l33L50k78K59j99J56J02j46O6qj72n0J98K3
5494C5J10j33K34k20j53K99j19M2k12J40M3j66J72l11K75R2O2j61K85l26n6M5
5516b3O5J40j03k8j62J90k2j91L23k23J95K0j44q8J2L43l03rl6M8j52O2K31j75
5540c0J51oj40J52l90K93q0L3K06r1M3l33J74N9j13R1r2J39k96N19l62oJ51o6
5564Fj32O0J51k5j9q9J19j86K90j05j89K09j0j65K97l23M6J67J02k55N9n0Oj2
5588d8J71j55K55l34K06n3P3j15n2L7J27k90L60j45L8O5l2m1J0k20Q2j04l4K60
5612F1r3J06J52k35j25l2J48J2P0j07j09L10l52Q1J38j09K29k55J51l7J28j73
$$ y = [-14, 47, -73, -40, 132, 17, -51, -115, 101, 92, 150, 63, 60, -118, -201, 101, 221, 124, 159, -192, 242, 46, 180, -36, -43, -115, 171, -179, -180, -44, 62, 95, -285, -127, 95, 67, -266, 84, -194, 65, -134, 22, 124, -22, 44, 36, -136, -186, 12, 35, 145, 12, 246, 26, -127, 172, 53, 95, -117, 23, 66, -100, 72, -239, 36, 128, 190, 29, 314, -12, -68, -23, 42, 182, 79, 51, -111, 79, 57, -134, 189, -34, 161, 181, 37, -51, -39, 304, 1, -8, -44, 4, -148, -86, 145, -30, 121, 115, -25, 127, -263, 30, -50, -17, 189, 98, 141, -192, -18, 41, -72, 19, -73, 66, -230, 289, -73, -79, 72, 6, -126, -66, 85, 60, 41, -48, 71, -115, 175, 70, -119, 90, 80, -85, 212, -111, -65, 102, 204, -51, 8, -42, -36, -48, 123, -32, 223, -111, 95, 42, 115, 0, -52, -15, 112, -178, 182, 37, 75, 140, 108, 67, 77, -143, -61, -165, -199, 61, -32, 74, 226, -9, -134, -166, -18, -6, 64, -43, -152, 158, -194, -113, 25, -84, 145, -110, 41, 4, 132, -41]
5634d1P3j96J05j19L22L4j91r6p4K41j27O7J9O3j29m1L27j41J7k9r6P6k10Q0j06
5659a72P2m6J16m5j10J27J14j95J71Q3j19K17Pj13p3K01l40M5K45k44j06K95o1
5682F9J10l34J15M3J56k14j9j50R8K48k62L35j20NJ6n78O49m4k92J83MJ39l66
5705b09p5L13pk01L11j38J86P6k50p7j0K3q0J64q0Jj52K16Np2r6J90k19K15J17
5730A51k59K14J35j51j85J60Q9jq4k27L20j67M8J82p6j18J72l54K20l2k50K70
5752E7K20l89K56j11N3j58p4J31K92l65L3O5k48K38l14K09P2p9o1R1J41l58L16
5775A7R8p6j5j57K65QJ87l82N3k17J96j76M23k68J25q2m4J31j89M10k51j62K5
5798h1P0j2Rl66J59K54k53N18m0k70J87k89QK56k49N0J37l1L9j63R9J47l13L50
$$ y = [-41, 32, -164, -59, -178, 144, 178, -13, -109, -183, 58, -69, -2, 17, 80, -49, -90, 237, 96, 113, 84, -12, 64, -146, -66, -172, -100, -146, -30, -75, -185, -58, 56, -139, 32, 115, -4, 213, 220, 107, 34, 235, -105, -60, 185, -59, -165, 130, 69, 179, -155, -40, 3, 159, -55, -74, -224, -126, 122, -140, 195, 75, 80, 96, -482, 167, 123, -169, 14, 18, 157, -209, -284, 29, 22, -179, 132, -6, 180, 256, 6, -71, -81, -58, -138, 26, -54, -53, -205, 11, 16, -56, -152, 38, -181, 34, 151, -108, 106, 241, 90, -95, 65, 154, 153, 69, -158, 162, -5, 43, 225, 149, 31, 203, -151, 69, 37, -213, 57, 277, -112, 144, 33, 86, -72, -146, -15, 277, -88, -55, 10, -238, 0, -314, -105, -33, -112, -173, -82, 59, -299, 17, 115, 39, 24, -133, 132, 140, 327, -55, -2, -219, -23, -199, 224, -44, 81, -1, -45, 86, -103, 307, 56, -106, -81, -11, -23, -14, -380, -221, 33, -220, 298, 258, -12, 175, -114, -106, 150, -99, -49, 88, 57, 96, -67, 32, 179, -134, 216]
5822B16j81J63j48K12m63K52j2j44M4Q6J5j11P5j7j08O4K12k47q7K33k29K13K2
5845F0LM3k19OJ26k41K86j38n8L32m99L07L06m9l33M6O9k0k7l3Mj34J92R0l1q9
5871ar3K61j03J17P9l82L67j23q2j43O3q6K44K1L4l37K34j32L26Lj79j56J5k5
5895g8K06j33p9J14o7J7J58j64n9K60j41J83k62j38N14k08J3j93O9p0j4ol2J98
5919H8R6m3k13J03m3N9K7k23O1J86m8P7j64M23l76m5J21J31Pp8j24N8j8j23K12
5944A51k8j65m7K01l42K83j97J1J65k35J51L7n2K1jj57J94k7K30J3j37j37P4j61
5968a55J66j08N6M05o25J05J35j12J45pJ11k41Q3J50Jj31J8p2P2K56k52J6k22
5991b06L41p8j39Q5J03j13j53J6O4J12N1J2k34j3J45j85J01j37L26o0k98M99k50
$$ y = [216, 35, 198, 50, 262, -201, 51, 39, -105, -61, 25, 40, -71, 4, -13, -121, -57, 155, -92, -179, 54, -175, 38, 60, 63, 106, -113, -107, 19, -222, 64, -74, -132, 200, -299, 8, 314, 265, -68, -22, 47, 27, 0, -33, -29, -163, 29, 119, 88, -1, -94, 167, 64, 181, 260, -122, 245, 122, 40, -103, -40, -126, 118, 139, 173, -164, 70, -62, 264, 267, 88, -68, -53, -78, 128, -5, -84, 30, -37, -20, 138, -26, -85, 175, 34, 217, -45, -183, 331, 123, 136, -57, 12, -58, -72, -78, -110, 88, 184, 141, -72, 31, -12, 47, 74, -149, -88, 98, 50, 127, -37, 386, 10, -35, 86, 217, 224, 146, 22, 80, 62, -61, 151, 123, -42, -89, 112, -230, 53, -144, -133, 32, -203, -52, -15, -67, -46, -47, -204, -10, -37, 193, 206, 69, -68, 6, -155, 11, -97, -41, 364, -261, -156, -21, -133, 12, 5, 116, -125, -42, 108, 109, -22, -4, -76, -4, 252, 0, 16, -206, 135, 57, -82, 3, 106, -7, -160, -144, -80, 32, 83, 95, -139, -152, -7, -192, -91, -228, 98, 38, -260, 239, -11]
6014a1L6k74K66Q2k33J9j51K86N3l20J59K27j49k1J17On1l8q3j0M1M1o2m3J59
6039D6J14j72o0Kp9J30k14J84J6L13l07O1k8J3O2l22K34J43J3k98J95R4k05L0
6063c5ON7O3k68L33j47r2K11k09j0R4J37k93l3M00j35j2k9l2L32l10j10O8P0j27
6088g1OP2k72J95j18P8m9j11M12q5j29j2l1L2Q3J79k52J96j92J3j0%o0K37J01
6113B12j35j90k4L08r2o0K40k52j44M92o98L61Qj41J96k3k95K65j68R2J68m45
6135c25L19L5k62J87j72o1K71N3k62L5Q7l5J26j3J88l00K34k04L67j87q6J2l6
6158b9J65m34J81K01o5J18j48J24j00L1P9l19O8%L6n3Q4l4J65L22k22m03K29J14
6182A10k67J5J78j72J42j01J11k27K65J07j1k33J4LO8J38r8K34m29l1O1J84N8
$$ y = [-11, 25, -249, 17, 99, -134, -115, -266, 20, 73, -247, -88, 139, -10, -31, 86, 92, 41, 3, -80, -90, -49, -8, -70, -113, 46, 160, -12, -72, -70, -149, -19, -233, -49, -33, 280, -27, 34, 6, 19, 81, -241, -7, 136, 149, -149, 46, 140, -65, -35, -29, 28, 91, -177, 156, 9, -83, 128, -81, -91, 3, 140, -153, -186, 214, 79, 67, 38, 6, 338, 28, -82, -14, 56, -71, -65, 7, -265, -70, -188, -110, -159, -270, 142, 57, -72, -84, -115, -83, 0, 179, -73, 123, -69, -56, -66, -66, -126, 111, 212, 77, -113, -137, 171, 79, 19, 259, 7, -137, 355, -343, 18, 26, -115, 81, 58, -237, 28, -140, -48, 120, -325, -6, 29, -233, -46, -218, -279, -8, 45, -217, -182, -95, -130, -4, -17, 171, -129, 105, -99, 268, 81, -5, 7, -29, 136, -298, -117, 84, 19, 137, -11, 113, 13, 44, 123, -196, -128, -128, -92, -145, -61, -95, 70, 392, 170, -233, -4, 110, -157, -142, 36, -136, 6, -95, 16, -211, 54, 161, 150, -83, -69, -66, 2, 140, 42, 276, -153, -184, -123, 61, 119]
6205A19j14nj99J76Q2J47l11K80l18K59N1j46J73l41J21O9pj46o8J38j08j09K37
6228b0o7O9ML4k59J21J75q8K00k13K4J8m1J66p5k37L68k61oRR3J14Q5j57m6J33
6254A43o1j77J94Nl23L57j11q5qM2J38m2l5k12K36j37J83K8k71P0J97k6r5L0P
6279D7L6j91o5J31n4j61M40m46L25n2K9J47l43M8J31j10K2M4J01n6J1r0j43J50
6303d9M7q7n4L05l34L9J00P8J10m5k03q7J32J67Q1n7j10n9J73o2j02j08K40j30
6327a5j49Q5J76p9J0R3l7Q7J96l97R6R6k06J99j6k87p4K88o1J05j42O8k9K41m93
6352b45J30J94L6k00M1n5O0L08k02j61j94M45j42q4K3j12L39k86J12m5k0M1q6
6375a03J18j0o8p7K36j55J41l23j5J08O1J79k38r4K57p2j57O3J20K98l04o2o9
$$ y = [119, 5, 0, -199, -23, 59, 206, -105, 175, -143, 116, 167, 21, 194, -147, -26, 43, 36, -110, -178, -40, -148, -257, -20, -87, -18, -14, 20, -239, -118, 57, -31, 169, -44, -20, -2, -43, 123, 48, -189, 179, -82, -88, -79, 14, 128, 213, 56, 10, 143, 82, -95, 99, 104, -219, 138, 27, -58, -66, -24, 114, 72, 37, -175, 61, -76, 107, 135, -136, -66, 131, 105, 10, 40, 47, 83, -108, -173, -42, -96, -257, 183, -263, 62, 10, 39, 186, -157, -109, 22, -88, -66, -22, 79, 23, 34, -56, -199, -49, -2, -89, -143, 162, -172, -133, -33, 45, 155, 110, -93, -180, -48, 119, 200, 143, 33, -26, 147, 85, -17, -125, 115, -15, -164, -79, 97, 18, 28, 121, 84, 171, 367, -30, 66, 162, -44, 155, 139, -148, -222, 66, 5, 110, -32, 36, 7, 248, -245, -115, 79, 115, -85, -44, -99, -39, 269, 67, -94, -288, 157, 15, -69, -46, -158, 181, -105, 7, -38, -58, -17, -103, 15, 5, -63, -140, 96, -59, 82, -241, -256, -148, -87, 92, -146, -240, 17, -55, -212, -149, -29, 269, -35, -97, -166]
6398a66M66m65K81j37j84L81k17N1p9p5P9J76j65m3l6j12N48j77p5j30j1J24l7
6421cj43K25L4l59K12j86Q8J83r6J52m78L35P4NQ6L6j32J10J5j26j17R4M9j88
6445a30j8K94j2p6k00J18l49M56M9j60j36K80k44R5J67k66K55k75L04o8j57J20
6467D7j71J81j40O1j77K04J6k22J25O9j21O2K45l26J09n3m5J49j87J33K50l31
6489a22L15k99J87J70k65k3N5j76K00J36m1l32J61K85k65j0Q7j23P7j52L34k99
6511a00J07j3J41o1q6J25j23P2P8q3k35K33n2k90K62L49j53j70O9k70K41j00K6
6534c3l2m7L23l91L66k28Or9j30O0K23J97j39l24K62J63l76J09J23J09j52K04
6556A94k83N7j01N1L19m78K81o8o3K18M8m27K05P8j04J78j39k27J77NQ0j79M16
$$ y = [-166, 300, -165, 116, -21, -205, 176, -41, 10, -69, -144, -65, 111, -54, -97, -133, -245, 303, 126, 51, -79, -90, 34, -3, -146, 79, 113, -246, -34, -220, -132, 51, -45, 107, -371, -36, 38, 43, 129, 165, 33, 143, 158, 32, -85, 9, 58, -130, -148, 146, 134, 58, -142, -24, -373, 83, 132, -28, -164, 116, -128, -33, 134, -132, 123, -152, 152, 84, -73, 47, -124, 57, -83, -22, -199, 5, 21, -201, -76, -7, -128, -66, 179, -147, -38, -91, -136, 13, -174, -41, 209, -122, 193, -106, 81, 251, -14, -37, 18, -158, 42, 178, 137, -195, -34, 251, -14, -24, 63, -60, 17, -135, 199, -100, 7, -6, 135, 74, -12, 113, -10, 62, 140, 57, -178, 55, 3, -287, -25, 324, 171, 1, 70, -200, 41, -59, -33, -65, -112, 211, -180, 186, -42, -36, -135, -265, -205, 18, 215, 76, -248, 14, 177, -199, -90, 33, 142, -10, 194, -89, -32, -133, -82, 237, -241, 40, -28, -91, 127, 175, -252, -47, 31, -73, 105, -34, -261, -84, -79, 1, -178, 238]
6579B38j70k73K91n3L3j15K8J00k40L13k13O1J1j84O7J17j8J88m08K05P0O2j56
6602d6j36J07j24O5K02j77j30O7J25J58L6o3j65j41J62J17K4j70l5J38N9j06J83
6625A50J82k30o1J41l98L25K6ro2k09K06P7j97M2P1Jk55J26J39q9o5J39l26J74
6649a02K17kk13L26m62K13K47j27K50j94l39L01n8J07k77M8J99j33K38l37N1r4
6671a41L76k63r9J14j53K08K59l69l1Q8m9K32j88o8K06k88K84K0P1j15k75K77
6693I6l4l9q8l4m7J69q1j52J74P7K7q8J04j24J33J71n64K34n0K9Q3O3k4j24J4
6718g5P9O4k26N0L6L0J18R7J13l90J13j75J66K07n25N51m47N6J10P7K45l31J92
6741A35j87J53j72J82k82L71m03L04j06R6j69j03J86r2J49j01J61k40J33LR6J4
$$ y = [238, 68, -205, 86, 33, 66, -49, -21, 79, -161, 152, -61, 0, 11, -173, -106, 11, -7, 181, -227, -22, 48, 110, -46, -182, -75, -199, -134, 68, -109, -239, -172, -47, 111, 147, 84, -81, -222, -60, 57, 81, -89, -124, 14, 73, -33, 150, 332, 102, 41, 182, -216, 109, 135, 126, 64, -145, 61, 138, -59, -17, 54, 55, -200, -74, 65, -24, -89, 50, -276, -102, 115, 113, -100, 226, -236, -23, 224, 97, 347, 153, -186, 115, 57, 164, -113, -65, 134, 1, 239, -98, -47, -141, 235, -28, -127, -13, -166, 42, 301, -68, -99, -11, -60, 172, -16, -84, 122, -166, 118, 138, 209, 94, -181, 96, 62, 23, -65, -99, -146, 23, -58, -210, -36, 41, 68, -20, 84, -40, 93, 264, -300, -66, -116, -87, -4, 59, 35, -89, -75, 4, 68, -158, -108, -72, -42, 76, 173, 286, -104, 9, -166, 0, 207, -318, 233, -214, -158, -48, 29, 274, -57, 135, -52, 101, -71, 111, -171, 200, -203, 101, -5, 91, -78, -181, 5, -87, 62, -39, 122, -118, 15, 18, 114, 128]
6763A28k02M5J07Mj98J65j43P8J3j26K56O2l30J71P2q5l9q4R4j19P3j33J92M6
6787D7m9N4j0k14K12j39K59j14j97K76j4j44k43L78j83J16Q4k58M29m94L1J07
6809f6M8J51l90J59l6J97j18N8m5K00j66L20m13Q7K01n29K36K27j83J04j60K05
6831H7j94K63j02M0j68J09o2J26J86o6l60K09R5m46M61j08Q2l2j95RJ31kk41L01
6855A23k06Q3j33Q6K52j53K64l40J42j52j77K53j61p5K80m4J53k3o4k82L33k65
6877a06J77J47k07nPQ0L2m27M85o53O12m6j99J22j83L26j97K16j07j01j7j06K12
6900F2k49K40N8j1j73j56J87j04j30QQ5J86L9Kr1K62l80J66J4J04j15L6j42K45
6924A43j27J81j23j8K6J63k08L7J79J13k73k09P7K35l76J79J3J13r6P4m5j56J6
$$ y = [128, -74, -29, 78, 82, -116, 49, -94, -16, -3, -129, 127, 189, -141, 30, 102, 17, -22, -106, -12, -131, -58, -191, 1, 47, -2, 52, 42, -172, 40, -99, 160, 46, -151, 125, 111, -33, -276, 102, -81, 35, 119, -139, 290, -204, -173, -66, -18, 133, -257, -98, -134, 63, -55, 3, -42, 158, -8, 312, -101, -14, 187, -342, -106, 121, -62, 42, -118, 87, -107, 156, 54, 94, -74, 35, -27, 99, 285, 219, -141, 68, 163, -283, 178, 70, 152, 120, -75, -66, 65, 63, -178, 123, -83, 0, -133, -47, 205, 52, 316, -24, 118, -34, -211, 42, -119, -194, 86, 42, 195, 172, 108, -174, 159, -106, 71, 218, 11, 6, 13, 93, 125, -302, 183, -470, 142, 96, -103, 19, -164, 162, -35, 181, 74, -27, -44, -150, 62, -187, 53, 111, 100, -73, -229, -42, -146, -276, -268, -183, 3, 42, 44, -47, 215, -165, 1, 15, 119, 4, 40, -102, 143, 16, 197, 74, 56, 82, 245, 37, 74, 253, 366, 93, -116, -39, 196, -180, -1, 12, 125, 29, 103, 58, -98, -82]
6947h2N3L4j69R0O8K06j68J08k44m4p0L79r1PK38m34j09J95J00J2j75J49J62j80
6971C5n6j40k2K60k2Q8m87L62L05j82l7k0m0J04j43J39l16K92Q0q8j35j30K75
6994A22l30J43J64p0J05k49K56k94p2K98j00M9n5K4l30L05o4J48n8m6N6K7r0J33
7018G2j7j7j0o9J17Q3m4j82j43L96j90j11OK08j51J99j93J00k69K95N2j66N2q6
7042f8l6Q7J2n3R9J36j36j67Q0J54l9r2j18O9J35r8O8q9K50j92K5J07j78J60J6
7067A32l21K87m1p4K4J08J80l51RJ8o4K8K44l08K10Rm08J55K48rN1j89J55J32
7091B25o6j3J16k36q0J93j17n1m5R0R0l6k3K20m36K54r7K22o7j45l7j31J91k30
7115b09P8J71m5J46q0J4n8J21k51M9N0J39K3k26K05k21o5M71j51o1L9n01K49K44
$$ y = [-82, -29, 5, -164, -74, -6, 200, 32, 140, -104, -148, -218, 161, 70, 77, 315, -119, -228, -33, 67, 79, -96, 53, 215, 35, -21, -161, -183, 77, 55, 143, -344, 18, 323, 141, 104, 84, 44, 148, 5, 144, -172, 120, 200, 112, -23, -153, 122, -208, -65, 99, 29, 134, -115, 141, -153, -225, 73, -27, 22, -33, -9, -339, -34, -98, 50, -8, -54, 2, 29, -61, 72, 55, 38, 28, -41, 76, 159, 115, -67, -210, 186, -4, -115, -109, 99, -52, 147, -46, 54, -215, 80, 132, -34, 18, -68, -104, -17, -5, -58, 41, 177, 41, -126, -46, 108, 69, -23, -141, -72, 63, -35, 33, -56, 194, 2, 27, 134, -44, 116, 132, -189, 98, 57, -17, 7, 115, 295, -56, -47, -29, -93, -65, 179, -129, 81, 90, -318, -163, 85, 76, 127, -62, 93, 225, 159, 146, 262, 26, -54, 139, 22, -29, -74, 16, 106, 70, 47, 267, -169, 85, -12, 210, 143, -2, -39, -170, 21, -209, -131, 40, -5, 141, 61, 75, 17, 138, -113, -64, -14, 125, 148, -78, 127, -94, -159, 312, 161, 100, 139, -362, -113, 131]
7139A31p2K8J18k63M6N0l4P2j77j3M5K04l29J84P5l7j60M22k16j28m4K22k02J64
7163H6n2L0M4j17M4k7k5j0J20j41J90o0k00nK67j24m0j50J45K21l36J48j14J89
7187H3r3j61J90m1Q8j85K31N1K20l58j32l8R7L4j47J27j19K0k4K19rj07M8l3j14
7212a53j7L56j61J45k14K42k37L17j63j18j24n0J82J1L1j10K77j71o6J74l82J01
7234a30J14o7L46l11K59k42Q5l7J7J45k86J38j3J4m4k4O0N2m0o5m61N41pj76J61
7259B9o0J46r9j76JJ10J81j89j65J38L0K34n1k72K71Q7j02j26L8n4k0K14n08L53
7283A0M3R6K5l67O8J15j05J29L4j94L6J00K5j58pK31k56L75m11J69K4Jq7R2M8
7308C6j52K9L31k04N8k95J35Q3r6J67k35j18K97j51R7j06K71k32J90k56QJ56p9
$$ y = [131, 59, 87, 205, -58, -12, 38, 4, 76, -101, -114, -69, 135, -194, -10, 65, 28, -132, 290, 74, -54, -98, 124, -78, 86, 34, 64, 108, -9, 35, 8, -17, -27, 93, -48, 142, 82, -118, -123, 144, 20, -20, -170, -25, 196, -140, 8, -106, 83, -10, -171, 19, -22, 66, -119, 112, 163, 383, 25, -107, -145, -48, -14, -161, -34, -153, -133, -157, 62, 53, -54, -6, -39, -153, -170, 186, 25, 170, -44, 198, -39, 278, 115, -3, -127, -177, 5, 16, 47, -63, 214, 43, -23, 151, -231, -130, -16, -83, 263, -48, 211, -31, 54, 17, 34, 179, -107, 31, 18, 32, -12, -36, 24, 76, 36, -29, -490, 51, 44, -132, 29, -31, 115, 16, -160, -159, -49, 132, -57, -222, -84, -54, 180, 129, -143, 128, 215, 113, -13, 25, -29, -49, 165, -343, 10, 53, 149, 174, -193, -125, -10, -115, 14, 48, -146, -110, -10, 15, -143, -150, 81, -175, 200, -211, -42, -18, -17, -104, -12, 36, -116, -87, 244, 40, 98, -197, -62, 21, -75, 92, -143, -261, 36, -115, -18, -124, 147, -85, 105, -151, -143, 13, -66]
7331f6Q8k2n7K19k47K04J93k99k3j73m1J02K51q7j44p1M64k81j69K82jj77K46
7354A91r6j96J69j91K05o6J8j31J05q4J21q7r4K16k70L98k83k16K91K22j51O0
7376A31l8j99m2J94L1j06J52j13J73l06L29m9l70J97r1J09J50j32J03k81J71j80
7398a67N1J85n4j02K17J0m8n3k08J9R6J94k17K77p2k02k9K47J17l79J85l75L66
7421E8j58J94j67R9O8l03Q6R7J06j36j71J81K5k05J07J12j84J96N5j82j7j03K22
7444b0j54J78n6j5J81j11L1l0Q2j23j15M09j26p8k1K6j60M7J84k76K91k20J67
7467I1o1m4j69K06jj1L1j79l9j01M11j74n4J61j8j34j41K71P6j04j24K96j93P5
7491G1J4j94n1K04j90K2J68j12K05p6p4l2O5J03l14M12j13j23N2m1J73p7N2q0
$$ y = [-66, 22, 0, -57, 162, -85, 119, 312, 13, -10, -183, -224, -122, 129, 42, -102, -173, 291, 10, -159, 123, 122, -55, 191, 95, -101, 68, -123, 82, 16, 34, -97, 8, -76, 45, -42, -136, 80, -190, 208, -75, -291, 0, 222, 71, 131, 93, -106, -148, 46, 77, -29, 123, 10, 183, -123, 206, 157, -213, -16, -107, 2, 152, 20, 123, -158, 13, -167, -116, 69, 15, -87, 130, 140, 92, 39, -169, -150, -54, 140, -77, 200, 128, -74, -103, 144, 261, -118, 67, -308, 58, -100, 94, -73, 26, 94, -209, -123, -26, 80, -56, -227, -46, -21, -226, -119, -7, -191, 5, 60, -122, -139, -242, -20, -174, 4, -52, -67, 114, 3, 34, 4, 86, -37, -152, 257, 131, 53, 32, 58, -102, -55, 129, -147, 144, -76, 91, 30, -14, -183, 23, 22, 11, 42, -137, -176, -277, 134, -40, -94, 67, 49, -85, -226, 45, 121, 17, -107, 189, -4, 71, 85, -109, -160, 44, -146, -124, 44, -68, 137, 61, -13, -45, 20, 123, -191, 221, 108, -15, 37, -4, 169, 92, 144, 64]
7515F4k44P4L0K66l14J48j94N7M5Q6j00K11J04m69K08j73J87N4k14M34j62k09
7537a11J08j42K84j79L5j3K45k05K6j98L4J49j91J63P8j37J45p8l1j76J69k12
7559b37K24K0n5J06N3p0Q9j21J11l6o9J55l88M70j47l45L50p7j6M4q3L4j19Q2
7583b5J58k05L3j09N2j42J91K38j56M21l21q0n7m0J2j75R6k2J14m6j01L47l19
7606a36K98k68P4k7rJ99q8j4J20J19k79K71j67L9k02J85q7k09l7L05j64j14K19
7629B8qj10J24m34M04l9J72O0k32J72q4L0j41Q3j27K7J25j70J33j19L52k90P8
7652C4mn4J17j84K73J62k37P1k11j00J55n0J47L6p0L1j74M5M0J6l6J68k16L10
7676B69m82J38K26l81J62K4j99K61J25j60J09l90P1K61J34j09O5j17K14l98M16
$$ y = [64, -180, -106, -76, 190, -124, 24, -170, -113, -68, 18, -82, 129, 233, -236, -28, -201, -14, 40, -174, 260, 98, -111, -3, -145, 139, -40, -5, -18, 227, 22, 48, -150, -116, 33, -158, 5, 83, -54, 91, 13, -18, -194, -25, -237, -13, 7, -48, 58, 111, 41, 130, 9, 120, 84, 15, 170, -218, 252, 105, -240, 110, 33, 17, 61, -22, 12, -107, -25, 133, -72, -39, -148, -96, -238, -47, 191, 35, 456, 135, 55, -2, -42, -30, -205, -109, -131, -17, -63, -164, 183, -136, 162, -106, -32, -59, -68, 131, 43, 29, 149, 268, -11, 260, 93, 132, -70, 115, 28, -181, -218, 87, -77, -191, 28, 20, -90, 34, -400, 4, -35, 137, 197, -35, 137, 53, 83, -58, 25, -102, -75, 50, -120, 13, -106, 246, -44, 34, 30, -24, 93, -91, 182, 344, 107, 178, -33, -133, 22, -28, 119, 155, 85, 116, -58, -13, 27, 43, 7, 175, -41, 269, -213, -75, 151, -230, -68, -44, -243, 18, 143, -17, 92, -298, -227, 34, 168, 59, 124, 7, 221, -177, 239]
7697B39l63J46j08j33J81M0L15m73R9J11O4J01l70N1J8j76P0M33l79K46l12m9
7719b49J38J83n8lj12J73q3J72k41L4K48j19K8q4Qj18L1nKJ91j51j32k0L00O5
7744A98m08K14K06k52J08j0j15P1J11j41q8J21L5m3M4j11R7k4J14k56Q8pj46L00
7768A06Rm4r6Q3Q0l66J60J16P6j21m9J97k41K74j57l3j76K79n6n1j5k11J43N9
7792c4j47k0L44o9k46K5PK50j67J15Rn2l12J55M26k00k23M9L6K90o43L39J33K2
7816H7J28l39M19r6k13J91j17J89l43l8J77m4K8p2j53K23j99m6M15k12L49k68
7838F6j92R5J61Kj53m2l9J85j76K3n9K96l8k80j70K94R2k10K6K33q5j06j57J95
7862c9L5K53k62K5j8k07L35l3j93J25k05L73k3l08j37L68n2l7M2k6J05k62P3J52
$$ y = [239, -124, 22, -86, -219, -38, 2, 317, -156, -57, 54, 118, 219, -151, -100, -82, -258, -188, 245, -134, 112, -200, -249, -111, 72, 14, 11, -101, 72, -11, 161, -80, -46, 202, 83, 111, 27, 35, -83, -52, -57, -55, 136, -15, -147, -167, 133, 198, -210, 4, 210, -42, 66, 56, -59, 12, 123, -18, -106, 15, 50, 7, 51, -60, 37, 13, 127, -129, -41, -48, -194, 106, 115, 71, -25, 58, 138, -228, -68, 48, 124, 3, -46, 151, -90, 184, 27, -6, -182, 97, 41, -10, -25, -236, -93, -34, -181, -201, 143, 74, -172, -147, -140, 110, -57, 58, 67, 15, -297, -142, 284, 84, -139, -90, -54, 236, -407, -68, 65, 87, 215, -124, 295, 199, -14, 177, 60, 249, -94, -132, 45, 1, 29, -43, -196, 27, -172, -218, 197, -15, 334, 66, -126, -31, 130, 132, -21, -63, -102, 83, -93, -70, -129, 167, 129, -151, -321, -27, 65, -145, -119, 114, 29, -77, -234, -39, -4, 249, -13, 12, -6, -213, 122, 89, -104, 21, -184, 189, 166, -142, -279, 89, 37, 0, 42, 16, 121, -141, -68, 84]
7886H4j49J03Pj16J07R0q1j2J1J77r6l04p7K61M1k06M01k38K54l84Q3L46m19q2
7910a99J62o8q0L56k11k98K28m4o5M10l34K33O2j5k1o2J9k55L71k72pk4J57J17
7934A60k46K39k06J29R5j89j55K6r8R9K20J01N1j5l33L02k75K04j16R7J2K6k32
7957a04J02j97M47k26n6J06p9Q5l4P3l71L40j85L0K44m15J58M8P4j59M5P9Q7j27
7981c5k6N4p4j13M35l75L92l50J19o6j03L10K5k00j50N5j99K32k38L21N4Qj21
8004d5r5J66j76L3Q5K3N1k8m8K1j13J70p9L58n59L89J11j84j61O3J95q0q7q6l0
8029a06m6K62k1K2K9j50j68L22j74J38o2J10L9j89o3J53k43P8N1j08L8L4J98k30
8053h6J76k71J23k7K28l54K84J9O4p7M3jj53L3K90l01k9k8n9L96l05O8j09K00
$$ y = [84, -65, 38, 45, -71, 36, 126, 45, 33, 44, 221, 125, -179, -256, 5, 46, -160, 241, 3, 257, -127, -44, 302, -117, -199, -37, -105, -185, 171, -40, -338, -110, -154, -219, 191, -143, 90, 152, 137, 116, 54, 73, -182, 189, -83, -90, -114, 43, 160, -86, 153, -53, 76, 171, -18, -173, -147, -245, -146, 74, 175, 226, 211, -122, 180, -95, 109, -7, 90, 102, 128, -104, -2, -199, 248, 22, -34, 72, -7, 78, 44, 117, -254, 86, -99, -69, 175, -240, -82, -34, 40, -119, -74, 5, 92, -35, -61, -7, -81, -194, 241, -134, 258, -92, 27, -39, -142, 168, 193, -7, -157, -102, -301, -69, -307, 14, 68, 76, -45, -140, 26, -150, -117, -32, -9, 42, 14, -34, -13, -126, 44, -35, 323, -236, 153, 264, 80, -81, -18, 177, 97, 10, -76, -106, -152, 110, 89, 111, 140, -10, -178, 144, -30, 108, 46, 156, 195, 6, -57, 96, -147, -69, -18, -126, -88, -54, 144, -86, 90, -181, -58, -85, 143, -211, 73, 92, 156, 79, 122, 121, -32, 1, 291, -10, -39, -67, -126, 270, -35, 33, -76, 124]
8077A24k51K04o1R7p0k2J6n1Pj43J85q4R1j02J02j63J88l45L24r7L30j92J0j56
8101e9j2J57J0q2O2J77l27K50j21k05K14k62K19mj6k91K80O3k09J49K6K5p5K78
8125B47p1r0K71k13k51O4j10J80jj71K17k68N1K24l72J59%K01j23N4K7M0k46J11
8149g0R6pk17L87j02J8R4l52K88j23j66j6K4OK84l7J2l34L77k29q6P9K5J16j44
8174g7J64m1j47r2K10J9r6R2J30k97L40j59Q7m4J16j66j53
$$ y = [124, -127, 77, 16, 113, 43, 21, 37, -14, -7, -150, 35, -49, 42, -60, 42, -121, 67, -278, 46, -51, 279, 87, 97, -59, -71, 86, 96, 14, 76, 253, -74, 176, 55, -150, 64, -198, 21, 17, 1, -290, -10, 53, -156, -7, 19, 44, -31, 247, 176, 86, 357, 144, -107, -43, -153, 27, 26, -145, 72, -196, -145, 79, -293, -134, -134, 67, -56, -2, 25, 65, -181, -70, 26, 19, -198, 189, 87, 105, 199, -153, 135, 12, -154, -170, -146, -140, 144, 107, 119, -215, 162, -67, -153, -74, -49, 67, -77, 87, 46, -101, -193, 17, 36, -60, 32, 162, -135, 205, 46, 133, 89, 205, 39, -114]
8191a14
$$ Imaginary data points
##PAGE= N=2
##DATA TABLE= (X++(I..I)), XYDATA
0@%%%%%%%Qj6J6j6J6k4L2m0N6p2Q8j04J26j50J76k11K51k96L44m00M64n34O14
30C28p02Q01r10J030j164J311j471J649j844K055k288K542k819L122l454L815
46B001m210M642n114N635o207O835p532Q307r173J0153j1266J2539j4013J5745
60H342j7815K0341k3498K7568l3037M0802n2719P3403j18824L75656j37866n43033
72c80680P04125m38013l8398L42579k94648O8477J48569j11253q811n6959J26664
83F1652n7800r860O5528r6369O3102r712j07134J14806k9489l2279J03371k9307
95C6509o8276Q2757o6214p4447J54336q2403n6827J67419j21337K0315M7944j30331
107i0555J33655k9367n0120R9025j17174N8051K809q4731J13426n2110M1279K4988
$$ y = [0, 0, 0, 0, 0, 0, 0, 0, 8, -8, 8, -8, 8, -16, 16, -24, 32, -40, 48, -56, 70, -80, 96, -115, 136, -160, 184, -216, 248, -286, 328, -374, 427, -483, 547, -617, 694, -777, 872, -972, 1083, -1205, 1337, -1482, 1640, -1814, 2001, -2209, 2433, -2681, 2954, -3253, 3582, -3950, 4357, -4816, 5337, -5929, 6610, -7403, 8342, -9473, 10868, -12630, 14938, -18099, 22703, -30016, 43387, -75437, 300219, 162353, -380680, 323445, -114568, -152966, 189613, -105035, -36558, 112011, 758, -8053, -65012, 61652, 3852, -6008, 59520, -36849, 26253, 16541, -90593, 24213, -5276, -37555, 65816, 36509, -31767, 50990, -15224, -89671, 64665, -17738, -74565, 92854, -28483, -8168, 39776, -90555, 43100, 13733, -36387, 62638, -54536, 3515, 6324, -78407, 35019, -17091, 24188, 49176]
119D9176j04878J02560q1683j5242J13338j35716P9242N3003j17090R2776k5425
130A0061o3913Q8817k969o1777K1487M2209o7126J6429M9001q1782P6330L7423
142F4190j04764N1335J6965m5503R509Q264p833M093M9451o3093n983Q7220r9818
155c5967L7195M7484j03866R5147l2075o7869J06501n5436n223M1357k9972K0452
167A7728k6358J5718k1393j1761P2071q9573L0273P0914j03743N9274R176n9939
179c7613P0237l3797k8377L2600j1601J070K967Q303r837J5232n76l3307M4837
192B0138k6191k0475N0322m8408J3580K5767l1339K3803k775O192j4100k321K4760
205A8953n7364M5862R953n8992Q4261m6218k2542P5808p7437K6614K8923n2840
$$ y = [49176, -55702, 46858, -34825, -50067, 63271, -72445, 6797, 59800, -57290, 35486, 10061, -53852, 34965, 31996, -29781, -8294, 33915, -33211, -16782, 32219, -49563, 26767, 64190, -40574, 10761, 27726, -17777, -8268, -4, -7837, -3744, 45707, -17386, -23369, 63851, -35967, 1228, 48712, -55154, 39993, 7918, -59951, 46550, -8886, -14109, 27248, -2724, 17728, -8630, 7088, -14305, -26066, 46005, -43568, -13295, 57619, -46124, 13150, 22326, -37613, 32624, -1173, -29550, 3050, -8551, -7481, -4514, 3789, -6048, 9184, 8608, -24699, 20138, -6053, -26528, 23794, -24614, -11034, 14733, -16606, 7197, 4422, 10614, -3486, -5807, 18953, -38411, 7451, 17404, -41588, 42673, -3545, -26087, 49721, -27716, -1102, 27821, -25019]
217b5019L8972j6736l127J0062j0306K3567k7659L2633k752m3334N2853m5693
229a6539m082M8387n2974L5571J2402l3528K1930j1328N407j0487P686J0494l5266
242b2327L7633k1021k0674N3340m2711J8756K4301m4929L1698j8744j8272K2994
254D4j1956J5275o318J1449j694k6599L6445k8698l658L8700m3192K0696N623
267F117k9827K6036p458O342O557l437O158k2342J5762j8942p676M1722l3066
280a4054K2428J1544l7960L6835k2150q416K4228k1702K1288j3018m617R120j9472
293a5946L4921k2249M443L3577n3705L4429r799m2854N8613l0021M442L1404l9519
306a2264K7529r108j4744J5618j7439K1733j1779K32R419l5032L8591p852k1719
$$ y = [-25019, 13953, -2783, -5910, 4152, -6154, 17413, -10246, 22387, 19635, -23699, 29154, -16539, -20621, 27766, -25208, 10363, 22765, -10763, 11167, -161, 5246, -5241, 2445, 12939, -22327, 15306, -5715, -26389, 26951, -15760, 2996, 27297, -17632, 14066, -4678, -22950, 44, -11912, 3363, -2955, 8494, 6800, -19799, 16646, -12052, -15710, 22990, -20202, 494, 6117, -23710, 2326, -5132, 1210, 7767, 4330, 10488, -11854, 3908, -15034, -22710, 19012, -14054, 8374, 19918, -18042, 18793, -3357, -11773, 12455, -9247, 12041, -977, -5594, 3526, -15946, 18975, -3274, 1169, 34746, -18959, 15470, 5671, -37183, 21430, -8591, -4149, 27255, -12264, 15265, 6157, -8587, 7031, -10408, 11325, -454, -222, 9197, -25835, 12756, 4904, -16815]
319a6815M2578k7198k46J1949k5023M932n66J7668q982m358K3337k7676J5727
332E327k779k5117L2807k0470J1070Q790l4908L5343j3948p133K4454k6070K4630
345A1996q058j3771J6757l2519K7120O161k3952L2437j6924J016J2207k2774P622
358b682j240Q536q16q334J1689j6866J7273L39k0968K8079j5063N334P648l1617
372a8688K4689q633K10J6448k5568K7377q369j1299J6631l5747L2944N93k9444
385a8856M0657l3273Q937K6146m5885L0188k251j5503K8371k8658M110R778j2875
398i114J2688p953O434M19l165J0054k2311P525Q234j1667J0355l893o8K405L603
413C546m875j3059K3848j2135m185K0576l4509K1871Q433k8826L2970j8951J421
$$ y = [-16815, 25763, -1435, -1681, 10268, -14755, -9823, -10389, 7279, -1703, -6061, 17276, -10400, 5327, 2548, -22569, 10238, -10232, 838, 9628, -25280, 10063, -3885, -11018, 13436, -12634, 11996, 3938, -9833, 6924, -25595, 1525, 7686, -16266, 16171, -753, 263, 12470, -10304, -2682, -3922, 4614, 3798, -4536, 7153, -9713, 7560, 7899, -13069, 15010, -53, 5281, 12929, -18688, 6001, -2632, -2422, 14026, -11542, 15835, 7466, -3833, 12798, -22949, 9995, 10588, -18856, 21801, -11472, -2535, 23611, -22274, 7914, 5663, -9840, 18531, -10127, -6017, 3761, -9114, 3574, -4379, 2055, 2474, -691, 9363, -12948, -5423, 2811, -8856, 1499, -2394, -2462, -57, 3546, -1329, -14388, 9460, -2675, -6860, 13716, -20793, 1078, 9511, -19315, 13655, -5296, -3875]
426c875K1321l1834K1726j2893o719L0956l3989J9303N050k0957L3851k9562l39
439g961K1433k3710K4452j6693j0803L0931k1975L273O486q454J3942o212n246
452e37l170O558K046j4174J4522l971Q14P372j8070J4704k888q062Q051j1338
466h143J8831j3423p548K4594k8854K0817J620k9370M2796k5160j0853K7509l0928
479a8112K4053l330j8961L2466k3058N689N141j9198K7534j9365k084J8609k1742
492a2358J8359o292j2146K3804j4211j843R597r062N104k62p423M994P811j0413
506d341K925J1326j5059Q247j379r640J9141j5708K558R986j4497J7548j6883
519e776J799K2522k9950J8641l215j5418L2186l4442R273K3686l4344K7827j1697
$$ y = [-3875, 17446, -14388, 7338, -5555, -12274, 18682, -15307, 3996, 9046, -11911, 21940, -7622, -7961, 13472, -10238, 14214, -2479, -13282, 17649, -4326, -1053, 5433, -3021, 10921, 4709, -537, -3707, 2851, 4897, -9277, 5245, 1274, 2088, 9460, -8610, 6094, 3206, -4856, 3195, -8143, 10688, -2735, -10283, 14311, -14543, 6274, 7894, -21476, 21320, -3840, -14693, 12816, -18112, 5941, 2611, -16350, 16116, -6942, -1253, 3888, -15310, 12224, -7141, -9225, 9384, -12358, 6001, -291, -12437, 11367, -2844, -4687, 4910, -4152, 952, 690, -6733, -1739, 6072, -4341, -1416, 9910, -5149, 3098, 1719, -7921, 11220, -4488, -1930, 8056, -6441, 11107, -5776, -3977, 18545, -11405, 7236, 4021, -11397, 20789, -13653, -4380, 19306, -15038, 12789, 1092]
532A092j1928L2544l3239P937J2815j7701J9317j7300K143J6780j9832R757n047
545b662L32J4088k1627O103R323j0424M676k062k229P715J175j3222N836J1101
559H123j7431P532K822p778J5347j5743J198J3540j4468J0035q167J925J4082
572A1017k3410J4394n8j0181J9941k2729R681J3932k3623J5915o704q72J3907
585A1210k2668J3915M948j1263R613j0910P943L148r185O716o753J0344k079j3572
599h593J4544m807R5K622p572Q686m040l08o46j514Q530j1901O090L877j1772
614f709J2615q803R64R138j4578Q783j683j04M661j4109J3644l108n940J0624
628E395j5702J3515J704j5443J6695j1724L037R324j7620J3574l483m925J0434
$$ y = [1092, -10836, 21708, -11531, -3594, 9221, -8480, 10837, -6463, -4320, 12460, -7372, 2385, -2662, -2330, 11758, -9869, -3766, 5557, -4867, -191, -2253, -4482, 3233, 4408, -8814, -2978, 8123, -9308, -1776, 1046, -6732, 8615, -7128, -5930, 7610, -6858, 3177, -4990, -3065, 11017, -12393, 2001, 1943, -8238, 11703, -11026, -1345, 12587, -11036, 4879, -1825, -2697, 11210, -11458, 2457, 7405, -3858, 5755, -5155, 2788, 5936, -3249, 3467, -3286, 7058, 4979, -8593, 5951, 1144, 1239, 3861, -3711, 4975, 935, 627, -19, -1533, 6997, -4904, 1186, 5063, -6709, 5906, -2897, -1933, 7205, -7373, 1410, -273, -377, 4284, -9825, 3819, 711, -5229, 5395, -10307, 3208, 4912, -10531, 6164, -5560, -2523, 6801, -10819, 2755, -728, -5653, 4781]
641D781j0675P141k157l751J1054j1364L712J592l649R878j1332N86Q186l772
655B30K564m602O14L900K50k977p456J2279k49p277P318r019Q045K748j1632R389
671D125n085L380K468j2280J3367n800j199R200j4363J1713k443r267J4285j2984
685d883M012M939j0118J3607q607j452P768r644Q284o198k518R575q847O854n482
700b710m041J4351j1181K414L269p776R777o535l168M345j640O618n560o03L193
715G53k171M695p443L69N469l971L892m830J307M179k739L050o098M941L457j0128
731e268Q320o265j66R570j0984Q801k23o722J0848j1397L081M792r204R314m752
746b55L6M263p801R173l772k549O652r209O576j606o324O998l298L036j42j992
$$ y = [4781, -5894, 1247, -910, -4661, 6393, -4971, -1259, 333, -3316, 6562, -4770, -4184, 4002, 230, 2794, -1808, -1194, 2706, 2956, -21, -7477, 4802, 4553, -2724, 4594, -4425, 3620, 6368, -5264, 4125, -960, 2420, 4888, -7392, 5975, 175, -1024, 8176, -6187, 5526, 3083, -6184, 8101, -4883, -871, 4068, -6050, 7557, -1050, -2502, 5266, -4378, 3906, -2292, -4810, 4765, -4082, 2772, -2710, -6751, 7600, -3581, -1167, 2102, -5674, 4103, -2432, -5600, -1255, -2895, 3723, -1837, -2440, 753, -1418, 3277, -4166, -3797, 1672, -2299, 1593, -3237, -1930, 2249, -490, 2560, -3538, 1403, 4860, -5268, 3052, -3213, -3379, 6191, -4793, 4008, 3785, -2937, 7911, -3486, -405, 4387, -4817, 4497, -255, -219, 4044, -3757, 5416, 1644, -905, 5747, -3462, 3114, 1508, -4816, 2182, -1116, 1920, 1778, -214]
762b14L569m559M229m984k661R152q789M280J882o413Q266n198P88K060n361Q322
778D369p746j086O159q317P799j534k768Q318p844L191o54o031P850n305J960
793a639L189m924N811l837K61L210l659M231m095J005J359n633O549k782o5O537
809E518n621K498q46j838R96l712N238k737P60N164p705N189p52m089O361n404
825i80K781q9l915N045o693N567J377n944J1279r718m43P636j3491Q361L07n758
841d678J0303p176J838K334o953P106m787L68M123n922L795k727k54L540l762
856b852M945j201j794K167n367J875j08KJ865nL082l612J621o65m645P899n638
873b431p6P140r655O430q71m818R851o783K761L555q851O007n112n77P063n607
$$ y = [-214, 3355, -1204, 3025, -1959, -4620, 4532, -4257, 23, 1905, -4508, 3758, -1440, -652, 1408, -3953, 4369, -3377, -4463, 1696, -6621, 1178, -356, -3124, 5194, -2650, 541, -113, -6144, 1706, -3599, -1639, 1550, -3374, 2437, -1400, -1139, 2071, -1588, 2643, -1452, -447, 912, -4721, 1828, -954, -1019, 5518, -103, 2395, 1549, -289, 707, -3005, 2233, -504, 256, 5420, -2285, 2904, 2152, -1937, 4424, -980, 1801, 1712, -2203, 2842, -3851, 1716, 3093, -2851, 8428, -1290, -1733, 5903, -7588, 773, 1080, -4678, 5625, -1551, 287, 2621, -4332, 2774, -2013, -1645, 2478, -3444, 351, -2376, -2630, 910, -2852, 2093, 892, -902, 1265, -4102, -2227, -2335, -2333, -468, -473, 2609, -1003, 618, -47, -4692, 3207, -2431, -2507, 4633, -5022, 1408, 537, -4281, 5570, -1213, 1548, 5103, -3748, 2259, -2853, -3430, 3633, -1974]
889a974N416r76j469M605q347K813J018k943N041m273J674J621l021K506k353
904f62K990J184l517K090l716j03N12q66L809j363L124j331k525L183p895L196
920a890L013n535O777m091L44N465q192M684o37o81M635q995L861K69m371O695
936A351o558N902N883r511N701m029k623N260p408N878J787m167O395n231Q19
951e51L107m938L713Q57k177j326j229L764j418j467L300K528J62k901j855j658
967b089L593q18n549O992J102j110J174p315P225N22p701P590m804Q61L189r159
983f297Q629j644k121Q360r155N771o06j1424J0724m139j388M973m711Q655m035
998A592o091O863n175M239m78p858Q545j031l969J965j404N248q8l215J204n84
$$ y = [-1974, 3442, 2466, 997, 5602, -2745, 68, 1086, -1857, 3184, -1089, 585, 2206, -815, 1691, -662, 2328, 3512, -5, 2085, -1631, -1734, -1222, -2088, 1721, 358, 3482, 2151, -374, 2809, -5086, -1890, 1123, -4412, 2365, -1726, -1382, 4083, -4109, 575, -62, -743, 3892, -5103, -1242, -973, -5344, 1351, -5207, 695, 6578, -2933, 2768, -1261, -3884, 1376, -6032, -154, 1633, -2534, 3861, -1370, -551, 2556, -2382, 1331, 2188, 11, -1315, -2544, 1220, -198, -1665, 1635, 4163, 4325, 1424, -431, -2089, 1504, 686, -4863, 2129, 3231, 2121, 3295, -4020, 3205, 3727, -3974, 3616, -1188, -327, 2862, -6297, 2332, 688, -1433, 6927, -2228, 3543, 2937, -8487, 2237, -1902, -3290, 1683, -3028, 5627, 1592, -4499, 2364, -2811, 1428, 950, -6908, 1637, 606, -3363, -1398, -2802, 2446, 2358, -857, 347, -237]
1014b37j422j433p8J196L025o19r16M311m651n96K162l530N521l836k868Q591
1030D620o811J791J760m188J0618o771m016P202o916L877l039l193J2016o129
1044H21J81K634o193Q095o012m132Q528m485J577l90l405O195k982j526L676j051
1060A531M92l101j012J813q54r26J570K921n58n59l145j41M826o523L91N283m122
1077b114M037l584k571P971n328J937L54l886P499q703r0O861p643Q162j072m437
1093b607Q536q503L85L142n188N795l075Q64M809o739L700l23k127N451n163M58
1109e85L380m866J037P71j19K759k93o18J554j084l694M03J68J787J418l874M638
1126B782R30o183N450m433P26O198q882L240J697m959N347n154L899M687p473
$$ y = [-237, -1659, -3092, -3170, -1974, 1051, 432, -484, 3827, -824, -1420, 742, -2788, 2733, -1103, -3971, 4620, -2191, -400, 1360, -2828, 7790, 1019, -2997, 4205, -2711, 1166, -1873, -5066, 6950, 821, 1002, 3636, -2557, 5538, -474, -4606, 3922, -563, 1014, 624, -2781, 3414, 432, -1094, 2582, 1531, 2023, -1078, -2090, -277, -1131, -2057, -487, 2434, 1876, 1317, -1828, -1969, 2857, -3666, -3275, 2008, -2114, 1923, -1661, -4232, 3739, -1589, 348, 702, -3184, 4315, -4388, -4478, 2383, -5260, 2902, 1830, -2607, 5929, -2574, -2189, 953, -4235, 1560, -1515, -651, 4158, -2581, 1119, 796, -1331, 4120, -1043, -585, 2795, -2071, -1034, -263, -382, 2377, 2084, 1466, 3020, 1936, -1758, -1355, -1187, 600, 2018, -1856, 2782, 3712, -2471, 2979, -1454, -728, 5470, -3412, -172, 1525, -3434, 1913, -3241, 658, 5345, -2128]
1141b128N462l834k603M737p973N348K904m647O625n348M68M016p567M062J278
1156H00k500K134l334J173J395j602J987N00J229p44j331j819k67J624j867K053
1172e69K286j152K712l650j46K161m275M322j678j495L945m370J851J129k315
1187a244N171k918J005M98n427L520k463o17M853k449K896L34l679K485k648N67
1203a16J07q61K302k164Q17J21j418K634q51M61K65q73k74l018J541J54o08L904
1221B123k164J488K90l806K302k807N07K983l583M044j627k276M293m191K944
1236E20Q92l230M197m315o43K676l730M442q6q30L268l332J055j134k547L249
1252D52j235J098N12j072J479j149M27Lk83J708j640Q77k047m10K604k647L232
$$ y = [-2128, 3334, -500, -3103, 1634, -6339, -991, 1913, -2734, 3891, -1457, -989, 3027, -4540, -478, 800, -1700, 434, -2900, -1727, -332, -1934, 53, 553, 1782, 1038, -293, -2112, -2379, -755, -2622, -569, 1717, 565, 3277, -373, -519, 1642, -2633, 1689, 11, -1484, 2461, -1909, -58, 1071, -1244, 3927, 1009, 2014, 2512, -2915, 605, -1858, -2475, 2378, -71, 2825, 3159, -520, 1965, -683, -116, -9, -870, 1432, -732, 85, 206, -1212, 1422, 571, 1032, 1297, 424, 150, -2868, -1327, -1173, -1781, 2123, -41, 1447, 1737, -2069, 233, -2574, -2067, 916, -2667, 1377, -250, -2526, 1767, -2424, 520, 1412, -1818, 2379, -1936, -2579, 97, -3633, 809, 723, -107, 3161, -171, 884, -250, -2797, 452, -783, 315, 827, -245, 1234, 85, 512, 515, 232, 1940, 300, 1177, -870, -1280, 1324, -1323, 1909]
1269A909L50k053L585m139p94J609k675L903j629P5K348l983L459j543k680M789
1285B531k873M68N81k929K099o67Q30K10n50K682k371m50k13k160K401j018R15
1302e14R57q40J877k376O7J052k940M202j993j969L718l711K117J004j989K836
1318A498j174N12q18k816L320k376J099K638k805K411j9j915Q07r80Q79N3K06
1335E20J09j741K620j295m08K189k156K163l89k708J507j698J583J23j012L405
1351B812k301M29Q07l851K749o87o27K088k102J090k88j183J968j327J275l30
1367E22p33N82k414N34Q61o51J495L6O64l33j308N03k172K135O7j826L150j971
1385h59M23Q71k454K998p40n54J323k637K239k188o07L686k874K929M02l611M064
$$ y = [1909, 2259, 206, 3791, -348, -1142, 467, -2208, 1695, 66, 141, 2489, -1494, 1965, 422, -2258, 2531, -342, 126, 707, -2222, -123, -790, 40, 250, -300, 2382, 11, -439, -652, -2812, -411, -1429, -514, 443, -397, 1480, -896, -829, 223, -2717, 1485, -508, -2477, 1241, -2470, -353, 651, -1338, 1498, 324, 836, 18, -2798, 522, -1854, -755, 1883, -922, 1489, 1470, -445, 362, -618, 261, 314, 520, 629, -1112, 1508, 213, -195, 1994, -162, 2001, 1612, -1096, 411, -1287, 296, 419, -593, 2812, 511, 940, 1747, -2104, 645, -42, -669, 1419, -683, 407, 119, -1064, 904, -423, 852, 522, -211, 371, -2043, -1509, -648, -1299, 196, 232, 896, 563, -745, -242, -2414, -279, -212, -2038, 1112, -859, -436, 435, -2019, 979, 239, -315, 1008, -1629, 610, -1578, -2185, 1501, -1373, 1556, 1958, -1653, 2411]
1402B411l068r93K719k304K588j156q23K592l062J859J84j669L322k373j108K306
1418A425j909j47J028Q0J227kj195k60P00j053r54M78Q89J129k375J102J000k507
1436a344K830k717L80M301n779J438J627l718M697k822m78N173n260J893n42k387
1452b708M525m606J394L793m220K903j927j285M570l945l8K718j575J200k146
1467a347m95L017j330m41J182l7P20j399j969J957J147j900J561j15l47J633l281
1484a444J312J906l163K510o97o90K535m327K368K060l741L570k464J97L049n555
1500b574K256J288j903K996l222J472K463m475J562j09k45K099l457J752J328
1515A231k758J538r56N94J887k413k52J939j401o07L82j06J629k03k255K123m46
$$ y = [2411, -657, -1650, 1069, -1235, 1353, 197, -626, 1966, -1096, 763, 947, -722, 2600, 227, -881, 1425, -484, -631, 397, 477, 1704, 1702, 507, 247, 947, -106, -1060, -582, 307, 1436, -939, 163, 1163, -1344, 1486, -1231, -851, 3450, -2329, -891, 736, -2982, 1715, -1107, -1585, 3588, -1672, 221, -321, -2708, 1817, -2789, -1395, 2398, -1822, 1081, -846, -2131, 2439, -1506, -1544, 1174, -401, 799, -1347, -1842, 1175, -155, -596, 586, 549, 1269, -130, -2099, -142, 1005, -895, 666, 551, 204, 1837, -1444, -132, 1774, -1389, 1121, 424, -266, 2269, -2058, 310, 2370, -1371, 2199, -265, -68, 2981, -2574, -318, 970, -933, 2063, -1159, 313, 2776, -1699, -137, -246, -491, 1608, -1849, -97, 1231, -1527, 11, -945, -351, 1536, -877, -1129, 810, -591, -1198, -816, -922, 707, 504, -1751, 372, -74]
1532g4j054J061k070K797L65l503L336j024p88K200l940L426J307m359L212j556
1548f64N75J286m061M631k96k337K497l335K294J495m690L372K72q66J465l068
1564a430K078Q56k360J741p20L66Q71k562J437J102j697O20L95q58J390p93k092
1581a656K955j044j023J355k99J87j53j724K360j280j18R66k391L101q57k961
1597b582L472j742P18Q63k685K800j094j079J867k419K193L19k657L183j691m36
1613i70J477j393J072k71q49J367j036O56j99m05J347p30n15N71R6p8l58Q7L03
1632A72O69n16o80J154j023N46P65k113J882k39j260J393p54O33n40m29J596j410
1650a54M43N33j507J756j308l05J636j579M18J07n65J114p08o0l5JM74r95N66
$$ y = [-74, -1128, -67, -2137, 660, 1025, -2478, 858, -166, -954, 1246, -2694, 732, 2039, -2320, 892, -664, -89, 1197, -2864, 1767, 1471, -866, 1631, -1704, 590, 2085, -2605, 767, 1039, 173, 1638, -1430, 648, 1504, -856, 885, 165, 531, 1402, -1160, 277, 1379, -318, 302, 697, -161, 1229, 436, -1656, 1299, 255, -768, 587, 288, 475, 322, -1402, 958, -322, -440, 526, -1865, 1236, 379, -2582, 890, -852, -134, 729, -1956, 844, -250, -1329, 538, -1881, 312, 631, -2026, 1157, -534, -970, 507, -886, 186, -85, -934, 433, -603, 53, -146, -551, 796, 66, -449, 122, 218, 140, -218, -131, 172, 841, 325, -355, 799, -224, 322, 1087, -1026, 856, 617, -643, 750, -4, 629, 89, -340, 1256, -154, 289, 822, -685, 1071, -237, -542, 1094, -485, -67, 40, -525, 589, -119, -179, -214, -213, 261, -734, -168]
1669a68l34k28R93j103N35N73p78M53m12o8P77q29M94n34L10M65r80Q00j07j18
1689b59O73j018O88j55m65Q43p62L19J69o02R66n69N61J00r38J132q62L30L04
1708D55j083J382n60k68J045j129Q13l3o86O43n24K01J95p76J155j046P90K80
1726H54j500J277m52n87Q69r10N15J61l49L42l96K62j94K9K45p61P44o27j28N64
1746d2m89L36M67q57M77k82k79J81L44k39o15J087k22n97J261r91K76N43j277
1765i18P32R3k46P36q19L77M60o26P44q26L97M28j133O98l54K4Q43n44L88J74
1785F28n17J84l20p6N22l65K19j55J29K03j92K26o4O7o06J75L07o28L02l5k9P60
1807G35p17J43l4n35J071j664N48J001j524J168K64j199J225o24j69P26q55J89
$$ y = [-168, -502, -730, 263, -840, -305, 268, -510, -57, -469, -537, 240, -589, -95, -629, -319, 146, -834, -34, -141, -259, 414, -604, 84, -71, -536, 307, -455, -136, 33, -569, 397, -172, 389, 489, -449, 683, -179, 151, 455, -628, 754, 194, -74, 971, -158, 655, 622, -64, 579, 55, 256, 451, -325, 830, -216, 574, 854, -646, 631, 179, -408, 461, -449, 66, 227, -122, 220, -176, 86, -108, -79, 166, -595, 149, -478, -606, -42, -531, -195, 272, -585, -108, -390, -669, -488, -144, -383, -998, 89, -133, -730, 531, -460, -184, 359, -918, -186, -93, -339, 397, -422, -45, 415, -211, 533, -293, 104, 532, -601, 97, -257, -233, 610, 66, 454, 628, 111, 295, -25, -101, 421, 56, 275, 120, 249, 452, 260, 486, 422, 489, -117, 58, 365, -263, 39, 4, -25, 735, 18, 161, 127, -408, 663, -1001, -453, 548, -976, 192, 456, -743, 482, -142, -311, 415, -440, -251]
1825b51J41n93K78L53j69R5K58k50K0k7l86K56m63N71K83n55Q26n86M8P85j193
1846e59O35J05p18J146r06k6J328j415P33O13q74P64j079j64J070j298R67O0l53
1865B9J247j391L94M32o45N72p27k30J039n66l05L18j65M98j44l37K39n27k37
1884e06L41j33J05K65l06P35j72q73L66l37M37J8r11J054n54q9O53j198J581M36
1904I12k032J226k09r56J010j059R01Q25j065J048n23q7K85j289J354j54j170
1921i83J504r72L39J156j721Q63R40j140L51m96m0J116j220j38J023mK17q32l2
1940f9J176r41j007J650m88L26l57j004J494k79q44J062p28Q38q53j279J858n92
1958c7n21J075o57Q50L6j916J148j84k64L00l30R20j89j281R04j8N32k34j032
$$ y = [-251, -110, -703, -425, -72, -241, -146, 112, -138, -118, -145, -531, -275, -738, -167, 116, -439, 387, -199, -151, 634, -559, 76, 181, -537, 609, -297, -323, 1005, -410, 323, 936, 62, 826, -253, -417, 653, -645, 322, 382, 29, 1276, -115, 279, 711, 66, 638, -89, -319, 720, 154, -151, 167, 2, 500, 356, 19, 258, -269, -506, -165, -298, -193, 72, -234, 501, 329, -544, -178, -515, -78, -60, -971, 83, -471, -560, 93, -1105, 476, 912, -1120, 106, -103, -1059, -49, -1108, -207, 618, -447, 601, 78, -9, 276, -1013, 341, 187, -983, 521, -451, -112, 1044, -677, 186, 1126, -14, 337, -159, -199, 917, -303, -441, 582, 578, 795, -37, -69, 1107, 166, -841, 809, 321, 647, 290, -714, 780, 501, -343, 719, -9, 829, -24, -1303, 555, -37, -558, 517, -140, 710, 746, -1170, -22, -206, -470, -170, -500, 420, 231, -1050, -146, -164, 368, 134, -898]
1977h98J055R7j108L70k87O41P34r56L99P71j333L9k70N51Q59j133K49R70p87
1996c7J04m43L50Q74r92j21M74n11P38q14K60J549j259l4N42q48P15r73k32J788
2016A130j075L11M48r22J317j368p80J660n00j99K18r72J353n56o50J220l80M7
2034C02Nj583J556n88r34J450j52P37L1j598J093j80j034N57k48L24M71j202O86
2053c07O42p45P16p73N75O49k118O10N93p39J023l46K80J353j268j38n2k62P17
2072D10r77L28J104j099J85L47l95R08n94l6P36j112K07k26k84J057o50J76R35
2091A020o73j9k18n96J022p91k93J015j08j02K45j091J031j70j56M08j067N55
2109A2j34q39R56J60m87J104o60oNj059N93ln58R21m40K35O51j101P44K12o14
$$ y = [-898, 157, 254, -854, -484, -771, -130, 604, -352, 47, 818, -515, -476, -746, -195, 664, -469, -220, 750, -37, 67, -376, -26, 848, -144, -265, 209, -302, 436, -378, -118, 1431, 172, 138, 680, -168, 547, -426, -658, 1130, 55, 366, 814, -108, 1209, -159, -939, 721, 221, 22, 240, -732, 621, 65, -585, 635, 255, 302, 307, -1276, 280, -308, -1242, 208, 56, 793, 824, -774, 319, 139, -895, -338, -586, -262, 209, -993, -307, 335, -410, 306, -467, 108, 757, -1361, -751, -158, -897, 126, -220, 60, 1413, 145, 7, -45, -307, 410, -567, -239, 865, -234, -49, 298, -97, 811, 217, 181, 917, -195, 12, -214, -498, 559, -91, 85, 1020, 347, 328, 110, -486, 536, -255, -548, 467, 359, 257, 502, -589, 442, 272, 116, 524, -543, 12, -122, -961, -5, 155, -332, 772, 112, 106, 111, -948, -355, -358, -916, 5, -435, -200, 451, -650, 94, 306, -308]
2130c08K13l86j68K35n22N78L68k38Q46o60kJ13p26L29K56m07R85j68n34O04r7
2151C11l18M72o50O18j02o15O43o30J93N79k42K23K51o71j36k47R6M29j44L71
2171D31L00o49K72l3k37r9p8K28r2l09M56l92j99P24n13M47J79p77o4j99N0L68
2193a86J17L83j63j92M43o70j67L23j12oK98l91Q3l29J17O40Q5k01MK2l71j08
2215c81j10K49L77n5J52J27j60jl24J20k7M5K24m10L76j52l12P42ol96M32m53
2237E7K8l5k82J52M19M7J77J62k97m77k24J73K7J65J89k80K39j35l37L42L6j29
2259A7J78l37j32rj93K12L80j23K05J21l93nl01j97K45M0J67M33l57j04J66j00
2281h7Q8L3L13o94p0J76n57N68K59N9M42r6m87J67m48k3L90R5k0L51m11J63j92
$$ y = [-308, -95, -481, -649, -414, -936, -358, 10, -228, 618, -42, -44, 69, -657, -328, -72, -479, 506, 338, -196, 408, 311, -7, 465, -185, 433, 331, -284, 359, -271, -78, 501, 259, 482, 733, 62, -74, -321, -225, 204, 60, 431, 731, 82, 354, 321, 84, -15, -93, 135, 43, -266, 190, -202, -401, 323, -190, 257, 436, -341, -405, -604, -554, -186, -69, 314, 151, -41, 402, -268, -435, -112, -224, -230, 68, -323, -240, -569, -452, 188, 273, 72, 76, 98, -273, -381, -491, -242, 135, 80, 232, 359, 199, 198, -126, -6, -33, 12, 236, -174, 202, 50, -262, 480, 474, 78, 510, 57, 85, 50, -232, -80, 339, 386, 563, 725, 428, -49, -273, -100, -73, 92, 281, 1, 240, 105, -232, 110, 146, 17, 195, -142, -274, -283, -476, -264, 116, -7, 198, 319, -74, -79, -380, -577, -332, -292, -125, 308, -49, -153, 13, -87, 1, 34, 347, -347, -417, -241, -798, -230, 29, 88, 530, 434, -53, 114, -334, -357, 33, 128, 108, 459, 48, 211, 19]
2304A9J32kr4J77J4j07l23J79k01N70N7L61Ln83M4l68k89M46k24K54N73o15M2
2327F5J2m11J07K34j53J0m2l29%J29O52n06L46J94l11j69k73j33P12m78L5P75
2349D66m93j44M22n54P6L98l29j48L24k51k93L11L70l61M07l2N3o3m91j70P26
2370B24j92J46R1l65P61k53m47l6K77j91J69q8Q4O5k6k4J18Q0O4l06K46m41O5
2393B1P4l40J063j56r35R39o12j91L7m89Q60M9o59M50j40J36k5m65L52J51l35
2414b15K56n15L25L93j003Q26M21p85K64j59k86P94r83J19R76o17j11J15r4M09
2434A30k44k66L33%L66p03P6J058j009M0N65n1K82o98m38R04m60j73O77m66J041
2455I64p79n58R29n44N5J80k25M90l08n61N52k4K34j6l74O88l68p86L38j92M29
$$ y = [19, 151, 149, 55, 232, 246, 139, -184, -5, -206, 364, 421, 782, 785, 202, 246, -122, -411, 35, -189, 65, 638, 23, 65, 77, -334, -227, 7, -146, -136, -178, -507, -507, -378, 274, -232, 114, 308, -3, -172, -445, -578, 134, -344, -309, 466, -27, -171, 251, -303, -227, 171, -158, -306, 18, -233, -526, -215, 155, -206, 201, 169, 222, 159, -332, -502, 224, 32, 178, 269, -96, 665, 412, -35, -71, 206, 15, 184, 96, 180, 245, 219, 195, 313, 393, 457, 151, 397, -44, 21, 95, -245, 818, 662, -273, 666, 54, -137, -100, -589, 271, 320, -339, 111, -29, 107, 82, -383, -31, 120, -215, 41, -474, -149, 244, -759, 67, 488, -297, -33, -192, -478, 316, -667, -548, 428, -189, -300, -185, -279, 130, -114, -380, -47, -47, 319, -384, -308, 750, -259, -219, 346, 295, 577, -121, -559, 345, -115, -288, 389, -77, 964, 185, -373, 556, 12, 67, 247, 22, 512, 204, -357, 195, 171, 405, 389, 15, 703, 335, -451, -113, -305, 124]
2476A24j2p47Q99M23j126L43j2j75P03r39L48M24p82K82j04M22O42j258M16N61
2496D32j165P43n28k85J447j093O22R6p43O34m81m26J351q20j02O71o87Q66p10
2515a78o9Q14m46l00M55o02N83l28o85J181k4k65K77o09N32K55j033Q78j12m46
2535a22N33o22L02O39j244J158j02p10O69q67K84N57r81O68k52J14O90j092O2
2554c16O88q23P88n65K93L41q83J29O87p40M45j20l19N64j56m01K11j23M55j75
2574b0k52N49n82J66J58n94L88Q5k69R17n40l76O76m92K15L29p77O63L1n51N50
2595B74n12L35K73n56N62l66KK71o53N90K93p13P40o15Q6L63q12N75J16l68J99
2616H4P6m26N97o58M03J70k52L28m12Q8M28n20K9K32m01Q1L53o00N02j46l98N43
$$ y = [124, 112, -635, 264, 687, -439, -96, -108, -283, 420, -519, -171, 253, -529, -247, -351, 71, 713, -545, -129, 432, -733, 10, -518, -803, 644, -449, 173, 269, -474, 160, -321, -747, 604, -216, -318, 353, -334, 532, -178, -247, 567, 121, -179, 276, -326, 257, -71, -756, 425, 401, 136, 413, -196, 336, 591, -442, 436, 324, -122, 411, -211, 91, 730, -514, 644, 542, -168, 501, -366, -82, 475, -506, 162, -90, 24, 714, -378, -316, 372, -451, 337, -228, 65, 406, -477, -348, 339, -401, 44, -76, -395, 169, 13, -388, -177, -300, 155, -20, -272, 277, -305, -139, 19, -575, -187, -102, -371, 546, 6, -370, 306, -186, 29, 358, -419, 244, 275, -276, 274, -238, 97, 370, -186, 376, 10, 12, 283, -370, 220, 513, -200, 540, -75, 11, 374, -438, 137, 253, -115, 84, 160, -266, 331, -327, 76, 246, -6, 322, -90, -2, 426, -94, -65, 167, -234, -153, 200, -400, 102, -44, -442, 101]
2638A01l06j04K95k08L70j97k16N46n26K48J34o33L17O6k21K88J01K3K59l88K08
2659A57m63K50J8q1O1K01k70J80l8l2J13o8J10j54L91o35L59K4l29L76Ll4J05
2682B44m50J59PL11nj40J95k30k10L51k12L62k97j88J29J3k30j9L50j96J91r7
2704C8J08j46O0j13m5j23J04Q0k6P0q0k7O7j42j00J77l8j4J75j73J64k38L54j62
2728c0JK07m12J65J01o7N9N3k20j4K98j62L1Q0L0l74M28j14j07J97l59K85K50
2751C26l20m2J22J92j45M2L25n21K86j25j17K31l02n3K46q9J12j57k7K42l52K75
2773A49P1k63J88m87J59M36n47L35k47J37j30qL43j31j72K49m24L40j56p3Q0P
2795a44L7j2j40J12P8M2m9oK07p3K12l10j6L24m60J80j62J49L56n59N22Nn83K52
$$ y = [101, -205, -309, -14, -222, 148, -49, -265, 281, -245, 3, 137, -496, -179, -113, -334, -46, 55, 78, 337, -51, 157, -306, -56, -38, -119, -58, 143, -127, 53, 15, -17, 96, 28, 138, -16, 375, -260, 99, 123, -206, 170, 173, 139, 244, -206, -47, -40, 271, 266, 126, 321, 91, -119, 232, 20, 382, 85, -103, 26, 39, -191, -210, 140, -56, 135, 38, 146, 0, 60, -53, -98, -221, -117, -37, -63, 7, -73, -100, -33, -175, -275, -98, -136, -150, 25, -148, 16, -222, 132, -30, -29, 178, -234, -69, 32, -35, 24, 77, -143, -157, 141, -21, 10, 90, 120, -254, 174, 60, -47, 150, -209, 76, 326, 6, -36, 86, 278, 133, 175, 500, -21, 265, 140, 23, 254, -48, -101, 145, 56, 168, 11, -16, 226, -126, 149, 220, -43, 145, -342, -183, 253, -294, 41, -206, -69, -199, -207, 136, 5, -167, 82, -342, -2, -158, -231, -151, -144, -107, -119, -259, -147, -69, -27, -76, -82, 125, 52, 264, -46, -62, 262, -198, -18, -180, -31, 325, -234, 288, 293, -290, -38]
2819c8K99l54M00k44k10M69k27k36K63K08k36p9P4l03N52l43K5p7K92j94k16J33
2841d2M72n39K00k49J96J00m37K11N1j37M22l67L67Mr17O00j84j2O65r81K12M24
2863E9l60L37k0j88L50o11k1N50j03J69m65K06M67m38P6J8l67M71j60m02N66j02
2885C2k24N31j18o0P2m80M92pn23N15m74N29Q7o05O02P4k54K58o83M18K84r05
2907d39P77j19l82P69q25K18K78n64O60l92M2N21q78M34K27n71L98k69J18L21
2927C24o30J00K55k36Q6J34r6K70o0n70N32m02mJ79j44M63k05n85R08l06k0K17
2949B10o58Q58m64n64P85m36K82K66p70R03r5m32M37n56M52j09n82Q24K5l32L17
2970C61o75O90J75n13K48l09P8J51o41O40M81q41M07j35j91K47l60J63N39n42
$$ y = [-38, 261, -93, 307, 63, -147, 322, 95, -141, 122, 330, 94, 15, 89, -214, 338, -5, 20, -57, 235, 41, -175, -42, 430, -109, 91, -158, 38, 138, -299, -88, -37, -174, 248, -119, 248, 252, -665, -65, -249, -261, 404, -577, -365, 59, -301, 36, 16, -172, 178, -433, -454, 96, -7, 162, -303, -97, 370, -68, 8, 26, -341, 130, -30, -432, 134, 32, -192, 339, 221, 161, 233, -247, 245, 238, -285, 230, -244, 285, 372, -233, 369, 443, 189, 447, -236, 182, 466, -439, 338, 219, -163, 606, -219, -1, 277, -287, 373, -19, 23, 544, -334, 100, 327, -244, 154, -115, 3, 324, -306, -206, 49, -187, -101, 33, -63, 207, 147, -423, 109, -293, -297, -118, -262, 201, -4, -589, 319, 13, -7, 210, -448, 410, -54, -618, 167, -269, 13, 279, -491, 412, 317, -115, 322, -234, 218, 109, -473, 351, 376, 44, 361, -314, 376, 551, 38, 286, -23, 55, 206, -435, 205, 686, -155, 252, 117, -74, 173, -187, -24, 515, -27]
2990b7J49Q3k56N34o11l84Q86l43k08K60m89P96n50k00N93n17M35rp02N50k58
3011b68m2L26j31J33K20p72Q52l94j04K90k96J30K13p06N56P1j35J23q3l6K57
3032B04k75q5K76k93L15j08j91M62k79Q5K12k6k28R4m97M75k76J05O6k8K58j39
3054A27q3K58m15L88l02j75O55n96K14K49n90N50l48K6K37l55K28j32k5J82k65
3075a72N4J46j0N5L0j61j02ok84L54M3j65K89p4J60k38L5q7K40l77K3P2M2K29
3099I6l07K84J08m01J28J16r7K88n22L12K81j56K02m73L45p1m37N02l30K30J51
3120B49m33M95j90j98J93K02P8m34P2n9K03j43l4J02K42m03L53j84l78K98j96
3141a65K75j08M2J39l29K73m5m9l4Nl35L50j64p1k8J13J75r6K03r2J53k31k79
$$ y = [-27, 122, 205, -51, 483, -128, -512, 374, 31, -177, 83, -406, 390, -160, -360, 233, -284, 151, 142, -560, -10, -268, -310, 16, -115, 18, 238, -534, 318, -76, -180, 110, -186, -56, 157, -549, 7, 78, -57, 66, -17, -53, 204, -71, -156, 120, -173, 142, 34, -157, 305, 26, 111, 323, 297, 69, 163, -334, 141, -135, -30, 36, 8, 266, 127, 44, 302, -113, 275, -27, -202, 453, -143, 71, 320, -270, 280, -68, -42, 195, -160, 68, -64, -89, 93, -172, -118, 28, 18, 73, 103, -58, -160, -166, -450, -96, -53, -218, 71, -3, 157, -81, -46, -133, 107, -270, -247, -175, -133, 96, -211, 73, 181, -220, -92, 24, -73, 215, -307, 5, 286, 130, 332, -141, 204, 133, -304, 198, -132, 98, 249, -184, 311, 121, -77, 116, 318, 396, -38, 34, -25, 178, 35, 1, 103, 345, -58, 295, 111, -267, 31, -165, 110, 2, 44, 183, -146, 127, 82, 33, -1, 4, -331, 19, -145, -216, -244, -131, 44, -52, 151, 59, 212, -19, -298]
3164b98M42l43J2Q8j82M92k91N2J00O7j33j0M3O7k04Q4K88o54M85J0j14j9k44
3187b62K40Jk54K26J38P8K20l38K47k40j32j43L43l9q6J96l8m9K61l26K48N7l44
3210DK11k06p2K34k46K33k99J83L45o03M22o0m34L80l71K32nj00m4J70K1N9j30
3233g6Mj03J23o4k60K14J4K97k80j41K04J8K2K77n37L63p7mK3j59K56Qj22J03
3257A03jM0j45k51j5K44M5L30n59L30j99K66j46k70J62J60m15M76J7N8j27oL4
3280A31j96K79r5k4k41J58k2J91J53k80k06Q3Q5j00j37rL25j27L2M1k35K55p7
3303a6k12M02k35k86L34l11L47nk98O91m68J60j72l65M25j43k5K97l08M49l94
3324a33k14N84n45J17M30l93R0J23l09L23P5j24J74l32L53j12l11M4K47Nj06J56
$$ y = [-298, 144, -199, -187, -99, -281, 211, -80, -28, 72, 139, 6, -4, 39, 106, -98, -14, 274, -380, 105, 115, 1, -18, -262, -22, -21, -275, -49, 89, 167, 387, 49, 296, 56, -76, -219, 124, 85, -1, 195, 157, 108, 369, 43, 291, 348, 4, 215, 9, -63, 171, -75, 158, -141, 42, 387, -216, 206, 146, -288, 92, -279, -47, -52, -152, -196, -26, -5, 54, -76, -72, -175, -52, -116, -376, -162, -148, 149, -131, -272, -68, -50, -28, 249, -288, 75, -2, -6, 17, -142, 114, 122, 0, 103, 102, 142, -3, -254, -269, -25, 20, 350, -209, 121, -78, 188, 42, -228, -66, 94, -321, 155, 172, 230, 103, 97, 131, -65, 214, 119, 95, -146, 12, -10, 181, 334, 54, -152, -69, 16, -84, -221, -230, 95, -32, 0, 41, -194, 61, -16, -228, 174, -61, -347, -13, -324, 23, 18, -280, 411, -57, 103, -69, -434, -9, -152, -177, 120, -188, 261, -133, -347, 237, -308, -191, 239, -154, -64, 59, -250, 73, 148, 24, 198, -134, 219, 107, -204, -160, 87, 92, -14, 142]
3346A42l17P42m51NJ41k25J10j07m49R07n95j1L65l19L46n0m29L98l54M2K41l58
3368b26P12l49j36K29l04J03p4l89O84k80r7M1k13M85l02k34M54P7l20J66l56
3389c29J99j75j14L31L14m61O8O8j49O1R8j65N17m80L25r6j03N97o90L40K04j36
3411B24r5j08k77N23m25J16M02m03L38l20k33N44m67K05J2q4M97n27j23M87k51
3432C5Q9J14m19N74n60j6J99P2o5L6q7L61l83l56M30k20L7K04m52N89L1l71K61
3455A03k64O8L73q63L88M06n28J48mj33N36l38K90O9m50P8k03J81L44m73N16j13
3477A31J3Kn12K98L65l37J22N2j08J13m87L38M75j96j4j13J80m51P3j19K91N9
3499A75j6J89l86J07j74Q3K19j94KJ93k27K7J94m13M04j68K30J3p15N75k20O7
$$ y = [142, -175, 567, 116, 121, 262, 37, 147, 40, -409, 498, -97, -108, 257, -62, 284, 234, -195, 203, -151, -109, 132, -226, 486, 137, 1, 230, -74, 29, -45, -434, 250, -30, -127, -86, -299, 186, -116, -350, 104, 181, -139, 27, -329, -130, -305, -419, -88, 226, -235, -167, -99, -248, -187, -89, -254, 263, -217, 108, 12, -91, 506, -184, 156, 360, 224, 129, 21, -256, 267, -158, -42, 360, -43, 295, -25, -258, 286, -181, 24, 36, -48, 449, -78, -201, 286, 35, 124, 238, -181, 393, -167, -183, 16, 88, 23, 59, -28, 333, -50, -406, 24, -196, -159, 45, -407, 182, 213, -158, 103, -161, -93, 280, -583, -195, 211, -317, -169, -173, -306, 230, -108, 182, 251, -199, -121, -324, -143, 201, -272, 244, 131, 144, 146, -366, -68, 297, -40, 82, 134, 26, 139, -348, -10, 465, 269, 255, 142, 322, -129, -56, -175, 116, 175, 159, 348, -38, 69, -105, -22, 197, 3, 5, 198, -29, -2, 192, -221, 183, 15, 245, 258, -457, 118, -102, -35]
3521c5P1l88N22k05j08K01j46J21J27m50K42J9m25M20k49L59l6j75J41j20j75
3542b89J72o4M36l03j33J12J16J2l96K42J19L99l09n4Q3j21j31K57n6LR3l07M34
3565C15o02K70j04m9K94o8J2J57l35K40k36l5L09k27J26mk29M29k59M0J67l18
3587a07J43R7l70M87m90K42j9J22j15krrL25o26K47j8l55M47k08M2K49m03K07
3610a23K97l78L33K3k97J79m60M26J42j36j08L9L0Qj21Q8J57k81K88j15J50k02
3632f1J50J52l81K16r4O7L00k99L7L6N5J91k16Jj45j71K84Q0j29J32k84J58Q8
3655A67j07pl9J61p3j57J99j30m3j42Q8j84M6K01o4j1J66k05O6L2P6o5L05l08
3679b8K42l51J41k8J44Q9l22l9J79o4k3m1M0p8N5r9l2P6J45NJ12P2j72k10J37
$$ y = [-35, 36, -352, 170, -35, -143, 58, -88, 33, 160, -290, -48, -29, -454, -34, -283, 76, 40, -135, 6, -114, -289, -117, -181, 255, -48, -181, -69, 47, 59, -337, -95, 24, 423, 114, 60, 143, 22, -109, 148, 92, 95, 188, -119, 315, -287, -17, -121, -170, 124, 56, 68, 225, -110, 130, -106, -141, 168, -59, 67, 63, -166, 263, 4, 44, 211, -107, 36, 133, -237, 250, -240, 2, -17, 105, -10, -12, -21, -30, 295, -331, -84, -102, -457, -10, -218, -176, 73, -330, -123, 174, -204, 129, 152, -145, 34, -426, 0, 142, 6, -102, -63, -33, -25, -146, -58, 99, -182, 106, -9, 141, -61, 89, 241, -140, 76, -18, 49, 349, 50, 87, 123, 178, 369, 153, 154, 9, -162, 122, 202, 73, 205, -79, 79, 167, 60, 53, 14, 175, 102, -55, 144, 14, -29, -171, -83, -267, -221, -20, -84, -95, 71, -134, -68, -36, 40, -25, 280, -28, 214, -137, 4, -24, 120, 209, -113, -152, 27, -37, -60, -101, -61, -139, -84, -183, -215, -139, 6, 11, 123, 195, 23, -187, -50]
3704e0L96l53J37N2j73K10j01j42K75n16M75k4m15L03j05R5J82k94K75j89O5J4
3726A17j44J64L3m24L73l53jM22k77%k4J20M4j22J10J07j81l9K15l59o4R1O7M8
3750g7R0k09P9j52MK58k22J02R5J21r9p9m4J54l57N84o36K70K32j58J29K7m6J62
3774B28l97M5L39k58J33m2O1K68n93L24Q7m36M01l56K03K01k81j38M07j36J6j13
3796c7Q5Q6q9J28j69K95l13P5P4o1k6p8J38m98M95j0q8J71P4l67K25m40L19J63
3820A52l98N14l55j24J22j51J79K64n49K40N5N3R6l69J08J99L4Lk35L45k44n5
3842a16J36k3J03l12K00J39O2j83J13j16j00K52j06j35J74k23k7M20k34K22l70
3863a24J22On0l0o3R8J53m8j69M86m11N2J12k16K19n0l80M09n0j05L16n05K92
$$ y = [-50, 346, -7, 130, 182, 9, 219, 118, -24, 251, -265, 210, 186, -229, 74, -31, 64, 246, -48, 227, 38, 103, 117, -27, 137, 170, -254, 119, -234, -235, 187, -90, -90, -114, 6, 50, -72, 38, 145, -36, -75, 140, -219, -283, -192, -125, -77, 13, -196, -117, -269, -265, -7, -229, -127, -32, 89, -10, -89, -133, 21, -336, 248, -388, -118, 114, -44, 85, 112, 66, 228, -169, -124, 215, -43, 90, 48, 109, 377, -216, 108, 195, -241, 160, -196, 7, 208, -73, -211, 196, 60, 76, -37, 48, 134, 45, 173, 4, 299, -14, 61, 135, 74, 48, -30, 108, -390, 105, 95, 7, 178, 252, -115, 110, -330, -11, 152, -246, 268, -87, -211, -89, -240, -61, 203, -346, -106, -51, 2, 98, -271, -163, 36, 70, 73, -162, 183, -61, -116, 20, -3, 100, -212, -12, 127, 189, 6, 119, 3, -97, 155, 49, -86, 88, -135, -162, 258, 24, 246, -124, -2, 4, -46, -76, -139, -41, 112, 64, -105, 381, -30, 22, 134, -82, 137, 87, -293, 116, 66, -39, 277, -228, 64]
3886F4K4k02N8p9N3J36m30M16K0l93M52k39K6q3J24J32r0k46L14r0n6J84j14j79
3910a98L04k36J76O2k41N02n36j98M90j35K05n3o36Q69m35j9K4j51N17j68l12
3931a69N44o24J27K36k33M61k64k75L77k09J23Ql34K05J1O1j37K7k0M7j14J36
3953a6K03l55K96k0J50k03k65j1K04j0j73J05j67L12L6nl56K5K10k42K09K87l57
3976a43n4J70o6J99k49R5L93n99p8L11n4K87k45O0r2p0L6L32k51N1k04p1N62j66
4000A54Q3j82J23q9P1k09K41J17l05J76k07K01J88m43J75r3K15j81J7j56J69j35
4022g0J14K3J29Nl85P2J65k35K44Kk12M50n09K34j7r3K78k25j98K75j12K77k78
4045f6J10k40P6K36j41j74L4R8k86K84j20J36l8J42j98K79k20k1M8qK25k44J02
$$ y = [64, 88, -114, -56, -135, -82, 54, -376, 40, 60, -333, 119, -120, -94, -177, -53, 79, -11, -257, 57, -33, -89, 95, -19, -198, 106, -130, 46, 108, -133, 369, -167, -365, 125, -10, 195, 142, -494, 375, -60, -79, -55, -206, 311, 143, -169, 375, -249, -122, 114, -119, 342, 78, -197, 180, -29, 94, 102, -232, -27, -16, 45, -92, -65, -85, -38, -152, -16, 187, -168, 128, 108, 258, 55, -210, -221, -17, -27, -200, -95, -262, 50, 86, 81, -275, -250, -40, -282, -73, 214, -143, -197, -27, -93, 106, -143, -48, 345, -254, -332, -21, -75, 212, -33, 27, -65, -135, -99, 233, -18, 33, -171, -242, 320, 154, 237, 55, 178, 89, 160, -49, 192, 309, 4, 180, -27, 174, 362, -81, 94, 1, 216, 35, 52, -104, 65, -70, 44, 67, 196, 201, -184, -112, 53, -182, 62, 64, -148, 302, -207, 27, 10, -83, 195, -30, -228, 47, -65, 212, -66, 44, -196, -120, 116, -25, -199, -165, -67, -353, -69, -189, -53, -91, 51, -147, 132, -88, -109, -61, -69, 156, -88, 14]
4068A4j39K0N3L3K07Q5k53k00K75j76L7r5r4M02p8L18l59O9J4L38o27K00n19N58
4092H3n5k10q5L25j27J59k11L02p2J20j27J59k54j33J8q4J3K02J58j98k4k14K47
4115hk33L15j55j25K80o2j32J83j71k9K95l68J46p3R0O6j57J16L4MJ2k97L14l93
4139c48K46K34p6k9K24k82J46k03K04%j39J05r9j20J85Q7m25L17m1J99q1K00l22
4162a8r5Q5j44K46j15J02J71qn4k31R4J00k34K43l08PJ75J3O7p4r7J81j80jP1
4187dk26JJ25J67p6j22K30o4j69K22j23PR9k10k2J34J04j20J56o0k6j97O7J03
4211dj47J38J54j25j06j44L29j9j93O7n1J71M0k8j64K08l32L93r0J50j82j5k0
4234C0K08o36O65k46j6l1K3j12o2J75J11k70J59N2O8J03l58J23Q9j19q3J67j09
$$ y = [14, -125, -105, -52, -19, 188, 273, 20, -180, 95, -81, -44, -139, -233, 169, 91, 409, 50, 119, 133, 471, -156, 44, -475, 83, 28, -182, -267, 58, -69, 90, -121, 181, 109, 229, 102, 261, 7, -126, -108, -192, -179, 23, 181, -17, -41, -255, -8, -241, 74, -81, -206, 74, 12, -120, 63, -108, -137, 158, -210, -64, -137, -47, 19, -138, -22, 12, 16, 28, -269, 45, -348, -102, 132, 56, 27, 251, -31, 115, -88, 116, 116, -23, 82, -17, -137, 48, 135, -290, 27, -14, 185, 104, 304, -18, -113, -28, -172, 74, -41, 61, 232, 224, 170, -61, 33, 133, -101, 142, -166, -159, 16, 29, 96, 22, -75, 106, -74, -75, -4, -230, -229, -104, 63, -13, -135, 95, 31, -138, 84, -39, -32, 67, -143, -165, -31, 73, -47, 109, 49, 23, -174, -107, -4, -151, -13, 141, 16, -90, -234, 95, 76, -117, -50, -101, 70, 110, 82, -82, 126, -206, 187, 97, 247, 65, 50, 30, 238, -398, 267, 21, 5, -26, -3, -115, -177, -2, 109, -161, -2, 50, 118, 221, -137, -14, 75, -44, -127, 40, -69]
4257f9K62j87m48L98J32r9P2M5k02r5O1L01J65l95O4j67M9K05j97k4J43J33k09
4280f2J8j67L88l67P8n9J48NJ42l57L39j2k4Jj46m8J96q4r7K12Q0o2K1r3k6j10
4306h6K42lQ6j88J89l53J37o8j59K78k52L89l99L20j15j0o5K83m3N8k93K40k08
4329b0oR9P2j71j35kQ0K97l02n9J57k55L15k99P7K84j20j53J38k08L37j17k55
4352b46J36k6L24k10k33M32j38j86K45l5J83l92k72L71N6j0R1j48J64j51l65M80
4374G0K08k41J26k50J73n1k37L67j11r1J44n28N00J18k65J24l5J29m3j62O5R6
4396A06m34M85l32n8L76o5k68K72k55K29%k44J07j66Q4L7Q4Q2j70J22k9J29l86
4419b94K00O9l29L19K2N9J54l65J17j57L02j97L6M33l54j46J42J15J10l66M8J81
$$ y = [-69, 193, 6, -442, -44, 88, -11, 61, 106, -96, -191, -130, 171, 336, -59, 5, -162, -113, 92, -105, -129, 14, 147, -62, -44, -211, 177, -190, -112, -171, -23, -18, 124, -233, 106, 94, 70, 71, -75, -123, 73, -11, -108, 104, 184, 122, 143, 50, 24, -86, 156, 153, 239, 51, 240, -113, 24, -44, -203, 75, -177, 212, -187, 133, 18, 8, -57, 226, 183, 241, -52, 188, -20, -26, 73, 145, -26, -161, -163, -83, 214, -88, -147, 10, -245, 70, -229, -152, 132, 12, -141, -3, -211, 126, 9, -246, -110, -136, 188, -22, -255, 177, 39, -147, 98, 63, 246, -146, -418, -47, 9, -1, 90, -58, 106, -45, -410, 70, 278, 37, 163, -87, 86, 35, -202, 165, 54, -37, 107, -421, 79, 197, -68, 56, 21, 150, 107, -55, 10, 106, -328, 157, -175, -233, 143, 78, -190, 82, -173, 56, 56, -188, -81, -247, -163, -126, -42, 40, -130, -8, -37, 92, -294, -94, -25, -354, -35, -13, 46, 200, -165, -48, -205, 97, -100, -64, 369, 15, -131, 11, 126, 236, -130, -82, 99]
4441I9rk50M7L4K97o8q9J59k38J38L0k04M39k94j88J06j18P3J37q4r2K71j93j29
4465a26L31j38n7j14J46l5J69N9j56k88L55j5j89R1j0N9q9j02K51l30J39K6k1
4488d4M8Q2m63K99j03k8J20j26J18J31j67P6Ok28L30j12o3n1J87k4O1n3L4j50
4512a20J61j42r3M9K7L37j08k79P7L87j68k38K20o9J07k48J18J57k99k00O50k30
4534I6K4o0p5Q5l88L36j61Q2Q4j51K15l6J4j9j00J40L5j30j0J46l26R9p6K67%
4559I1l4m2K9j9o7Q0n3l5l6P5k7k55L22k54L9K28j35M87m13q8K4J05j08%R8j72
4585a60L35l91J67m7K35k29R6r2K05j49N2L2l69K95OQ9j88K85n4m3r8J97N1Q2
4609C07k43N3l69L21J01r1O9j61M20j10j46l44J23J51k12j63J35K07n9q1p0Q5
$$ y = [99, 90, -160, -113, -79, 218, 150, 61, 220, -18, 120, 150, -54, 385, 91, -97, 9, -109, -36, 101, 17, -75, 196, 3, -126, 205, 67, 10, -104, 42, 7, 176, 235, 79, -209, 146, 131, -58, 33, 23, 82, -7, -109, 142, -188, -49, -23, -44, 4, 86, -377, -78, -181, -209, -89, -215, -97, 34, -133, -57, -51, -279, 51, -61, -124, -175, 12, -12, 49, -4, 30, -120, 41, -101, -194, -145, -118, 219, 111, -168, -91, 296, 128, -110, 110, 41, 148, -100, 18, 175, -124, -324, 326, 96, 120, 60, -15, 70, -318, 18, -143, -61, 23, -128, 87, 51, 65, 46, -54, 86, 121, -9, -19, 127, -199, -100, -176, 91, 91, 57, 15, 44, 25, -42, 38, -15, -50, -86, -11, -38, -293, 29, -225, -186, 42, -93, 394, -19, -107, -83, 22, -86, -86, 12, -160, 175, -216, -49, -96, 139, -90, 6, -86, 119, -30, 22, 54, -315, -20, -14, 75, -113, 172, 118, 75, -23, 174, 225, 307, 64, 117, -252, 69, 170, 79, 148, -13, 407, 297, 151, -193, -70, 81, -131, -294, -159, 48, -11, -92, -162, -77]
4631g7J23m0j59P3m7r5M6R9l7N0j5J06j33O0J21R4Ok92K37j61M0j84Q1J73p3k53
4657b57K25K45k20k22K54j10J91j76R2N6j98K75k98J32Kj74J31O7R6j56n3K68
4679A70j75J12L12o22L21j87ON5K7m1J55k46N3P8o8L8O0k24L67j57k64L28r7j83
4703a82K41j66K54r2l61L96k30QJ42j38L7J98j66j36L03j68K15o4q9K61j66lj05
4726a1k12K10k92L35j41K37j35j84K3J10Q8O8M0p9j9Pq6J72O0j39J76l09k6J83
4750G6r6q7K26k08K11k78k8J48N2L86l01j67L42l29J22j78J4r4L05q2J3K24m96
4773b25K18j86M37l14R6Q6l46J11L44r9j59P3k63L10k43J02J25p3J36j16j85K46
4795G5n3r9k68K04J03L15l57J4K34k30L25l2N2k22l2j55J23Oo5j48J25o3N0NL
$$ y = [-77, 46, 6, -153, -80, -127, -222, -176, -77, -114, -64, -79, 27, -106, -46, 75, 169, 175, -117, 120, -41, -1, -185, -104, 69, -4, -257, -32, 213, -7, -229, 25, -85, 106, -70, 22, 78, -120, 155, -143, -11, -9, -183, -52, 15, 111, -45, -98, 170, -5, 107, 419, -203, 118, -69, -63, -8, 19, -22, 133, -113, -60, 18, -50, -12, 48, -176, 191, 34, -230, 98, 1, -182, 59, -107, 147, 55, -306, 90, -140, -132, 10, -128, -91, 107, -59, -195, 108, -60, 155, 91, 2, 263, 97, 94, -11, -223, -13, -305, 30, -111, 126, -9, -193, -170, -60, 28, 96, 136, 57, 38, 45, -41, 131, 191, 52, 228, -81, -107, 76, -20, -107, 119, -89, 122, -156, -184, -36, 16, 402, 101, -66, 276, -53, 69, -109, -95, -189, 116, 34, 47, 271, -225, -7, -193, 244, -70, 26, 112, -234, -123, 221, 122, -37, 36, -227, 83, -160, -58, 67, -6, 130, 14, -171, 75, 22, -77, -345, -141, -38, 277, -80, -66, 168, -62, 263, 231, 283, 61, 29, -126, -3, 3, -62, -210, -85, -148, -98, -93, -90]
4820i0kJ44p7mP9j47J92m11L52l7m7j44K46q0J43lL8o8O5l63K55j11J46k1j39
4845h4R8O9L2j72k0K05m9r6O4k32L04j03j17K46k90K26Ok20J62k10k08N42k51
4868i8k74M67j28P1ok07L07n8N0j36o5j2K59j81L0N0j22J82k89K51K25k65k0K28
4892B59j85p0K37k91K78l77L9K51k83J02o1k0M58j87O3l81N7J86m39L83P1r2l0
4915c2J27j45K17j08K4k27j2K39ok06Q5J20j70K0O9r5J29j74J31K86k66q5j9J13
4939A5p1j7J37J2j56J51k20Rr6J37k2l2l6J5M8L20j05r5j08j9J68J55k1o9J36
4964B36o9j66l0J99j46P4j57J27j87J44k58J23J66l75N36j28P2m0k87L39K0k68
4986g5K76k21J29k22L37j10k62K97j45Kj91L41l43Q4J51k51R7L6P1%k52L98k49
$$ y = [-90, -92, 52, -25, -29, 50, -97, 95, -316, 36, -1, -48, -192, 54, -26, 117, 114, 152, 84, 149, -214, 41, -70, 76, 55, -84, 14, 83, 115, -57, -77, 128, 79, -17, 47, -185, 119, 16, -101, 145, -145, 81, 87, -133, 29, -181, -389, 153, -98, -372, 95, -33, 38, 32, -175, 132, 74, 124, -12, -77, -89, 170, -11, 19, 69, -53, 129, -160, 91, 316, 51, 31, 259, 74, 4, 241, -50, 228, -149, -110, 141, -142, -40, -101, -121, 337, 150, 213, -168, -111, 75, -364, 19, 90, -2, -32, 95, -50, 167, 59, 83, -144, -156, 83, 77, -129, -44, 76, -94, -74, -5, -100, 29, -145, -14, 272, 6, -79, -98, 15, -56, -73, 64, 76, -80, 71, -149, -140, -236, -99, -121, -153, -189, -174, -126, 194, 89, -6, -114, -133, 35, 190, 169, 100, 236, 167, 1, -29, 170, 24, 98, -59, 68, -119, 25, -233, -110, 56, -319, 217, 89, 161, 121, -166, 173, 193, -75, 201, -20, 109, -113, 224, 114, -148, 149, 4, 6, -185, 156, -187, -103, 48, -203, -106, -70, 1, 1, -251, 147, -102]
5009a02J92j14J42l64K22o1q2J11J00J50l55M9kO3j52J11R9J06k16J03L7J3j14
5032f4j47M74j15q3qJ76k50j91L14k33J95k3P8j89L49m56K59N7k45M24j50j62
5054A0J15k03J47K1n5J50j8j80j44J65O3j75K90j96L6n7n1L6M3p6J07m1l9N8K7
5079C3J24j4ml78J08%o6J96K26k84J79k83J22K4M9j91J15j18P8M4j3L95l37j84
5103a79n5J58J36j91QJ00j20K73j43K9j02r1J96J33K0k42M4K40j58p0P1Q1j95
5126e7R0K50m5j15Q4k26J56J35q0j8j31J83l01j14K05K08m06L8J3K77k78K28j56
5149f0J50R5j35k31J71J41n1m5M1J20j98o7j5j09M56l65K85k85L1nj7O7j07Mj22
5174b51M25k03m4L2%om2K19l48J89P4k19J13L7oj23J70J13k79K91ro0n8k10NK25
$$ y = [-102, 90, -24, 118, -246, -24, -85, -167, -56, 44, 194, -161, -112, -114, -51, -203, -92, 7, 113, -103, 0, 37, 50, -64, -211, 263, 148, 65, 57, 233, -17, -208, 106, -127, 68, 45, 123, -66, 283, -173, 86, 143, -102, 322, 172, 10, 125, -78, 69, 90, 35, 185, 167, -13, -157, 8, 71, -104, 186, -10, 26, -31, -82, -46, -3, -79, 28, -13, -52, 6, 33, 157, 143, 139, -239, -131, -131, -197, -1, 225, -59, 120, -163, -41, -17, 32, -159, -44, -162, -84, -40, -53, 342, 5, -179, -234, -76, 60, -131, -123, -23, -143, 130, -13, 16, -86, -177, 19, 152, 172, -70, -26, 214, 56, -14, 57, 138, -57, 33, 283, 238, 123, 207, -19, 137, 272, 192, 174, 43, 226, -75, -189, 16, 224, -182, -144, -131, 146, -132, 96, -60, 90, 185, 50, -181, -10, 131, 80, 35, 76, 196, -2, -69, -84, -193, 263, -102, 183, -102, -71, -76, -93, -26, -133, -129, -251, 174, -29, -73, -41, -41, -47, -89, 130, -218, -29, 45, -174, -61, -24, -30, -153, 17, 130, -149, 142, 133, 73, 15, -195, -190, 35]
5200C5j87J52J22j35l1k06K01K48n4j10j42J21m1N6K1j89K63j10Q2r8n6L09j43
5223A08k88K62R5k65J88j52k6r5K93K4j60Q1j84J61l08J36L6K39Mm60L60j58j13
5246b22J33Q5K2R5J9k38n6L00O6k88L61k85q2L73l4k58O8j24J05m8O2R4j72J04
5270H0r2J2P1j66k6J4q5J83n6J65l03K28N7j24P0J03k76J09l2J95j04k12J35J65
5294A11oj60J88j85Q0m4p2jP7R1J6k38J73Jq3j12q9R0R6L70j35j95J42j91k07
5319b83K19J61j46Q2j59M1j0J6J21Pk68K06k08L28j27J6K23k56j30J85l3j11L73
5342B47k30J70Kl78J33O0j43L54j73k7K00l38l0K44m9k54K99q6K9J12k65K39J15
5365B31j8k97J97J39l13P7k08J97N8k91K38P0k5j10j70K15J07J43j43j46K50m05
$$ y = [35, -152, 0, 122, -13, -44, -250, -49, 199, 145, 35, -107, 14, -27, 29, 50, -139, 124, 14, 96, -2, -58, 251, 108, -180, 82, 177, -88, 100, -52, -78, -173, 120, 144, -16, 65, -119, 42, -266, -130, -94, 145, 149, -311, 49, -109, -222, -89, -4, 18, 113, 132, -106, -162, 138, 204, -84, 277, -8, -90, 283, 249, -9, 59, -65, 40, -8, 54, 148, -24, 80, -12, 0, 71, -95, -121, -107, -192, -9, -65, 100, -203, 25, 82, -42, 28, 131, -145, -36, -68, 127, 23, -189, -54, 111, 105, -55, 133, -52, 28, -16, -88, -89, -12, 79, 95, -143, 30, 31, -52, -164, -253, -163, -67, 303, 168, -27, 115, -76, -283, -64, 97, -49, 33, -126, -85, -95, -79, 42, 49, -219, -13, -221, 107, -20, -4, 219, -37, -167, 18, -15, -126, 247, 17, 187, 189, -189, -56, 4, -139, 215, 42, 15, 215, -123, -153, 91, 42, -212, 87, 1, 30, 142, -123, 116, 231, 213, -84, 113, 252, -61, 16, -192, 5, 63, -228, 10, 80, 55, -55, -225, -10, 97, 240, 97, -49, 201, -204]
5387b04L60k78J14k46J2K96Lj61j93L58L0k23OJ67j43Q6J04k44L73k54J32Kk96
5410a99M56k00j50K50l05l5K10J00l18K36J97j3J9j27j05q1J67O6k9j82k58L74
5432G3j68o1L53j71j26K02j7N7k27n8K20o1j2P1J24j60J28j38J54kl83K18K9j07
5456f2j82J45r8K37k72J64J14k66J95j75J24N3j67R7M8O6K18l49j5P2n3J36O5
5479I5k12J13N6j64K20k09J51k9J58L6k31J90j7k10J31j85J14o1J62m0J11l85
5501b06J22k5J52J27o6j21K19j31k28K91j92K41k79J81j2J26k72r3L7J7p9J89
5523bK41j06j29l2J9J52l00J7J39Q4j29K02r8l00J07P2M1p0K2J53n0Q3k93K95
5547A18k42J02J85k80J24L7n5k8K59j51j32J10K0m5K66q6l42K87k78J00K11k78
$$ y = [-204, 156, -122, -8, -254, -242, 54, 57, -104, -297, 61, 91, -132, -126, 41, -102, -16, 88, -156, 217, -37, 95, 97, -199, 257, 57, -93, 157, -148, -183, 27, 127, -191, 45, 242, 229, 248, 121, 16, -65, 102, 168, 139, -43, -301, 73, -95, -156, 197, 26, -100, 102, 85, 142, -85, -143, 77, 16, 4, 75, 199, 39, 167, 29, 183, 181, -202, 16, 45, -62, -244, -99, -197, 40, -232, -68, 46, -220, -25, -200, -76, -23, -190, -93, -45, 21, 239, -110, -125, -53, -106, 30, 95, -117, -4, 52, -112, 108, -101, 50, 21, 179, 215, -16, 174, 157, -53, 78, -107, 7, -54, 108, 68, 179, -206, -84, -109, 43, 170, 104, -17, 202, 71, -157, 134, -58, 183, -96, 85, 73, 199, -73, -166, -129, -112, -191, -2, 239, 133, 4, -28, -9, 143, -157, -140, -1, 83, -46, 156, 58, -242, -135, -63, -22, -92, -70, 83, 33, 116, -177, 118, -124, -22, 163, -117, 7, 44, -11, -39, 220, 69, -63, 47, 67, 22, 288, 202, -140, 147, -131, -31, 180, -98]
5569i8K3j21K80m1j12K20l14J76K3p9J23R3j33j57Q9N2L6j02K50j69j62J84O8
5592A29k38J39m27K25Q0l6J18N7r3oJ68j28j22j8K15J06j39l9K3j35K42j93Rm6
$$ y = [-98, -75, -196, 84, 43, -69, 151, -163, 13, 36, -43, 80, 173, 40, -117, -28, 24, 60, -42, 208, 39, -123, 61, 129, -109, 30, -397, -172, -92, -128, -10, 47, -46, -52, 116, -12, -134, -152, 63, 169, 30, -9, 14, -121, 121, -72, -63, -109]
$$ [...]
8191b4
##END NTUPLES=NMR FID
##END=
