##TITLE=1H_SL72(27.08)
 CDCl3, 8 sc, 
 27.8.2020
##JCAMPDX= 6.0         $$ Bruker NMR JCAMP-DX V2.0
##DATA TYPE= NMR FID
##DATA CLASS= NTUPLES
##ORIGIN= UXNMR, Bruker Analytische Messtechnik GmbH
##OWNER= root
$$ XWIN-NMR		Version 3.5
$$ Fri Aug 28 10:34:47 2020 Russian Standard Time (UT+4h)  she@DPX200
##.OBSERVE FREQUENCY= 200.1315066352
##.OBSERVE NUCLEUS= ^1H
##.DELAY= (6, 6)
##.ACQUISITION MODE= SIMULTANEOUS
##.ACQUISITION SCHEME= undefined
##.AVERAGES= 8
##.DIGITISER RES= 18
##SPECTROMETER/DATA SYSTEM= spect
##.PULSE SEQUENCE= zg30
##.SOLVENT NAME= CDCl3
##.SHIFT REFERENCE= (INTERNAL, CDCl3, 0, 15.7039)
##AUDIT TRAIL= $$ (NUMBER, WHEN, WHO, WHERE, WHAT)
$$ ##TITLE= Audit trail, XWIN-NMR		Version 3.5
$$ ##JCAMPDX= 5.01
$$ ##ORIGIN= Bruker BioSpin GmbH
$$ ##OWNER= she
$$ F:/spectra/data/she/nmr/H-F/1/audita.txt
$$ ##AUDIT TRAIL=  $$ (NUMBER, WHEN, WHO, WHERE, WHAT)
(   1,<2020-08-28 10:33:26.78 +0400>,<she>,<DPX200>,
      <created by zg, POWCHK disabled, PULCHK disabled
       configuration hash MD5:
       00 E9 B6 7A A2 85 ED C7 34 08 36 98 17 FE 4E 26
       data hash MD5: 16K
       C8 40 95 81 8A 72 71 D4 BC 2F 08 64 05 58 E6 8F>)
$$ ##END=
$$ 
$$ hash MD5
$$ 5F 15 B5 FB E9 97 A5 5F E2 60 68 33 C0 D5 6F FB
##$RELAX= 
##$RELAX= 
##$RELAX= 
##$RELAX= 
##$RELAX= 
##$RELAX= 
$$ Bruker specific parameters
$$ --------------------------
##$DU= <F:/spectra>
##$EXPNO= 1
##$NAME= <H-F>
##$PROCNO= 1
##$TYPE= <nmr>
##$USER= <she>
##$AMP= (0..31)
100 100 100 100 100 100 100 100 100 100 100 100 100 100 100 100 100 100 
100 100 100 100 100 100 100 100 100 100 100 100 100 100 
##$AQSEQ= 0
##$AQ_mod= 1
##$AUNM= <au_zg>
##$AUTOPOS= <>
##$BF1= 200.13
##$BF2= 200.13
##$BF3= 200.13
##$BF4= 200.13
##$BF5= 200.13
##$BF6= 200.13
##$BF7= 200.13
##$BF8= 200.13
##$BYTORDA= 1
##$CFDGTYP= 0
##$CFRGTYP= 5
##$CHEMSTR= <none>
##$CNST= (0..31)
1 1 145 1 1 1 1 1 1 1 1 1 1 1 1 1 1 1 1 1 1 1 1 1 1 1 1 1 1 1 1 1 
##$CPDPRG= <>
##$CPDPRG1= <>
##$CPDPRG2= <>
##$CPDPRG3= <>
##$CPDPRG4= <mlev>
##$CPDPRG5= <mlev>
##$CPDPRG6= <mlev>
##$CPDPRG7= <mlev>
##$CPDPRG8= <mlev>
##$CPDPRGB= <>
##$CPDPRGT= <>
##$D= (0..31)
0 1.2 0 0 0 0 0 0 0 0.06 0 0.03 0 0 0 0 0.0002 0 0 0 0 0 0 0 0 0 0 0 0 
0 0 0 
##$DATE= 1598596406
##$DBL= (0..7)
120 120 120 120 120 120 120 120 
##$DBP= (0..7)
150 150 150 150 150 150 150 150 
##$DBP07= 0
##$DBPNAM0= <>
##$DBPNAM1= <>
##$DBPNAM2= <>
##$DBPNAM3= <>
##$DBPNAM4= <>
##$DBPNAM5= <>
##$DBPNAM6= <>
##$DBPNAM7= <>
##$DBPOAL= (0..7)
0.5 0.5 0.5 0.5 0.5 0.5 0.5 0.5 
##$DBPOFFS= (0..7)
0 0 0 0 0 0 0 0 
##$DE= 6
##$DECBNUC= <off>
##$DECIM= 32
##$DECNUC= <off>
##$DECSTAT= 4
##$DIGMOD= 1
##$DIGTYP= 9
##$DL= (0..7)
0 120 120 120 120 120 120 120 
##$DP= (0..7)
150 150 150 150 150 150 150 150 
##$DP07= 0
##$DPNAME0= <>
##$DPNAME1= <>
##$DPNAME2= <>
##$DPNAME3= <>
##$DPNAME4= <>
##$DPNAME5= <>
##$DPNAME6= <>
##$DPNAME7= <>
##$DPOAL= (0..7)
0.5 0.5 0.5 0.5 0.5 0.5 0.5 0.5 
##$DPOFFS= (0..7)
0 0 0 0 0 0 0 0 
##$DQDMODE= 0
##$DR= 18
##$DS= 0
##$DSLIST= <SSSSSSSSSSSSSSS>
$$ [...]
##$SUBNAM2= <"">
##$SUBNAM3= <"">
##$SUBNAM4= <"">
##$SUBNAM5= <"">
##$SUBNAM6= <"">
##$SUBNAM7= <"">
##$SUBNAM8= <"">
##$SUBNAM9= <"">
##$SW= 16.880792210976
##$SWIBOX= (0..15)
0 0 2 0 0 0 0 0 0 0 0 0 0 0 0 0 
##$SW_h= 3378.37837837838
##$TD= 16384
##$TD0= 1
##$TE= 0
##$TE2= 300
##$TE3= 300
##$TEG= 300
##$TL= (0..7)
0 120 120 120 120 120 120 120 
##$TP= (0..7)
150 150 150 150 150 150 150 150 
##$TP07= 0
##$TPNAME0= <>
##$TPNAME1= <>
##$TPNAME2= <>
##$TPNAME3= <>
##$TPNAME4= <>
##$TPNAME5= <>
##$TPNAME6= <>
##$TPNAME7= <>
##$TPOAL= (0..7)
0.5 0.5 0.5 0.5 0.5 0.5 0.5 0.5 
##$TPOFFS= (0..7)
0 0 0 0 0 0 0 0 
##$TUNHIN= 0
##$TUNHOUT= 0
##$TUNXOUT= 0
##$USERA1= <user>
##$USERA2= <user>
##$USERA3= <user>
##$USERA4= <user>
##$USERA5= <user>
##$V9= 5
##$VALIST= <valist>
##$VCLIST= <CCCCCCCCCCCCCCC>
##$VD= 0
##$VDLIST= <DDDDDDDDDDDDDDD>
##$VPLIST= <PPPPPPPPPPPPPPP>
##$VTLIST= <TTTTTTTTTTTTTTT>
##$WBST= 1024
##$WBSW= 4
##$XGAIN= (0..3)
0 0 0 0 
##$XL= 0
##$YL= 0
##$YMAX_a= 262465
##$YMIN_a= -216078
##$ZGOPTNS= <>
##$ZL1= 120
##$ZL2= 120
##$ZL3= 120
##$ZL4= 120
##$ABSF1= 10
##$ABSF2= 0
##$ABSG= 5
##$ABSL= 3
##$ALPHA= 0
##$AQORDER= 0
##$ASSFAC= 0
##$ASSFACI= 0
##$ASSFACX= 0
##$ASSWID= 0
##$AUNMP= <proc_1d>
##$AZFE= 0.1
##$AZFW= 0.1
##$BCFW= 1
##$BC_mod= 2
##$BYTORDP= 1
##$COROFFS= 0
##$CY= 11.3945322036743
##$DATMOD= 1
##$DC= 2
##$DFILT= <>
##$DTYPP= 0
##$F1P= 16.9975609425685
##$F2P= -3.02152046262296
##$FCOR= 0.5
##$FTSIZE= 0
##$FT_mod= 4
##$GAMMA= 1
##$GB= 0.15
##$INTBC= 1
##$INTSCL= 1
##$ISEN= 128
##$LB= 0.24
##$LEV0= 0
##$LPBIN= 0
##$MAXI= 10000
##$MC2= 0
##$MEAN= 0
##$ME_mod= 0
##$MI= 1.114404
##$NCOEF= 0
##$NC_proc= 0
##$NLEV= 6
##$NOISF1= 3.799351
##$NOISF2= 2.8
##$NSP= 1
##$NTH_PI= 0
##$NZP= 0
##$OFFSET= 15.70392
##$PC= 1
##$PHC0= -9977.187
##$PHC1= 19.00092
##$PH_mod= 1
##$PKNL= yes
##$PPARMOD= 0
##$PSCAL= 0
##$PSIGN= 0
##$REVERSE= no
##$SF= 200.130013532006
##$SI= 16384
##$SIGF1= 3
##$SIGF2= 2
##$SINO= 400
##$SIOLD= 16384
##$SREGLST= <1H.CDCl3>
##$SSB= 0
##$STSI= 0
##$STSR= 0
##$SW_p= 3612.71676300578
##$SYMM= 0
##$S_DEV= 0
##$TDeff= 0
##$TDoff= 0
##$TI= <>
##$TILT= no
##$TM1= 0
##$TM2= 0
##$TOPLEV= 0
##$USERP1= <user>
##$USERP2= <user>
##$USERP3= <user>
##$USERP4= <user>
##$USERP5= <user>
##$WDW= 1
##$XDIM= 8192
##$YMAX_p= 0
##$YMIN_p= 0
$$ End of Bruker specific parameters
$$ ---------------------------------
##NTUPLES= NMR FID
##VAR_NAME=  TIME,          FID/REAL,        FID/IMAG
##SYMBOL=    X,             R,               I
##VAR_TYPE=  INDEPENDENT,   DEPENDENT,       DEPENDENT
##VAR_FORM=  AFFN,          ASDF,            ASDF
##VAR_DIM=   8192,          8192,            8192
##UNITS=     SECONDS,       ARBITRARY UNITS, ARBITRARY UNITS
##FACTOR=    0.000296,      1,               1
##FIRST=     0,             0,               0
##LAST=      2.424536,      0,               0
##MIN=       0,             -216078,         0
##MAX=       2.424536,      262465,          0
$$ Real data points
##PAGE= N=1
##DATA TABLE= (X++(R..R)), XYDATA
$$ [...]
1779a082R52n4p78J106p29O7M19n03R38l92J10K99q80J292q57k68O75q58P93L05
1799E55q56O35j86q9M95o65K89Q4Jn8j70M53l43M45J18m94Q46o08o51P67o48J4
1821f6L41J7K21N7k52k3j83N9n66L50J06p07Q41n20p7M16p10N90j34p9q2j95k16
1844h12K59J56J25J46k0k11L14n29j22J08k16R4N11k28L18j57J99J13l33N40m96
1865b41qM19r62Q08K20p88J305j05n34Q99p82O8n1k56M52n43Q16J80p32N90l16
1886D39j00M58k18m03J95j19m09M59J48j49N51n33J05K93p28J59l05Q4M11j044
1906g06O33N09q42J081q77k32R63j370O43l22k24Q04n62J49O46j196J156l84r14
1925a045J136j300L53P85o43M14l5K81J25o35L20J25j94M75r47J93R45q10O20
$$ y = [-1082, -130, -184, -962, 144, -585, -518, -99, -602, 336, -56, 54, 353, -527, 765, -92, -360, 315, -543, 250, 555, -301, 334, 148, 59, 554, -111, 178, 262, 263, 205, 35, 488, 145, 590, 708, 214, 1060, 452, -199, 568, -80, -66, 275, 292, 513, 570, 318, 295, 112, 171, -395, -45, 61, -646, 195, -325, -402, 14, -696, -106, -240, -319, -401, -596, -812, -553, -397, -272, -126, -146, -357, -43, -572, -694, -586, -802, -708, -197, -425, -107, -264, -65, 48, -285, 255, -241, -249, 170, -792, 16, 236, -552, 753, 648, 114, 1013, 231, 299, 248, -8, 444, -99, 717, 897, 165, 755, 439, 339, 797, 579, 176, 371, 252, -157, 302, 450, 301, 852, 319, 424, 717, -11, 148, -157, -73, 338, -706, -73, 436, -406, 675, -202, -434, 529, -841, -198, -520, -744, 60, -502, -353, 293, -903, 253, -131, -1045, 91, -1209, -856, -71, -714, -300, -335, -54, 71, -564, -244, -119, -313, 162, -785, -592, 353, -457, 163]
1944A63L17k70K60l91j34K60j39j17L53K17j66l1l33N65J07p91M99n3m33N87l97
1965G3p1O64k84K39p0k25P0n63K38r7J49J02n23M88J65q08K93J4k30O61l11m95
1987e21N78j44n00K23K13L44m3m09L09p18l5J14l90N96M03m43O54m85o1j35l61
2008h11J018m92N2M06o20N31r1n05J222k64o22P67p41M4L37r10J027N24k75L12
2028I09n95K17k27m53N26j33N6J31k39J69J63l40J53L90l25J55o45K6L01p27K56
2049b32Q58k07N9k68n55P55p43j78O62o47Q25j15r03P40k74k86N29o05N63n09
2069e31l40K99m39N07N41n57Q40j32p02M2m17M12j88q4R69k61j95O39p22J32N04
2090C17m79Q7J02j55q0o0M27q0N82k7N0O4p17r1J76k80K24K97Q1j16K2J73k92
$$ y = [163, 480, 210, 470, 79, -55, 205, 66, -51, 302, 519, 353, 322, -11, 554, 661, -130, 369, 316, -117, 470, 73, 2, 666, 382, 621, 551, 326, 396, -167, 71, -26, 123, 225, -298, 190, 355, -453, -160, -146, -376, 285, -26, -521, 57, -87, -587, -364, -151, 193, 150, -259, 50, -668, -703, -589, -979, -383, 20, -423, 231, -254, -315, -450, -811, 207, -285, -233, 173, -447, 84, -7, -512, 710, 446, -176, 591, -150, -106, 231, -679, 348, 872, 597, 909, 314, 531, 304, -149, 377, 244, 300, 431, 192, 361, 524, 184, 337, 727, 402, 557, -88, -62, 239, -488, -232, 626, 419, 478, 210, -345, 410, -333, -511, 151, -496, 329, 214, -689, 51, -223, -509, 20, -585, -22, -531, -871, -572, -1011, -504, 37, -520, 320, 188, -514, -472, -889, -477, -665, -749, 220, -41, -236, 403, -319, -187, 317, -162, -75, 27, -128, -208, -268, 159, 79, 661, 634, 684, 748, 31, -60, 116, -164, 60, 357, 438, 322, 344, 517, 225]
2113B25L89k55k02N34o69k0J15k18N02J05j29J84j96l11k7o71M53K62l70M51J46
2134B98k79K33o37K23J34k69Q7l30N36k55k59O10k60O6N82q13j92Mk76J92j19
2155g24M15J45J16L35n16J53J82m24PO6K89L0l20K5L05Q0K86r0M47n83l81L31
2177A74n37K26N01r8M09n06J38K3k13L82n26Q0O34o15Q6J25l01O55n13J65J96
2198D85o73N02o23j2M87n27N39P9o33N18m16r4J56l26L10k94J91Q5o87Q07j95
2219c21k58Q58n97k17K47k73J1j09L17L14k12K76m32J57j00j72N01j76j67N36
2239A83m82L64J5k91O98m60N3J24l89R0J94k3K42K33K59m19J86J5n02L45m33p0
2261f8P39r0k35K18k02j49M52k31j18k36Q6l28j17L78L4mM73o04J91l3n65K74
$$ y = [225, 614, 359, 157, 691, 22, 2, 117, -101, 401, 506, 377, 561, 365, 54, 27, -644, -191, 71, -299, 152, 298, 19, 252, -385, -162, -28, -297, -210, -540, -4, -259, -518, 92, -168, -102, 480, -333, -525, -521, -797, -605, -724, -309, -164, -48, 287, -229, -76, 106, -318, -311, -245, 44, 74, -246, -221, 84, 164, 450, 360, 807, 224, -157, 174, -363, -137, 364, 266, 675, 169, 307, 330, 117, 499, -27, 53, 687, 72, 158, 283, -18, 637, 124, 289, 485, -188, 314, -309, -321, 166, -361, 178, 257, -376, 142, -274, -368, -212, -538, -228, -522, -331, -246, -933, -126, -321, -579, 279, -318, -535, -288, -561, -550, -659, -342, -28, -240, 36, -396, -239, -339, -511, -10, -186, -353, 183, -299, 65, 80, -211, 487, 27, 80, 204, -185, -95, 99, 76, 318, 551, 810, 391, 577, 592, 90, 435, 2, -68, 671, 581, 346, 564, 362, 213, 665, 434, 316, 80, 166, -162, -279, 99, 133, 129, 602, -2, 189, 156, -409, -135]
2283a35m5j22J95M8q4K9l11M67k02j3K6j15l6j61j09j13R9M71L1q8L16l51m50
2306f53L64k30K25K62J3J71k87N4r8j7N69p23O32k80k44N40l51j82Q09l53L91
2327F12r3l68r9l39K94j57L65L04k76K55j76k90N87o73J25N19n18L00p14R8J73
2348g1K2L91O6r7J74n65K31l92n15R98n40M37R6p36L17J97p68O83k34J10p0o9
2370c35l7j78N01k30K53K76l34q5l7k24j28M42L6J88J96l29j45N5n8J27J70l32
2392b08N19j1k42J31j15oM25k96M76j65l04k20j85M55L82l61K67l37k9J66p14
2413c72N46J70m03P67m82l15J99j46K36M09l17k70J98l37N7k55m5L63P8j35j03
2434a57j39M53n69m3N38n38L43J62o88Q85k69o27R81n11j84J74l16J21J74k60
$$ y = [-135, -180, -302, -107, -59, -143, -114, -425, 42, -160, -173, -147, -262, -298, -459, -568, -681, -582, -111, -80, -168, 148, -203, -653, -289, -519, -294, -32, -19, 152, -135, -81, -179, -196, 373, -350, 282, 2, -242, 298, -53, -235, 574, 221, 612, 519, 151, 52, -287, 7, -150, 215, 519, 243, 498, 322, 32, 619, -54, 71, 590, 72, 372, -342, -244, -71, -49, 342, 408, 311, 485, -80, 151, -241, -756, 242, -298, 139, 235, -501, -184, 13, -755, -72, -306, -196, -266, -335, -372, -550, -49, -279, -26, 250, -84, -169, -206, -430, -558, -116, -80, 108, 304, -25, -170, -115, -173, -46, 124, -208, 311, 300, 58, 189, 74, 68, 493, 197, 673, 508, 204, -16, -201, 254, 636, 275, 542, 205, 176, 342, -372, 174, 344, -59, 708, 226, -89, 110, -36, 200, 609, 292, 22, 220, -117, -60, -315, -360, 3, 81, -54, -157, -296, 157, -412, -455, 83, -455, -112, 50, -638, 247, -22, -649, 332, -179, -363, -189, -505, -384, -210, -470]
2454d70J74m0O02n67j80O14k18j24Q3p1K06nk19N26m36J52J20k04L69L2k11J48
2476B81m02L42J29K8J46j47k17j71J60J51m40K40O9M70l67p2K93m25K80j55l02
2497a09M90k66j77L95o51O27lp62O34k69r5K0k30N09J3m51M80o58M31k19m43Q92
2519A58m38R9oqPL2k24M65j65r7L79m60K64O9k96l18M66J59j15Q1k52K51j70J23
2543DK09j07J20k64l9N35m80J36M58n53K78Q6l35J11P9l28L64jJ26O3n18K83k37
2566a0L05j93k66N39j14n45L21l22M1N62n94K47K16o63M95o5k81K15k42J97O44
2587D87j105M48j85k22O14n48K02L24n74L89k70J5M81m66K42L3j47L34k97j83
2607d28M50k20K56K7j39J62k12k92M78k27M63k77o7J30l22N30K7j87J57k4J59
$$ y = [-470, -296, -336, 266, -301, -481, 133, -85, -209, -126, -197, 9, 4, -215, 311, -125, 27, 147, -57, 312, 344, 133, 281, -121, 221, 350, 378, 524, 377, 160, -11, 149, 300, -140, 100, 169, 639, 272, 200, 493, 68, 348, 193, -109, 381, 115, -62, 333, -318, 309, 306, -456, 178, -91, -186, -166, -396, 113, 126, -325, 155, -503, -72, -291, -734, 158, -280, -181, -187, -195, -188, -156, -380, 85, -80, -177, 202, -258, 6, 75, -221, -539, -73, 86, -29, 52, -200, 51, -119, 4, 213, 106, 226, -38, -77, 458, -22, 114, 572, 19, 297, 383, 48, 159, 238, -90, 274, 273, 399, 462, -56, 227, -10, 295, 102, -164, 375, 261, -284, 37, -285, -244, 318, -276, -29, 187, -476, 19, -46, -327, -112, -354, -157, 487, -618, -170, -355, -577, 37, -511, -309, 15, -559, -170, -440, -425, 56, -410, -168, -135, -282, 52, -245, -428, 22, -198, 58, 85, -54, 108, -104, -396, 82, -145, 318, 41, -26, 104, -218, 312, 339, 152, 309, 285, 444]
2628D44j2M5k86n1M15m82K14L53m86L64p58L03M17n47M37j3l30N12q57L63L52
2649C97l97M01k41k77M52o76K66J82l30K97k27n9J95k83R0J92l93K72j38K20j38
2670a95q6J7q2L28k08j5K7r2K46l02L72r1k64M66l11j04N01l48N28r3k34K50j84
2693A26j16M67p09K61J04J2M14m46Q9p7l13M02q7J06N7j90J36l9r1J45k45o8K29
2716A67j36RR7J5n0L39n50K70o8L44m16O2j62p1J4M2l5L3o6n4O0K15k13l24L55
2741a23j09K6p7O7K03m6M9j94J44J09l88r1L46nj52K05jjJ3o0j21L04o8J85n0
2766A65l6O7j30j16L77k62M77l15j4L0k10K94p1l18N18m51J06J09j41J10O8q7
2788A70K22l54Q4J05j51J77k59J00o4L0M4R2j90j58MK34j02j20K01l94N02m20
$$ y = [444, 432, 477, 191, 140, 555, 73, 287, 640, 154, 518, -240, 63, 480, -67, 370, 357, 27, 539, -318, 45, 397, 0, 401, 160, -117, 335, -341, -75, 107, -223, 74, -153, -212, -17, -300, -210, -18, -411, -139, -277, -57, -195, -281, -264, -346, -18, -226, -241, -214, -306, -60, -362, 10, -81, -345, 121, -190, -294, 207, -141, 387, 294, 60, 310, 126, 10, 477, -232, 29, 133, 145, 559, 113, 202, 125, -188, 214, 127, 233, 290, 100, 236, 197, 106, 251, 6, -62, 167, 31, 40, 137, 152, 102, 441, -109, 161, 93, 437, 21, 83, -79, -150, -136, -94, -129, -96, -162, -216, -156, 59, -154, -478, -123, -232, -206, -283, -216, -13, -59, -10, -204, -60, 49, -339, -430, -84, -89, -241, -36, -37, -38, -25, -85, -206, 98, 30, 215, 165, 129, 196, 66, -50, 327, 65, 542, 227, 213, 243, 33, 327, 256, -62, 456, 5, 111, 220, 79, 189, 257, 170, 392, 38, 122, 227, 76, 253, -6, 94, 30, 60, 104, 196, 6, -152, -148, 86, -16, -136, 65, -329, 173, -247]
2810b47M2J31l47L21r2j85K48k63L41P8l11J58P8k29J85j27O5j44K71J11p13N49
2832h0k45K24K91n97K5M10m13J35K23mJ88j70J74J04j24j04R9K32m13J24L23l00
2854A02K85n34K74J60n51O80j51j47K44n55L18R7k73K44L1l64L27l76L30L0j57
2875A4J15j62Q0J98m19L14L1l98M33m60J22L1J11n9r5k33K64n5P8p9j58L08J25
2898A06l48N9K37n28M88n7l19N56k38l2K07k42j9j74J98L44o51N82L5m74O14m16
2920g2O6N68n76J42k9j55K65J57q5L6k43J88p6r5R0j94K43OM9k05J72m02o0K33
2944B3l23K73O5k86K02l7K1J79l35J69L74n12K2l46K63L07n03L92N1l04M23o47
2966e29M33P2p90Q21k57j27N75m88O7L9j08K40O4J8J06l54k69M99o9J32k2J74
$$ y = [-247, -205, -74, -421, -100, -192, -377, -129, -392, -51, 27, -284, -126, -48, -277, -92, -219, -154, -298, -27, 84, -629, -80, -325, -101, 190, -407, -382, 28, -385, -250, -27, -31, 157, -13, 161, 265, 141, 37, 136, 368, -45, 79, 402, 102, 387, -147, 127, 287, -264, 416, 265, 118, 362, -193, 125, 222, -51, 193, 224, -140, 187, -189, 141, 171, 14, 129, -33, 47, 245, -174, 140, 171, -227, 206, -254, -132, -101, 10, -49, -144, -377, -113, -168, -90, -169, -327, -19, 106, -242, -183, 54, -474, 14, -43, -362, 194, -44, -76, 131, -111, -130, -304, -106, 238, -413, 169, 204, -270, 344, -72, -6, 562, -14, 128, 99, -56, 209, 366, 281, 317, 74, 262, 186, 91, 181, -13, 230, 236, 285, 80, 252, -150, -210, 23, -300, -27, 38, -248, -46, -83, -62, 117, -218, -49, 325, -187, -165, -511, -248, 59, -444, -52, -1, -305, 118, -529, -96, -24, -814, 7, -250, -377, 198, -290, -223, -184, -292, -52, 12, 30, 136, -218, -487, 12, -57, 75, 53, 227]
2988B27l3j96q0J55q7k71N64j25J19K14o92O39k10m43N91n72J26L81n14O81k12
3009B62j68M46n38J15K91l26J84k01j58L03n08O05k82q1M23l44N0K65r34O55j52
3030i3m45M88K6k22Q8J53J14k4l98K32n4k78J07L76q7l05j02L89J25n32K41J2
3052a89k98P05n14M4K92k77L99M6k18pj4p8P2O5J05r3P5l0m4J18j21K1J04r7R2
3077A58N8l71J02L07k32J38qK29p3l9l34K00k73J64o2j11J58K83j6k77J58k15
3099e6J45m05L95j21k90L23k20r7K54k44L48Kl04J42k18L35O0n18L30k3K38k82
3121b06l18O56k29QJ69k3l51J7K41Q2j50M52l04j18P8N9j45o0L17J06k53L09l60
3144b3j05M24m95M07J52m08K66J81l18K99m82L57j70r4M76o71L45J53l89L27k4
$$ y = [227, 194, -2, -82, 73, -14, -285, 279, 154, 273, 487, -205, 434, 224, -219, 372, -200, -74, 307, -207, 474, 262, 94, 540, 2, 117, 408, 82, 266, 65, -93, 210, -298, 307, 25, -56, 367, 23, 73, 338, -596, 59, -93, -538, -50, -24, -246, -158, -5, 109, 85, -313, -81, -135, -413, -306, 70, -17, -322, -424, -35, 90, -442, -201, -189, -487, 218, -296, -252, 40, -237, 162, 208, -10, -17, -31, -109, -37, 28, 133, 40, 115, 85, 41, 159, 38, 59, 163, 66, 158, 216, -155, -53, 254, 22, 160, 152, 381, 308, 269, -65, 135, -138, 26, -36, -147, 11, 294, 278, 1, 159, -56, 89, -316, 79, -42, -332, -9, -229, -326, -72, -316, 32, 34, -270, -128, -346, -11, 49, -469, -139, -162, 76, -206, -524, 132, -97, -89, 80, 57, -294, -277, -36, 46, -104, 348, 44, -74, 4, 63, -82, -142, 175, 281, 28, 337, -23, -128, 296, -199, 208, 360, -48, 218, 399, 81, 380, -102, 255, 85, -9, 467, -204, 141, 294, -95, 232, 208]
3165B08j68L56m00K04n03lK29k96L55J43m7J86m61K32o8k30Q4q1K23n5n19P10
3187I9j56l46M74m20N05j94l63N9l9L55j56J31j1j47L2K0Q7Jj11J15j43J78J38
3210A08k77J36J18j33L98k33J46j60m04M03k32L59l5o7M9J30k42J30k79J89J81
3231B85k48L52m63Q2Q5M2r7K66l13N5j85L40j41j23P3J1j0J65l99M85m72L4M0
3254a36K7J37N1r9j88R0j65K7L90j85j23L72n22K88k07p1K40r7Q1O9p2K75j22
3277F0k15K47k39mJ07j04J4J13J86J01k82L65j72o6j09K5L2l36O04r0m0o6k91
3300a60J06J35j23Q3J49k8m7k21O12l60QK37o19M15j12j90K57l65O5L22l07L54
3322B11k26j6O7l28J90kj00N07l14k17L76n11M64l38Q3P8l04J18J18J50L03l30
$$ y = [208, 40, 396, -4, 200, -303, -306, -77, -373, -18, 125, 78, 264, -197, 35, -33, -263, -179, -260, -37, -92, -611, 99, -57, -403, 71, -349, 156, -38, -401, -342, -381, -26, -182, -51, -62, -209, -177, -157, -70, -69, -180, -65, -208, -30, 108, -169, -33, 85, -48, 350, 117, 263, 103, -301, 102, -130, 229, 194, 127, 176, 306, 64, 194, -85, 104, 285, 37, 389, -74, 8, 93, 135, 38, 304, -9, 46, -139, 201, 60, -63, 10, 21, 11, 176, -223, 262, -210, -176, -136, -109, 28, 79, -20, -208, -118, -283, -256, 134, -51, -174, 198, -324, -36, -243, -314, -74, -171, -90, -21, -93, 182, 60, -155, 92, -147, -151, -44, -148, -134, -21, 165, 266, -16, 349, 177, 111, 2, 27, 59, -277, 327, 237, 197, 131, -160, -54, 81, -42, 41, 190, 162, 115, -106, 506, 146, 154, 391, -228, 187, 75, -115, 142, -223, -158, 164, -143, 211, -15, -31, 36, -292, -102, -104, -204, 303, -11, -228, 148, -363, 101, -237, -154, -76, -380, -262, -144, 6, 309, -21]
3344b1R9k56M9N3l04L34q0N1K19l32L40j16j46L65k73j73Q7K64J25l16K16K0l92
3367a87M87k61J11M2n24M20m4k6K60j72K72m0m94M27q3k20K55j41J28k43o2L67
3389B72m28K44j08q4M95m72n8J91j43n6O0K87k79K10k28p6P4J20k78J84j5j52
3411b40Q9j78L35j57J81J76k38J41k16N2j07j09J92o0p6K19J1pJ57k35J80o6r5
3434e1j91J79J29J81l76J84J99p6n9K32k88j86Q5K56p7oJ77k17K03j5j87kN5k56
3458a07n2J30O2J76k38P4J39j31Jj4O3K1k25L8J18l20M27k25j83J61l19J62K64
3481B2k18M84m71J32Op8J44j02p5K92o08N36j47j69k0K47j13oK84m6k33Q8K73
3504B22n17M32Q8q5o6j21R3k16K09K6J20nj61J44o2J55N9n64K67N13n25K69k76
$$ y = [-21, 78, -178, -129, -76, -380, -46, -126, -75, 144, -188, 152, 36, -110, 255, -18, -191, -104, 160, 285, -31, 185, 205, -187, 300, 39, 150, 192, -332, 88, 44, 18, 278, 106, 378, 338, -156, 271, 188, -32, 223, 82, 210, -33, -95, 272, -156, 88, -20, -104, 391, -81, -139, 52, -91, -147, -87, 200, -79, 131, -97, -173, -99, 21, -257, -73, -88, -240, -151, -329, 6, -151, 30, 206, -32, 109, -107, -55, -162, -271, -79, -139, -215, 4, 15, 8, 165, -70, 110, 44, -51, -242, -63, 66, 247, -129, 55, 254, 178, 119, 351, 63, -123, -38, 218, 141, 135, 312, 95, 298, 283, 96, 94, 149, -107, -159, -29, 33, 209, -29, 45, 184, 53, 54, 40, 103, 124, -101, -63, 55, -265, 162, -63, -246, -85, -404, -242, 22, -196, 288, -183, -51, -45, -123, 21, -81, -156, 136, -472, 64, -83, -252, -272, -25, -138, -144, 140, 94, -139, -51, 222, -295, 137, 225, 140, 74, -47, 46, -170, 39, 65, 185, 180, 19, 163, 101, 256, 315, -249, 18, 531, 6, 275, -1]
3527aJ32Q3j55L15l13p5j7L0K39k00J86k14J41o2n3l12K71K05j92J44j64O4K0
3550G2j90J94n60M77J6k77J59l3p5J28j24K04q0n5N7k85O29n55K14m8P7R9j12
3573f8L9R9j83l5M1J66J35k54J6L5j25K92m48L53r6J31O6k08J17J00j19J29j59
3596B4J8p9L03l17k23L09l5m2J22l09L89J15q3Ko4l09M20k73K80j91oj78R3K49
3620B15l4k29P6J99k12K13n86M61r9k94L92j77k29K98k9K4l3p8L25m50M5K23m0
3643a9Q8l25K37j75o0K77j31K87j44j9qq2L3J59p4K09j96L9P7k92L79k68Q1qn5
3668A0J95j59K6j5L17j07P6K0l56n2M3L1l00L53M6K29j73r1K37j83k69J19k73
3691b76L74j01K38j62p8L08l87J38%J03j67K7j09k54O6L70j61m1R5J06k19m6M
$$ y = [-1, 131, 214, 59, 374, 61, -14, -31, -1, 238, 38, 224, 10, 151, 89, 36, -276, -5, 200, 8, 152, -12, 52, 72, -118, 76, -484, -7, 9, -268, -109, -142, -217, -89, -213, -9, -89, -144, -87, -372, 257, -298, -84, -132, -55, 44, -68, -29, 70, -113, -148, -107, 59, 194, -60, -44, -9, -134, 158, -290, 63, -33, 98, 164, -44, 73, 173, 54, 183, 24, 42, -37, 266, -51, -274, 35, 0, -42, 80, -229, 160, 275, 192, 194, 130, -179, 241, -32, 248, 57, 51, -127, -34, 215, 181, -48, 28, 227, 15, 228, -358, 103, 4, -290, 102, -75, -304, -6, -35, -11, -44, -122, 203, -247, -202, 21, -19, 69, -256, -19, -194, -254, 23, -108, 179, 35, 16, 8, -74, -41, 118, 44, 253, 57, 96, 173, -119, 260, -8, 73, 65, 10, 205, 46, 72, 57, 374, 267, 343, 363, 7, -45, -2, 29, -271, 82, 128, 357, 184, 93, 330, 147, -122, -3, -276, 98, -3, 235, 73, -5, 303, -84, 54, 54, 157, -10, 17, -92, -346, -280, 90, -71, -112, -17, 89, -130, -176, -172]
3714a72J75k72O3K08j34N6j07j11K13l3M2k03M8K92k11m7J12M7k2J01j9j64K78
3737A40N3j12J29m4k82K42K7k8o7p8J7j51L48j84n8K39O4L9m7K03m35J29j26q4
3761f6J16j46K11l01K86j36O9j29N6l8m7J99K5k88J48NNJ77l28K55j23j58J66
3784d2j61J74J0j19j0PRM55n51K91m4j10mL6l13N16O7j52j6J41j33l2j27J51O1
3809A04n4p8L65l7j95j08O8K1l9J15k44J58N8k49K91j92Q2r4Q3O4j11N9J33J51
3833C51n06K72j71M8j41J37J32m25K09J99r8K9j42J03NJ94o2q4J0j86j96K41J46
3856F5k41K8L7J93Nj57r9oP0q9J52L8K4q2N8kk1M0j11J57l35K35k2l6J3K84k57
3883e9k49K77o5K36j08L7k32L60j44j30m1L24l61L61m20L78O2j84J4k49J01L79
$$ y = [-172, 3, -269, -206, 2, -132, -76, -183, -294, -81, -114, -72, -275, -227, 65, -146, -193, -81, -34, -56, 45, 26, -138, 140, 193, 81, 210, 166, -116, 126, 153, 125, 58, -20, -3, -154, 194, 10, -48, 191, 255, 294, 247, 450, 15, 144, 18, -66, 50, -96, 115, -186, 100, -36, 33, -96, -40, -78, -125, 74, 99, -189, -41, -36, -31, 146, -182, 73, -50, -208, -42, -203, -29, -19, -138, -148, -141, -132, 323, -228, 63, 19, -91, -95, -59, -372, 144, 211, 59, 43, 184, 51, 19, -108, 43, 104, 50, -28, 337, 300, 105, -3, 65, 86, 47, 162, -82, 76, 134, -115, 176, -16, 66, -28, 55, 119, 8, 67, 200, 351, -155, 117, -54, -6, -147, -10, 122, -303, -94, 105, 7, 36, -106, -3, 2, 196, 134, 50, 60, -126, -322, -81, 65, -176, -148, -111, 82, 87, -70, -169, -175, -105, -194, -42, -4, 20, -62, -4, -6, -27, 13, -98, 59, -276, -41, -63, -99, -86, 198, -59, -308, -31, -96, 140, 32, 69, -163, 197, 53, -77, -118, 206, -155, 206, -214, 164, 226, 42, 56, -193, -92, 287]
3905B87m54L96j21K4j79J04J9K29k91Kj0q6J47k52J47J27r8N7j26j50J52L19k04
3928C9N0k02m5K04j52L45K2m44L07k13J99k92J45l8n5M5O1N1J67k12j74M15q3
3951A40l35M6j3L20k10P2N0j68r4J94L2O6k87J45K80j04k45J08J3m7J98P8j58
3974H1p4M3Q0l3J30q3j52pJ06j33J50J04k72J62N6p8J28l1Q0l85L7K08k96L93
3998B14j75n31M18R7R5k52J07J73j49Pk13J05k1K4j9Q9j48J57o6J23J18j00r0
4021c7j73L32o0k6m7J2j41L5J93j73J14r4K3P8j57K14j64J52J16m4L6K3K1k65
4045c2k25L86j59J35J36k63no3J78M8l12K33j62K05n5J9J71j80m8o2N8o0j19M68
4069B92k89J63Jk11J9j71j6l6J08J34kQJ51k94NN7j34L05k18%J18O5j14O9N7J15
$$ y = [287, -167, 229, 108, 132, -47, 57, 76, 305, 14, 16, 6, -80, 67, -185, -38, 89, -9, 48, -78, -228, -76, 243, 39, 89, -113, -158, 46, -106, 239, 261, -183, 124, -89, 110, -182, -37, -75, -130, -85, -24, 27, 194, -18, -192, 223, 140, -195, -149, -162, 158, -52, 20, 70, -98, -192, 2, 34, 100, -187, -42, 238, 134, -111, -3, 10, -37, 161, 239, 81, 7, 50, 130, 97, 227, 144, -8, -15, 91, -42, 108, 212, -60, 102, 158, 80, 208, 177, 257, -128, -91, 117, -179, 214, 39, -492, -74, 23, 118, -134, -27, 146, -3, 4, -209, -104, -125, -101, -120, -31, -179, -22, -88, 35, 153, 53, -37, -210, 122, 62, 36, -11, 1, -140, -105, 88, -85, 29, -65, -42, 36, -121, 93, -71, 81, 197, 153, 189, 212, 233, -32, -257, 129, -30, 105, 241, -22, -27, -90, 88, 136, -176, 57, -105, 100, 45, 64, 235, 55, 7, -55, 3, -57, -176, 292, 3, 166, 167, -44, -25, -196, -212, -248, -140, -6, -8, 0, 151, -143, -138, -81, -215, 90, -128, -128, -10, 55, -59, 10, 67, 182]
4095A82k12L4j11j8K51j29l4K65k20qr4m6J05J15q0J23L1O4j99Q2M7M3N3k48r4
4120i8J32k7N9P1j98K70k95Q9O6o8L3J24k2q0N9K2Q0j81m6k53K33L1k05N99l76
4145A9J27k51j79L71j35L47n58K06J31l25P3J7J74q5J70k65J94k0p4k10m6L40
4167B1J07k70K37j25J24j05P7k62K88K0l60L37j11L5j70K39j7j10J3K00j01R5
4189A62P4j69P8j62M8j0K4O0p2J00K0j5j32K26l50Q4R5Nl1p5O4o1%l0M2J1r1j
4217a06J75j5r2r7J07q9m3p2K85q8r6j13J47j2J61j10k3L8K3j19O3j0lJ75j96
4242a10j06J64Q6j45j81J83K10q6j02k39K60jJ40Rk2J85m40k2L30k30O7K60k11
4265aJ65j84K2K20p3r9j24q2Q5k2J38O1pm1k3k05j2K6m4o9L04r3J59j67Q6K69
$$ y = [182, -30, 4, -107, -125, 126, -3, -37, 228, 8, 0, -94, -140, -35, 80, 0, 123, 154, 218, 19, 101, 148, 191, 244, -4, -98, 34, 7, 66, 137, -61, 209, -86, 3, 69, 1, 34, 158, 136, 56, 115, 137, 217, 36, -10, -263, -30, 1, -204, 395, 19, 146, -105, -284, 87, -48, 299, -259, -53, 78, -247, -174, -157, 17, -68, 102, -163, 31, 11, -63, -273, -319, 21, 128, -142, 95, -30, 94, -11, 66, -196, 92, 112, -248, 89, -22, 13, -157, 82, 65, -45, -32, 168, 67, 162, 236, 67, 145, -17, 31, 21, 45, 105, 33, 133, 153, 138, 6, 232, -118, -34, 61, 66, 35, -40, 24, -37, -37, -67, -25, -14, -105, -106, 69, 54, -38, -135, -28, -117, -160, -232, 53, -35, -131, -244, -97, -109, 52, -58, -81, -43, -20, -139, -76, -86, -89, 86, -110, -216, -52, 34, -111, -292, -109, 101, 15, -87, -326, -66, -67, 73, 82, 60, 245, -195, -217, 113, -117, -50, 210, -1, 164, -20, 2, 222, 149, 50, -74, -156, -71, -93, 45, 106, 99, 58, 35, -170, -182, -156, -200, -269, 35, -58, 101, -66, 20, 289]
4291B89l50K3Q1J10j19M2p5r9J45k1L1jJ09j83J13o6K3j33r4J61J21m53L93N8
4315A05j67km0j57N0j9J56K39l76J28j53L50l01K81p5q2n5J65J04k52J16L0j79
4338a34L60o6k11L0J14qkP8l45M40k78K93k07k7L15m05J51j33p7K27o0J46j98
4361Cl8O0J26l52L28j76Q5j16P3P6m32L27QL6M9O7n3j22R2j14Q5N3l4o4K85k88
4387c6j7j96L2Q6J50m5l4j79N3J50M1P4j12l3Q6r7L54m93J65J45j59J56J85k87
4411a1j72M39O0j97l65J29J97l0L31l76P2J10k51P8J17l1r2K88l07J09L6n5O8
4434A47j24K08j16j1l70L71k68R8j62K35J38j74j18J78j00Nj2Oj6k7k6L05k2k32
4458h7L8k9J90L4j21j37o5J82j91J99N7l68J35m7k7L35Q3l86L43k7l93J72J89
$$ y = [289, -61, -38, 43, 153, 34, 76, 1, -98, 47, 26, 57, 56, 165, -18, 95, 29, 52, -81, -175, -14, 107, -346, 47, 105, -62, -64, -104, -261, -211, -230, -74, 165, -211, -83, -236, 114, -187, 94, 19, -63, -118, 47, 151, -101, 15, 45, -134, 226, 160, -51, -21, 93, 85, 83, 161, -184, 256, -22, 271, 64, 37, 352, -53, 98, -35, -112, 115, 55, 201, 3, -35, 25, 151, -201, 127, -49, 36, -80, -7, 69, -363, -36, -28, 8, 57, 124, 71, -51, 41, -73, 12, 65, 31, -33, 252, -36, -53, -249, -217, -131, 19, -26, -60, -239, -186, -36, 5, 79, -33, -66, 20, -77, 277, -216, -51, 94, -65, 91, 276, -11, -183, 256, 316, 119, -246, -117, 80, 50, 381, 5, 77, 187, -64, 14, 131, 100, 8, 296, -11, 98, 134, 79, 147, 23, 231, 115, 104, -266, 105, -163, -65, -227, 8, 146, -28, -146, 32, -68, -63, -75, -69, -85, -112, -138, 167, 145, -87, -49, -78, 112, 146, 25, -112, -177, 5, -186, 13, 70, -298, -163, -210, -237, 98, 181, -205, 138, 111, -282, -110, 79]
4481G9l23K17j36J66J57n5k0o3Q1k12P9K85j10j6N4k87O8PP3O8k61O0K91l59L46
4506A89j70r4K17k54J78n0J83j27O6k29J83l52L15l8J88r1M5q1R3k41j31R9J57
4529E5p1J5n3k41J91k6K52K0k39L1K80l68J03j58M40l83k55K93j5K74n4q1k84
4552b74L05P5K8m28L95l1O2o4k13R8M6o8rJ63J18k23lr0R8kQ5o3J56J56k89k8
4578@J4p7L7K09j22pj45L11l53K57r1J5P6k05r2Q0Q9K1K17j71j15K9J63l48K39
4603C1K1j06L2j21p5K51p2l6pJ44R3p1j26j97K94R1j31l62M39K0J3q9M5j18R8
4628F1P4k95K84j48J64j51j7J69j53M4OJ44J60m66J74N4R0m4k04J45K20o9k17
4651B5J77k59J21J79j02j60K10o5j25j67J29j00K77m40K91j66L33Nj66j34p3J64
$$ y = [79, -244, -27, -163, 3, 160, 105, 85, 22, 103, -109, -30, 255, 145, 129, 183, -104, -36, -29, 44, 112, -149, -89, 202, -157, 189, 19, -75, 142, -112, 66, 16, 199, 72, 138, -91, 92, -260, 55, 17, 205, 114, 159, 78, 171, -70, -201, -102, 55, -16, -1, -54, -295, -104, -130, 122, 142, -97, -66, 214, -154, -51, -209, 231, -152, -407, -114, -129, 145, 91, 10, -274, 31, 106, 134, -294, 101, 70, 132, 68, -145, -47, -1, -69, -78, 85, 203, -20, -23, -113, -15, -17, 68, 5, 161, 317, 28, 0, 14, -63, -26, 183, 61, 54, -91, 220, -133, 124, 33, 48, 124, -81, -173, -93, -4, 17, 234, 63, -52, -23, 140, -208, 31, 52, -54, -22, -143, -218, 33, -39, -75, -82, 62, 155, 84, -42, -239, 55, 146, 15, -347, 92, 112, 125, 36, 81, -37, 61, 135, -160, 124, -24, 140, -11, -28, 141, -12, 32, 38, 182, 342, -124, 50, 104, 194, 150, -54, 91, 311, 242, 25, 202, -57, 64, 243, 141, -19, 191, 126, 1, -166, -37, -137, 140, -300, -9, -175, 158, 163, -3, -137, -210, -46]
4673d6j2k40L24j11J03k63K87k0j2O3m2l8MK1n4o0J48k24K67j25n2Q8k1L5k88
4698b68J59R3o1j16K26q0J29N4j09N8O2k61K57j4o1J6j80J31q5K98j87J20j39
4721D2k32K76M8J34k93M1j42O5J64k33J21m9O7p4P6N8J0j64J99m9j04Q3j93J51
4745Bl2q5J03J58j66rK66l06R6Q0k71K5j20L00l94K14O6k10L81k50Q7r3J43p9
4769i4J71o3L3Jk2k18K08p0J21k14J53N0M6O5k39J9K67k28J65k18Q2K90l31Np9
4794a00P7J00M6l10L09N6k9k07J02j51M13m20N4n7J85q9J8L58m51n5Q2J0K55l17
4818a21j2o5J9K63k38J37o3K31m13K38r1k8m3J34K35n0r9J20j97o8K75k71J64
4841E7L5k41K17j33k5Q7J75om5J42m5l83K5M3J41j00J3R2N9j71J8J60j00l8L83
$$ y = [-46, -58, -298, 26, -85, 18, -245, 42, 22, 10, 73, 31, -7, -3, 18, -36, -96, 52, -172, 95, -30, -82, 6, -15, 20, -268, -109, -16, -77, -193, 33, -47, 82, 136, 27, 85, 147, -114, 143, 129, 68, 84, -96, 35, -50, 248, 61, 181, 42, -190, 86, 134, 268, -25, 16, -126, -61, 103, -130, -9, -58, 9, -65, 11, 69, 79, -85, 114, 65, -39, 44, -149, 2, -30, -115, -12, 146, -20, -29, 237, -69, 27, 107, -164, -139, -259, 41, -353, -139, -73, -283, 98, -152, -65, -158, -15, -94, 77, 14, 47, 48, 26, -192, 16, -54, 67, -147, 6, 56, 102, 167, -72, -53, 214, -14, 151, -67, 15, 305, -26, -21, -100, -23, 77, 123, -187, 122, 178, 149, -58, 44, -107, 306, -114, -60, -117, 68, -21, -3, 355, -96, -151, -69, -59, 196, -121, -133, -198, -179, 84, -154, -17, -80, 151, -262, -24, -115, -143, -186, -52, 183, 133, 34, 154, -43, -111, 164, -107, 57, 92, -149, 68, -65, -90, -3, 172, 166, 121, 263, 218, -165, -140, -97, 44, -56, -43, 49, 108, -63, -45, 115, 15, -23, 360]
4866C60j27j97J35m4k46J21R5k08J08J72k63q9K92r9k17L22k31n6L82l58J40O
4888bk6j3N4Rl4RN3j60q8m8J0K91m7p4Mm2k05M84k31P1L1O7j22k20K92J45p6j27
4916Ej27k95N21p2O7k0j40j18O9K10j89J63K81k73lm1J8o3R2p5J11J58q0q4k92
4941a77J53pJ52m2J02k23P0K9N1J23l04J16J17p8j01O7o4qJ86j12J45j55k27K29
4965D2m9j84K05j80j6L11j65J12j13J32M2k1j24rq8K53j18j88J51j41kj6J70j89
4989a85L27j05k8j35J66J71k08m6R2Q7j42L7r1J81j94R8k47K59N4o8N5p2K02j80
5013B8K69k99M0j27K6K04L8J09l32L09k47R1l69J38J36j90k1K99L2j68N5q0P6
5036A7j35K40k11K64j64O0l22R8l2j3J38J24N9j39j58l5K11L0m3j11K21j75J05
$$ y = [360, 233, 36, 171, 127, -119, 2, 97, -111, -3, 169, -94, -183, 109, 10, -207, 115, -116, -172, 210, -148, -8, -2, -28, -41, 13, 22, -12, -3, 50, -110, -198, -246, -236, 55, 8, -66, -62, -104, -309, 175, -56, 15, 46, 113, -9, -229, 63, 208, 132, 5, -122, -417, 104, 32, 99, 79, -61, -179, -110, 100, -89, 74, 355, 82, 79, 38, 56, -7, 85, 10, 121, 279, 199, 115, -177, -24, -31, 121, 79, 181, -42, 28, 57, 108, 231, -73, 43, 160, 82, -19, 48, -16, -24, 162, 50, 195, 40, -187, 42, -7, -191, 14, -166, -182, 129, -36, 76, -37, 95, 137, 116, -8, -17, -105, 148, 30, -158, -7, -148, -150, -166, 4, -185, 142, 37, 9, -126, 40, 211, 3, -43, 49, 136, -6, 31, -60, 121, -73, 25, -222, 37, 91, 23, 78, 6, 208, 28, 297, -2, 38, -89, -63, 141, 179, 288, -44, 265, 18, 109, -260, -122, 14, -176, -197, 102, 134, -34, 21, -59, 17, -118, 122, -89, 175, 11, 71, -251, -153, -185, -198, -60, 64, 123, -16, -174, -209, 2, 32, -11, -122, 99, -76, 29]
5059B9K09n20L73k33J34J09k63J78l1J54l03J04k33M20j52Q4r0l2k06L40j90o
5081a25J52oR9j17r1QJ89k29L03k65L71l04k8KK17k63K53O3l24K43l60J06j3r2
5105b11L93p9j81L01q8r5q0r5J78l74K55mM04n00J49k8N0J25j77Q9o8k8o9K45
5129A12j86K18k37J40k56K37k0O5j82o7J77j14J68K8l1p4m1K87l25K2K86j31l9
5152C7l56M28k21J78k19K46p5PK35k86J42o4j60O9NM6l9K82j13j04K1K28m29k2
5176a64L45k61N4k2J68k06K84k56J64j4Q2P9k24M0k46K38j22J25k6J84j6k45k4
5199f3RO7N1j32J18k15K14j28n6Q2J6o3J34J34o3p3k92M19k88L60r1q9M4Nk61
5224a61K12O0j42K05j38R3j85ON1j2l4p1R1j61K89M5j76k5J35J08j63Lok31R9
$$ y = [29, 238, -282, 91, -142, -8, 101, -162, 16, -15, 139, -164, -60, -293, 127, -25, 59, -31, -63, -269, 71, -119, -125, 27, 21, 120, 3, -88, -80, 109, -120, 183, -82, 289, -15, -43, -41, 176, -87, 166, 229, -95, 148, -212, -106, -119, -211, 182, 103, -78, 223, 135, 40, -40, -135, 43, -331, -76, -80, 324, -176, -27, -55, -5, 120, -57, 32, -36, -64, -133, 112, -74, 144, -93, 47, -209, 28, 8, 73, -109, -176, 1, -113, 55, 83, 52, -22, -63, 224, -101, -79, 207, 76, 37, -319, 109, -112, 66, -153, 93, 18, 25, 260, -26, 116, 52, -108, -39, -34, 12, -27, 255, 142, 38, 59, 287, -142, -164, 181, -80, -26, -48, 120, -86, 198, -58, 106, 92, 174, 253, 29, 69, -177, 61, -61, 64, 38, 222, 206, -39, -63, -54, 13, 64, -68, 50, -165, 49, -79, -135, -53, -37, -100, 34, 168, 105, 32, -260, 159, -129, 231, 140, 51, 95, 100, -161, 51, 111, -31, 174, 36, 129, -56, -50, 1, -11, -45, -116, -25, -186, 103, 148, -28, -53, 82, 190, 27, 30, 24, -207, -108]
5249a08J19J15j84K64l70J79M6l4j37M6J57p4j40r9L26o6P9k27lk6R7J5J60m9
5273H6J66l66O6j39K38J08m35L85j68j4J63l31J77m5L9O1m1Q6J43n60L17K08o2
5296H2l8L7j06j61K95r4R4j30j37J93n2J41J17k35r9J68J22j45m6q6L1j03Q5k02
5320b69L83j23J35q0M1M9j83J33kK8R2j52O3Q5l98J38J71j66o9J10%q4J10M7j12
5345e3J35o4p1J83l28Q0J47k00K75k5k29K52k20J50j80J73J2k04L18j08l06K65
5367BQ7j92l7K59J45k51l04J43J49J66l88J57J5L25m60J60P5j63J16P6j70J50
5389F0L5j36J71j29K4l11J40J58K13k14o1j01K52k1j29QJ75j83M9L5n9K27k31
5412b8k33M40j43r3o8J99L7j81n1j0K31j05j17j15K19m7L17o8k28K6k88L10J11
$$ y = [-108, 11, 126, -58, 206, -164, 15, 61, 27, -110, -64, 93, 19, -121, -220, 106, 40, 119, -108, -111, -137, -40, -25, 135, 86, 252, -114, -48, -187, 51, 159, -276, 109, -59, -73, 90, -241, -64, -109, -70, -9, -50, 36, 179, -381, -64, 144, 82, 44, 81, -25, -186, 109, 15, 109, -21, -158, 35, -17, 124, 241, 6, -93, 75, 197, 52, 6, -80, -49, -152, -67, -269, 114, -9, 126, 46, 87, 136, -47, 86, 84, 112, 204, 52, 115, 200, -198, -60, 111, -55, -124, -14, -14, -98, 12, 59, -53, 82, 18, -53, 130, -198, -118, 29, -171, 104, 79, -150, 102, -118, 32, -148, 25, 37, -167, 151, 43, -263, 2, 89, -103, -140, 119, 264, 13, -291, -148, 1, 167, -221, -64, -49, 276, -184, -24, 51, -112, 4, 80, -90, 60, 95, -41, 130, 1, 25, -286, -146, 12, 225, 11, -50, -151, 101, 80, -49, -41, 134, -49, 0, 35, -24, 203, -28, -261, 179, 36, -57, -125, 74, 111, -70, -121, -131, 100, -5, -122, -237, -18, -65, 252, 184, -44, -18, -306, 4, 115]
5435A15k16J80p9p9j51J46K57r6R9q6j41j10J07q0q2J34j24K17L00m18J52k79
5457b34K87J23l0q4j83R7l07L90k09J39K60r2Q5j72k11K21L1j31J79m08L16m4
5479B3J94j5j80q3P2J4k71J48J97k57O0J82q2l9j0J57n5nn8oQ6j06qJ14k74M01
5505A99o5k85K02j25L3Ok16L65l66L20K4m17Q7O0J9L37j70j06J75q4J22k09j09
5528b03K78j53J3q8L88O0k69r9O6p2j8J24Q9Q1Kj19O3Nj08j90K50O3j55J7p8M3
5554a0j68K03j85P2J74j4K1k23J07Q6l9R3r0p3K95j57o7J53k61J04J6n8K1j47
5578a47JP8K42n2J08l29k6K62j97M3K70j80l7m3O9m0l1R6j08n0K19o5p0k24K5
5603a86J29p0J56j81K09L4m12K37L35m24M5L0%j16O7k0K07j12j84J30L3R3R6k07
$$ y = [115, -101, 79, 0, -79, -230, -84, 173, 77, 176, 90, -51, -161, -54, -134, -216, -82, -206, 11, 311, -107, 45, -234, 53, 176, 146, 62, -121, -24, -331, 59, -150, -11, 249, 157, 242, 70, -141, 80, 111, -20, 159, -249, 67, 23, 217, 202, 22, -61, 11, 25, -246, -98, 99, -158, -98, 84, 2, -37, -47, 110, 55, 50, -8, -14, 72, -34, -42, 72, -202, 199, 134, -151, 51, -74, -41, -35, -251, 114, -252, 68, 92, -325, -238, -178, -159, 178, 8, -98, 77, -7, 115, -94, -203, 75, -78, -65, -153, 235, 295, 26, -73, -7, -79, -97, 27, 116, 197, 199, 80, 143, 148, 40, -150, 100, 163, 8, 25, -53, -10, -178, 25, -160, -88, 86, 72, 93, -130, -23, 63, 24, 117, 27, -46, 249, 92, 25, 178, -83, 21, 37, -21, 0, -147, -146, -68, 174, 122, 230, -99, -125, 137, -60, -17, 253, 73, 36, -7, 62, 22, -9, 87, -21, -71, 148, 83, 13, -211, -186, -57, -127, 29, -152, 57, 91, -321, -84, 251, -173, -128, -98, -98, -214, -147, -167, 40, -72, -256, -126, -93, 0, 96, -111]
5627a11J21K06k95J54k0n3n5KOK4o3K01l12L56l14K08j46l9J96k13J19N0q6n3
5651a17J58O7m3j19J12j51N8n2R1J9J84j99j82n6K64O0l2k8j58LJ82p0K43j89
5675D5j38j28L70k23K5j26J13J85n3k1o4K0j5j44L25q9Q1m7j80O2R6l2J63j83
5699D2K9n3j28K75Qj07j88J36J62l47K33L2k28J32m5N3K79m27Q7k47L64k43K64
5722H3r7M5R0j33J58m47M19l99K20j13K5L33j94L9P0J77l65M8j4J0K8o4k8K24
5746A15k05K1R8O7%j1q6J08j76o1K68o4j60K21l31L24j04K65j30j36J65j86k0
5769a8J3N5k70K54q2J54j37j25J81o0k77L49j36K14j85q5K01MJ21j82m1J33j41
5792f0OJ81k92K71o2L13m76R0k8k4J08R9q6l00L75k00K5J93j32K8m31K84ko7K88
$$ y = [-111, 10, 216, -79, 75, 55, 2, -53, -51, -45, -21, -84, 117, -195, 161, -153, 55, -91, -130, 66, -147, -28, 22, -64, -117, 41, 108, 65, -54, 58, -93, -35, -87, 4, 23, 207, 8, -174, -230, 34, 94, 62, 34, -124, -121, 61, -9, 234, 45, -93, -221, 149, -74, -49, -175, -62, 123, 70, 49, -15, 5, -10, -154, 171, 82, 163, 116, -64, -2, 94, 62, 225, 42, 71, 18, -110, 165, 173, 66, -122, 14, 176, -171, 62, 94, -134, -2, -47, 6, 285, -142, -55, -302, 62, -181, 83, -14, 31, 121, -12, 146, -301, 118, -281, -61, -174, -149, 184, -10, 29, 99, 276, -89, -41, -55, -45, -17, -81, -109, 115, -90, -69, 29, 96, 96, 85, -1, 107, -69, -130, 138, 74, -86, 135, -196, 128, 24, 289, 159, 23, 188, 2, -18, -5, 50, -220, 34, -48, 106, -31, -156, 25, -35, -312, 37, -99, 115, -70, -155, 46, 50, 171, -11, -52, 81, -60, -54, 127, -165, 106, 44, 357, -119, -29, -57, -81, 27, 126, 40, -260, 115, -85, -60, 133, 1, 29, -402, -118, -120, -187, 101]
5817A01j16j29J94j4j02M5J12r2J03j69p9QJ15R3q0j11M2k65L22n1l0L19M4l12
5841e2K73j99R9J29l99K18k52J17J57k83QQ9K49l8k25K10j73l5J05N1p6l01M61
5864A33j98L5j11k27K22J98k4J15j72r8n3O2J67J91j32j33K9j56K88k47K67ll03
5887a50oJ43J42n2j82J12k56L47j8j02Pp8K06Q3o6j09r2J2J13k0Np8L3j2Q3k45
5913a80Q9RL8j8j26L15m50L90Q5p0o5L3k78J69K19j78J14k84R6j5J99RM9j02j73
5938a25rJ56J32O3Nl93J67j95J37n3L46n49K36J76k87K46J4L04n06K59l64J90
5960e0J04rM4k19L52l86k24L46R2m18L72j19L36l71P2J56l22J76LJ07j86K53m6
5983F3KN7pj01n9J65K8j56k11K75k39K03K19k26J30m22N05k19L16k72j16K33j45
$$ y = [101, -15, -144, 50, 36, -66, -21, 91, -1, 102, -67, -146, -138, -23, 70, -10, -121, -79, -344, -22, -73, -103, 216, 260, -52, 221, 22, 121, 250, -149, 69, -183, -66, 91, -192, -184, -95, 154, 116, -109, 101, -72, -107, -2, 49, -27, -328, 133, -65, -30, -141, -368, -146, 52, 28, 143, -29, -127, -180, -118, 49, 240, 108, -25, 4, -152, 136, -111, 156, 153, -150, -156, -13, 129, 77, -105, 7, -249, 98, 80, -22, -15, -93, 113, 196, 130, 21, -71, -59, 54, 34, 39, -39, -6, -18, 65, -180, -91, -82, -44, -62, -188, 127, -323, 67, 152, 82, 17, 50, -228, -59, 160, -18, 96, -188, -92, -107, 92, 101, 150, 48, -125, -134, 22, 154, 217, 222, -171, -4, -199, -62, -115, 231, -318, -82, 94, -193, 53, 67, 371, -135, 124, -240, -50, 54, 45, 89, -130, 222, -164, -388, -42, 50, -368, 4, -115, 221, -150, -78, 78, -244, -68, -65, 42, -144, 109, 63, 65, 122, 115, 14, -45, 120, 148, -8, -219, 56, -183, 20, 239, 13, 143, -279, 226, 7, 323, 51, -65, 168, 23]
6006B3j41l2O2k5n1K9L05j49K8N9K35m14L9r5nN9p9J10q3K00j43j12J22J45k9
6031E8j43J25J53p6k32K15k00Q2J7P8l19oK51n5k80K31J11j24N4K21k84J49kJ4
6055C8j91l0L52k66L05l2K4j80N2j0p5j63K93k7k70J99M7Oj6m4P6k9M5k18O0J72
6081A18J69j03q6l34J60P4r9J57j48R3j10J62M0k03P4j4o5J0k0J64n3j86o4K95
6105C1q8L39k35J3n7j69K56j88Pj08K54n3j05P9j6J72k22J26j26J39k00L32k13
6128c2K31Kl22J62O2R3k85J09M3J51k16n3q8O25n91J30jM7j13K11ok06%J11k62
6153a98J59j5P2n2k62M74p6K46n79K58Q1l35N29l32R9r6M07l69k22n0k3K97j17
6176a04n5K72k67M49l19j47K57k13K12l3j91J67K49j41l7l95L93l20J90J22n5
$$ y = [23, -118, -150, -88, -113, -164, -135, 170, 21, 49, 108, 343, -71, -32, -127, -132, -73, -152, -42, -125, 75, -68, -180, -58, 87, 58, -85, 40, 193, 117, -115, 100, -100, -18, -1, 77, -242, -248, 3, -52, -332, -101, 10, -114, -60, 161, -123, 26, 24, 38, -153, -183, 169, -97, 208, 176, 200, 20, 72, 62, -13, -176, 117, 90, -180, 19, 66, 72, 56, 12, 88, 59, 104, -114, -54, 118, 287, 184, 98, -236, -76, -2, -101, 56, -92, 1, -109, 53, 93, -110, -36, -50, -115, -105, -125, 39, -14, -200, -264, 31, -57, 282, 47, 60, 3, -166, 90, -98, -91, -199, 55, 2, -103, -24, -40, 132, -90, 36, -90, 49, -151, 181, -32, 199, 201, -121, 41, 103, 196, -89, 20, 63, 214, -2, -55, -143, 482, -109, 21, 20, 67, -46, 165, 159, -47, -47, 64, -198, -39, -54, 18, -34, -296, 178, 102, 348, -231, 27, 108, -227, 302, -30, 69, -27, 380, 11, -211, -261, -284, 13, -104, -159, 113, -154, 295, -24, -171, 86, -127, 85, 52, -139, 28, 277, 136, 99, -296, 97, -223, -33, 89, 34]
6197C4N9j63K24j98K4j61O1M5j9Q4M1LM5K3K1j78K5k63J2M23j86K33j80J4J52
6222A75m1q4p6R3j16R7q1j0lK9j12J10j08J42J15pj64J36l36O8Q6m5j4K11j09
6247d4j02L08j76Ml2n3n6M35k31k0r7j1Mp4L38j23j76J44k78J50K5M1J64k52L4
6272g8J94J9j38Q6p0j32J13J06O5q1j52M9k2K42l20J64K0j57J81R5l94L18L9j14
6296C3J08q3j9k1M16l02p9k05K9k2J23J85j64l01M45n7j22R5q0n5P0j44M23l59
6320h6J20j46J66M2k6j65m6K67q9L4o7Mk25K95j4j7R9m48M46j10j34J50k13L05
6344A42l36K93j29P5k06K02r3K08j08p9O2q7K02Mj94j34Q9M7L23k19j1j43N8J26
6368I2j46K18k18J01j73Q9k8m3K22j58j24J87j06N3j55J42J34j51J2j2o3k9J13
$$ y = [34, 93, -70, 154, -44, -20, -181, -120, -75, -94, -10, 31, 34, 79, 102, 123, -55, -30, -293, -281, 142, -44, 189, 9, 23, 175, 134, 50, -26, 67, -49, 48, -33, -43, -46, -17, -129, -19, -127, 15, 130, 123, -41, 95, -241, -173, -87, -132, -146, 65, -44, -146, 162, -14, -10, -42, -95, -151, 284, 53, 33, -64, -75, -71, -145, 193, 70, -106, 38, -240, -90, -65, -24, 140, -112, -78, 116, 135, -3, 83, 13, -119, -6, 100, 165, 84, -68, -19, -41, 201, -119, 45, 65, -92, 89, 184, -210, 108, 147, 33, 141, 58, 39, 18, 434, 132, 53, -152, -123, -145, -22, 163, -1, -302, 143, 86, -36, 59, -21, -76, -6, -150, 273, -86, 34, -112, 54, 96, 70, -95, -141, 126, 37, 71, 4, 8, -217, 78, 64, 47, 146, -302, 144, 34, -100, 50, -163, 142, -194, 99, -30, 45, -161, 41, -52, 156, 48, -31, 31, -56, 146, 150, -44, -178, -89, -42, 281, 62, 51, -92, -34, 92, -54, 164, -54, 47, -126, -37, -65, -108, 114, -44, -168, 19, -87, -34, -189, -47, 87, -64, -52, -64, -127, -156, -43]
6391d3oJ03N7l60L06l1o7K36k11k84M5K07K2M1j88K71j10K75l23K9m9L81k93J1
6415A9j90J23o6K14k6k91M32j05j61J14Pj38J49k40k4K03Q8q2K0%q5o9O5j01K56
6440A12jq3p4n8j8j1K91k98l0j7K86o7J9l8k1m1N2O4j52K05j65Q1j86L13k26J16
6466E3n3J55k15N4p8L03k36j01K74O8k94N0P3j95K90m09J92jlo9Q1J27L3j65Q9
6491B3J50kk16j96K45q7J39j65M55k59j10J8J38l27J32k0J08j34K40K2j67L5l9
6514a7j50K76j30K3J0K0j13K35r2m26L37m4J61J18k76N3R4m26L85k14J91M5k05
6537a45J74kL8j74K11j50m4J25rK2J70k25q7K83r1j20j88O6K24J26j56j06l5J77
6561H4m1m7J59j47J59j21p0O1k3r8J93p3P9M3j08j18K22j59n7j8J23J71l77R1
$$ y = [-43, -49, 54, 111, -249, 57, 26, -41, 195, -16, -300, -255, -48, -26, 15, -173, 98, -12, 263, -60, -31, -80, 301, 8, 19, -171, -48, -114, 100, 74, -217, 215, 110, -51, 63, 70, -68, 81, -159, -183, 20, 108, 26, 46, 46, -39, -108, -43, -144, 112, 111, 28, -46, -104, -122, -133, 158, -140, -170, -187, 99, 32, 51, 13, -8, -49, 3, 67, -85, 120, -45, 36, -150, 163, -63, 53, 0, 155, -60, -6, -84, 219, -17, -118, 156, 224, -70, -20, 53, -142, 148, -261, -69, -70, -73, -142, -61, 66, 99, -66, 23, 173, 171, -45, -241, 4, -83, 56, -109, 346, 87, -23, -5, 133, -194, -62, -82, 26, -108, 132, 154, -13, 22, -17, -167, 109, -21, 2, 12, 32, -81, 154, 62, -364, -27, -71, 90, 208, -68, -15, 79, -347, 38, -176, 15, 60, -145, 29, 27, 65, -109, 102, -48, -92, 33, 24, 46, 216, -9, -96, 187, 96, -24, -212, -146, 78, 204, 48, -58, -93, 84, 43, -4, 155, 8, 167, 46, -24, 37, 14, -84, 109, 36, 115, 158, 50, -68, 154, -5, -62, -80, 43, 214, -163, -72]
6585g2Q6j54J79K03k31m6R1K4q3j39K07q1j57K59m6k17o1L17j05K15m7M0k59k43
6609c20O65n91R1R7k2j0mJ56J49j81J02j97J21j8J71j01j7M0j23J45n5j01m6Q3
6633C4J59k32K0p3P3j74J22o7J87M1k73J99j33L8J43J63k02r2M2j49Q9J58P9k52
6657a00O1j74M31k59K08k22k09L66K8j83L4oJ18R0k41J98k92KR7K01k33j7N38
6680D36m20o9K40j64k12K18J20l68N29k19J78p4j40K1J34j28o3L8R0j36l32L35
6702A4j97L46k15J2P2nM8J03j35J16l60J60M6q7M8j01r3K25Q5Nq3QJ23m4O6m3
6728A14k32J1R0p7N2J90k42N9n1R1K70l29MJ26o6m7j12K70j52N40m07Lj01mJ16
6753A16j54kK86j09n3j29P3l21M10m28K95K80m60Q7lK11j25P4J02j29J8O5K48
$$ y = [-72, 14, -140, 39, 242, 11, -35, 56, 80, -3, -142, 65, -16, -173, 86, 40, -177, -238, 79, -26, 189, 142, 182, -77, -320, 345, -246, -155, -58, -80, -90, -94, 62, 211, 30, 132, -65, 56, 38, 209, 108, 91, 131, 8, 153, 98, -3, -49, 34, 193, -39, -19, -92, -19, -193, -71, -138, 49, 90, -183, 16, -117, -79, 64, 227, 25, -67, -25, -174, -85, 73, 152, -100, -39, -213, 218, -41, 167, -55, -264, 102, 130, -53, -19, -25, 93, 183, -58, 140, -152, -150, -53, 148, -85, -102, 436, 16, -53, 187, 23, -189, 29, 149, -219, 310, 91, 269, 195, 55, 76, 210, 82, 19, 57, 147, 11, -321, 14, -183, 163, -52, -40, 32, 27, 75, 178, 43, 159, -201, -41, 5, -82, -34, -135, -228, -3, 82, 87, 4, 12, 135, 91, 157, 114, -118, -107, -17, -94, -42, 148, -94, -35, -86, 5, 275, -54, -50, 76, 10, -37, -149, 121, -31, 509, 102, 105, 4, 0, 116, -38, -40, 246, 137, 84, -45, 28, -293, 117, -311, -16, 264, -196, -109, -112, 99, -26, 48, 150, 21, 39, 104, 352]
6776C52n53J53J85k33L99l93L03k95J64N7j31K0k15R8K9k1n0L04j19j20L6j0n6
6799i6m3Q7P9K8l9j73J18q8O0Q2R2j0k12J15m6J37P9j99m8N2r9j10P9j10K84o9
6825e0L3q9P4n2o9jK74l04L53j22M3k0j79k9J60J32q5l5p4p4J78q6k5p3J29O1
6851G0l92K12K88j10M2q3p8P5kJ20k60j12L02J6Pk7k66L90Jj99p2K6j43K51k46
6876a90J36K4o6j66K69o4R0K08j67p5j98K94P4L4m4j76jK4r5J75l8o9j67j17N05
6901B00P4k52J84n8l87L31j27P2j50K05P3j50R8k84J78J15j55j72K83j25O4n8
6923d1L24q5j02j30K4J9K0NJ27j24J51l19NQ3K17n7k30K68k33K39k25J7N2j9P7
6948F3Mj08L9J86k7j42k46K09J10J17k30r4J57M6l00K80p6m3L44l36K81j09k58
$$ y = [352, -201, -48, 137, -96, 303, -90, 213, -82, 82, 139, 8, 28, -187, -89, -60, -81, -131, 173, 54, -66, -30, -40, -96, -139, -52, 27, 55, 16, -157, -39, -127, -67, 15, 107, 97, -115, 0, -46, 91, 170, -29, -77, -25, -124, -234, -155, -265, 19, -50, -17, -106, -32, -84, -153, -154, 120, -184, 169, 47, 90, 70, -109, -138, 22, 154, 69, 34, -40, -114, 64, -22, -47, -120, 9, 70, -322, -110, 178, 68, 110, 27, -51, 24, 22, 142, -118, -230, 72, 88, 95, 68, -198, 192, 193, -6, -78, -52, -195, 56, -190, -54, -30, -96, -262, 7, -57, 33, 241, 74, -1, -199, 95, 169, 203, 159, -17, -18, 6, -89, 86, 48, -21, -188, -305, 200, 274, 22, 206, 148, -239, 92, -35, 37, -113, 92, 165, 15, 113, -171, 7, 122, -33, -205, 78, -47, 17, -41, 283, 198, 96, -34, -10, 9, 29, 34, 161, 37, 188, -131, -126, -43, 174, 117, -113, 155, -78, 161, -64, -47, 5, -14, 63, 67, -41, -2, 184, 157, 15, -231, -22, 88, 205, -25, -119, 38, 84, -216, 64, -12, -55, 289, -47, 234, 125, -133]
6971a33L48m02L51J27j11O7j75k69L22M1j03O9o9k30R0K10p2k33J76q2l9qK57
6994A32j42J9j2kJ26j85nj01m6J96q3J12K40k16q9q4N5j98O7Q0K5L9J67J35j96
7019C4k4r9N4J18J62m74P27l18k08O5O7k39J11J97m4m3j32N2L5k49J49P7J12k6
7043A04k58O7P4N7O2j72l09L13N9L1j55K21r1m4k13M21q2j12J68p2p1p7mr8L88
7068B07k78J50j27K31l89L45Rk6l33L57j75j09J65p3J31Q4j27N2P1k35L50k48
7090C2O9n5k35J39L10k27j1r9J28l3l2Ll8k8N9j4rJ13j10J58QNm7l4k3l0J94k68
7118g5J88q3P7j65J72l24K78p9O2K3r7j31L01Oj40K3Ln5J68j90L4R4j43l6K04
7143A15l22K18l3j24J85L9Q5k83K45q3p1L1l2r8J53k85M25l55kL05k10j90K17
$$ y = [-133, 215, -187, 164, 291, 180, 247, 72, -197, 125, 166, 63, 132, 63, -167, -77, 133, 61, -172, 4, -78, -117, -125, 132, -10, 9, -3, -5, 121, -64, -69, -170, -216, -20, -103, 9, 249, 33, -56, -140, -85, -283, -216, -136, -111, -72, 95, 230, 34, 10, -89, -35, 83, 245, -229, 498, 180, -28, 37, 104, -135, -24, 173, 129, 86, -46, 6, 41, -208, -59, 18, 130, 104, -154, -87, -13, 44, 106, -66, -375, -62, -3, 28, -127, 94, 3, -41, -254, 167, 85, -27, 141, 69, -2, -79, -83, -181, 207, -71, 79, -48, 183, -206, 139, 148, 122, -211, 146, -29, -138, 27, -46, 85, 169, 42, 94, 165, -70, 280, 32, 101, 46, -189, -50, 260, 33, 22, -77, 51, 18, -14, -11, -49, -77, -18, -32, -41, 72, -38, 120, 128, 133, 86, 52, 29, -1, 193, -75, 113, 30, 107, -58, 114, -210, 68, -11, 51, 74, -23, -154, 147, 153, 13, 36, 39, -16, 152, -38, -4, 90, -53, -89, 115, -207, 11, -22, -146, 39, 78, 163, -120, 125, 42, -29, 2, -30, -128, 25, -260, 165, -190, -192, 113, -97, -287, -70]
7166g0K03nj40n6K88j52MJ79r0k71L53m37K02J85j67J12j77q5M0q8J09q5J43L7
7190C2q9j32K51j42R3J2J20q2k57J64J49j4j66J89N6k70Q4j04K9K05Kj83N4K51
7214B52l59L3KK34J1l85p6M0L26k18L68k79J5J03J5j25J88J2J29k63j60K06j63
7237i4J19L8j69J26J12k13J63j65Po0M02m59L16m2Pq7k03K23q7P9M7j56K08j85
7261g3R8j9jn6j96L13j06q3o9K28o7o9J49l13K43J11j56j25J54M4N9J00qj72J4
7286@J02r8j32K76j03K47m65K37P7k86M8K51l50K18O7j22qj01M03l13L2j43J79
7309A6q3J40j44j41J68r3K00j68j08L01l3p2k5J29j17m2PJ87rk2o9j56L53J2m14
7334a83k6K84p5n3o6n2J95J03k27J11J79j66l5K6j01r6P7n1QN1J74J81l59J75
$$ y = [-70, 133, 128, -12, -68, 220, 68, 72, 251, 161, -110, 243, -194, 8, 193, 26, 138, -39, -124, -84, -172, -63, -148, -5, 32, -57, -189, 62, -80, 13, 25, 145, 63, -194, -30, 119, 105, -61, 128, 184, -86, -2, -106, -77, 128, 130, -53, 1, 252, -107, -74, -72, 162, 173, -212, -288, -248, 78, -140, 228, -51, -36, 67, 82, -43, 145, 157, 286, 23, -137, 69, -94, 25, 63, -106, 20, 132, -81, 82, -83, -76, -136, 266, -193, 123, 81, 88, 1, -202, 21, -66, 13, 60, -96, 112, -73, 25, 6, 5, -51, -247, 66, -40, -123, -192, 36, -31, -100, 49, -264, -21, 90, -66, -191, -37, 7, 66, 166, 158, -14, 0, 102, 4, -128, 148, 45, 292, -173, 64, 141, -145, -97, 154, -196, 22, 89, -33, -41, -142, 261, -52, -20, -163, 16, -67, 73, -71, -212, -44, -137, 63, -105, -213, 88, 55, -17, -42, 87, -30, -72, -65, 122, 113, 91, 22, -134, 219, 231, -183, -209, 75, 0, -53, -119, -171, 24, 127, -100, 11, 190, 24, -11, 15, -86, -182, -105, -156, -148, -97, 77, 258, -101, 74]
7358G4J48J07j64k23K08O5l27R6N0Q4O7k45j4n1Q5k2p6J76J3mJ13M8k88O7l0j57
7384b00J6M29l23k2j5K62k35N0m3j65J77n1M0L2R4l5j33L37j16K8j1o5o4kj39
7409a54L35q1j75Q3n6o2J43J21P5r2l59K00M1j2R3p2j86K88k33mN0K43l25K69
7433A30m2k45j08K30m9J44j40k3N3Pq8K63j76k19M0N03k08j10O3k28J75O6j19
7456h1K99k81J63j2N2k85J95K00k63kO0J75k74M9k9J91k56J17J0J36k53O4j50
7479a75M39k98K84m48j2L34j93O2K26k38p7J34P6o1m7j32k4p5L11j96K28m12K59
7502c5jj19P77p24K16l13M70l70J33n9L72m18m7L95k35j07K59J6m38K86jj56J71
7525G2p1K85k87Qm9J89J5l14J35J85j81J83l09K72k27J84O0no5n6P1k57J81j26
$$ y = [74, 222, 329, 165, -58, 150, 215, -112, -16, 34, 118, 185, -60, -74, -125, -40, -62, -138, 38, 51, 47, 160, 208, -80, -13, -43, -200, -184, 245, -78, -100, -115, 147, -88, -38, -81, -246, -69, -120, -80, -48, 46, 11, -122, 215, 99, 127, 116, 51, -13, -15, -154, 181, 100, -75, 8, -48, -110, 33, 154, 229, 137, -222, -22, 19, 7, 100, 28, -158, 130, -103, -107, -57, 186, -139, 130, 88, -157, -265, -35, -84, 60, -80, -103, -50, -43, -131, 132, -44, -263, -223, 280, 72, -38, 25, -203, -28, 38, -81, 218, -63, 100, 88, 140, -145, 50, 250, -13, -15, 45, 220, -54, -5, -34, 157, -99, 18, 28, 164, -89, -25, -175, 264, -34, 250, -198, -210, 124, -69, -7, 219, -19, -96, 38, 114, 53, 6, -126, -150, -225, 86, -110, 118, -294, -35, -36, -155, 622, -102, 114, -199, 271, -99, 34, -25, 347, -71, -118, 277, 42, -65, 194, 210, -228, 58, 57, -99, 72, 1, 286, -1, 7, -42, 147, 162, -152, -17, 168, -13, 170, -139, 133, -94, 90, 150, 145, 80, 24, 95, -162, 19, -107]
7549a07K36k40M6J97j12N0j33j60K70L1k04N0k4J24k41L44l13L53k81L9J09o7
7571c3L21j90q5K08m45K55j93P2L8J72j54M2J86k89N8J18l1L7j16J76L7k73K02
7594A13m32L85r4K30l27L66o7j19%j27p9J43J2j24J67Mj68J55k73K57j07K51k75
7617a09J69J28nn31M80J6k86K78q6K31k98O0j3Q3j58M1K60j13k74J63P2j74K23
7640A57l40O7K0J17m2j06J46k14K53n0j93PJ15J90j02j38J75N7n7m6J4r4M5K67
7664B48j33l23L67o3k86M14n12L39J60k20j82K91n1pk46J97R3l67L01R9j34K38
7686B23k33k02L90k18R4j17l6O8j36J21J45k33N5J38o6j68K86k16J27Q1p5O2L6
7709A26k97P3J10Q8j46N9K20k48j00m3J98p5O5M7l05J37J04j41r6J88J70n8Q4
$$ y = [-107, 129, -111, -65, 132, 20, 70, -63, -223, 47, 78, -126, -76, -100, 24, -217, 127, -186, 167, -114, -75, 34, -33, 288, 98, 13, 221, -224, 31, -162, -90, -52, 120, -34, 8, 194, -95, -37, 81, 50, 87, -29, 147, 184, -89, 113, -319, 66, -28, 202, -125, 241, 174, 55, 55, -72, -151, -8, 4, -120, 47, 51, -117, 38, -235, 22, -85, 166, -109, 60, 188, 183, -348, 132, 148, -138, 140, 54, 285, -13, 47, 34, 117, -41, 0, 260, 147, -127, 36, 108, -66, 157, -183, -116, -96, 21, -21, -127, 19, -195, 58, 8, -185, -178, -63, 127, 25, -113, 62, 119, 62, 16, 30, -64, -19, 248, 115, -208, 159, 96, -190, 224, -288, 51, 211, -9, -191, 100, 49, 42, -204, -7, 86, -281, 20, 119, -15, 223, -10, -212, 178, -40, 54, -63, -99, -31, -167, -46, 99, -134, -79, 59, -7, -175, 111, -105, 22, 103, 28, 90, 126, -171, -98, 12, 100, -46, 13, 233, -15, -115, -158, 40, -35, 30, 77, -228, -91, 13, -128, -224, -36, 134, 76, 160]
7732A60j34n4R0J8k10J53OP5k43J22J56j26L6j99J17k6o3K66j16j47K02k80L05
7755A08O2j52M0L2r9l5j71K22k7m7R9j05K36k02jl1RP2k1pJ29J48k91l5J17l8
7781A2J16j24k76J91J31o1j76K46k22K7Q3Q3J43j1p9J8q0L3j45M5j84j8J64l6
7805a20J1J79q8J4R9m0Kj92q4L13o5P3j64J02L8j16Q6jJ8k9k40L55oj22m7J5p9
7832h8M7j5Q3j70L00j72J63J06l05J90j91M10l57j16K89j42QR9k28j8J34o4M6
7855Im9l9L9j53L8J39J15j52J2O8j41J38K7j24L0j28J21J61j52n4KP8Q8P1j13
7880C1N3j09Q5j56Oo1K54j18JJ11k32K55l12K51M9l7K06j92P2j48Q7k44K92j60
7904a6l43L90j15n2L44l63K7J18J82j40p6J71r0Ql59L89j5k91K42l15L78j25J49
$$ y = [160, 26, -28, 62, 80, -130, 23, 29, 104, -139, -17, 139, 13, 49, -150, -33, -59, -122, 144, 28, -119, 83, -197, 108, 170, 18, 58, 90, -9, -44, -215, 7, -20, -67, 32, -73, 163, -39, -40, -71, -62, 10, -11, -18, 111, 259, -32, -67, 50, 12, 128, 4, -272, -81, 50, -11, -187, 59, -163, -136, -53, 30, 173, 162, 83, 101, 21, 54, -91, -46, -230, -248, -84, -120, -109, 70, -18, -4, 95, 55, 57, -135, -219, 94, 29, 102, -62, 40, 78, -38, 48, 47, 65, 36, -204, 151, 145, 23, -24, -9, -88, -41, -56, 27, -143, 157, -15, 148, 254, -51, 139, -52, 358, 1, -115, 174, 32, 40, 139, -89, -107, 27, -37, 9, -40, -79, -40, -193, -155, -16, 99, -53, -41, 27, -114, 24, 51, -73, -43, -171, -50, 111, -41, -95, -93, -15, 73, 144, 31, 84, -25, 60, -96, -90, -151, 103, -15, -14, 97, -135, 120, -192, 59, 108, 71, 277, 85, 157, 9, 96, -148, 144, -16, -359, 31, -84, -136, 208, -155, -128, -10, 172, 32, -44, 127, 37, 45, -314, 75, 60, -231, 11, -304, 74, -51, 98]
7927I8O3k08J2j68J76J07k71k3R7K31l18L74m92L39j16kL27j79Pk6j99K46l02
7950b27K32J26j45J06J06k10n9R2ok95J31L11j67R0j27q1J48m3K83k25P1J6k56
7973a29j23M80j61k71J57J61p5J20n27K78J18r0K24j49J0N1k04K04o0j19J18n4
7995d1J5R5j98K57JM6R6k30J01j48L0J04j90N7O5Ok51k12J83R8K69j10o7k46K39
8020c1n1K15o7n4p1l7o8J67K37k55Pp8N5j35K82m36K30Q5o7J15K3n8j57J45J55
8045A51j56j2K50j29o5O8R5r9J14Q9m54J32J50k38J07L5L3l7J75k8Lj73j25K92
8069A78j57P3L4j3k26j06K79lO5j29R1L9j90j17K12j62L79k26j72O8O8k1q2J80
8093F2k94J29Q4j82M3J38n1j7J19k8p2l3P2l5J60r6l5j25k9K65j26O5P9j51K94
$$ y = [98, 161, -47, -35, -203, -27, 80, -191, -214, -117, 114, -204, 170, -322, 17, -99, -101, 226, 47, 54, 28, -171, 75, -227, 5, 131, -14, 92, 198, -12, -71, 21, 15, -280, -149, 162, -5, 85, -42, -123, 25, -18, 265, 40, 111, 127, -129, -252, 228, 67, -204, -47, 114, 39, 159, -368, -90, 28, -62, 162, 13, 23, 74, -130, 74, 14, -105, 13, -41, -26, 69, -129, 128, 129, 175, 271, 41, 142, -6, 24, 128, -62, -5, 60, 66, -185, -397, -214, -116, 153, 43, -24, -270, -31, -82, 133, 66, 12, -59, -96, -164, 3, 240, -15, -8, -86, -31, -166, 116, -320, -90, -5, -72, 43, 66, 8, -149, -4, 151, -5, -17, 233, 104, 39, 107, 202, 103, 217, 306, -148, -16, 134, -104, 3, 38, 71, 34, 209, 181, 184, 11, -114, 178, 21, 94, 128, 115, -111, -217, 62, 59, 124, -5, 86, 125, -65, -182, 30, -132, 247, 21, -151, -83, -15, -36, -118, 62, -232, -103, -19, -201, -158, -20, -71, -88, 31, 3, -69, -102, -30, -65, 95, -1, -36, -161, -190, 75, -51, 14, 93, -58, 236]
8118B36m32J46M0l3J49no3r8K77k63K1j95K97j83K11o7l9p7o5R3j44L09j95Q3
8142CJ85K5k25K6m5J03l0j00j23J01l6N9k53M36o6P2m0J10l64J97j22j22K91j35
8166e3m6P5k45K54l0J44N1Kj48J3J38j30j8r4J60k68R4O9m5r2j28K43K27l37J38
$$ y = [236, -196, -50, -10, -43, 106, 101, 38, -60, 217, -46, -25, -220, 77, -106, 105, 38, -1, -78, -143, -50, -194, 115, -80, 3, 188, 213, -12, 14, -31, 72, 42, -58, -181, -80, -116, -57, -310, 126, 60, 132, 92, 202, -162, 35, -87, -209, 82, -53, -99, -24, -269, -15, -45, 99, 150, 152, 4, 17, 155, 25, 7, -87, 73, -195, -101, -32, -77, -169, -297, -54, 173, -164, -26]
8191b6
$$ Imaginary data points
##PAGE= N=2
##DATA TABLE= (X++(I..I)), XYDATA
0@%%%%%%%%%Qj6J6j6K0k8L2m0N6o5P3q9J13j36J59j86K14k51K91l34L83m39N02
32B67n68O41p27Q22r22J033j153J286j434J593j767J955k163K391k635K905l204
49a680L529l884M277m715N202n745O357p050P845q766R846j1137J2711j4677J7204
64I317k0592K5389l2713M5341p2757K26109j17818k78354M41952l25908L9480
75f0554J87353k15579R5100M9324p1327L6444n7180O7327l0070l166K8753m0752
87a4327L8598l1895k0510M4467m3035M0575N493k0048J5745j5232p235j4501K6860
100D955k300k6491M9069l8865J3661J5300o1398P1401k5873k1826O6584q5746
112d1529M1154J7759p5354Q3419l1905n186N3608p5719M3629o187l7558O1666
$$ y = [0, 0, 0, 0, 0, 0, 0, 0, 0, 0, 8, -8, 8, -8, 12, -16, 16, -24, 32, -33, 40, -49, 64, -72, 87, -99, 115, -136, 155, -179, 204, -235, 267, -301, 340, -387, 435, -487, 546, -607, 679, -755, 838, -929, 1026, -1137, 1254, -1381, 1524, -1680, 1849, -2035, 2242, -2473, 2729, -3016, 3341, -3709, 4136, -4630, 5216, -5921, 6790, -7887, 9317, -11275, 14114, -18599, 26742, -46015, 180094, 62276, -216078, 225874, -100034, -60554, 126799, -88780, 6320, 55644, -15683, 20761, -36419, 30908, 838, -2328, 26425, -14327, 24271, -7624, -28134, 16333, -26702, 13873, 19366, -682, 15063, -169, -7404, -21905, 4955, 2655, -23836, 25233, -13632, 29, 15329, -46069, 25332, -541, -22367, 44217, -41529, -375, 17384, -57970, 25449, -6456, -11642, 41966, -33753, 9876, 3689, -33869, 27797]
124B7797n3557J5434M1288n2042K9308m229k4861L1995K826k0577o79K5089k7728
137i936k656K7931l5202K9850J5443l6624J8660l481K227j0334m718K4172k9952
150a4620K9960p97m1730N7252l2249j1789M6614n1406K5789O963m1298M3640j5434
163H95j0559K1034j4182J1788j0580J189K464j6996L0956k2926j1971M1574l4132
176a1446N01K6384k8861J2703J4227k7515L631J9319j9229N32K2121k6981J4314
189c00J5736m0296L3264j928l0127M0704k5404m846K7137k6554J2953J282j763
202a42N578j1391J7932k3824O463K0892l8247L6769n112k6666M4890l5594K992
215e460K6892l7028K3531j808j4381J8393j3394N592L59K361N342j3875J5059
$$ y = [27797, -25760, -10326, 30962, -21080, 8228, 3999, -20862, 11133, 13959, -6618, -7297, 17792, -9936, -12592, 15339, -19863, 9987, 25430, -11194, 7466, 3985, 6212, -4122, -8840, 15332, -14620, 15340, 14543, -27187, 30065, -2184, -13973, 32641, -18765, 7024, 13987, -27311, 16329, 895, -9664, 11370, -2812, 8976, -1604, -415, 2049, -14947, 16009, -6917, -18888, 22686, -11446, -10945, 15439, -13422, -719, 13508, -14007, -10376, 8943, -10286, -9754, 12367, -14614, -300, 15436, -24860, 8404, 6476, -23651, 17053, -8351, -13197, 13940, -12614, 339, 1621, -142, 5436, -5955, 11977, -11847, -5384, 15508, -22739, 14030, 8918, -17748, 27142, -8452, -5460, 21432, -15596, 7935, 6127, -8254, 10139, -3255, 2337, 2696, 5057, 10399, -3476, 11583]
228A1583j2671n221J6829k1119J5178L548j3495J6552j3998O408K062j4741J9685
241A0600j5386P71J2235k2333J8222l270r347J9638j5031O727q43j3141J3213
254B055j2506Q600L348j2007K1158j7890l38J7584k3682J4711K976j6050J4405
267B364n362n719M645L876j172M21R351j3427M995K758j8480J9757n268m844J7203
282A1098j7418R018K331j0274J1704j0248Q988j609q480J3781k0158J3702P126
295I561k1830L1434j5589r338K6453l4561J1052J4389k3869K3014o782q089J5523
308A1368j3354L400j40j389N293o821Q267j2166q04J4242j7035J1726N993j2980
322d400J2079q320n173K351m18N550p580Q523k544l610R605j6175J0422M20r106
$$ y = [11583, -1088, -6309, 10520, -10599, 4579, 8127, -5368, 11184, -2814, 3594, 5656, -9085, 10600, -4786, -4015, 8220, -14113, 4109, 839, -8508, 11130, -3901, 2826, 1983, -11158, 2055, -10451, -1851, 1497, -10510, 10648, -7242, -7580, 10004, -13678, 1033, 4009, -12041, 2364, -2998, -8717, -4072, -196, -1368, -947, 8404, -5023, -28, 2730, -15750, 4007, -1261, -6105, 11098, -6320, 2698, 5029, -5245, 6459, -3789, 5199, 3590, -4890, 8891, -11267, 2435, 9561, -12269, 19165, 3576, -5762, 20691, -13870, -2818, 11571, -12298, 10716, 3934, -4155, 11368, -1986, 1414, 1274, -115, 5178, -1643, 6624, -5542, -6346, 7896, -9139, 2587, 8580, -4400, 7679, -641, -5814, -3463, -3881, 1669, -5911, 2612, 68, -3542, 6063, -10112, 310, 730, -8376]
337h376K0788k2200K805J5100k3379J8596k653q969J9088j3066K433p95q154J1759
351B977p337L850K849m158Q359p770Q69p15o24R163r500L855j60n843J0658q996
367b523K679M881l929Q257j0224J918J117q730J6349j3501J517J6670k1720J5395
381H156l863j7613K7557j7255j277J5648k2329J6380r81j3644J5613j0499N961
394A854M065j2000Q325o603J551L172o059P371m366M481O18j0798R025k482l505
409e351O068l285q76K699L115r468L730Q458j3734J2801j965j4251J9105j0926
423c880l267J3782j4375J0046K315p986P075q961P348n39o971J2367j0897N797
437A854O759j6546J3091l383l664J2676j6819P739N450j3103J2083o157j844J0497
$$ y = [-8376, 12412, -9788, -6983, 8117, -15262, 3334, 681, -8288, 10800, -2266, 167, -628, -8782, 2977, -4360, -510, 2339, -1819, 6540, -1230, -361, -1076, -1700, 7463, -2037, 1818, 1658, -4185, 6473, -2523, 156, 5037, 1108, 9365, -859, 1059, 2176, -6554, 9795, -3706, -2189, 14481, -7239, 8156, 4293, -13320, 14237, -3018, -4295, 11353, -10976, 5404, 4423, -9221, 6392, -4107, 1854, 5919, -6081, 2244, -4359, -2808, 364, -5695, 1676, -2690, 1791, 2409, -8389, 636, -1846, -5351, 717, -2568, -3444, -745, 2370, -7098, -3368, 5090, -8644, 4157, 2192, -12059, 7046, -3880, -7147, 6635, -7740, 2306, 4621, -3365, 3710, -5251, 2097, 1558, -5413, 6954, -3943, 1854, 8613, -7933, 5158, 1775, -1889, 10787, -6032, 1707, 7157, -5946, 6137, -20, -1864, 8633]
451H633p624J946r42p58O23l196N032n918N336J357q646J0408p262p45P409j0000
467d347Q118m781j892P541j2069J0856l537n699J4936j4931M810M075j1534J2368
481C914q975J318Q309j2273J0676m494n239J2552j1831L704N961r972O956j535
495i29m389O413j626k341L867M82l687K847j246l286O969m519k32N837o482M078
511A756l14k692M880n316M123j081l016P745j0586O893L992j2293J4461q920l135
526c503J5045j9455R562N255j5149J6343q401k805J0499j1281O567k319j162M348
540C544q919R431m461l430Q735j1201Q432J086r800R516m698k86K424l819K879
555e67j676L288l696j67O179r500O555j05o160J0610r979K083P325j0431P755
$$ y = [8633, 1009, 2955, 2013, 1255, 1878, -1318, 3714, -2204, 3132, 4489, -4157, 6251, -1011, -1756, 5653, -4347, 3771, -1010, -2902, 4639, -7430, 3426, -111, -5810, 9126, -5805, -995, 3080, -8454, 3914, -5061, -3743, 4566, -7707, 2969, -1525, -6764, 5788, -6043, -2339, 3622, -6350, 606, -929, -5318, 1095, -531, -2872, 995, 1477, -2210, 637, -609, -3895, 3074, -1445, -1677, 4160, -2322, 1756, 1442, -1250, 3630, -1686, 2437, 1356, -1660, 6085, -4501, 2392, 6384, -5909, 8552, -368, -3503, 11542, -7913, 1649, 6904, -8245, 8098, -303, -3108, 7391, -3890, 2677, 358, -804, 3544, -5375, 4056, -405, -3835, 4900, -6301, 2131, 3217, -6583, 2933, -1765, -2051, 373, -3446, -567, -2243, 1045, -2651, -2818, 3361, -6139, 416, 311, -5849, 4761, -5218, -3135, 4190, -6241, 1514]
570A514k396k688Q148r147N299k00m273Q483r077N065L451r412J0367p286J287
585h65P345j2535J0407j704n549Q862r282O587Q70o844P863p674N656J639r065
600d289R590n291R65K821o198P097o206L269K326r098J1582q307p50J0390j3151
615e250O841P55n949P996o985J709J198j801M376q185O069R44o639Q756q399J247
631c317P610j0119O102n26m890Q001o107J53M176m758L125k55j152P68p37K224
647B98k528J770L62k395N337m060j942N268l215J450P94k172J572J625o21l968
663b425L953M45l531N047m155K03M877n422L252j514m84L766m924L632k176j812
679a268N543n708L395l64k720O008n585R82P34l203O230n524Q2L511m307M974
$$ y = [1514, -882, -3570, 4578, -4569, 730, 530, -3743, 4740, -4337, 728, 4179, -5233, 5134, -2152, -865, 6480, -6055, 4352, 2648, -2901, 5961, -3321, 3266, 4136, -2708, 5155, -2519, 3137, 4776, -4289, 5301, 10, 975, 3796, -2402, 4695, -1511, 1758, 4084, -5014, 6568, -1739, -2489, 7901, -5250, 1591, 2346, -3603, 4393, -2592, -883, 315, -1486, 2890, -5295, 774, 1718, -4921, 3835, -4564, -3317, 4293, -5826, 276, -250, -5140, 2861, -3246, -3093, 1083, -3675, -550, -805, -1957, -1189, -1926, 298, -2230, -460, -98, -2493, 2844, -1216, -3158, 2110, -1105, 345, 1139, -1033, 539, 2164, 1543, -2425, 1528, 1973, -1558, 3489, -666, -463, 4414, -1008, 2244, 730, 246, 4012, -912, 2720, 544, -1268, 4275, -1433, 1962, 1598, -1122, 4886, -699, 283, 1017, -2186, 4044, -1480, -1398, 2113, -2194, 2780]
695B780l803j689N357l797J810k225j640M426l296R28L44j141L403k745L13P7
711h98k156L942l180K89K522l503L569j044j908L086j810J270k22r27Q9j019L829
728A929l610K09N326o054M377N90o543O818l010p09K561l447M439k560R47J610
744B873m332N453l708K48L017o931O655k359l047P348p235M200J913o834N651
759B912l066p47K390l388K483j100J430k50l022N257m032m1L490o055L693n53
775e99l156M446k874J783J034k878L292k905j65J445k759K833j389k06K931l021
791b188K175j156l00K605l474K335p01k490M514l468J092L323l069K161p77q23
807b41N12q25J061j110J593K12j422L371l411J424J507l385L307j783p89K309
$$ y = [2780, -1023, -2712, 2645, -1152, 658, -1567, -3207, 1219, -2077, -1149, -805, -1946, 1457, -1288, -975, -898, -3054, 888, -2292, -2003, 519, -2984, 585, -459, -2367, 719, -1091, 179, -43, -970, -881, -1900, 1929, -1681, -1472, 3854, -2200, 2177, 2767, -3776, 3042, 32, -677, 1884, -1563, 2876, 316, 1263, 2873, -1459, 3994, 286, 534, 3551, -3380, 3275, 916, -2131, 5217, -2018, 2182, 4095, -2739, 2912, -154, -901, 1489, -1899, 584, -516, 914, 664, -2358, 2899, -1133, -1174, 2316, -3739, -46, -599, -3755, 691, -2183, -400, 634, -2244, 1048, -1857, -2022, -577, -3336, -503, -1892, -2098, 833, -2188, -13, -1169, -1469, 1136, -2338, -3, -704, -3194, 1320, -2148, -1056, 2267, -802, 1359, 582, -241, 271, -554, 507, -603, 990, 1202, -220, 3151, -260, 1164, 2671, -714, 2593, 810, 21, 2330]
823B330l048K292j045J072J179k624L608m141J74L182o469N830m8n086P338n090
839e46r61M767n795K898J059k836K312k518J244q7j307L099k786K280K63m470
855c384M147k837j296M424l601K194J632l357J865p41l70M96K91Pm05J496k675
872b114J064K250l571M658j340k229L860m895J606J307k990M663j979P13J407
887B410l100K374k342J033Q77k373M458l469P4K939m667L867L06l372M104k915
903B04q2P69k797K508L29l59J531p37p33q76M47j639k17K778k627K307K61l866
921b799L699j179j280L037l260J334L25k572J069j339K882K31j202L217m229J847
937b19O36n942N909j078j920M960m486J919J508l649L546j571j98K332k893N49
$$ y = [2330, -718, 1574, 529, 1601, 2780, 156, 3764, -377, -203, 2979, -3490, 2340, 2292, -2794, 4544, -546, -1507, 3260, -2535, 363, 1422, -1414, 898, -1620, -376, -463, -1770, 1329, -1457, 823, 1086, -3384, 763, -2074, -3370, 1054, -2547, -353, 1279, -2078, -213, -954, -1324, -828, -537, -530, -935, 561, -2114, -1050, 1200, -2371, 2287, 947, -1282, 2578, -2317, -711, 596, -2394, 2269, 290, 1003, 2410, -690, 1684, -658, 375, 1252, -1121, 3337, -132, -58, 2881, -1786, 2081, 2387, -985, 3119, 204, 122, 891, -1906, 602, 931, 572, 2103, 1366, 633, -243, 204, -1435, -1652, 1126, -1501, 806, 1067, -2799, 900, -279, -1559, 1478, -1782, -448, -123, -2695, -1626, -2965, -83, 148, -1054, 2163, -2066, -219, 417, -5525, 384, -694, -2614, 2346, -2140, -221, 1287, -2362, 1184, -387, -585, 1747, -1146, -597]
953e97k43n76J393J203O41j155J257l63j786j16k45R26O95M27n51l33K587k616
971E48l37K354k804L063j741l127M277k867O2L643l372K700m6k795K353m245J564
988g70J172k466M157k195j012L494k897M06r46K16K459l841J681p53k230N171
1004A646l093m21L718k247N90j085j828R46Q7Q08j118K186L3j593K511l022J201
1021f81J037k359L180k408j73J697k451L941k160N0L587m068J674j461r33K891
1037A363k894K974l71r57L854n197J757K015l918L813k103j065K905k870J364
1052F70k30J05K228l064K246j180k328K555k689J792J402k360L111k112l95Q51
1068F02k690L394j536r70J380j984K315j765k09K554k420K762k118j800L389m290
$$ y = [-597, -840, -1416, -23, 1180, 1821, 666, 1923, 1560, -226, -342, -587, 339, 1034, 1461, 910, 577, 3164, 548, 211, 2565, -239, 2824, 1083, -2044, 2233, -634, -572, 3071, -301, 2399, 2353, -442, 1911, -2334, -770, 402, -2064, 2093, -102, -1114, 2380, -517, -111, -1057, -841, 1618, -2223, -542, -1295, -3525, 1646, -1447, -1868, 1850, -397, 193, -892, -2720, -1774, -1687, -879, -1997, 189, 222, -1371, 1140, -1882, -681, 356, -2003, 1177, -1231, -1404, 293, -2158, 1783, -377, -327, 3260, -808, 866, -595, -1528, 1363, -1531, 1443, 1072, 115, 3969, -1228, 529, 2544, -1374, 2439, 336, -729, 2176, -694, 670, 440, 545, 2773, -291, 1955, 775, -1553, 1002, -1687, 105, 1507, -853, 2258, 146, -249, 602, -2088, 1306, -230, -1200, 180, -1804, 511, -1254, -1463, 1091, -1329, 1433, -685, -2485, 904, -3386]
1084c386K742K98k386N499l852M74J869m184L346j443n78L497l609K189p89j061
1100a374L307l023J759J189k633K478l123M45K196k895L116Q67j894J705j324
1115G96r29N50l05j47Q45O91r45L7M59q96J325o74k00J492k110K15o51j185K468
1134H36p13P89Q27j536R82k206L57L1j553L084j818L79K108l974L070n45k276
1151b158M052l220L00J417l629J758M01K15J540j010J118j132q14M3j103R04O83
1168f35R2K36K69L99j068P71n60M42Q39j731J203r61j106K852j864J818J426k295
1186A27K255k188j052J685k442K035R67j265K322j673kM29j219J670j341N43M92
1203A343k195J545j289J75K270j664J946r76j202Q04k452J132j33Q1K031k275
$$ y = [-3386, -644, -346, -2732, 2767, -1085, -611, 1258, -2926, 420, -1023, -1601, 1896, -1713, 476, -313, -1374, 1933, -1090, 669, 1858, -775, 1703, -1420, -975, 1221, -1674, 1442, 2309, 415, 2120, 796, -133, 417, 112, -35, 810, 1501, 556, 593, 1052, 156, 1481, 807, 607, 2099, -11, 204, -447, -1632, 836, 123, 912, 1739, 203, 1185, -1021, -664, -633, -2186, 898, -920, -541, 1567, -2407, 663, 118, -2158, 1894, -1326, -1026, 391, -3238, -1480, -1079, -864, 676, -334, 784, -348, -1162, -1119, -2222, -1318, -635, -543, -307, -38, 361, -707, 64, -496, -54, 785, -946, 257, -704, -1810, 1042, -822, 996, 2422, 127, 2382, 194, -858, 827, -1615, 420, 1387, 122, 2444, 771, 769, 1198, -21, 1649, 308, 851, 1343, -852, 693, -596, -421, 1849, 185, 2131, 1155, -47, 757, -1695, -563, -696, -615, 1416, -859]
1219h59K055j059j833L282l421J744N29k810L693l429K83K870l784L945n23k124
1235a441L041l438J064o88j379L897k389J748Q06l086L272k289n24K623k981K574
1251H10j78k212K335j684Q34J434j235J411p89l59k7j362J081r2J233K97j127
1268C70J864k215N07R68l055K871m80j078J731k310J152L55p42J818k273J785
1284A268k22k708K284j872P79J908k486K109n92j223J157k190J333m4m32J541
1300F10k373J077M26j124R89j22M04K4k86l79j381J379M74r53J945p64o71J320
1318E95j295l72M06P23k71LR46r99K09J153j729Q03Q06q31N78j002j06L91K63
1337B71J187p82L25J129k138N56j08p69J290j21K77p18J023l89q98J191j296l7
$$ y = [-859, 1196, 137, -1696, 1586, -1835, -91, 438, -2372, 1321, -2108, -1825, 1045, -2739, 1206, 683, -1441, 1600, -1838, -774, -1462, -2841, 1056, -1333, 415, 1221, -1865, 1407, -882, -1406, 1217, -1764, 810, 632, -1580, 755, -929, -95, 1339, 104, 1515, 726, 367, 340, -1022, 59, -33, 1200, 1497, 370, 2234, 19, 526, 1494, -1561, 1310, 830, -248, 1483, -827, 325, 680, -62, 1756, -517, 1268, 1046, -1662, 622, -1250, -471, 1437, -1049, 1060, 468, -755, 402, -1788, -455, -499, -931, 610, -1763, -686, -260, -1384, -395, -517, -113, -89, -375, -754, -2135, -756, -282, -1235, 710, -54, -725, 595, -700, -1072, -666, 57, -214, -211, 735, -264, -55, 1098, -631, 172, 978, 147, 725, -277, -383, 8, 271, 1458, 676, 1001, 2130, -8, 548, 440, -329, 961, 840, 1117, 399, 1422, 1033, 135, 1326, 30, -7]
1355gJ908k437P35j05o84J219p28J259o95r9P48k751J568N5j707K685j555N4J286
1374G49j810J225r97MJ306j675J266j184o48J744j281Q97O45q87R26r75k48J58
1392g85q18J535r94Q31Q96j660J660r42n10J737j737J173L16j626J505j263M32
1409b50J383j151J758j059n29J062k295J513m5r58J966j087O97K42j894J836r40
1426B49K4L74m84P21j147J4L75k18J063m90P8k11l53n9j198J127J84o99J430j122
1446c42N27J50j732J403q34K38M10j257J635r07j101K103j628J293N65k100K326
1463G49j172j512J827j247J406N57j388J594o53l87O4p14J408j22n11M70l20j13
1481f4Q11q01J25J319o15l38M95j170P4J271j376K231j145q99K112k597J198M28
$$ y = [-7, 1901, -536, 199, 94, -590, 629, -99, 1160, 465, 366, 1114, -1637, -69, -14, -1721, 964, -591, -537, 749, -1061, 164, -833, -829, 477, -1198, 68, -1116, -1764, -20, -1301, -404, 241, -646, 280, -695, -943, -785, -1603, -68, -1062, -231, 665, -995, 665, -277, -787, 950, -787, 386, 702, -924, 581, -682, -250, 1133, -18, 1740, 681, 152, 1214, -1081, 432, 387, -571, 1395, 308, 1005, 1247, -647, 1189, 249, 273, 647, 163, 884, -263, -249, 126, -92, 971, 481, 559, 348, -5, -64, -1262, -135, 49, -650, 780, -342, 185, 335, -1397, 6, -828, -590, -180, -1437, 198, -709, -1810, 293, -1335, -42, 523, -1577, 749, -423, -1935, -108, -1355, 51, 608, -780, 814, 161, -226, -162, -876, 532, 410, -101, 369, 49, -64, 747, -54, 71, 1390, 775, 437, 932, -238, -164, 1107, -269, 1962, 817, -82, 2030, -567, 631, 1059]
1499A059k305L297j328r57J518k089J804m81j542K060j103N93r5j509J488q18
1515d08m04J357q40O62k53j059R49n26l24O2M83J81l51k53j70P05n45k00J050
1534A16j046Q71l35j576K302p66j020K385k029J197K74k194K801j367n58J804
1550H59k007K129o99j519K583k040J473J97k284K864j271j043K251k046J625K07
1566A279j622J820j166Q5M46j030J033k7q88Q79o3o21L34K38o78O15p3q29R02
1585F34k62q24N34j25M27m80k33Q24j145O55P2j680K000p87m72J687k045J130
1603i0J67j756K288j440p8J314j891J469n47n16J932j823N77R30j610J432q86
1620e28P2N67k63Q31j026J5R86j033Q00o5m81L04O38q58j56R71k94p69J382p31
$$ y = [1059, -1246, 2051, 723, -234, 1284, -805, 999, 518, -1024, 1036, -67, 526, 431, -1078, 410, -408, -812, 545, -295, 367, 114, -945, 4, -522, -846, -784, -301, -120, -471, -724, -894, -189, -734, -934, 116, -930, -59, -394, -1970, 332, -434, -1454, 931, -1098, 99, 373, -1821, 980, -387, -945, 859, -1148, 981, 282, -1237, 1346, -694, 779, 976, -1308, 1556, 285, -758, 1493, -553, 1072, 1279, -343, 1477, 311, 396, 842, -188, 845, 818, -70, 809, 746, 125, 459, 697, 19, 634, 561, -268, 634, 372, -452, 82, -43, 384, -96, -329, 495, -650, 5, 77, -1603, 397, -390, -862, 825, -1220, -90, 77, -1679, 609, -831, -909, 405, -1486, -17, -564, -1080, 852, -971, -394, 536, -1074, 358, -528, -456, 111, -152, 679, -347, -332, 654, -379, 421, 356, -125, 179, 817, -41, -197, 774, 480, -289, 1093, 362]
1640C62k39P99q96L38R9O9J92o91Q40n27o64J128p13k13P90l96k99M33q23N36
1660A25J84n23K68j05K07mn13P2k03L32K69q78L87K24p20M71J9l67M45j13m55
1681h78P91m60j20L85n07O12k94j02O18p13Q5P79n97L31k2k34M36l20L74m10M63
1702B17N78j215J121j53o35P80n66Q1K73j58Q1N9K98m44M67J00j020R67l77m67
1722a3Q67p93M63L26l06K83n20j57L05o84O22k03j96M80o93K63K38j18K00j217
1742h53N22N02j268J003l59j20P24n56ML33q10Q71o15J76j92k90J103j046L54
1761e17K57n25J112r27J63N54q78Q50p21J75R79j071J106j54j045J308o66k97
1779b97Q53j332J077K70n99P08p17M45L1l82R59j085M25K23j007J153k57l83J108
$$ y = [362, 123, 922, 26, 364, 463, 532, 724, 33, 873, 346, -318, 810, 97, -116, 674, 278, -21, 412, -411, 125, 309, -214, 54, -51, 156, 152, -361, -289, -492, -160, 109, -769, -382, -158, -878, -407, -388, -755, -310, -423, -878, -87, -547, -667, -282, -789, -177, -471, -573, 45, -668, -583, 196, -401, -70, -92, -326, 110, -210, 164, -246, 217, 795, -420, 701, 548, -87, 693, 127, 208, 481, 323, 404, 463, 761, 317, 784, 884, -136, 831, 454, -13, 854, 61, 524, 850, 544, 827, 307, 150, 455, -229, 393, 190, -6, 474, -219, 44, 282, 164, 364, -853, -331, 171, -1097, -94, -453, -573, 151, -405, -401, -68, -878, -7, -622, -446, -638, -928, 175, -871, -517, -260, -785, 327, -600, -437, 117, -761, 89, -632, -457, 522, -549, 557, 403, -642, 666, 0, -297, 556, -776, 301, 571, -28, 680, -37, 408, 439, 57, 1016, -69, 356, 579, -428, 725, 468, 85, 1193]
1798A193j164L61J64o90P87o20J01L94m21rk97N95k09l19N71p73K32K39j020P43
1818a42m7k12N44k55K35j92k99j0o42P86l55O7P61q80M09q7k16O48m00k01N9J40
1840b89j72j3p7K98L23M00l45J98m03M0P8l54L26oK24K67k01J10r2l9M05n05L24
1863D97j07l08P81r38L5J183p58N68l2j054M83j87m09P12k45K5K48l48O77q41
1883a8K76J87o19J30J26p32O31p6m65L10M70n01K02j80j74J51n12j4L04o7L40
1904b31l62j55J066r73L89K6o80J110p88j59P90q09R68m2m38P67j130M70L94r69
1924g56R33l73j47J191n50m61L84k58N87m57l5N15n91O69m89k73J090n84m2M99
1944H52m29k07J97m76L27J80m36N24K92l55k72k20K24K09n76J45J77n15L86j93
$$ y = [1193, 29, 390, 554, -136, 651, 31, 132, 526, 105, 96, -201, 394, 185, -134, 437, -336, -104, 135, -885, -142, -189, -401, 143, -112, 123, -69, -368, -378, -1020, -234, -589, -522, 239, -641, -232, -319, -535, 113, -287, -488, -429, -289, -461, -474, -551, -253, 70, 470, 125, 323, -80, -40, 38, -316, 10, 4, 228, 495, 294, 404, 312, 273, 678, 173, 497, 390, 82, 863, -75, -40, 1143, 385, 953, 921, -133, 350, 163, -246, 466, 221, 246, 494, 146, 823, -18, 258, 445, -174, -44, 82, -650, -19, -95, -560, -250, 220, -281, -79, -259, -433, -282, -794, -808, -504, -571, -231, -593, -748, 318, -655, -266, -240, -920, 190, -598, -757, 33, -776, 192, 150, -288, 479, -651, -181, 213, -756, 177, -196, -343, 848, 298, -163, 221, -37, 550, 93, 58, 573, -18, 651, 162, -111, 979, 395, 353, 852, 423, 216, 413, -63, 264, 444, 8, 532, 824, 469, 197, -23, 201, 410, -166, -21, 156, -359, 27, -166]
1964a66k48Q35m74oJ32m20J00l42M2K96o7J32j15j74O34o98l33Q14n29L63j5n08
1986g47N00Q8l47K40N43k96J44o01M24k3o02Q51k72L61L19p72O74R7r04M31K3
2007A31J36K82p11J037m37m31P29o35O59J25j280P41r5k60O98n76K53P92r19J36
2027C75l33l44K25k79M33L93l00J03n04K44K07l91k71K42J63n18k8R1J29J04j00
2048c59N97l12k24q3n45M34P2p21J029J77l22L28q04N66L02q65P76j52j76J01
2068a81n34N50L28m07R33n36J47K64j301M81O0Q9Q72k74J82J80r90Q69n54J21
2088B99N76p91J35L8j94R7L14J78kr4M5k59r9m15j57L11O3K83M3j22Oq8k5m97
2112c55K71J91l67K20P6o09K71J18O77k53l11J8l12l00M9k77O86M49m61J49l1
$$ y = [-166, -414, 421, -53, -59, 73, -347, -247, -589, -547, -251, -318, -186, -301, -475, 159, -539, -872, -58, -587, -224, -239, -747, -247, -159, -506, -266, 277, -19, 125, -476, -52, -75, -677, 174, -98, 263, 582, -190, 484, 581, -323, 108, 131, 267, 549, -162, 875, 438, 7, 736, 101, 760, 885, -395, 346, 251, -9, 689, 113, 366, 1158, 239, 375, 42, -302, -77, -356, 77, 470, 170, 273, -231, 13, 220, -171, -442, -200, -37, -555, -583, -492, -363, -259, -359, 238, -74, -298, -381, -926, -492, -420, -1141, -112, 65, -257, 71, -733, -167, 135, -730, 46, -106, -282, -181, -715, -165, 163, -244, 689, 153, 300, 564, -737, -256, -196, -107, 765, 491, 673, 853, -137, 732, 178, 299, 875, 84, 219, 257, 63, 160, 474, 652, 650, 556, 601, 342, 243, -172, -329, -18, 45, 328, 371, 249, 255, 167, 142, -355, -84, 107, -260, -40, 36, -573, -302, -184, 493, 240, -71, -53, -365, -665, -616, -893, -207, 242, -219, -70, -101]
2133a01n22M81l46Q1J76j09O7j41RO02n94M79M09n90K94q6p38Q04n84M64Q4K59
2155C98J11j92J34l69l09L89j11l5N17n86K10J95l39J55O47j13j62l12k17l48
2175c37K91J89q7K52K3q9r5k36L65l36K36r9n61L33q2j13M22l77M24j64j86J06
2197a21p07K74J53k96R42n26N4N29q85J00L95k17L22k37R2K10n57L31j99J83L55
2218A95k80J09K8n69L29N3j40O28J0j65R0m8k09j08J89K5L31k9j90L52m04m9M04
2241E52k92L01M2o51K76J3j91L09K04jL4j63m37q7J70m25M27L68m44n0K33n48
2263c60L41j61L4n2k0j16l33K86l3L3J94K69k53J97k23m73K85j58l87Q07l89M82
2285c0Q3j46Ok95J01O2m9J09o4M4l6J6K24N8K93k82j24N49p61k29L64m8M29L24
$$ y = [-101, -623, -142, -488, -407, -231, -340, -273, -414, -405, 197, -397, 82, 491, -99, 195, 109, -629, 175, -409, 55, 139, 398, 509, 317, 451, 82, -227, 162, 51, 16, 533, -53, 157, 352, 13, 168, 815, 702, 540, 228, 11, -337, -46, 143, 56, 308, 331, 242, 147, -89, 276, -60, 176, 77, -484, -151, -233, -346, 76, -301, 123, -41, -227, -121, -828, -554, -401, -697, 245, -281, -227, 302, -583, -483, -88, -305, 17, -220, -128, 82, -475, -144, -343, -160, 195, -85, 24, 52, -517, -188, -135, -275, 353, 363, 198, 288, 240, 31, -77, 112, 137, 468, 439, 249, 601, 197, 148, 552, 260, 561, 603, -48, 228, 241, 50, 359, 563, 562, 596, 433, -4, -91, 79, -346, 81, 449, 5, -45, 188, -360, -19, -180, -146, -198, -218, -334, -667, -381, -414, -381, -187, 82, -171, 26, -197, -670, -385, -543, -930, -123, -512, -30, 53, -93, -87, -382, -281, -219, -268, -159, -223, -179, -215, -199, 25, 83, 376, 94, -30, 519, -242, -471, -107, -155, 274, 598]
2309E98k16l0j07k76K02j48N54m06J94J71p73N85J95l18L38Nl05R3l38j61k67
2330d10N37K1K08O7m57J15J2p54R23k36m20M98m75O0K48n08P35l69M66k71q2j5
2352a07o84K80J56k35N28J08k94M34r02K57L23l03L99K31k69Q3J40l53J33J14
2372C9J6J47P4m19k0J96m7P4M63Mj35J14l71l22L96n8J56N46q05k0M23m36N12
2395E27J9q3J15l47l23O01o89J25lL38L24o13K24q7l10M64p60J46M34m44K29L94
2417B81o97L60j16j78K67q2m02J19K57k86N04j81O5K96m43J48j74K02l94l26R63
2438A83l21l43P42p07L54M78j004Q15J62m13K11l61J92J54n1M45l39K34l80l84
2458c33P19k88l18O33l52J83K85m28L1K45k92K91l58J90J50j98j85L40j23KJ25
$$ y = [598, 382, 352, 245, -31, 171, 23, 577, 171, 365, 536, -237, 348, 543, 225, 563, 568, 263, 356, 18, -143, -410, 127, 148, 356, 423, -34, 81, 93, -661, 262, 26, -394, 104, -371, -311, -63, -571, 164, -205, 261, -10, -92, -107, -791, -511, -355, -590, -62, 46, -248, 186, -716, -459, -136, -439, -40, 191, -78, 5, 145, -208, -75, 39, 55, 202, 276, -143, -163, 33, -14, 60, 523, 527, 392, 506, 135, -187, 209, 151, 307, 853, 48, 28, 451, 15, 527, 546, 463, 578, 231, -92, 509, -180, -55, -58, 280, 604, -9, 215, 128, -182, 282, -478, -332, 102, -342, -113, 281, -416, -56, -172, -350, -83, -165, -567, -448, -191, -477, 27, -154, -89, 207, -236, -88, -262, -60, -454, -780, 183, -138, -481, 261, -446, -92, 386, -618, 197, 359, -54, 157, -204, -12, 142, 91, 536, 197, 431, 51, -333, 386, 98, -220, 413, 61, 244, 529, 101, 132, 377, 85, 376, 18, 208, 358, 160, -25, 315, 192, 194, 319]
2479C19j80m9l3l24K59P5j49K14k40L16m49P6oj02M71J05q75L83K16q11Q37m49
2501c96J38N30q53L68j6r9J92k99M36j51j16K68r2j40M05n19J62L53o71O21j01
2522B0r3O4j23N89kr6j33j09k02K78k40O8M52k6j84K30p10L55j85%J98j02K61
2545C10l02J18J69k99PM88n16Q5J95n13K95j80k01L38J23Q5j22l49K48k7k23K10
2567f1m47J68J55k17Q4M22k82K50k57k47N20n21j89M44l84L16K50k05L35l23m6
2588b35J2q5M76l08p5O04n42L9K8k75N17r3j95P40m64j23rj17O12J7n40M69l56
2611I7K42j19j19J22K3K79j47j76o4q3k5L42k56K45k10J34l10J81j73p4M32l52
2633a1K1K24l85J75J2m31O92m40k38N49o35J78n0j21M85n07L76K21o68M64l51
$$ y = [319, 139, 90, 57, -267, -8, 67, -82, 132, -108, 208, -241, -165, -171, -273, 198, 303, -572, -189, 27, -784, 53, -396, -258, 272, -581, -213, -229, -328, -136, -435, 1, -150, -266, 2, -90, -230, 175, -344, -182, 171, -500, 121, 20, -73, -9, -132, 457, 455, 359, 226, 117, -85, 193, -47, 21, 473, 447, 263, 493, -217, 138, -47, -47, 151, 49, 310, 8, 126, 295, -4, 3, 491, -25, 60, 255, -258, 37, -143, -344, -6, 117, 202, 80, -269, -21, -48, -271, -61, -508, -340, -185, -402, -318, 104, -178, 72, -185, -432, 88, -433, -622, -178, -562, -246, 4, -201, 134, -189, -235, -223, -308, 168, -140, -215, 389, -153, -114, -86, -361, 156, 63, -132, 608, 144, 21, 12, -105, 507, 524, -16, 453, 97, 339, 220, 101, 223, 246, 525, 378, 202, 138, 55, 30, 372, 116, 361, 151, 285, -25, 156, -17, -91, 341, -11, 10, 234, -151, 24, 36, -395, 297, -143, -381, 168, -467, -289, -339, -460, 25, -482, -106, 115, -553, -89, -440]
2654d40K17K69n10N12L7o56N79m07K21K84k47J40l00K32j64k14N79k73K62P9l51
2675a51L11k01j4L60o28N23l19K02K23m16K35K7J07J70n85N29Q8l16K74j54k28
2696C7L05m47L66j68k52J43j13K66l3j86K72k30j9o2j19J49rJ17o3j21J03k22
2718b86J88k29K51p1m1j23M51k21k33J52k17J58q8j60K33L94k51M1L83l33M1l11
2740b72j82M92P2j07K48k39K11p0k28K89q0k6k6j18J90k08N4L50J21j67J0p4J12
2763C52j29K25l21L12j67j16L18n64M71l14j80N37m59j81L76k65J92k31l0K76
2783A02k04J6p7n6K63m51L75m5l11N12k35N4N7j79r7p9o6K72j13J47l18K93K56
2806A16o54L57J14lK37m08L2J84j5k6j49J98L68o84N55l33j78L84r2j30J19L6
$$ y = [-440, -223, 46, -464, 48, 85, -571, 8, -399, -178, 106, -141, -1, -301, -69, -233, -447, 132, -141, 121, 200, -151, 160, -41, -55, 305, -323, 200, -119, 83, 306, -110, 125, 152, 259, 429, -156, 373, 461, 145, 419, 265, 37, 342, -105, 261, 93, -159, -16, -129, 137, 104, -82, 190, -40, -59, -121, -240, -91, -100, 17, -46, -167, -64, -286, -98, -327, -76, -147, -188, -311, 140, -81, -314, -162, -379, -221, -309, -469, -236, 158, -93, -52, 331, -2, 39, -272, -454, 38, 110, 3, 251, 12, 223, 153, -75, 214, 134, 108, 82, -36, 154, -54, 0, 350, 471, 304, 314, 240, 352, 223, 448, 127, 439, 272, 156, 474, -90, 381, 67, -113, 424, -35, -216, 160, -105, 87, -144, -174, 102, -102, -86, -163, -219, 44, -407, -32, -77, -388, 124, -111, -57, 0, -179, -276, -355, -421, -149, -262, -115, -433, -140, 116, -538, -181, -67, -70, 167, -241, -209, -25, -40, -66, -215, -17, 351, -333, 222, -111, -289, 95, 3, -127, -8, 28]
2828B8K78k92L10m5k84K57j50k65L75k28L64J60k54J65l27K19l63K30J25l63L02
2849B42J77n19K05N0k0j15M3L10o32K68J84k89L26l78k1K86k53j6M2j17Q6L5q8
2872a94J54k73J78k34j47O05j60j48L87m94O6K64j47K7J88k65lm0P9J89j07J45
2894G0j46j30K80j6k08K20q4J55L27n59j46L32L1Pj73r5M53j91M72n20n6K60k43
2917D0m7J88k67K20p6j48J47j09J24p5J15L09m68j11l9p1M31j44k04M70o10K41
2939h4J93l73R1k07m3L16j4j54L26J3j21k42J31j76N48o23L77j48l51O58k33M2
2961g4M08n00L72n89R9N08n01L14K75l30K92k39k1J8P1m1P9k3O7l13K86K36p3
2984C21q6j71L10k58Q0k27J24J87l26L96L2j97J10l52o5N09j51l92L17k60K36
$$ y = [28, 306, 14, 324, 279, -5, 252, 102, -163, 212, -16, 348, 508, 254, 419, 92, 311, -52, 178, 303, -60, 242, 419, -100, 105, 155, 135, 20, 63, 373, -259, 9, 193, -96, 230, -148, -169, 117, -136, -152, -110, -227, -141, -106, -194, -40, -313, -135, -369, -516, 89, -71, -219, 168, -326, -260, 4, -143, -116, 72, -193, -196, -236, -157, 32, -75, 70, -76, -206, 74, 58, -150, 70, -14, 141, 468, -91, -237, 95, 126, 133, -40, -135, 318, 127, 599, 79, 23, 283, 40, -7, 181, -86, 134, 58, -90, 57, -52, 72, -3, 112, 421, -47, -158, -197, -268, 163, 19, -185, 285, -325, -84, 109, -264, -173, -380, -423, -107, -121, -275, 51, 64, -57, -299, -168, -344, 204, -419, -42, -190, -541, 117, -116, -74, 334, -166, 206, -383, -284, 224, -277, 37, 312, -18, 274, 35, 14, 32, 103, 62, 141, 118, 185, -128, 158, 394, 321, 235, 64, 374, 116, 196, -31, 93, 280, -46, 350, 382, 185, 295, -57, -122, 387, 236, -156, 161, -99, 137]
3005A37j60j42L75l03J58j77kM52p56J79L15o27N75m13K11J42m16M35o1l03O91
3026C10n55j1L39m95J39k3p6M00K1j83J20j39j51K39kJ16j83j5N36l48j07J19
3048E1k89K34J93l03L31j18k49M01l48K10J48p3j15k15l7P8n7K71O2j19Qj8l8
3071Hk0J17M5j77m6L10n20M97m1k27R2l22M44j80j85P2J76j73j19L33qk26Q7k64
3095c27J12P8o6J12r3j01L34l20r6K61q2O53m34k83J72l5L9p5m1M50m25K37j74
3118a04l5L9L2L4L53k02L7r9L3P6k6K20l40L83o2m25J68J0N5o2n5K02j87l65M93
3143A73l12L76n5m38R30n86k05N41p38N96l17J90j27m32N36k27k56N31p29O19
3163G0J18n26N24o69K95j60K2K82l10N8P48p52L58j37l75M15k79L00J36m50M13
$$ y = [137, -23, -165, 210, -93, 65, -112, -114, 338, -418, -239, 76, -551, 24, -389, -178, -36, -452, -17, -78, -381, 310, -245, -256, 83, -412, -273, -296, -372, 28, 49, -134, -14, -153, -304, -65, -67, 49, -134, -149, 387, 39, -68, 51, -238, -4, 189, -114, 217, 99, -150, 251, -97, 113, 261, 188, 73, -142, -179, -101, -158, 113, 175, 56, 64, 46, 8, -12, 105, 150, -27, -73, 237, -283, 214, 173, -54, 38, -284, 160, -20, -205, -133, 43, -130, -249, 84, 76, -150, -63, -327, -215, -137, -203, -91, -184, -285, 49, -271, -367, -106, -188, 465, 31, -252, -80, -115, -76, -151, -192, 258, -167, 70, -104, -139, -100, -68, -34, 319, 117, 154, 55, 88, 164, 138, 358, 18, 401, 339, -86, 82, 92, 147, 85, 30, 232, 45, -320, 173, -139, 237, 182, -256, 674, 88, -117, 424, -314, 282, -35, 155, 28, -404, 132, -95, -351, 180, -549, 70, 188, -338, 186, -483, -188, -348, -326, -44, -354, -296, 452, -300, 58, -79, -454, -39, -318, -18, 118, -332, 81]
3184H1k06l0N19l74K62l01J18j15j49J95J22r7M79n46J66k3k68M22l73J58J70
3205B10j90r4k3J12L52j89M66o06M9J66l59L56l17J40m2J18J22j09j08K10m71
3226b07L12j92r6N91m41K42m25j03M54j14K1m3j74p2O2j5j77K33j7R9J70l79K2
3249b49K67l26O8J83l7P6j18P9P2Lrq7J30k3r1j17l27O02Rl12M77l42J00P1l2
3274F7l4l1O9J57N3k88K48k08J2J33j78K62k8J38k08k47K96j12Q2O5m65N30m45
3297a32L1O7J03J81k02L2M2k60K79j69J26M4n16O73m14k21M12n19L09Oj60N08
3319B20m05J58m4n03K88K10pJ99k68o7O7JK32o06O56p4l93M55l87J33L47m99M92
3342B05j37j68R7j70L87l33P0K43k97J51n2J33J50j77L17k06K5k09j0K72l93L19
$$ y = [81, -125, -155, 364, -10, 252, -49, 69, -46, -195, 0, 122, 25, 504, -42, 124, 101, -167, 255, -118, 40, 210, 20, -74, -97, 15, 367, 178, 644, 38, 87, 253, -106, 250, -67, 73, 31, 149, 271, 162, 54, 264, -207, 105, -87, -183, 408, -33, 209, -216, -319, 135, 21, 42, -1, -175, -247, -185, -200, -377, -144, -161, -62, 108, -271, -249, 18, -308, -240, -57, -94, -18, -136, -57, 15, 18, 9, -78, 52, 29, -62, -179, -506, 96, 105, -207, 270, -72, 28, 99, 67, 33, 2, 71, 228, 281, -7, 241, 33, 45, 178, 0, 262, 234, 372, 164, -83, 213, 101, 183, 248, -217, 313, -132, -101, -34, 69, 250, 48, 80, 122, -138, 141, -28, 98, 142, -374, 299, -115, -336, 76, -443, -134, -128, -288, 220, -185, -27, -71, -574, -286, -76, -83, 116, -152, -219, -152, -151, 81, -525, 131, 57, -336, 119, -268, -135, 212, -287, 205, 68, -100, -3, -173, 214, -119, -49, 194, -103, 48, -4, 129, 279, 102, 419, 213, 238, 29, 19, 291, -102, 217]
3364B17K3k16K58k9j46L9l89L03j16j59O60j68k16R1k54L21k6l80J98rJ56k50
3386i2k68K30j63L25J42m19J24p4k56K2L37j20J41k32L16j74J84j91m7K57k08
3407a66J00o3J32N3l86L48J79j34O4j80J16or6J74q5J67k6k50K30r8o5P9k85N50
3431C52k74j67K90k77L0J97j09L11r7j35j29L52l39J18J57j38n4Pj9j53Rl5J21
3454A8j07J33O9k18M9l22L57k4l25P65n14k8K70n81M18j79L7M96k73j72J01n03
3476e33O34l28k9K89l32K96j74p3L99j68K53k22j22J50q1K14j24j06J62p5k5K71
3498B76j00k80R4j14K65j42N5k25M6J84K2J68k29q7K48M8J17k54k81N03k69N3
3520I8p3j12K49k45j87K25j63M41j84l8K95l52K03l38J47Lm4K1J11k27K29L0l35
$$ y = [217, 240, 24, 282, 253, 107, 146, -243, 60, -56, -215, 445, 277, 61, 152, -102, 219, 193, -187, 11, 2, 158, -92, -360, -130, -293, 32, 174, -245, -121, -195, -451, -429, -92, -212, -71, -303, 13, -161, 23, -168, -215, 42, -166, -66, -129, 3, 56, -330, 18, 197, 63, 127, -53, 63, 57, -39, 135, 50, 217, 191, -59, 171, 73, 8, 87, -198, 352, 78, -89, 201, -76, -46, 151, 42, 353, 256, 121, -8, 344, 5, 123, 280, 142, 88, 95, 76, -77, -68, -103, 18, -89, 44, 113, -105, -56, -378, -21, -45, -370, 395, -119, -147, 123, -458, -40, -219, -182, 314, 41, -131, -30, -533, 101, -227, -256, 33, -299, -3, -177, -250, 149, -19, 234, 12, -110, 40, -41, 173, 49, -57, 105, 30, 5, 276, 176, -104, -10, -124, 141, -1, 54, -171, -125, 59, 81, 249, 20, -67, 181, 229, 346, 92, -189, 314, 45, 98, 25, -87, 162, -83, -270, -45, -208, 233, 49, 11, 306, -46, 157, -181, -34, -31, -75, -54, 57, -170, 59, 89, -246]
3543b46M58m48N5J69r3qj90K44L5M1Jj72K40k51L5K58k04m1K2M2j18k16O09k24
3567bk59N9K27J0J17j07K00r2j13r0r8K59K03k54K80l68R4O2K10k97N0j03Q3k73
3591b02L35n5J37k36J12L0j17j43r5K26%k0K06k17j04K4j92J72J46k09J05j21
3613b18M1J84k23k6J97o3P7j69J99o9j48L95l27J44qk03L29j12J36j88j64L06
3635I0r5o2J83k32O4J37j91L04k15L2r5j29K50l8J4J28o0k05L80k91N8k01K41
3658F7M0L1K2k3l4j49RJ71k61J57O3l5J23n4j42N9r4R4l5j04M22n40L42j0k06
3683h7L32m17K24j81j81K20j01K21l0j48J1Q9l0k8L6P9P9j27p7J01N7ok90K17
3707c7K53j00n2r3J42qj10j14p3L69j83p4K95k17m9j79K26L7j2q7L44k75L91k08
$$ y = [-246, 212, -236, -181, -12, -105, -113, -303, -59, -24, 17, 18, -154, 86, -165, -130, 128, -76, -117, -95, -53, -171, -387, 222, -2, -261, -202, 25, 35, 152, 45, 245, 153, 40, -50, -148, 111, 314, 60, 340, -28, 66, 128, 338, 41, 91, -12, 71, -202, 133, 78, 215, -21, 91, 121, 4, -139, -234, -8, -8, -28, 178, -39, -143, -119, -311, -139, 7, -202, -97, -218, -177, 7, -216, -242, -45, -108, -31, -200, -1, -70, -218, 177, -150, -6, -14, -217, 112, 0, 136, -52, -216, 90, -5, -67, 116, -116, -52, 85, -106, 198, -17, 15, -80, -209, 41, 3, 17, 145, 85, -120, 260, -31, 27, -174, 67, 107, 138, 160, 137, 103, -46, -37, 134, -127, 30, 93, 58, 181, 127, -15, 44, -50, 44, 9, -95, 327, -213, 129, 119, -87, 245, -172, 52, -129, -310, -90, -191, 30, 0, -148, -137, -48, -78, -106, -70, 9, 88, -39, -116, -15, 42, 36, -254, -37, 216, 116, 64, -29, 113, 105, -5, -119, -192, 177, -6, -80, 215, -2, -51, -230, -4, 33, 21, -66, 278, 3, 394, 186]
3731A86j76J50j67J83m6j45L14k06M7n7J70n37M76J18J35n56K37j60J64k36Q2
3752b4o4j61K15j08n6L42q3k01j08K11L5j23R4q2m9J05l1j04j3K44j33j3Q6j31
3776a52J42j12K39k52K68j90m7j56QO6K90k33Q9o1J92J08j39J82m58K83J68l09
3798g4Q9N6J05k76J76L5k18RJ69k2J31j87K23q7j16j4l5L71m34k00L53J55k17
3821hL7K9j77O0J11m1r2K07k80J2Ql21L70rp4M47o53L66L7o6j60L91k27p9k0K58
3847A26j95k8J20k6P7r4o0K95R5l78J69k0k90K88k45K20jq1J78k38J0P3J56k81
3871a30K10Q6k06K27k33MM5j15K64NJ07p9j21k63L55p2m4m5J34N2j69K86k39k10
3895a51M32l74J21l7MQk1j03q5J44P3n0n5J86j3l98M32j82l0JK32j26k02N5J1
$$ y = [186, 10, 160, -7, 176, 130, -15, 299, 93, 140, 83, 253, -284, 192, 310, 445, -111, 126, -34, 130, -106, -24, -88, -249, -34, -142, -198, 144, 61, -140, -248, -37, -2, -125, -31, -113, -162, -57, -88, -192, -205, 39, -94, -107, -21, -152, -10, -122, 117, -135, 133, -57, -104, -260, -252, -186, 104, -129, -40, -101, 91, 199, 60, 242, -216, 67, 235, -74, 15, 71, 176, -100, 76, 111, -107, -98, 71, 49, 180, -7, 216, 129, 13, -1, -36, 335, -99, -299, 54, 209, -8, 29, 58, -119, -59, 52, 11, -81, 126, -154, -142, -134, -455, -85, -94, -168, 279, -374, -8, 29, -37, -197, 194, -33, -112, -132, 126, -69, -97, 23, -3, 74, -20, -80, 215, 310, -68, 101, 81, -209, 79, -166, 54, 53, -28, 150, -88, -78, -5, 151, -130, 80, 166, -40, 187, -46, -42, 3, -112, 152, 157, 264, 185, 64, -199, 156, 84, 40, -5, 129, 181, 12, 298, 59, -151, 281, -93, 28, -9, -5, 3, -18, -121, -206, -62, 11, -39, -94, 92, 79, -319, 113, -69, -99, -98, 134, 8, -194, -139, -128]
3920a28j76Q6J89RJ45k79m6L19O4k85N8j5J2k9L4l6M9rJ70k14J99R3l05Q5J31
3945A21k71M08k48o8K27j68J25o6J45j86j13K73L62p40K21J0K54k98P1kj27k8
3967i8J32K3q1J44n6lo6J86r0q0kR4k28J0o9J40j00J45l06J94j1J03K02k34J37
3992H6o4j72L25k87N4K5j40J24Jj53K75l01m2L82m68M79n9k34P0J21N7N8J20k71
4016a4p7K88j07j49J63j02K3m3j37K11N0n7O9j29P1l9O7J60k00K7J5K34l08k56
4040b40K99J73p8l26K85J02k6l33O3J34M2J04M1k17m8rj07L92k06J97l94K96l50
4063b06J26J76k55J52o7J9k28J85O4q9K54j50k45J84J01J09j31k01K57k45K73
4084H3K31m23J65l67M52N3l64L33j9j37oN6J8k0j21J67Q2n2j09j69L56k82J22
$$ y = [-128, -304, -218, -29, -20, 125, -154, -200, 119, 183, -102, -44, -59, -47, -76, -42, -78, -29, -38, 132, -82, 117, 210, -95, -10, 121, -150, 258, 10, -58, 169, 1, 126, 60, 205, 19, -94, 179, 541, -199, 22, 32, 286, -12, 59, 57, -70, -98, 34, 57, -24, 120, 64, 61, -5, 181, 91, 11, 9, 103, -125, -115, -184, -44, -144, 1, -305, -111, -122, -19, 183, -51, 86, 22, -150, 175, -112, -58, -33, -173, -49, -48, -201, 74, -227, -269, 113, -355, 124, 65, -169, -99, 22, 79, 137, 257, -14, -91, 197, 90, -59, 104, 2, 25, -18, -155, 56, 106, 49, 118, -11, 60, 21, 88, 248, 48, 75, 90, 324, 16, -240, 59, 232, 154, -172, 113, 215, 189, -144, -81, 53, 95, 199, 240, 23, -25, -34, -141, 251, 45, 242, -152, 144, -206, -80, 96, -159, -7, -74, -55, -283, -98, -34, -123, 131, -19, -264, -80, 21, 130, -1, -202, 55, -190, 83, 314, -109, 56, -311, 141, 194, -170, 163, 144, 7, 1, 57, 75, 55, -66, 101, 183, 131, 22, -147, 209, -73, 49]
4107D9OL8J93k53m6K5m9J89k10o8K9K2L6J4M4j65j00L42j91O5k9j27L92k90K5
4132e9r0o0L09n2m06K40K29l09K42q7l9j70K10JN7J95k39Q0j61J8j16J0K05o5
4156e7k3M8M8r2mJ50J1j31M3m8P8K62j42k60K83j28J76k48j4Q4J69j25J03k53
4180g0J69Kk04M67l30j85L57k33K97k48m0L1j10K11p2J41l79K76q2j53L03Lj83
4203c2P7j1k06L10j09j48q5K14j58K63k15N6j02j23K04J66o1j1K15k62J00q2n1
4226e1K23q1k17K53k63K85k92J76J07k82j16L19l6K44l16JK24l16K26J71n05K43
4248cK97l49M8J02m7J93j90j74L15q5j36j8J64j13n1K46n74L00r3K0K18j7o5K1
4272Ij91K48pJ64j26Q8o7q5q8k53M15k06K61j90k47M38k22L7q6J74L1k38K27K5
$$ y = [49, 55, 93, 286, 33, -13, 12, -37, 152, -58, -126, -97, -75, -39, -25, 19, -146, -246, 96, -95, -30, -59, -186, 206, -84, -59, -149, -209, 100, 48, -358, -118, 111, -198, 44, -43, -82, -252, -42, -41, 16, 211, -28, 52, -109, -91, -207, -197, 8, -57, -80, -32, 16, -76, -80, 70, 81, -50, -7, -55, 23, 285, 143, -117, 166, 38, 214, -34, -48, 36, 205, 80, 183, -70, 99, 101, -103, 364, 34, -151, 206, -27, 270, 22, -18, 13, -97, 114, 42, 183, -196, 80, -2, -155, 148, 151, -32, 45, 34, -172, 138, 29, -119, -204, 10, -148, 115, -100, -44, -146, -269, -65, 101, 40, 29, 244, -18, 82, 0, -51, 172, 91, -126, 127, -136, 149, -143, 33, 140, -142, -258, 61, 25, 269, -47, -46, 178, -138, 88, 259, -246, -3, 294, -55, -7, 95, 48, 241, 51, -123, 192, 107, -29, -47, 117, 4, -47, 199, -375, -75, -168, -148, 70, 53, -12, 9, -182, 66, 59, 223, 97, 185, 118, 33, -55, -308, 107, -99, 162, -28, -275, 163, -59, -22, -108, 66, 97, -141, 86, 111]
4296A11j24m4p7N3J01k87J53K29l18R9p2L5K9J69j37J61l41L02q3J02o4O4K10
4319B71k05J28r3j83J03J02KL8K8o1j35K95m71K6O2O0J41k5%l1j85J43p8l1P7
4344b2L3j91L79l49K36j6k48K28j26n7J69k27j42L05mq1j8j2j18J62Q1J72l29
4367a75J23k16K40p5J00k4l5O1M3N9onQ4p4k38K73j90K35j38j25L35j53j63J24
4391F0o1J07k86K66Ol76M08j71p2M06N3j06k87J46O7l5JJ19l29L56l46O6J77k07
4415c8m4J63l9J33j44k66K17J12Q3q9j86L38k48j3r3j14K11m7j01K71j85K6m1
4438i4r9p1K13J34m7J30j88j82J37P9J20k20o9Q7J5N4j52J4K7j4L2P4O1p7J09
4463G3q8J16j44j11J61n5p2J14J54q2k29n6L91j83O7j4r3K10Ml13J77J52k50n1
$$ y = [111, -13, -57, -134, -81, 20, -267, -114, 115, -203, -104, -176, -141, -112, 57, -80, 81, -260, 42, -41, 61, -3, 61, 271, 66, 194, 101, -82, 21, 123, 125, 163, 191, 130, -5, 290, -181, -155, -93, -33, 108, 83, 83, 52, -133, 10, -68, -99, -22, 11, -180, 199, -150, 86, 70, -178, 50, -76, -133, 36, -191, -333, -28, -32, -113, -131, -143, -261, -99, -18, 154, -175, -52, -268, -28, -103, -3, -27, -62, -1, 42, 101, 95, 90, 174, 100, -138, 135, -55, 180, 42, -83, 252, 99, -64, 60, -1, 106, -180, 86, 92, -284, 124, -47, -119, 287, 340, 234, -53, 93, 160, 125, 126, 245, -84, 272, -74, -8, 169, -38, -82, 81, 42, 175, 31, -235, -18, 94, 177, 88, -98, 240, -8, -21, -114, -228, -17, -64, -165, 106, -79, -53, -94, -193, -264, -51, 83, 36, 166, -22, -204, -67, 12, 132, -88, -157, -70, -55, -1, -153, -139, -112, -126, -94, -20, 41, -36, 73, -15, 101, -43, -154, 7, -48, -120, -6, 148, 66, -163, -219, 172, -11, 56, 42, -51, 159, 163, -150, 27, 179, -71, -122]
4487a22KJ5J52L3n3p9rO4J48k52K01k74J59J13j88K61l4p2j37m2J86m1K70l73
4511g2o0P6O4k44J70k50L83j78J84K4j92J27k0p6kk5J15J9j13J2J19j45L10l09
4535h3L39l00L2o5K90j71k55k7K70j81L18J19m03R4O3j42J79J57j12l17L21J3
4557A39l44J60Nl04K30L02j23J48k39j9M3l2k25L16j50J71k86J26J38j95J53k36
4579b22J49L8J29l8j76K04P4r7j62J67L8n5l8p7j7j25N4K89k89J55J42l00K27
4602G0k99K03J61j05J60k19L6JN5l8r3K86j1j74P5j22J84J4j52k54J13K42j02
4625C1k29J77J44r4N8r4J07j94N1L39m38J74K06l28P8K4l4P2O3k07R7j44L89m72
4649b24K90N6j28j73Q6Q8Q9j95J17j28M7J63j37oJ8O5K9P8n5k21J93j15m6O0j72
$$ y = [-122, -120, -105, 47, 80, 27, -52, -61, 3, 151, -101, 100, -174, -15, 98, -90, 171, 137, 65, -72, -114, 72, 31, 301, -72, -132, -56, 8, -236, -66, -316, 67, -111, 73, 97, -95, 32, 12, -64, -66, -91, 24, 43, -70, -58, 61, -84, 226, -83, 256, -44, -12, -77, 213, 42, -213, -240, 30, -151, 167, 286, -117, -23, 40, -102, 77, 234, 122, -195, 126, 139, -205, -45, -40, -344, -114, 188, 65, 213, -26, -45, -2, -34, -259, 57, -93, 78, -208, -82, 56, -139, 14, -222, -73, -35, 94, 56, -120, 84, 158, 61, -101, 66, 104, 49, 11, -66, -83, -208, -154, 135, -154, 1, 143, -157, 70, -229, -26, 135, 30, 190, -29, 7, 8, 63, 25, -68, 218, 207, 33, 108, -14, 170, 184, 32, -222, -109, 133, 31, -198, -21, 123, 29, 87, -7, 100, -94, -43, 296, -142, 32, 238, -90, -12, 12, -22, 50, 113, -94, 3, -141, 248, -224, 66, 122, -6, -179, -93, -5, 84, -111, 6, -122, -75, 88, -49, -55, -37, 28, 57, 135, 80, -141, 52, -63, -109, -49, -221]
4674b21J38j43p8K49Q4K06n14J81J28j17K04j37m2R4Q5N1j71r5O2J17k2j28R7
4697B8j0O5j47R2q2k1K08k11J05N2j35p5J50O6o3k40L30l2j27J44j47R3j59Q2
4721c4r3K6K19j44j78J05m4J16J00q2m6J72jk21p4L31l36J72K1J49j92J35m0J37
4745A98k99K09q8o2l8q0Q5q7J59K35l49J21L3j90J21j10J28J12l39L00J48k42
4767c5K4k10L24j35K39k15K90k36o7k2J83M1k42L47k09N7k56K15Q5j73j71J10
4789e6n7J7L07l4n8J19k02k29R9K49l10P4l4N4M2k8L0M2k61J55j96N34l57r2K90
4814I8k62K11j39R8J3J49l42P3M1K95j66k12K78m9k47J3J95k95K38N2J38j48l3
4837aP6jj21Q3J62j74m7n4JJ08L6R2j89M6j88K76j96R0j83L98k00M8J2k21J62
$$ y = [-221, -83, -226, -304, -55, 29, 235, -279, -98, 30, -87, 117, -20, -62, 32, 117, 168, -3, -98, -36, 81, 59, -69, 28, 18, 83, -64, 28, -54, -75, 133, -78, 27, 79, -56, -131, 19, 85, 22, -218, 112, 80, -47, 97, -50, 43, -116, -34, -127, -101, 118, -26, -204, -99, -143, -27, 73, -9, -55, 117, 116, -105, -179, 152, -184, -12, 9, 158, -34, 101, 61, 198, -101, 108, 20, -42, -80, -160, -75, -162, -3, 232, -117, 4, 37, -153, -32, -142, -14, 98, -241, 59, 207, -35, -11, -221, 103, -32, 207, -8, 282, 46, -21, -43, 140, 181, -61, 286, 77, 134, -122, 93, 178, 5, -166, -56, -113, -96, 211, 177, 119, 238, 36, -193, -94, 155, -155, -81, -115, -61, -19, -47, -17, 25, -236, -81, -277, 257, -100, -192, 98, -164, 47, -92, 6, 19, 168, -174, -101, -60, 235, 69, -143, 135, 86, -161, -148, 47, -248, -10, 42, 180, 32, -1, 75, 74, -47, 36, 198, 24, -23, -77, -76, 32, 68, 160, -29, 17, -171, 105, -91, -1, -184, 214, 14, 62, 74, -147, 15]
4862A5mqj42J72J75L5k87j38K70q2J53k33p7J84j93K36j62j08n6L7K28j61L4L1
4886h1J60l53L86k29J30Jk79K33j30m9J56M8l1J37r1j35K79l32J27MJ08J22p0
4909A11j76J66J38j06q5j75K62j29k64L47j15L9k51L74j37J41m8k5k26K89o5j94
4931a29J42j37J93k8J78p6r0j43J38L3J38q3J00l11J4n8j44L32m09L30R5J93k86
4954hJ17k13J42k5J02q3m4O2j03n5j1j17k0M26k46L9o1k9J18j3j4K56l18P8J0
4979a0m2K7P5p2j8J72j51l0N6P1R9j61j30N5J76K41l41Q3K9j39K86j98j9j95P0
5004f6m8J87j69N2J48k77K17Q1j95k4J17r1M6j36J78k9J11K3k95M45k93J59j72
5027c1J71m0k03M1P8j0O7j64k09L70m0l8r0r8M0J62p1m5M0QJ7M4O2j0k11L81J3
$$ y = [15, 11, 3, -139, 33, 208, 243, -44, -182, 88, 6, 159, -74, -151, 33, -160, 76, -86, -194, -250, -213, 15, -146, -112, -81, 79, -274, 112, -117, 13, 14, -265, -32, -162, -211, -55, -7, -38, 99, 8, -127, 152, -180, -53, -49, 59, 181, 111, -65, 101, 239, 133, 48, -127, 135, 6, -258, 89, -26, 13, -238, 136, -1, 140, 92, 67, -159, 130, 65, -129, 13, -124, 69, 41, 219, 143, 53, -90, 48, 81, 219, 136, 236, -75, -61, -119, -263, 69, -340, -10, 85, 278, -8, 109, -104, 38, 13, 115, 32, -12, 50, -53, -108, -119, -236, -256, 170, -76, -37, -98, -127, -9, -22, -36, 220, -98, -20, -10, -52, -25, 50, -22, -40, 132, -19, -49, 7, 78, 177, 16, -114, -59, 117, 358, 17, 100, 129, -10, 276, 78, 59, -136, -66, -114, 73, -96, -44, 104, -173, 44, 125, -70, -94, 23, -68, -22, -158, 20, -9, 102, 125, -170, 275, -18, 141, -31, 140, 100, -103, -62, 16, 6, 73, -91, -300, 70, 30, -8, -98, -196, -156, 6, -65, -110, -70, -62, -45, -1, 61, 51, -160, 221, 234]
5054B34j69k00J35j43N6J24j02J47l3r0O8o8K59k89R7O2l00J66M2j12K95j67j78
5077a66K08Q6r3N7k73J11K06k30J21M9LK3K3k41K35p7k75K41m5N5J59j58K07l4
5101A92k44J37j43k57K82J38j43L28l75J92j26J44k15P7N2j1p4Q3j85J3K6K27
5123A18q1O2Q7k65J9K06Km10L48R6k61N1J37k70k8L37k10J1O9J17m7j41J2O3O1
5148H3O1j39K32o9j31Q3j85J04l8J42k07j16J77j8j3K20m06n8J47p2K57j04o2
5171a12R2O0J81l64J51J02l69L12j65m3J9J46j57%M8K27l7o9o4m2o7k74K21Q3
5195a21K09j26J30k01mL15j66k2N7j57L1J11j78L11K3k58l8q7K35r8J64k25P0
5218b5J1L2n9J58k6M8r9j40R1r8J4J84k6k22K6K32l07N6K24n8q6J17j76J70K9
$$ y = [234, 65, -135, 0, -143, -87, 37, -65, 82, 49, -41, 27, -41, 218, -71, 26, 88, -212, -46, -4, -116, 179, 12, -166, 42, 128, 35, 92, -181, -70, 136, -94, 27, 76, 79, 102, 125, -116, 119, 42, -233, 8, -37, 18, 177, 19, 226, 192, -52, 85, -58, -315, -33, 105, -38, 290, -85, 107, -19, 125, -90, -13, 39, 28, -46, 37, -148, -135, -109, 118, 37, 99, 186, -79, -60, 146, 148, -262, 86, 182, -79, -28, 109, -161, -189, 148, -62, -51, 18, 135, 88, -53, -41, 22, 83, 144, 5, 237, 168, 37, 120, -65, 39, 1, 143, -64, -180, -3, -21, -34, 186, -220, -278, -131, -203, 54, -50, -112, -20, 40, 221, -143, 8, 110, -259, 53, -112, -155, -136, 10, -147, -147, -99, 128, 91, 22, -42, -84, -151, -425, -204, -121, 88, -38, 92, -109, -113, 202, 36, 14, 71, -86, -55, 56, -122, 189, 212, -46, -84, -171, 64, -34, 130, -95, -25, -14, 18, -41, 117, 91, 139, 40, -100, -9, -107, -93, 91, 65, -157, -131, 101, -206, -150, 74, 16, -70, 47, -129, 41, 70]
5243G0J30l06K55j28j71K18K4kk30J35Kk3J23J5pj99J58j3j59O7J20r3r4j1K29
5268A10j82P9R0j16Q0K1k42K46O3m46O1L6L38k32J30j36J71J9j55J14j30k24L36
5291C1k28N3K22j96P4L1J2J79j21k55J37NJ07l1j13O3K28L6k51R1k4k33K95k77
5315a65MJ49J7o0Q6m1l1J1j00m9N0M9j63J36K48J19l86R0o6J09n9P4j4l5K08l26
5341a45m4L63k04K8Rp3Q9K07N0k35m5o5j78K68l14K90k17K05L9j66j3J03J07k5
5365C4j08L9K3j33o3J28O0j3P5K7Qk36K76j14j10J08o3J46k29L05J69l46J02k6
5389E9m2J6K21l73P6j39J21qO2k84K86J1P8J86k07O7q5N9j19P1k7P3p0j19L38
5414B51l07m8P5j50o8J31R1J39j13K04o9k82l2L36o7p4J90L2l32N0J03k54J66
$$ y = [70, 200, -106, 149, 21, -150, 68, 92, 90, -140, -5, -3, -26, 97, 112, 105, -94, 64, 51, -108, -41, 79, -14, -108, -119, 110, -72, 7, 97, -19, 61, 82, -160, 86, 149, -297, -236, -200, 138, -94, 36, -100, 71, 90, -65, 49, -81, -305, 31, -197, -144, 78, -118, -44, -13, -1, 178, 57, -198, -61, -56, 51, 20, -93, -30, 198, 234, -17, 74, 50, -183, 112, -165, -161, -12, 5, -55, 31, -10, -41, -30, -130, -179, -129, -80, -243, -107, 141, 260, -126, -36, -102, 7, -52, 22, 8, -27, 181, -145, -189, 174, -30, -2, 7, -66, 23, 230, 280, 45, 0, -65, -243, 25, -289, 1, -216, -11, 28, -138, -151, -48, 59, 34, -74, -35, -12, -145, -208, -80, -20, -33, 42, 69, 77, -159, 117, 3, -107, 1, -62, 84, -145, 160, 329, -17, 85, 59, 17, 33, 254, -119, -43, -182, -61, -69, -7, -291, -5, 6, 84, 270, 63, 130, 45, 104, -15, 56, 29, 102, 32, -87, 251, -56, -104, -29, -179, -247, -116, -25, 114, 1, 205, 136, -146, -178, 158, 91, 17, 207, 239, -93, -43, 60, -194, -28]
5437b8J01j12o6j67K56J32k2k78L23j97R5N3J1k2p3j01K9K89k57M0J07l42K13
5460a6L4qPr9M5J05j04o4K75K69n36J49m9Oj13L04l26P7P1j33K17n6l3k49L65
5485A38j90J43q6j95O3O8O7j92K23k02K20j65J90k08J87J4k79K59j81K91l65M76
5507B76k29O8Jj31R3N3k60J90R5j39k62J94K2O9k04L0M08j48K9j56qj56K05N3
5531I3k88J03m3L37j77P3o2l16K45m1m0J57P6k59N0jo0J63Q7p8j20M6K35O8j07
5556A41M8j38j88J08l1J47l5O5j05J87l82K33j66J77k2K9j36K5L3m9K37j90K45
5579B33j83l33L50l03L63k34j08J18J75k19K09j91k3J78p1j33n2K55J69k55q2
5600a37P3j91R4K81M6k24L6p3j29K13J0Q3Ko5Mj14L6J56j77J68j80R7J72m51O7
$$ y = [-28, 73, -39, -105, -272, -16, 116, 94, -184, 139, -58, 37, 90, 101, 79, 6, -95, -66, 223, -34, 6, 113, -229, -16, 18, 10, 17, -82, -37, 68, -36, -100, 175, 444, -92, 57, 8, 14, -99, 205, -121, -44, 27, -106, 111, 55, 22, -227, 138, -52, 91, 5, -190, -127, -59, 8, -184, 39, -163, 57, -108, 82, -126, 61, 75, -204, 55, -126, 165, -200, 276, 47, 115, 116, -15, 78, 131, -129, 61, 156, 17, -245, -51, -29, 40, -164, -134, 274, 126, 155, -1, -9, -165, 40, 93, -195, -92, -135, 202, 25, 98, 36, -280, -35, -76, -116, 41, 117, -142, -92, -93, -153, 10, 97, 19, -101, -55, 180, 248, 141, 189, 51, -137, -29, -60, 87, 52, 117, 12, 199, -183, 50, -116, 61, 39, 68, -68, -43, -10, -59, 178, -12, 233, 50, -283, 67, -236, 127, -107, -215, -97, 78, -141, 68, -123, -146, 32, -39, -172, -224, 31, 200, -55, -137, -64, -255, -161, 120, 166, -58, -22, -95, -224, -11, -1, 82, 84, 19, 23, -91, -55, 101, -76, 92, -88, 9, 181, -270, -203]
5625b03J85OK8j13N9O8q0j94L77k3k79q9K47P1J63k56l01K59K70k50N4N0j09J00
5649D0k97L92k64%K22p8m8K3q8l6J83Q7j6l45M60l44M72o01L47J6o4K3j67J47
5673F4J95l72J12J79k88K31L5R3k71jM2M2N2j97J3L2Q8j82K9p0K77j51J48O4j97
5698c3j6j64OJ51J02j77J20K38l55J44K35j56q3J37r0j19K12o1k94J47K3m4k1
5721i8R8j49J15K2L8j83P3J86j75J12K30m35K17j47K63k85Q8L02j98l1j7K5O2
5744A13m1j96K33q8j46J1m9K80j97J38N4k01M0N6K36k65Q5P6k01L1j20J53j8q5
5768a01N0J67k00Q6j8L8J29j75q2M5J30k75J80j68J70J04j19j16o0jJ53P2L7J91
5792B37n1l33qm1O1n4J51J86o4l5r2l1j49K76p5j00nO4p3P5P9j24J93j71M6K66
$$ y = [-203, -18, -12, 16, -97, -38, 30, -50, -244, 133, 110, -169, -258, -11, 60, 223, -33, -334, -75, 195, -55, -1, 49, -60, 40, -257, 135, -129, -129, 93, 15, -33, -10, -98, -134, 49, 136, 120, -225, 235, -109, 363, -238, 109, 125, 61, 84, -83, 64, 259, -113, -1, 178, -110, 121, 156, 249, -22, -23, 19, 61, 113, -84, -71, -39, 49, -133, -104, -174, 103, -48, 100, 164, -33, -49, -213, -207, -56, 46, -131, -11, 227, -128, 16, 251, 95, 12, 149, 59, -60, 152, 91, -203, -56, -33, -77, -98, 0, -149, -34, -12, 26, -157, -84, 102, -73, 39, 269, -166, 51, -96, 167, -118, -30, 272, 74, 43, 26, 51, 113, 72, -124, 109, 21, -125, -114, -163, 117, -80, 58, 112, -89, -49, 7, 243, -22, 63, 139, -62, -31, -151, 2, -16, -101, -51, 116, -84, 2, -16, 22, 151, -24, -106, -61, 69, -206, -26, -194, -24, 80, -39, -155, -215, -216, -63, 9, 46, 237, 186, -147, -155, -196, -135, -189, -38, 148, 84, 49, -43, -74, -223, 53, -22, -122, -127, -63, -136, -61, 18, -106, 87, -84, -38, 228]
$$ [...]
8191A3
##END NTUPLES=NMR FID
##END=
