##TITLE=1H_SL71-DAU(CHCl3)
 CDCl3
 8 sc, 
 23.09.2022
##JCAMPDX= 6.0         $$ Bruker NMR JCAMP-DX V2.0
##DATA TYPE= NMR FID
##DATA CLASS= NTUPLES
##ORIGIN= UXNMR, Bruker Analytische Messtechnik GmbH
##OWNER= root
$$ XWIN-NMR		Version 3.5
$$ Fri Sep 23 12:39:01 2022 Russian Standard Time (UT+4h)  she@DPX200
##.OBSERVE FREQUENCY= 200.1313499994
##.OBSERVE NUCLEUS= ^1H
##.DELAY= (6, 6)
##.ACQUISITION MODE= SIMULTANEOUS
##.ACQUISITION SCHEME= undefined
##.AVERAGES= 8
##.DIGITISER RES= 18
##SPECTROMETER/DATA SYSTEM= spect
##.PULSE SEQUENCE= zg30
##.SOLVENT NAME= CDCl3
##.SHIFT REFERENCE= (INTERNAL, CDCl3, 0, 15.7039)
##AUDIT TRAIL= $$ (NUMBER, WHEN, WHO, WHERE, WHAT)
$$ ##TITLE= Audit trail, XWIN-NMR		Version 3.5
$$ ##JCAMPDX= 5.01
$$ ##ORIGIN= Bruker BioSpin GmbH
$$ ##OWNER= she
$$ F:/spectra/data/she/nmr/H-F/1/audita.txt
$$ ##AUDIT TRAIL=  $$ (NUMBER, WHEN, WHO, WHERE, WHAT)
(   1,<2022-09-23 12:37:43.07 +0400>,<she>,<DPX200>,
      <created by zg, POWCHK disabled, PULCHK disabled
       configuration hash MD5:
       00 E9 B6 7A A2 85 ED C7 34 08 36 98 17 FE 4E 26
       data hash MD5: 16K
       C7 F9 BD 0F AB 5B 46 4F 9B 5F F9 03 35 C5 A9 38>)
$$ ##END=
$$ 
$$ hash MD5
$$ 74 FC 9F 44 96 C9 D3 16 F6 E1 46 9C 52 BF 61 F5
##$RELAX= 
##$RELAX= 
##$RELAX= 
##$RELAX= 
##$RELAX= 
##$RELAX= 
$$ Bruker specific parameters
$$ --------------------------
##$DU= <F:/spectra>
##$EXPNO= 1
##$NAME= <H-F>
##$PROCNO= 1
##$TYPE= <nmr>
##$USER= <she>
##$AMP= (0..31)
100 100 100 100 100 100 100 100 100 100 100 100 100 100 100 100 100 100 
100 100 100 100 100 100 100 100 100 100 100 100 100 100 
##$AQSEQ= 0
##$AQ_mod= 1
##$AUNM= <au_zg>
##$AUTOPOS= <>
##$BF1= 200.13
##$BF2= 200.13
##$BF3= 200.13
##$BF4= 200.13
##$BF5= 200.13
##$BF6= 200.13
##$BF7= 200.13
##$BF8= 200.13
##$BYTORDA= 1
##$CFDGTYP= 0
##$CFRGTYP= 5
##$CHEMSTR= <none>
##$CNST= (0..31)
1 1 145 1 1 1 1 1 1 1 1 1 1 1 1 1 1 1 1 1 1 1 1 1 1 1 1 1 1 1 1 1 
##$CPDPRG= <>
##$CPDPRG1= <>
##$CPDPRG2= <>
##$CPDPRG3= <>
##$CPDPRG4= <mlev>
##$CPDPRG5= <mlev>
##$CPDPRG6= <mlev>
##$CPDPRG7= <mlev>
##$CPDPRG8= <mlev>
##$CPDPRGB= <>
##$CPDPRGT= <>
##$D= (0..31)
0 1.2 0 0 0 0 0 0 0 0.06 0 0.03 0 0 0 0 0.0002 0 0 0 0 0 0 0 0 0 0 0 0 
0 0 0 
##$DATE= 1663922262
##$DBL= (0..7)
120 120 120 120 120 120 120 120 
##$DBP= (0..7)
150 150 150 150 150 150 150 150 
##$DBP07= 0
##$DBPNAM0= <>
##$DBPNAM1= <>
##$DBPNAM2= <>
##$DBPNAM3= <>
##$DBPNAM4= <>
##$DBPNAM5= <>
##$DBPNAM6= <>
##$DBPNAM7= <>
##$DBPOAL= (0..7)
0.5 0.5 0.5 0.5 0.5 0.5 0.5 0.5 
##$DBPOFFS= (0..7)
0 0 0 0 0 0 0 0 
##$DE= 6
##$DECBNUC= <off>
##$DECIM= 32
##$DECNUC= <off>
##$DECSTAT= 4
##$DIGMOD= 1
##$DIGTYP= 9
##$DL= (0..7)
0 120 120 120 120 120 120 120 
##$DP= (0..7)
150 150 150 150 150 150 150 150 
##$DP07= 0
##$DPNAME0= <>
##$DPNAME1= <>
##$DPNAME2= <>
##$DPNAME3= <>
##$DPNAME4= <>
##$DPNAME5= <>
##$DPNAME6= <>
##$DPNAME7= <>
##$DPOAL= (0..7)
0.5 0.5 0.5 0.5 0.5 0.5 0.5 0.5 
##$DPOFFS= (0..7)
0 0 0 0 0 0 0 0 
##$DQDMODE= 0
##$DR= 18
##$DS= 0
$$ [...]
##$SUBNAM2= <"">
##$SUBNAM3= <"">
##$SUBNAM4= <"">
##$SUBNAM5= <"">
##$SUBNAM6= <"">
##$SUBNAM7= <"">
##$SUBNAM8= <"">
##$SUBNAM9= <"">
##$SW= 18.0517283424941
##$SWIBOX= (0..15)
0 0 2 0 0 0 0 0 0 0 0 0 0 0 0 0 
##$SW_h= 3612.71676300578
##$TD= 16384
##$TD0= 1
##$TE= 0
##$TE2= 300
##$TE3= 300
##$TEG= 300
##$TL= (0..7)
0 120 120 120 120 120 120 120 
##$TP= (0..7)
150 150 150 150 150 150 150 150 
##$TP07= 0
##$TPNAME0= <>
##$TPNAME1= <>
##$TPNAME2= <>
##$TPNAME3= <>
##$TPNAME4= <>
##$TPNAME5= <>
##$TPNAME6= <>
##$TPNAME7= <>
##$TPOAL= (0..7)
0.5 0.5 0.5 0.5 0.5 0.5 0.5 0.5 
##$TPOFFS= (0..7)
0 0 0 0 0 0 0 0 
##$TUNHIN= 0
##$TUNHOUT= 0
##$TUNXOUT= 0
##$USERA1= <user>
##$USERA2= <user>
##$USERA3= <user>
##$USERA4= <user>
##$USERA5= <user>
##$V9= 5
##$VALIST= <valist>
##$VCLIST= <CCCCCCCCCCCCCCC>
##$VD= 0
##$VDLIST= <DDDDDDDDDDDDDDD>
##$VPLIST= <PPPPPPPPPPPPPPP>
##$VTLIST= <TTTTTTTTTTTTTTT>
##$WBST= 1024
##$WBSW= 4
##$XGAIN= (0..3)
0 0 0 0 
##$XL= 0
##$YL= 0
##$YMAX_a= 308706
##$YMIN_a= -448676
##$ZGOPTNS= <>
##$ZL1= 120
##$ZL2= 120
##$ZL3= 120
##$ZL4= 120
##$ABSF1= 10
##$ABSF2= 0
##$ABSG= 5
##$ABSL= 3
##$ALPHA= 0
##$AQORDER= 0
##$ASSFAC= 0
##$ASSFACI= 0
##$ASSFACX= 0
##$ASSWID= 0
##$AUNMP= <proc_1d>
##$AZFE= 0.1
##$AZFW= 0.1
##$BCFW= 1
##$BC_mod= 2
##$BYTORDP= 1
##$COROFFS= 0
##$CY= 11.3945322036743
##$DATMOD= 1
##$DC= 2
##$DFILT= <>
##$DTYPP= 0
##$F1P= 2.36226072786647
##$F2P= -0.459571619588291
##$FCOR= 0.5
##$FTSIZE= 0
##$FT_mod= 4
##$GAMMA= 1
##$GB= 0.15
##$INTBC= 1
##$INTSCL= 1
##$ISEN= 128
##$LB= 0.24
##$LEV0= 0
##$LPBIN= 0
##$MAXI= 10000
##$MC2= 0
##$MEAN= 0
##$ME_mod= 0
##$MI= 1.114404
##$NCOEF= 0
##$NC_proc= 0
##$NLEV= 6
##$NOISF1= 3.799351
##$NOISF2= 2.8
##$NSP= 1
##$NTH_PI= 0
##$NZP= 0
##$OFFSET= 15.70392
##$PC= 1
##$PHC0= -18029.64
##$PHC1= 3.400695
##$PH_mod= 1
##$PKNL= yes
##$PPARMOD= 0
##$PSCAL= 0
##$PSIGN= 0
##$REVERSE= no
##$SF= 200.130013532006
##$SI= 16384
##$SIGF1= 3
##$SIGF2= 2
##$SINO= 400
##$SIOLD= 16384
##$SREGLST= <1H.CDCl3>
##$SSB= 0
##$STSI= 0
##$STSR= 0
##$SW_p= 3612.71676300578
##$SYMM= 0
##$S_DEV= 0
##$TDeff= 0
##$TDoff= 0
##$TI= <>
##$TILT= no
##$TM1= 0
##$TM2= 0
##$TOPLEV= 0
##$USERP1= <user>
##$USERP2= <user>
##$USERP3= <user>
##$USERP4= <user>
##$USERP5= <user>
##$WDW= 1
##$XDIM= 8192
##$YMAX_p= 0
##$YMIN_p= 0
$$ End of Bruker specific parameters
$$ ---------------------------------
##NTUPLES= NMR FID
##VAR_NAME=  TIME,          FID/REAL,        FID/IMAG
##SYMBOL=    X,             R,               I
##VAR_TYPE=  INDEPENDENT,   DEPENDENT,       DEPENDENT
##VAR_FORM=  AFFN,          ASDF,            ASDF
##VAR_DIM=   8192,          8192,            8192
##UNITS=     SECONDS,       ARBITRARY UNITS, ARBITRARY UNITS
##FACTOR=    0.0002768,     1,               1
##FIRST=     0,             0,               0
##LAST=      2.2672688,     0,               0
##MIN=       0,             -448676,         0
##MAX=       2.2672688,     308706,          0
$$ Real data points
##PAGE= N=1
##DATA TABLE= (X++(R..R)), XYDATA
$$ [...]
2393B633M16m96Q97l68k416k578o25m70m18k64K251K328J128R8P70Q33j420k816
$$ 2633 3049 2553 3450 3082 666 -1912 -2537 -3007 -3425 -3689 -1438 890 2018 2116 2886 3719 2299 -517
2411e17r84k31j586q16J587K617R51P66J493Q57j181j736j135r33j835j458Q12
$$ -517 -1501 -1732 -3318 -4134 -2547 70 1021 1787 3280 4137 2956 1220 85 -848 -2683 -4141 -3329
2428c329J738O28J346K113J365q33j047p26r96k113j844L06O42K49J443K234J857
$$ -3329 -1591 -963 383 2496 3861 3028 1981 1255 259 -1854 -3698 -3392 -2750 -2501 -1058 1176 3033
2445C033j99qN9q11k663j907j65J75o78N40K672K057K83J63J226o03k485k424
$$ 3033 2834 2826 2885 2074 -589 -2496 -2661 -2486 -3164 -2624 48 2105 2388 2551 3777 3174 689 -1735
2463a735L7n97j355j34K162K474N52K06J787N23k027k102o87n87j724q69J729
$$ -1735 -1698 -2295 -3650 -3784 -1622 852 1404 1610 3397 3920 1893 -209 -896 -1483 -3207 -4076 -2347
2480b347J777O97M66K271J281r85j886o49q53k157j338M93J566M11J146K026J570
$$ -2347 -570 127 593 2864 4145 3160 1274 625 -228 -2385 -3723 -3230 -1664 -1253 -107 1919 3489
2497C489k96j162l71r87k085j728K09K43K22J065K191J337N45j42J08q61k115
$$ 3489 3193 2031 1660 673 -1412 -3140 -2931 -2688 -2466 -1401 790 2127 2672 2530 2638 1777 -338
2514c38j501n10n73k72O35K398J984K44M23J256q01k031j583l49q38j410j04J798
$$ -338 -1839 -2349 -2922 -3194 -2559 -161 1823 2067 2490 3746 2945 914 -669 -1018 -1856 -3266 -3370 -1572
2532a572J741N99O61J913M34j979j706n09n96k221p11J344J594K79J078K439R92
$$ -1572 169 768 1429 3342 3776 1797 91 -418 -1014 -3235 -3946 -2602 -1008 -729 349 2788 3780
2549C780j401j265o3q73k308j201R11J197k16R17K335J802n10r62Q6r43k205j895
$$ 3780 2379 1114 1051 178 -2130 -3331 -2420 -1223 -1439 -522 1813 3615 3105 2143 2229 1286 -919 -2814
2567b814KL08q2M76K154J818L90l4M50n56k156j697o91k49l22O85J798J361Q50
$$ -2814 -2812 -2504 -2586 -2110 44 1862 2252 2218 2668 2112 -44 -1741 -2432 -2681 -3003 -2318 -520 841 1691
2586A691Q58J223p78j636j241p31j006j509M62J350J304M34R73J684j74j313r86
$$ 1691 2549 3772 2994 1358 117 -614 -1620 -3129 -2667 -1317 -13 421 1394 3078 2904 1591 605
2603F05l64j804k115l22J670M84N92J577K408L55p92o69K09j325k541p03P33O28
$$ 605 241 -1563 -3678 -4000 -2330 -1846 -1254 323 2731 3086 2294 1625 1834 509 -2032 -2735 -2002 -1374
2621a374n40J548K536R97o16m17L53j089k379j501K98j94q12O90K309J656k4J02
$$ -1374 -1914 -366 2170 3167 2551 2134 2487 1398 -981 -2482 -2184 -2378 -3190 -2500 -191 1465 1441 1543
2639A543P94l50k105j535o0l25j032L08K090J725L60Q84J226l8j606j471m96j217
$$ 1543 2337 1987 -118 -1653 -1713 -2038 -3070 -2762 -672 1053 1413 2297 3523 3485 1879 408 -88 -1305
2657a305j336j05J284Q22N95J172J502J1j031q18n85j713j758m3P21P59N05J435
$$ -1305 -2641 -2746 -1462 -640 -45 1127 2629 2640 1609 791 206 -1507 -3265 -3308 -2587 -1828 -1323 112
2675A12J708O61l35k86K04j441k150n35O48j56l4J303K373P71l85J56O3j024k330
$$ 112 1820 2481 2146 1860 2064 623 -1527 -2062 -1414 -1570 -1604 -301 2072 2843 2458 2614 2677 1653 -677
2694f77j096j00p95q12J089K136J184K12M68Q68m94k159r77K8j279n01J48K043
$$ -677 -1773 -1873 -2668 -3480 -2391 -255 929 1141 1609 2477 1983 -176 -1153 -1125 -2404 -2905 -2757 -714
2712g14J282O87J060Q06J25j598q37l84j159j399l80J067Q30M90J310J464J71
$$ -714 568 1255 2315 3121 3246 1648 811 427 -732 -2131 -2511 -1444 -614 -124 1186 2650 2821
2729B821j244q08k47j462j913j81N25K42M38J480J975O53l10J73k76j535j503
$$ 2821 1577 769 522 -940 -2853 -3034 -2509 -2267 -1829 -349 1626 2279 1969 2142 1866 331 -1172
2746a172n71J46p1k72J572K140L55Q6M22K96j472j961p35m35n87j134J265K002
$$ -1172 -1743 -1597 -1668 -1940 -368 1772 2127 2213 2635 2931 1459 -502 -1237 -1672 -2259 -3393 -2128 -126
2764a26M32J87J348J100j233j443j073j22j292j014O24J687Q20M43J649J125j11
$$ -126 306 493 1841 2941 1708 265 -808 -930 -2222 -3236 -2612 -925 -105 338 1987 3112 3001
2781C001j393o79k83j592j514J83J065L05N77J198J357L80r34l79m89j373j633
$$ 3001 1608 929 646 -946 -2460 -2277 -1212 -907 -330 868 2225 2605 1671 1292 803 -570 -2203
2798b203n30L25J47L72J643J709N40l64L01J2j585j232o92j73m99M25J285J181
$$ -2203 -2733 -2408 -2261 -1889 -246 1463 2003 1639 1940 1952 367 -865 -1557 -1730 -2229 -1804 -519 662
2816F62Q67K87J021J16j392j687m91l41j582l19R37J308O83O06J200M24o72j368
$$ 662 1529 1816 2837 2953 1561 -126 -617 -958 -2540 -2859 -1922 -614 69 675 1875 2299 1627 259
2834B59p67m93j116r96Q21J320L96Q98J191J330l46j014j95m89j525j409j04J226
$$ 259 -508 -1001 -2117 -3113 -2292 -972 -576 322 1513 2843 2497 1483 1288 799 -726 -2135 -2239 -1013
2852a013O9J40J599J256M47p76j73Q6k069j627k72N12m22L46J369J540L71j39
$$ -1013 -944 -804 795 2051 2498 1722 1549 1635 -434 -2061 -2333 -1821 -2243 -1897 -528 1012 1383 1244
2870A244P63j39j521j111n45j12l89j16J087J442N74L24J189J28j276j176o74
$$ 1244 2007 1868 347 -764 -1309 -1421 -1810 -1926 -839 603 1177 1501 2690 2818 1542 366 -308
2887c08o05j198l69R09J206K45O15J266P81j211r15o6q17j567r96O84J102K04
$$ -308 -913 -2111 -2480 -1571 -365 -120 495 1761 2542 1331 416 350 -467 -2034 -3030 -2346 -1244 -1040
2905a040O18J870J103n49p65o2k78j420j546L06P04l89L70J768J454K5o53L82
$$ -1040 -422 1448 2551 2002 1237 1175 897 -523 -2069 -1763 -1059 -1448 -1078 690 2144 2169 1516 1898
2923A898l49j615j406j94j35k95M1J549J371M73N1L96nj140j366m75l88j66l82
$$ 1898 1549 -66 -1472 -1666 -1801 -2096 -2055 -506 865 1338 1389 1785 1780 640 -726 -1201 -1589 -1755 -2137
2942b137J060J283P78M27Q08M23q78j329n95l80j291n56J005N64O52P63Q88R15
$$ -2137 -1077 206 984 1411 2219 2642 1764 435 -160 -540 -1831 -2387 -1382 -818 -166 597 1485 2400
2960B400p61n80m02r47j496p37N89M98o6J002J756N82j97j14L3p43j716p96K20
$$ 2400 1639 1059 657 -290 -1786 -2523 -1934 -1436 -1502 -500 1256 1838 1641 1527 1560 817 -899 -1695 -1475
2979a475J66p8M62J546J249j41o5K97l75j381j560r3k89n11J8J502J426L56L49
$$ -1475 -1309 -1387 -925 621 1870 1729 1664 1961 1586 205 -1355 -1448 -1737 -2248 -2230 -728 698 1054 1403
2998A403O87j38j215j061m9p98p69j34Q94J269P24L71J115K92r13j161m36n19
$$ 1403 2090 1952 737 -324 -373 -1171 -1940 -2074 -1180 89 813 1184 2299 2591 1678 517 81 -438
3016d38j157o20O68O41L40R36J279M66l41n95m87q90j349m17J74N19j4Q29J291
$$ -438 -1595 -2215 -1547 -906 -566 370 1649 2115 1774 1179 692 -198 -1547 -1964 -1790 -1271 -1285 -456 835
3035H35J045l30r9K36o63j612r27K87m6l71M07J713Q33J6M63L45l03j708j271
$$ 835 1880 1550 1451 1687 1024 -588 -1515 -1228 -1274 -1645 -1238 475 1308 1324 1787 2132 1829 121 -1150
3054a150J96o12n13J02J576Q39L06N31J078o9j427r87j93o57j224J37R35J065
$$ -1150 -954 -1566 -2079 -1977 -401 438 744 1275 2353 2284 857 -130 -323 -980 -2204 -2067 -1132 -67
3072f7L0O25J200M87j020o71l82p05j120k20J97O86L83O27J253P77l91n98J63
$$ -67 -37 588 1788 2275 1255 584 202 -503 -1623 -1843 -1646 -960 -577 50 1303 2080 1689 1091 1254
3091A254r98j363o34J01J42j38J173J297M43J33J77J91o10j468r36l14n6m21Q06
$$ 1254 256 -1107 -1741 -1640 -1498 -1636 -463 834 1277 1410 1587 1778 1168 -300 -1236 -1550 -1606 -2027 -1221
3110a221J400N63K27O34M30o91j358n40j06j025k42M81Q57P34J86R48J046o14
$$ -1221 179 742 969 1603 2033 1342 -16 -556 -662 -1687 -1929 -1448 -591 143 329 1277 2323 1709
3128A709r30o74j09r52j143P3J174M16O4J020J032L40o99o61l2q08j529l67M49
$$ 1709 779 105 -4 -956 -2099 -2026 -852 -436 -372 648 1680 2020 1321 660 628 -180 -1709 -2076 -1627
3147a627O70k9R19J334M74m15j52K30q24j688m24J86j06j7R79J223M14L75m3J89
$$ -1627 -957 -986 -67 1267 1741 1326 1174 1404 580 -1108 -1532 -1346 -1452 -1469 -490 733 1147 1522 1479 1668
3167A668o88r98j058l14K0n69M71J346N39N01M37N55l08j184o74j92j086m57L40
$$ 1668 980 -18 -1076 -1390 -1370 -1939 -1468 -122 417 918 1355 1910 1602 418 -256 -448 -1534 -1991 -1651
3186a651R64O57K11J102O81l55n49o47l41o41j201J05O44J64L47J111R85K73n34
$$ -1651 -687 -30 181 1283 1964 1609 1060 413 72 -569 -1770 -1665 -1021 -857 -510 601 1586 1859 1325
3205A325n03j83p32j213m50K84P3K27Q67J342L02m5J63n3r55j013o14Q3k23m24
$$ 1325 822 639 -93 -1306 -1756 -1472 -1399 -1172 -305 1037 1339 1294 1457 1404 449 -564 -1178 -1095 -1318 -1742
3225a742J236R77N81K12M90Q3j078q74o67k47n28j15M84J088M28J12R64M29r12
$$ -1742 -506 471 1052 1264 1754 1837 759 -115 -782 -1029 -1557 -1672 -1188 -100 328 440 1404 1833 921
3244I21m25k44o25j169k83M70O09M15L87J126N51r7p05j83k95j285p62Q2O33R2
$$ 921 496 252 -373 -1542 -1825 -1355 -746 -331 56 1182 1733 1636 931 748 453 -832 -1594 -1512 -879 -787
3264g87J14J369Q25m0m19n3j75j175p00o08O69k97j19P92J731Q9k43M64p1r95
$$ -787 -673 696 1521 1481 1062 1009 834 -341 -1041 -1649 -980 -1277 -1396 -604 1127 1216 973 1437 1366 371
3284C71j124n33L71o61j39J091J295L04J20J16P10p53j295m74k26m25m09L80J041
$$ 371 -753 -1286 -915 -1576 -1715 -624 671 975 1095 1211 1921 1168 -127 -601 -827 -1252 -1661 -1281 -240
3303b40J43Q30M14O48o62n11o51l00q70o06J91M92N72O03J037N20Q1p13n8m45
$$ -240 -97 733 1147 1795 1133 622 -29 -329 -1199 -1805 -1614 -1122 -550 53 1090 1610 1691 978 920 475
3323D75j069o90l36P34j79L59Q88J219p5k58M25m56j268p76m09J40l89J19J038
$$ 475 -594 -1284 -1620 -886 -1065 -706 182 1401 1326 1068 1493 1037 -231 -1007 -1416 -1276 -1665 -1546 -508
3342e08J317K47l49O67kr66r25j51k24n64l38J098R96M98j37R27J94o21p42m50
$$ -508 809 1056 707 1374 1372 406 -519 -670 -894 -1458 -1796 -698 298 796 659 1586 1780 1159 417 -33
3362c3n52p99r8K78J032P6L36R99L14j48j031j45l37j040n73p2O51L24N87R60
$$ -33 -585 -1384 -1482 -1204 -172 -96 240 1239 1553 1405 374 229 -108 -1148 -1721 -1793 -1142 -818 -231 729
3382G29O65l22L3k05k43j377n34J05R3j08N13J193O22K99n9j62l68o10j231K06
$$ 729 1394 1072 1105 900 657 -720 -1254 -1149 -1056 -1164 -651 542 1164 1463 1404 1242 874 264 -967 -761
3402g61k33n32J29J190R14k16K10N74p6o82r86k38K2r78j57P37J174R9N84P57
$$ -761 -994 -1526 -1397 -207 707 491 701 1275 1199 517 -469 -707 -685 -1663 -1820 -1083 91 190 774 1531
3422A531J67q22q67o4l36q30m73N19Q65o3M87J291Jk19q14P7k94j157n48K96L7
$$ 1531 1698 876 9 -55 -391 -1221 -1694 -1175 -310 -373 114 1405 1406 1187 373 450 156 -1001 -1549 -1253 -1216
3443a216K06N23P41J130p0m58r5K7j304p80L93k18j08L86P99J021J22K25J09k28
$$ -1216 -1010 -487 254 1384 1314 856 761 788 -516 -1296 -903 -1121 -1229 -843 -44 977 1099 1324 1433 1205
3463A205r64q23l6k05p33K26J112O64j36O34K88J31r64o82j64n40m80K01N10P80
$$ 1205 241 -582 -618 -823 -1556 -1330 -218 446 310 944 1232 1363 399 -283 -447 -987 -1467 -1266 -756 24
3483B4k19P41R92j55p80j25k05m40q21n58O34N00J69L67R40M45l77k29J17q57
$$ 24 -195 546 1538 1383 603 478 273 -167 -988 -1546 -912 -412 -243 124 1064 1509 1132 903 1020 163
3503A63r16r05M21j9L90K71J350k8K65o9Q0n46r88n96J3p8K23L03Q14P90K24j3
$$ 163 -753 -1658 -1237 -1256 -866 -595 755 727 992 923 1003 457 -531 -1127 -1114 -1192 -969 -666 148 938 1162 1149
3525A149L99j58r83o37l29k29l46k1R33N30jN11N83l5r13l33n77k57o13q9M27
$$ 1149 1548 1390 407 -230 -559 -788 -1134 -1155 -222 308 307 818 1401 1366 453 120 -457 -714 -1327 -1416 -989
3546i89M85L17N75P42K44n38l50j75n32r66o2M91k6K43P61R08K44k93j01J74p81
$$ -989 -504 -187 388 1130 1374 836 486 311 -221 -1187 -1249 -758 -784 -541 220 1128 1372 1079 978 1152 371
3567C71j011o31J46K34j76L49J142N78l19J54K67n09r84n83K3l39R8K43Q28Q07
$$ 371 -640 -1271 -1125 -891 -1067 -718 424 1002 683 837 1104 595 -389 -972 -949 -1288 -1190 -947 -119 688
3587F88J86lO79k46r36k98m22n70j93K4P52M78K72N02N81j41p92m09k65q58n32
$$ 688 874 871 1550 1304 368 70 -352 -922 -1115 -1091 -339 139 411 913 1494 1353 561 152 -113 -971 -1503
3608a503Q3N84J6K59Q11P40jLl73m5p92j020M76M3K75j21Q92Q16J49m3l4J11p94
$$ -1503 -1420 -836 -820 -561 250 990 989 992 619 574 -218 -1238 -762 -719 -444 -565 327 1143 1292 1249 1215 1326 532
3631E32j047l32K00l44rN23Q52K12P9K35K06j55j321k32j22l56m00L94P68O84
$$ 532 -515 -847 -647 -991 -1000 -477 375 587 666 901 1107 952 -369 -601 -723 -1079 -1479 -1085 -317 367
3651C67J32N50N11m58m43q80R2m47o14J2P65N62J59K08R92l64n90m42j73m96r76
$$ 367 499 1049 1560 1102 659 -221 -129 -576 -1190 -1178 -413 149 308 516 1508 1144 554 112 -61 -557 -1533
3672a533Q7N20J94J54Q03N91L25l99K2j73p00o11n44K86K1M22O21Q36J42o4n7
$$ -1533 -1446 -926 -732 -578 225 816 1141 742 764 591 -109 -720 -1264 -978 -957 -535 86 922 1064 1000 943
3693I43K83j045m24j97k29l46l69Q56Q29J00K99M14k3n19r00q3m90l81k70N48
$$ 943 1226 181 -243 -440 -669 -1015 -1384 -528 301 401 700 1114 1091 572 -328 -411 -901 -1282 -1552 -1004
3713a004P92J78N09N93M10k93o55m41j78m38m84k02P91L42r0Q56R63m36o06P6
$$ -1004 -212 -34 475 1068 1478 1185 530 89 -89 -527 -1011 -1213 -422 -80 -170 686 1649 1213 607 683
3733F83l02o62o59l92N68O5J77P01P78J12n11K3l17k35j145J55N5J56j05Q82N63
$$ 683 381 -281 -940 -1332 -764 -699 -522 179 957 1069 558 581 264 29 -1116 -961 -906 -750 -855 27 590
3754E90J69L33J64l23m47q51r3j26m00k38O41O10L09L16J22N58p92m62l95l36
$$ 590 759 1092 1256 933 486 -365 -458 -584 -984 -1222 -581 29 338 654 776 1334 542 80 -315 -651
3774f51n30k82O15N20P5N12M84N45l10o80Jj95n26n89K50N7N34J71M66P71j79
$$ -651 -1181 -1463 -848 -328 -253 259 743 1288 978 298 299 104 -422 -1011 -761 -704 -170 1 467 1238 1059
3795A059m58n5k22q92n65P8K92m2l1Q64N79J63k86J30r3n44m41m74K40n10K39
$$ 1059 601 546 324 -568 -1133 -1055 -763 -805 -836 28 607 770 484 614 521 -23 -464 -938 -698 -1208 -969
3816i69P96P05P8L46J41L81j007o51l28j09j73m51N09Q29J82K60P51p0o04n54
$$ -969 -173 532 610 956 1097 1478 471 -180 -508 -617 -790 -1241 -732 97 279 539 1290 1220 616 62
3836F2j89k05o24m21L10O55R0M83O66O19n48n31l6j57p69l48J86J47J63L08O88
$$ 62 -127 -332 -956 -1377 -1067 -412 -322 161 827 1446 898 367 331 174 -595 -943 -757 -610 -447 -139 549
3857E49P10l31k67R7j58r80o34P6Q1j78L33P50Q46N5l83K66J06q52n69j54l07
$$ 549 1259 928 661 758 600 -380 -1014 -938 -857 -1035 -702 48 894 949 566 832 938 86 -483 -637 -944
3878i44J24j69Q20N46L7Q9N84L3o97m05k80l19j96k85O80j02O22K22L83L51l02
$$ -944 -820 -989 -169 377 414 503 1087 1120 423 18 -262 -581 -777 -1062 -382 -484 138 360 743 1094 792
3899G92l76m40m57m74p3o1O22R1L08P00L86l38j1m9n19o48l09K1J22N9L63P32
$$ 792 416 -24 -481 -955 -1028 -1089 -467 -376 -68 632 1018 680 669 620 101 -547 -856 -835 -713 -654 -291 441
3921D41M80n3jJ80l97p55n22Kl58J95kQ20M99J02j51N47qo89o50j10j37m68j41
$$ 441 921 868 867 1047 650 -105 -627 -625 -983 -788 -790 30 529 631 480 1027 1019 330 -320 -430 -567 -1035 -1176
3944a176R09N43P3L08K22J81m51m43k70l19q95K04N49K98N02K90M29M2m16j68
$$ -1176 -267 276 349 657 879 1060 609 166 -104 -423 -1318 -1114 -565 -267 235 525 954 996 580 412
3964D12k51n38n01j52K39J45J71L96M79P91n99j17J18j58p90n00J9J83j40L93
$$ 412 161 -377 -878 -1030 -791 -646 -475 -79 400 1191 592 475 593 435 -355 -855 -836 -653 -793 -400
3984d00O94L64R8L9J81o45l99m54j50Q4m89L46P92K05K13K07K45k15n85l64l58
$$ -400 294 658 756 795 976 331 -68 -522 -672 -588 -1077 -731 61 266 479 686 931 716 131 -233 -591
4005e91j32m14J66O85K83j04Q91K03k31j02n31j05m12m06l66N00M80j91O02M46
$$ -591 -723 -1137 -971 -286 -3 -107 784 987 756 654 123 18 -394 -800 -1166 -666 -186 -377 225 671
4025F71J37k77k13L2m03p36l86M85K48j2M14R07p5r1oK17q14k93m75ok29L6N09
$$ 671 808 531 318 350 -53 -789 -1175 -690 -442 -454 -40 867 792 701 695 912 98 -195 -670 -676 -905 -869 -360
4048c60P67NM0K40L73p89l71n85J5k14k02K00P45O41j49J73O49k43p20l48k3l24
$$ -360 407 412 452 692 1065 276 -95 -680 -665 -879 -1081 -881 -136 505 356 529 1178 935 215 -133 -156 -480
4070d80m25L20J76K14L83M30K82K50o37j74m02j98p56J85j6L87L02L84O53R4l44
$$ -480 -905 -585 -409 -195 188 618 900 1150 513 339 -63 -261 -1017 -832 -848 -461 -159 225 878 972 628
4091F28l28J98o36p30j75M04j72K50J83P87K46RK7nl73n65l29j97o7J70L58M51
$$ 628 300 498 -138 -868 -1043 -639 -811 -561 -378 409 655 664 691 686 313 -252 -581 -778 -845 -675 -317 134
4113A34J66J00N14N9o39l26k60l32j34m58M96L19M31K60L44N07n39l83j84l01
$$ 134 300 400 914 973 334 8 -252 -584 -718 -1176 -680 -361 70 330 674 1181 642 259 75 -226
4133b26l25l00J91M50k5P8O01N18l00l85q3on76o12K28J81MP1N82Q64j77k42o
$$ -226 -551 -851 -660 -210 -235 -157 444 962 662 277 194 188 -388 -1000 -772 -591 -587 -516 66 930 753 511 505
4156E05L5n56l93l48O8K22k12M18O52O64l29LJ60k19q07l70n9m00L08j71R12R6
$$ 505 540 -16 -409 -757 -689 -467 -679 -261 391 1055 726 729 889 670 -137 -507 -566 -966 -658 -829 83 179
4178A79K48R9N45m36q02O9l51l37j66L37L19J26O14j4L60q0m51J47n86k19n28
$$ 179 427 526 1071 635 -167 -98 -449 -786 -952 -615 -296 -170 444 430 790 710 259 406 -180 -399 -927
4199i27J73L99R5J25P67P2Qj5j06l92n14l50M5K31l62L26K95P46M4m71M88q9n26
$$ -927 -754 -355 -260 -135 632 704 712 697 591 199 -315 -665 -620 -389 -751 -425 -130 616 660 189 677 588 62
4222F2o22j50qj46p2Q78L95J95m4M98j54l85n37j86k8n50K02L26N25K8K0M42K68
$$ 62 -560 -710 -718 -864 -936 -58 337 532 488 986 832 447 -90 -276 -304 -854 -652 -326 199 227 247 689 957
4245I57m51o84o7j19l44m66N14M88P9K31M72O5J26o17K16l80m45k29r7N43j50
$$ 957 506 -178 -245 -364 -708 -1174 -660 -172 -93 138 610 675 801 184 400 20 -425 -654 -751 -208 -358
4266c58K86K20N65pk35oo2l87o85K2J54k67L84O23K10j5J42q3o9l79m52k67mj66
$$ -358 -72 148 713 706 471 465 403 16 -669 -647 -493 -760 -376 247 457 442 584 501 432 53 -399 -666 -670 -836
4290h36P1L76O89l0K53K73j74k57j38k72m48q3l7K36K99K00K66L73J92m08l02
$$ -836 -765 -389 300 270 523 796 622 365 227 -45 -493 -576 -613 -377 -78 122 388 761 953 545 243
4311B43m7l98n03l53L45O24j63K11N45kk48J08k41j83k83n62K66P1K12R0L87O37
$$ 243 196 -202 -705 -1058 -713 -89 -252 -41 504 502 254 362 121 -62 -345 -907 -641 -570 -358 -268 119 756
4333G56J13o2l55N3n46n58M04l3m65L28K51M24J53k0L98K9q68j91l60K96l74l4
$$ 756 869 807 452 505 -41 -599 -195 -228 -693 -365 -114 310 463 443 841 870 2 -189 -549 -253 -627 -661
4355f61K62M97K62q8M18K37m36m93k85K4n16q1K61M24R4J37N36J98q4l88k17k43
$$ -661 -399 98 360 272 690 927 491 -2 -287 -263 -779 -860 -599 -175 -81 56 592 790 706 318 101 -142
4377a42k37n06L94j81M38j5M24M54p1j49k06P6q13j82K37k16K45K41L19L26K60
$$ -142 -379 -885 -491 -672 -234 -249 175 629 558 409 203 279 -534 -716 -479 -695 -450 -209 110 436 696
4398F96Mj86j64o29j54J0k80K9l1Q06R4L38l1J08K21p66k47j75j00j83RL71J12
$$ 696 700 514 350 -279 -433 -423 -703 -674 -705 101 195 533 502 610 831 65 -182 -357 -457 -640 -631 -260 -148
4421a48L63L29K92k78k02j46j22l54m56j26L70N13L6J47L59R6o1k87l1m35n35
$$ -148 215 544 836 558 356 210 88 -266 -722 -848 -478 35 71 218 577 673 612 325 294 -141 -676
4442f76q3J29K70n7N0O95N53k44j78l17M4q23j45J48L02k15K26M85M33k62K92
$$ -676 -759 -630 -360 -417 -367 328 881 637 459 142 186 -637 -782 -634 -332 -547 -321 164 597 335 627
4463F27K4k86j72o45J30k40m8j57O18N89J66k24M15j79n16m17K97m85l46O8L41
$$ 627 651 365 193 -452 -322 -562 -610 -767 -149 440 606 382 797 618 102 -315 -18 -503 -849 -781 -440
4484d40L71J93K16L88N9l89m1m27k85j20k21K49J32L16K09N50j33R9l34j42l83
$$ -440 -69 124 340 728 787 398 357 -70 -355 -475 -696 -447 -315 1 210 760 627 726 392 250 -133
4505a33l40J69l22N1J59J71O25L54l14J06j8m22o27K2K9k09O4L43M33J90J47J1
$$ -133 -473 -304 -626 -575 -416 -245 380 734 420 526 508 86 -541 -519 -490 -699 -635 -292 141 331 478 489
4527D89K69l59l10m11Q0r8k99P6M04L23J24K13N32m63o40j06j55k36m39K49L03
$$ 489 758 399 89 -322 -242 -340 -639 -563 -159 164 288 501 1033 570 -70 -176 -331 -567 -1006 -757 -454
4548d54K28K02J21N09J76l48k77o5l03o73J43K58J39J45M31M19K25n16J54l6l39
$$ -454 -226 -24 97 606 782 434 157 92 -211 -884 -741 -483 -344 -199 232 651 876 360 514 478 139
4569A39l81k94K38M6m8J29L17J13J91J39k42j2o11m04J5K24k95L00N42J33L4M60
$$ 139 -242 -536 -298 -252 -300 -171 146 259 450 589 347 335 -276 -680 -665 -441 -736 -436 106 239 273 733
4591G33j79p7n43j21j07l16J63j37Q21j53J89K33L19j97l89O0j90k85n16j2L23
$$ 733 554 477 -66 -187 -294 -610 -447 -584 237 84 273 506 825 628 239 299 109 -176 -692 -704 -381
4612c81J09Q9M24M70Rn93O7Lm48n09k9L67L5N9N57K55o0J30O4k36j31p39%K67
$$ -381 -272 -183 241 711 720 127 194 197 -251 -760 -789 -422 -387 -328 229 484 424 554 618 382 251 -488 -488 -221
4636b21k69L34P4O25J71l52J50J30o21k04l1j77nn81N65L43K50J36K13J02k19
$$ -221 -490 -156 -82 543 714 362 512 642 21 -183 -214 -391 -396 -977 -412 -69 181 317 530 632 413
4657D13n03J26k11j88n40K14M56J36L23L17Q8j45l36O0k41j35k19j36J25K10K70
$$ 413 -90 36 -175 -363 -903 -689 -233 -97 226 543 631 486 150 210 -31 -166 -385 -521 -396 -186 84
4678H4L50m5M8M5L1k76o67r1k7J16m22L46L91O68n6O5R2j48n29j52Rj99m58J72
$$ 84 434 389 437 482 513 237 -430 -521 -548 -432 -854 -508 -117 551 495 560 652 504 -25 -177 -168 -367 -825 -653
4702f53P70p4K33J87K94Jo00k12Qj79m02p6N28L58M5O7M05O4n27k28k62J62m00
$$ -653 117 43 276 463 757 758 158 -54 -46 -225 -627 -703 -175 183 228 295 700 764 237 9 -253 -91 -491
4725d91p02R04O7P1L0N78K65j55j21r6k81n49n16L20L96j73M30J53M76l03Q4L1
$$ -491 -1193 -289 -222 -151 -121 457 722 567 446 350 69 -480 -996 -676 -280 -453 -23 130 606 303 387 418
4747D18j41m91k60O3P3k63J47K83N50r0P9K24K0l77l22k45J07m45J33K82M88J2
$$ 418 277 -214 -474 -411 -338 -601 -454 -171 379 289 368 592 612 235 -87 -332 -225 -670 -537 -255 233 245
4769B45L02Oj67p2n74J15k34j21J26O2J90Q8K52J76J24m0j07k57k04l47JJ71k82
$$ 245 547 553 386 314 -260 -145 -379 -500 -374 -312 -122 -34 218 394 518 478 371 114 -90 -437 -436 -265 -547
4792e47M57J87K56J83o9j71M36n62o68j98J70K6%N23L27L60l80R0J74l70o31m7
$$ -547 -90 97 353 536 467 296 732 170 -498 -696 -526 -500 -500 23 350 710 330 420 594 224 -407 -454
4814d54J31M8m44J84P52K59l19J52M53k07n17j15k49K17m70p1N68K19M7K1J37
$$ -454 -323 -275 -719 -535 217 476 157 309 762 555 38 -77 -326 -109 -579 -650 -82 137 184 205 342
4835C42K24j76o05R2p8m37l80M35N31k88O53L8L52k88k51J4n5n19r2J36l9l6M65
$$ 342 566 390 -215 -123 -201 -638 -1018 -583 -52 -340 313 351 703 415 164 178 123 -396 -488 -352 -391 -427 38
4858C8M58j3j59K36j94l10m22j03Q6j67M12p0O8M75L2n5J33k74L5l33m7m92R5
$$ 38 496 483 324 560 366 56 -366 -469 -383 -550 -138 -208 -140 335 367 312 445 171 206 -127 -174 -666 -571
4881e71j6P33Q1J13K41K16m14k74j00k28N4n38K54K28K15J87K60Q0J05m01k44
$$ -571 -587 146 227 340 581 797 383 109 9 -219 -165 -703 -449 -221 -6 181 441 521 626 225 -19
4902a9r4j36n40J67K69j33K43L96M60j8l37Rk8l75l78O3K15j29M8J93M23M54m00
$$ -19 -113 -249 -789 -622 -353 -486 -243 153 613 595 258 267 239 -136 -514 -451 -236 -365 -317 -124 299 753 353
4925C53K31L1j82r38L10j94k7p0M6M43J90j2j1L98k91l72j81J49l80k21K83M52
$$ 353 584 615 433 -505 -195 -389 -416 -486 -440 3 193 181 170 568 277 -95 -276 -127 -507 -728 -445 7
4947GK38k8J44J99j01k65j75k28M7n16pK13P06k30P9P52l29j79l00J28k97j4k36
$$ 7 245 217 361 560 459 194 19 -209 -162 -678 -685 -472 234 4 83 835 506 327 27 155 -142 -156 -392
4970c92j53J90J67J88L51J10l39J95j61l29l08K84k42m3K06M87R9R5p3J64m0k1
$$ -392 -545 -355 -188 0 351 461 122 317 156 -173 -481 -197 -439 -482 -276 211 310 405 332 496 456 435
4992D35n12j05j5k20o6J95N00r9J89J21K55n32l13L5j10j27r1j6K32K33Q9M48
$$ 435 -77 -182 -197 -417 -483 -288 212 113 302 423 678 146 -167 -132 -242 -369 -460 -476 -244 -11 78 526
5014E26L9J00m71p8k57j86n68N42J86n6N1L15M61o0k04k21J7Km66J16j39jK53
$$ 526 565 665 194 116 -141 -327 -895 -353 -167 -223 -172 143 604 544 340 119 136 138 -328 -212 -351 -352 -99
5037i9J14N10k1K9j85k12j11l37k34J89l6m8K14M04K59J23K2j34l59k86j94j55
$$ -99 15 525 504 533 348 136 25 -312 -546 -357 -393 -441 -227 177 436 559 581 447 88 -198 -392 -547
5059e47O4Q0J59L07J2K09L20r9l08o9j30m59j36N0N14k55M57qJ53L77l19k01J50
$$ -547 -483 -403 -244 63 75 284 604 505 197 128 -2 -461 -597 -547 -33 -288 169 161 314 691 372 171 321
5082C21m14j15l11L2K92p4K29J88L11l36J36j16P6p79q0L50m8j55M17K97K06Q6
$$ 321 -93 -208 -519 -487 -195 -269 -40 148 459 123 259 143 219 -560 -640 -290 -338 -493 -76 221 427 513
5104E13j56j17L02n66k61O0q3j73j35N04M37j31K97K8k34J29m51k76J61l27r0
$$ 513 357 240 542 -24 -285 -225 -308 -481 -616 -112 325 194 491 519 285 414 -37 -313 -152 -479 -569
5125e69PN40J24J37Q5K60j81l38k71O5l01Q1k6K60J26l5K02L28K37n36n9p4j12
$$ -569 -562 -22 102 239 324 584 403 65 -206 -141 -442 -361 -387 -127 -1 -36 166 494 731 195 136 62 -50
5148e0p4m09K27m5K26L04J65J40l3m17Oj87q7j70P8p6J16L67Q5K23P8n3j24k04
$$ -50 -124 -533 -306 -351 -125 179 344 484 451 34 40 -147 -234 -404 -326 -402 -286 81 166 389 467 414 290 86
5172H6m5l50J61j98J8P2M60l9J64M38j57m95m0j54l29m3O0j95N25J32m3O84j55
$$ 86 41 -309 -148 -346 -328 -256 204 165 329 767 610 115 75 -79 -408 -451 -391 -586 -61 71 28 712 557
5195E57l27k67Q0j54k69k82M18K39l97K29K92M40j70r6K50m09k10k76oJ70k05
$$ 557 230 -37 43 -111 -380 -662 -244 -5 -402 -173 119 559 389 293 543 134 -76 -352 -358 -188 -393
5216c93n7L77N83j79oP2o4k82n43L7q9K33m1J24O50r2k11L11j05l12l2n21J86
$$ -393 -450 -73 510 331 325 397 333 51 -492 -455 -544 -311 -352 -228 422 330 119 430 325 13 -19 -540 -354
5239c54K43l03J12L11J23K33N4J4jk63k07j6l31j16L09K12J23K8K71J14j7m71
$$ -354 -111 -414 -302 9 132 365 419 433 432 169 -38 -54 -385 -501 -192 20 143 171 442 556 539 68
5261F8J67n14j06j75P0n2R0M21K32K56j03J2J45l91k45M0j08p0l34M11M65Q9K6
$$ 68 235 -279 -385 -560 -490 -542 -452 -31 201 457 354 366 511 120 -125 -85 -193 -263 -597 -186 279 368 394
5284C94J54n4j32o26J14j13j98p4J96L36J72j87L61K32j04n16k59J65k48k10J72
$$ 394 548 494 362 -264 -150 -263 -461 -535 -339 -3 169 -18 343 575 471 -45 -304 -139 -387 -597 -425
5305d25O40q3j23K25L88L70n13k72l65O6l52m5K07K46O5o3J97L55j69j01J44o51
$$ -425 215 132 9 234 622 992 479 207 -158 -92 -444 -489 -282 -36 29 -34 163 518 349 248 392 -259
5327b59j13k25L9K60j66L46N13J45j85m6J87r9m34k95j94R1p4L46M91J7k03M31
$$ -259 -372 -597 -558 -298 -464 -118 395 540 355 309 496 397 -37 -332 -526 -435 -509 -163 328 345 142 573
5349E73m26L70m78k55K55k79m28L48K36M69j11M0K68j19k90j48j07k32j9J22j67
$$ 573 147 517 39 -216 39 -240 -668 -320 -84 385 274 314 582 463 173 25 -82 -314 -333 -211 -378
5370c78K60L11J5J74k59K61q3l14j80j40j39K88r2N7K52M92j5n6k38J18k47l49
$$ -378 -118 193 208 382 123 384 301 -13 -193 -333 -472 -184 -276 -219 33 525 510 454 216 334 87 -262
5392b62k53K57jj4J41M10J30N9l26K40k72j47k16k0L5j62K41J96J67p8K48P0j35
$$ -262 -515 -258 -259 -273 -132 278 408 467 141 381 109 -38 -254 -274 -239 -401 -160 36 203 125 373 443 308
5415C08l83k84K47k50Q0LM5ML65K37K50j3k01k76j95l24j21J31J36Q8J46J98J49
$$ 308 -75 -359 -112 -362 -282 -279 -234 -230 135 372 622 609 408 132 -63 -387 -508 -377 -241 -153 -7 191 340
5438C40R1j48k58P4k09m54K16J70o8K17K12K75k56J39j4p5k79j63k73K71j5J02
$$ 340 431 283 25 99 -110 -564 -348 -178 -246 -29 183 458 202 341 327 252 -27 -190 -463 -192 -207 -105
5460a05L94j55J57m4J69j4l33k8j33m6j48k89L94J13K88O3J43L8k27k58M4q5k40
$$ -105 289 134 291 247 416 402 69 41 -92 -138 -286 -575 -181 -68 220 283 426 464 237 -21 23 -62 -302
5483c02l15M29K46j77J83R9K71j8n03O4J90m58j48K98jq8L51OJ90K45m03Q5k7
$$ -302 -617 -188 58 -119 64 163 434 416 -87 -23 167 -291 -439 -141 -142 -230 121 127 317 562 159 244 217
5506B17l36j49o1J20k84J73J96J75M10k60n9P3j55m04p8M8J38k12K39M11O1J65
$$ 217 -119 -268 -329 -209 -493 -320 -124 51 461 201 142 215 60 -344 -422 -374 -236 -448 -209 202 263 428
5528D28j78K56m25j39j11m03L60O0j3M96L2j95K84n4q6l81J7n3k64Rj1J06Q5O04
$$ 428 250 506 81 -58 -169 -572 -212 -152 -165 331 363 168 452 398 312 -69 -52 -105 -369 -360 -371 -265 -180 424
5552D24k04J83j73L0l6r9l58k34M21m02J58J58M78j6r1kM7k98J79l85j71J25j11
$$ 424 220 403 230 260 224 125 -233 -467 -46 -448 -290 -132 346 330 239 237 284 -14 165 -220 -391 -266 -377
5575c77J30L82J60k3k8K72k0m97j39l00J12k50R4L49M07P4l65M30K7l17k24J11
$$ -377 -247 135 295 272 244 516 496 -1 -140 -440 -328 -578 -484 -135 272 346 -19 411 438 121 -103 8
5597Hr3k01j94K30K99J77q4J34M40m17k23m5J0l71l22N69l34M52j20K84J52J50
$$ 8 -85 -286 -480 -250 49 226 142 276 716 299 76 31 41 -330 -652 -83 -417 35 -85 199 351 501
5619E01l39o9l17L3m3j83O6K99k4J14L13K8J50l24P0n08n0K1k39J02N6K75K96
$$ 501 162 93 -224 -191 -234 -417 -351 -52 -76 38 351 379 529 205 275 -233 -283 -262 -501 -399 -343 -68 228
5642B28L73k85QJ59n36Q0j31k40j42K30J28J66j0Q6J36J76k98r4qk62j72R0L03
$$ 228 601 316 324 483 -53 27 -104 -344 -486 -256 -128 38 28 114 250 426 128 34 26 -236 -408 -318 -15
5665a5n6N8R7K44O2j39j7r9k73l54J75J80k18L88r6K13M13l2k76J19l15l75q7
$$ -15 -71 -13 84 328 390 251 234 135 -138 -492 -317 -137 -355 33 -63 150 563 531 255 374 59 -316 -403
5688d03K69Nl43J95M95K32K9r8j22j1l68l3k11K00k96K68k4M39K1J15J5m5j99
$$ -403 -134 -129 -472 -277 218 450 479 381 259 248 -120 -153 -364 -164 -460 -192 -216 223 244 359 374 329 130
5711A30m59r6K82n4l40M10O0M78l80N99k89j22j51j06r8j49l66K71NK48L97k10
$$ 130 -329 -425 -143 -197 -537 -127 -67 411 31 630 341 219 68 -38 -136 -285 -651 -380 -375 -127 270 60
5733F0K03K81m21J61m10k41j65R4K84k28L89M89j59q6l5q8o2l04M3m2l00K52J44
$$ 60 263 544 123 284 -126 -367 -532 -438 -154 -382 7 496 337 251 216 128 66 -238 -195 -237 -537 -285 -141
5756a41M27O1j19Q8Q9j55l63j42j00j50k5K60k1O83n40M35K42q5m96q8J68m47
$$ -141 286 347 228 316 405 250 -113 -255 -355 -505 -530 -270 -291 392 -148 287 529 444 -52 -140 28 -419
5778d19j20K27m8L79k6J12M17j95M0k64o7m73J74k00J87K97O8k65L25K28m21K62
$$ -419 -539 -312 -360 19 -7 105 522 327 367 103 36 -437 -263 -463 -276 21 89 -176 149 377 -44 218
5800B18j32r6k48j80N5QK60R5K48j8K12k19OM9m74j95K9j79QL81M89r2L48j11
$$ 218 86 -10 -258 -438 -383 -375 -115 -20 228 210 422 203 209 258 -216 -411 -382 -561 -553 -172 317 225 573 462
5824D62J06j62l59l41J21j62l1J55J29J08J1Q3J79n6l38M4k77k38Q3r1K21L66
$$ 462 568 406 47 -294 -173 -335 -366 -211 -82 26 37 120 299 243 -95 -51 -328 -566 -483 -574 -353 13
5846A3l12O62K90j96j69j6Q1m71k79K18J39n6r9K69M48J94l76o3K22o48j93R5
$$ 13 -299 363 653 457 288 272 353 -118 -397 -179 -40 -96 -195 74 522 716 340 277 499 -149 -342 -247
5868b47k3q7L4M48P0J16j86J48jp6m19m6%j20m16M11O93Q5j47K07Q3j32j32k86
$$ -247 -270 -357 -323 125 195 311 125 273 272 196 -223 -269 -269 -389 -805 -394 299 384 237 444 527 395 263 -23
5892b3Q9m06l3r5L72K63J68J27O4O7m93p4k10j4m69J40J15K06K84j40K53j51J74
$$ -23 66 -340 -373 -468 -96 167 335 462 526 593 100 26 -184 -198 -667 -527 -412 -206 78 -62 191 40 214
5915B14J53k97k66l9k1K69l89L70K12M87j52kj9m57j92k60J12j60J53j26L66L28
$$ 214 367 70 -196 -235 -256 13 -376 -6 206 693 541 539 520 63 -129 -389 -277 -437 -284 -410 -44 284
5937B84k4J72j55L3O5n16k40J19O9j55Q3Q0L07Q2R7n7l58RK4q2r9m6k04K51M1
$$ 284 260 432 277 310 375 -141 -381 -262 -193 -348 -265 -185 122 204 301 244 -114 -105 -81 -163 -262 -308 -512 -261 -220
5962b20K36K43R0k54R4l39J22j62l04J33M38k05j13O18l7L19m36r8J60m73q7j92
$$ -220 16 259 349 95 189 -150 -28 -190 -494 -361 77 -128 -241 377 340 659 223 125 285 -188 -275 -467
5984d67L7P4K75P2J73M07k97j89K86l25k53j15O0j65M2J92N6O42l37M02n89L03
$$ -467 -430 -356 -81 -9 164 571 274 85 371 46 -207 -322 -262 -427 -385 -193 -137 505 168 570 -19 284
6006B84l38j34j0k61K6K10J28J17L43J54j73m1l49R1l96O1k38K07R8L3K41K74
$$ 284 -54 -188 -198 -459 -433 -223 -95 22 365 519 346 305 -44 47 -349 -288 -526 -319 -221 -188 53 327
6028C27j97L21k38j25r3j68k66K4J07R2J55K99K51j35J84l18nm22m4J4k65O4J99
$$ 327 130 451 213 88 -5 -173 -439 -415 -308 -216 -61 238 489 354 538 220 215 -207 -251 -237 -502 -438 -239
6051b39L72O3n7J6J44J27o88j7j23l5O4p2J94M48r7m1L70n8l65J40l38K9j20j14
$$ -239 133 196 139 155 299 426 -262 -279 -402 -437 -373 -445 -251 197 100 59 429 371 6 146 -192 -163 -283 -397
6075c97L59j02J85J7M70j84J4m02p4L65m46j72lN67n20R6L45K25J09l08J23J0
$$ -397 -38 -140 45 62 532 348 362 -40 -114 251 -195 -367 -370 197 -323 -227 118 343 452 144 267 277
6097B77m83j36p4q4J56L34J17L65j8l64K84j48k20m67M26j79j05m4K65L96k76
$$ 277 -206 -342 -416 -500 -344 -10 107 472 454 90 374 226 6 -461 -35 -214 -319 -363 -98 298 22
6118B2K65J37k10N8p94N02j31j24j5M03k59L24O5M1L87o09lj17j05q1j41J05L43
$$ 22 287 424 214 272 -522 -20 -151 -275 -290 113 -146 178 243 284 671 62 59 -58 -163 -244 -385 -280 63
6141F3j78L44K17J32l54J7j10k45j77J50j29O8j03K26K69K06K7j29l3l49Q2k79
$$ 63 -115 229 446 578 224 241 131 -114 -291 -141 -270 -202 -305 -79 190 396 423 294 261 -88 -6 -285
6163b85j87K50k38J11N24J62j57J15j5J3m34J7J38l31LP6N03J06q3j25K54o4j36
$$ -285 -472 -222 -460 -349 175 337 180 295 280 293 -141 -124 14 -317 -314 -238 265 371 288 163 417 353 217
6186B17l76J82k49k51R3j19M87R1L08J50j05j11l03Rl51j2j82K37L2L00OK72Q2
$$ 217 -159 23 -226 -477 -384 -503 -16 75 383 533 428 317 14 23 -328 -340 -522 -285 -253 47 53 325 407
6209D07q8m0J56n10k06j89J15L18o1J04J08M03P0n3l30k30k06r6r6J47k21L86
$$ 407 319 279 435 -75 -281 -470 -355 -37 -98 6 114 517 587 534 204 -26 -232 -328 -424 -277 -498 -112
6231a12J02L47r1j63K25j96n9j34Jj78l81L20K88J32p3L43L05k37k67j53l3k52
$$ -112 -10 337 246 83 308 112 53 -81 -80 -258 -639 -319 -31 101 28 371 676 439 172 19 -14 -266
6253b66l1m9K12N5J86J21M03j53o2l02J27l13m03q5J03M83q8J88K96Q4j48O1l41
$$ -266 -297 -346 -134 -79 107 228 631 478 416 114 241 -72 -475 -560 -457 26 -62 126 422 506 358 419 78
6276G8K8l74q1j9r5K50L35j43L45K98l22Q2j26m18j07k33K90j53M6J72J35J01
$$ 78 106 -268 -349 -368 -463 -213 122 -21 324 622 300 382 256 -162 -269 -502 -212 -365 -319 -147 -12 89
6298H9N9K16k64P3o30N3O9L8r7J37N7M72r6K81m42J70J2n4m63J39j33K39N5o3
$$ 89 148 364 100 173 -457 -404 -335 -297 -394 -257 -200 272 176 457 15 185 197 143 -320 -181 -314 -75 -20 -83
6322h3L73L19J90m14k0k96Kk97QN2q3l7M23J60k8q8K3n5r0k28j08J4J7k08P05
$$ -83 290 609 799 385 365 69 71 -226 -218 -166 -249 -286 137 297 269 181 204 149 59 -169 -277 -263 -246 -454 251
6347B51R1Pj11J17J18l06j21l53J93k9j63M9J71K57J69j36J57K19l72l93q6j83
$$ 251 342 349 238 355 473 167 46 -307 -114 -143 -306 -257 -86 171 340 204 361 580 208 -185 -271 -454
6369d54J03J22P3K63p8M37r5K52j94k77l37J15l66n4K39j7K15L22J52L9k97J19
$$ -454 -351 -229 -156 107 29 466 371 623 429 152 -185 -70 -436 -490 -251 -268 -53 269 421 460 163 282
6391B82j95n9l06L2K9j8K16M6L42j42K16j33J1k55l28K7K6j2N0p8J97K07j64J0
$$ 282 87 28 -278 -246 -217 -235 -19 27 369 227 443 310 321 66 -262 -235 -209 -221 -171 -249 -52 155 -9 1
6415AL65j67k85r2m5j54q4Q2K73J52L3Q5J23J16l40n8r6M4n03J96L69o0L62j37
$$ 1 366 199 -86 -178 -223 -377 -461 -379 -106 46 79 164 287 403 63 5 -91 -47 -550 -354 15 -45 317 180
6439A80K04N3J27j55k86k04n39J79L71j44Q8K84LM9L43j90q2j66m52j62K77j21
$$ 180 384 437 564 409 123 -81 -620 -441 -70 -214 -126 158 161 210 553 363 281 115 -337 -499 -222 -343
6461c43k00M12N32j14l7J33j4q4k57l70N7L8R3J15L39K31m05M26j98j31k44N1
$$ -343 -543 -131 401 287 250 383 369 285 28 -342 -285 -247 -154 -39 300 531 126 552 354 223 -21 30
6483C0m53K1j42L80MO7M20J36j53L4k89Jj3m04N0K83j00J05J02R5J71L1n3l24
$$ 30 -423 -402 -544 -164 -160 -93 327 463 310 344 55 56 43 -361 -311 -28 -128 -23 79 174 345 376 323 -1
6507aP1l17M5j30M36j88j80K58M72j26o6mj59k77Pm03Q7M8K8N0L02M33k48N61
$$ -1 70 -247 -202 -332 104 -84 -264 -6 466 340 274 270 111 -166 -159 -562 -475 -427 -399 -349 -47 386 138 699
6531F99k14k37m9n19n2k21M30J7K60J16J95K4K24l20l28r1k09p8m5L56Q2K10n81
$$ 699 485 248 199 -320 -372 -593 -163 -146 114 230 425 449 673 353 25 -66 -275 -353 -398 -42 40 250 -331
6554c31M24K11j39n0j55j82j06K0J22R9k12J07P76k74j22J58M2j30l84n08K90
$$ -331 93 304 165 115 -40 -222 -328 -308 -186 -87 -299 -192 584 310 188 346 388 258 -126 -634 -344
6575c44J65p6K22K49M4K7P7j22%m22n2J1P8j07l2J49M01k02J8L72l08j56K2k41
$$ -344 -179 -255 -33 216 260 287 364 242 242 -180 -232 -221 -143 -250 -282 -133 268 66 84 456 148 -8 14 -227
6599b27N5j34j68L78j7K59q6K91l7j13j32l4q7j61j26R6N9j5M9N32K34l42L1j88
$$ -227 -172 -306 -474 -96 -113 146 60 351 314 201 69 35 -52 -213 -339 -243 -184 -199 -150 382 616 274 305 117
6623A17j92l12K5J53j06P5M76p9Q3j13L54j66j61l98k29J55j80L4O91k44M52l77
$$ 117 -75 -387 -362 -209 -315 -240 236 157 240 127 481 315 154 -244 -473 -318 -498 -464 227 -17 435 58
6645E8J12K77j54j08m52K18k12k34R2J67K02j51K06M19k55k34k0K44m83q9j60
$$ 58 170 447 293 185 -267 -49 -261 -495 -403 -236 -34 -185 21 440 185 -49 -69 175 -308 -397 -557
6666e57L87O2k0L71J83j70q8q1O7k91j61j24j78N64k15K51K83J84L5k09j51Q7
$$ -557 -170 -108 -128 243 426 256 168 87 154 -137 -298 -422 -600 -36 -251 0 283 467 502 293 142 229
6688B29m98l0j76J57k1L81K00mr3j0K04j71m60q4K3L7rk20M83L76p4P7K24p8m54
$$ 229 -269 -299 -475 -318 -339 42 242 238 145 135 339 168 -292 -376 -353 -316 -325 -545 -62 314 240 317 541 463 9
6713Ij32j10k63L4k3L36M29n8k5J19m8j81J97m09M7k69k06L94K06J2m6K15M36
$$ 9 -123 -233 -496 -462 -485 -149 280 222 197 316 268 87 284 -125 -78 -347 -553 -159 47 59 13 228 664
6736F64k81j84j33l44R3k40J06K67k61L34L5M85j10l30K53k06l82q1n0L58k28
$$ 664 383 199 66 -278 -185 -425 -319 -52 -313 21 56 541 431 101 354 148 -234 -315 -365 -7 -235
6757b35J80qJ74J96P9J1J22p33l20K65m1N7j83M88qJ4P2K7L7j18j38j39r3J9k91
$$ -235 -55 -63 111 307 386 397 519 -214 -534 -269 -310 -253 -436 52 44 58 130 157 194 76 -62 -201 -294 -275 -566
6782e66K07K60K3K77M0Q4l42J75o9J02j91m63K51J8Q8L71L82l3m14J08k60k1l36
$$ -566 -359 -99 -76 201 241 325 -17 158 89 191 0 -463 -212 -194 -106 265 647 614 200 308 48 27 -309
6805c09j48J53P7J77K45j2J81q9O2J36n37L3l31j1J1KJ87K28K29l49L77J45m51
$$ -309 -457 -304 -227 -50 195 183 364 275 337 473 -64 -31 -362 -373 -362 -360 -173 55 284 -65 312 457 6
6828FJ92n09N10l43L4J17J48L8J19o4K93l90ko1l30j50m35N16J99JL09K23n2L8
$$ 6 198 -311 199 -144 -110 7 155 193 312 248 541 151 149 88 -242 -392 -827 -311 -112 -111 198 421 369 407
6852D07k60jj84Nk66J53J4k89J86M0M55K36k81o2k2j01j81KO8k08K65P8Q1J30
$$ 407 147 146 -38 -33 -299 -146 -132 -421 -235 -195 260 496 215 153 131 30 -151 -149 -81 -289 -24 54 135 265
6876B65q2j99M88k46n17M8L2m20K96J3N57n6p0L96p3m58r2K91l25m3j17N5J2K38
$$ 265 183 -16 472 226 -291 -243 -211 -631 -335 -322 235 179 109 505 432 -26 -118 173 -152 -195 -312 -257 -245 -7
6900gk02O52J95k90n1n01K76k14l71L07K43j88J06L77J1j76J1J0j56r4k48K1M6
$$ -7 -209 443 638 348 297 -204 72 -142 -513 -206 37 -151 -45 332 343 167 178 188 32 -62 -310 -289 -243
6923b43J91J6j37N64p6k54J41K6k81j87lR1j34J7M00n5K15j9J10J56j55m12j87
$$ -243 -52 -36 -173 391 315 61 202 228 -53 -240 -243 -152 -286 -269 131 76 291 272 382 538 383 -29 -216
6946b16nj41j46J20N47j02J88jK34j90l12N9m01L5K16k70K2L18k15L20K52K24
$$ -216 -221 -362 -508 -388 159 57 245 244 478 288 -24 35 -366 -331 -115 -385 -363 -45 -260 60 312 536
6968E36l44j7k08j62L4j16k19M63J27O5K66k16J68j59j51Q1m08j39K37r8J81Q7
$$ 536 192 175 -33 -195 -161 -277 -496 -33 94 159 425 209 377 218 67 148 -260 -399 -162 -260 -79 8
6990HL69K5l10J71o9m46K14l39K66l57J12L85J42J2J68m5l2R3m91p7j77j3j97
$$ 8 377 402 92 263 194 -252 -38 -377 -111 -468 -356 29 171 183 351 306 274 367 -124 -201 -378 -391 -588
7013e88N53M7J61k82N52j07n5k09j76J71o96L51n0L52n4J52P6L7L60m24j19m5
$$ -588 -35 12 173 -109 443 336 281 72 -104 67 -629 -278 -328 24 -30 122 198 235 595 171 52 7
7035Gl14j71k1L66N3p3L31O3J29j73L3rm70j12K36N8k82k7N11K45j33J44J23m17
$$ 7 -307 -478 -499 -133 -80 -153 178 241 370 197 230 221 -249 -361 -125 -67 -349 -376 135 380 247 391 514 97
7059I7J07k70l42J22k56K23K20J1K59r5M46m29P3l72Rj09O2j92J27K29o7K01L59
$$ 97 204 -66 -408 -286 -542 -319 -99 -88 171 76 522 93 166 -206 -197 -306 -244 -436 -309 -80 -147 54 413
7082D13kj80J78n28O5l72J40r6J09j21L93L39J75k20m6l1n5j92m19mJ20L2K43
$$ 413 411 231 409 -119 -54 -426 -286 -382 -273 -394 -1 338 513 293 247 216 161 -31 -450 -454 -334 -302 -59
7105e9J56L62j09r9K05l79j79k56QJ62N0O5k20N45l4J11N4N9l05J5l72N3k10R5
$$ -59 97 459 350 251 456 77 -102 -358 -350 -188 -138 -73 -293 252 218 329 383 442 137 152 -220 -167 -377 -282
7129b82K42Q6J33J04J70k63L5k38n8j07j75j73L10P9K89J64J07n0j04O9l89j90
$$ -282 -40 46 179 283 453 190 225 -13 -71 -178 -353 -526 -216 -137 152 316 423 373 269 338 -51 -241
7151b41r4J04k6mJ03J20K15k9K29r6k01J30m93K3Mj46K42%K44K63Q6j95Q5j10
$$ -241 -335 -231 -257 -261 -158 -38 177 148 377 281 80 210 -283 -260 -256 -402 -160 -160 84 347 433 238 323 213
7175B13k42p3J84k06l43L46mL95j26o7N48l62k59K09k04j19n00K29L48K87j99
$$ 213 -29 -102 82 -124 -467 -121 -125 270 144 77 625 263 4 213 9 -110 -610 -381 -33 254 55
7196E5j23M36p6k78L6pr1m35K4K03J87J63N2M8J21l2k7j34J49m55j04J39j78M9
$$ 55 -68 368 292 14 50 43 -48 -483 -459 -256 -69 94 146 194 315 283 256 122 271 -184 -288 -149 -327 -278
7220b78O5L79P3k2j82J92k07j3j04l21J07L7J45K10K13j04j5J37J45l33l25J37
$$ -278 -213 166 239 217 35 227 20 7 -97 -418 -311 -274 -129 81 294 190 175 312 457 124 -201 -64
7242f4k11J33k65L83RJ0K28M02l50l03N2j51l39m2R9L30Q5J22J73J14l12K63l52
$$ -64 -275 -142 -407 -24 -15 -5 223 625 275 -28 24 -127 -466 -508 -409 -79 6 128 301 415 103 366 14
7265A4p2j8m78L75J02p5p9L35R6J73k78L2R0k84k49K22l02J1J05n1J90M69j90
$$ 14 -58 -76 -554 -179 -77 -152 -231 104 200 373 95 127 217 -67 -316 -94 -396 -385 -280 -331 -141 328 138
7288A38J11Q3j42l83p3O2J40l55J95M25o6L5J63J23l03k93K42k90k55k10L29J60
$$ 138 249 332 190 -193 -266 -204 -64 -419 -224 201 135 170 333 456 153 -140 102 -188 -443 -653 -324 -164
7310a64L85j5O0J3M4r2k58lj1k43j21L12r3J1K74L27k14Q2p3j53j76m03J59J66
$$ -164 221 206 266 279 323 231 -27 -30 -41 -284 -405 -93 -186 -175 99 426 212 294 221 68 -108 -511 -352 -186
7334a86m6j47L64K89k1j13J56j03l28jk70J46J51l09L01L53L2M8J53j32j56m03
$$ -186 -232 -379 -15 274 253 140 296 193 -135 -136 -406 -260 -109 -418 -117 236 268 316 469 337 181 -222
7356b22J59j42k57Q3K9M14J92jj82L59l56l10K1kj18j82L89K68j5j24N4O44j89
$$ -222 -63 -205 -462 -379 -350 64 256 255 73 432 76 -234 -213 -215 -333 -515 -126 142 127 3 57 701 512
7379E12n10n3K24m47l30K40J36J89K8J15J14J82j89L3r6m98k23K48l7k6K97L25
$$ 512 2 -51 173 -274 -604 -364 -228 -39 -11 104 218 400 211 244 148 -350 -573 -325 -362 -388 -91 234
7401B34l9L05l83K07L9m59J36m24p4L92l72N44j99M34j21J56jm06kl41L80l76
$$ 234 195 500 117 324 363 -96 40 -384 -458 -66 -438 106 -93 341 220 376 375 -31 -33 -374 6 -370
7423c70j11N23l10L88K1L21l15L4q9j06j08j15j81K27K12k18K31L28O1j06Kr1
$$ -370 -481 42 -268 120 141 462 147 181 92 -14 -122 -237 -418 -191 21 -197 34 362 423 317 319 228
7445B28j10m74j08J65J49J7j0K56J30p3n3J43j49k81j62M9J45j89M2L08J90J4
$$ 228 118 -356 -464 -299 -150 -133 -143 113 243 170 117 260 111 -170 -332 -283 -138 -327 -285 23 213 227
7467B27j7K1M6l33j73M3J59r1m87P28o4K58N3o7K5k60nj17j50J15j46n2M40pl46
$$ 227 210 231 277 -56 -229 -186 -27 -118 -605 123 59 317 370 303 328 68 63 -54 -204 -89 -235 -287 153 146 -200
7492b00M12J64r7j03j47J01k11j58o9R5J35k09L09K02l9J52Lm01j01k17j01J59
$$ -200 212 376 279 176 29 130 -81 -239 -308 -213 -78 -287 22 224 185 337 340 -61 -162 -379 -480 -321
7514c21J24J96K08Q1k66K26k23J22k32j24p3J60k49J38M79o5O6j81m2J36M6k91
$$ -321 -197 -1 207 288 22 248 25 147 -85 -209 -282 -122 -371 -233 246 181 247 66 24 160 206 -85
7536h5j43p2J01l4J48Q1j05M13JMk99j65R6j95J37m07M41j21J35K24J80k07J59
$$ -85 -228 -300 -199 -233 -85 -4 -109 304 305 309 10 -155 -59 -254 -117 -524 -83 -204 -69 155 335 128 287
7559B87k37J18k76J26l62J47K02n4j06N29N5k54J56J03l45k70r6K28k16j85L08
$$ 287 50 168 -108 18 -344 -197 5 -49 -155 374 429 175 331 434 89 -181 -277 -49 -265 -450 -142
7580a42J02L80j00J01P1r8m12l65K24O4k17M5L32j01M31J78j94J68k41o00M54
$$ -142 -40 340 240 341 412 314 -98 -463 -239 -175 -392 -347 -15 -116 315 493 299 467 226 -374 80
7601H0k83j29R6J51J14J0M42l69K84k00R1m18N7k89J29l3N6L7J38M39j36J66r9
$$ 80 -203 -332 -236 -85 29 39 481 112 396 196 287 -131 -74 -363 -234 -267 -211 -174 -36 403 267 433 334
7624C34j46q4n17q3K39m8k6N35K68o0o7j7K12n91k02M24m72L37l94K06M44j45
$$ 334 188 104 -413 -496 -257 -305 -331 204 472 412 345 328 540 -51 -253 171 -301 36 -358 -152 292 147
7646A47L2J42l2k10k18j52J20J11j45j15K48q2K20J70J30k34j08j1j06J4k41j08
$$ 147 179 321 289 79 -139 -291 -171 -60 -205 -320 -72 -154 66 236 366 132 24 13 -93 -79 -320 -428
7668d28K28O1K38K1M51j5l98QK4m30K10k88p9K18P4j39N87L9j58p9J20l07j37
$$ -428 -200 -139 99 120 571 556 158 166 190 -240 -30 -318 -397 -179 -105 -244 343 382 224 145 265 -42 -179
7691a79j35p3Q7p0M55p9M5Q4J01K18l02n7l42P2j0j53M42oK27l97M29j79J62l14
$$ -179 -314 -387 -300 -370 85 6 51 135 236 454 152 95 -247 -175 -185 -338 104 98 325 -72 357 178 340 26
7715B6j17n6L4k98K55j7M4J52K16K56l12j78J2l7J8l06Q4J75l13K35O40L8k23
$$ 26 -91 -147 -113 -411 -156 -173 -129 23 239 495 183 5 17 -20 -2 -308 -224 -49 -362 -127 513 551 328
7738C28O1l09m4p3j51k98J31J35N0J35L71Q8k6j87Nj65r7l63L65j07k46M08K66
$$ 328 389 80 36 -37 -188 -486 -355 -220 -170 -35 336 424 398 211 216 51 -46 -409 -44 -151 -397 11 277
7761B77j07R2j06J68j96k30k72L6J21k55O0N62l50L49J35j3J43m85J62l46q7M2
$$ 277 170 262 156 324 128 -102 -374 -338 -217 -472 -412 150 -200 149 284 271 414 -71 91 -255 -342 -300
7783c00LJ78J22P8K85r2J82k81l8q7m98R1L2K81j03k4J79M53k73J8O5k40k38j77
$$ -300 -297 -119 3 81 366 274 456 175 137 50 -448 -357 -325 -44 -147 -171 8 461 188 206 271 31 -207 -384
7807c84N6J99m8j94L69O8K30J11J6k06k50m05K40j60O1l1O6L67j55R0K57r2p3
$$ -384 -328 -129 -177 -371 -2 66 296 407 423 217 -33 -438 -198 -358 -297 -328 -262 105 -50 40 297 205 132
7830A32k77j9J37j16n24M38L14L03k56K30j53j92L0j61J38k55k51J18K43J5J43
$$ 132 -145 -164 -27 -143 -667 -229 85 388 132 362 209 17 47 -114 24 -231 -482 -364 -121 -106 37
7851C7K37J60r8N5j62k12j81l28K18K06p8J61J89j83L41n6J5m18O9k69J04n0J48
$$ 37 274 434 336 391 229 17 -164 -492 -274 -68 -146 15 204 21 362 306 321 -97 -28 -297 -193 -243 -95
7874i5n6M2J59J71P3J48k57j02l36J14j61J31J34m34N99k9J20K25p6l8k95l7K45
$$ -95 -151 -109 50 221 294 442 185 83 -253 -139 -300 -169 -35 -469 130 101 221 446 370 332 37 0 245
7897B45p52j50O80j41K13K23nm6o8k59M59l65l17K4J33n7J8J49K44O0j54k19L29
$$ 245 -507 -657 23 -118 95 318 313 267 199 -60 399 34 -283 -259 -126 -183 -165 -16 228 288 134 -85 244
7920B44j31j85j83j06O4j48L73M5L28j61K02j26k3l20L8M8k84k31K63M38o7j09
$$ 244 113 -72 -255 -361 -297 -445 -72 -27 301 140 342 216 193 -127 -89 -41 -325 -556 -293 145 78 -31
7942c1J14K41J57l06m39K02k67j20J59L47j34Q9J21KN97m94m2k40Q6k82k6R9J55
$$ -31 83 324 481 175 -264 -62 -329 -449 -290 57 -77 12 133 135 732 238 196 -44 42 -240 -266 -167 -12
7965a2j2M5L05j88L4o4K81n48m6k36J12J34KL55J1J19o3n3J62j77k96j52L3j21
$$ -12 -24 21 326 138 172 108 389 -159 -205 -441 -329 -195 -193 162 173 292 229 176 338 161 -135 -287 -254 -375
7989c75K5J03K89J70k93N25j74J07k11n34L55q0l78R1L70J96J9p7l8L1Mr0o3k44
$$ -375 -350 -247 42 212 -81 444 270 377 166 -368 -13 -93 -471 -380 -10 186 205 128 90 121 125 35 -28 -272
8013b72K9k17M84J65k82L45L1r1J28k72l25K80j46k85J19K29J40k10M27K41k44
$$ -272 -243 -460 24 189 -93 252 283 192 320 48 -277 3 -143 -428 -309 -80 60 -150 277 518 274
8034B74J37l87O7k86j79K88k74J82K79j4L88k97L07k77Ol12j00K71m04R9q1M37
$$ 274 411 24 91 -195 -374 -86 -360 -178 101 87 475 178 485 208 214 -98 -198 73 -331 -232 -313 124
8056A24k5r9J93o9K24m83Q6l1k03j8P4J46q8J20L34M0k07k21J93o2m11O9p1J65
$$ 124 99 0 193 124 348 -135 -49 -80 -283 -301 -227 -81 -169 -49 285 325 118 -103 90 28 -383 -314 -385 -220
8080b20m6K13J23J95m8p0j16J07k76k67J48k1J53qK55J22Q1k87J71J98l51j45
$$ -220 -266 -53 70 265 217 147 31 138 -138 -405 -257 -278 -125 -133 122 244 325 38 209 407 56 -89
8102h9k82K96k61j89N05J33K22j69J23j79K25k67k78Q0l0j61mM66K12l34K00J89
$$ -89 -371 -75 -336 -525 -20 113 335 166 289 110 335 68 -210 -130 -160 -321 -325 141 353 19 219 408
8124D08k18k18K22l24k71l4J31N9K25Q6K55r1L7k22j53K7n8l23J66Q7m8M77l3
$$ 408 190 -28 194 -130 -401 -435 -304 -245 -20 66 321 230 267 45 -108 -81 -139 -462 -296 -209 -257 220 187
8147A87J99j46M2K9k75k36Lj2j3k19K52K12J21L17k79l3r6J88m19k54J58L52l56
$$ 187 386 240 282 311 36 -200 -197 -209 -222 -441 -189 23 144 461 182 149 53 241 -178 -432 -274 78 -278
8170b78J79L51j73P1K86j7l16j20k09J86j72j54J74J15L3j46L94J48P2m20p2
$$ -278 -99 252 79 150 436 419 103 -17 -226 -40 -212 -366 -192 -77 -44 -190 204 352 424 4 -68
8191f8
$$ Imaginary data points
##PAGE= N=2
##DATA TABLE= (X++(I..I)), XYDATA
0@%%%%%%%%%%%qJ6j6J6j6K4l2L5m3N3o1P2q8J04j20J39j62J87k14K46k80L17l58
$$ 0 0 0 0 0 0 0 0 0 0 0 0 -8 8 -8 8 -8 16 -16 19 -24 29 -32 40 -48 56 -64 75 -87 100 -114 132 -148 169 -189
34a89M03m55N12n74O41p15P96q84R82j087J203j331J468j617J781j964K164k384
$$ -189 214 -241 271 -303 338 -377 419 -465 517 -570 633 -698 770 -847 934 -1030 1134 -1250
52a250K629k901L204l548L939m387M909n524O262p168Q309r795J1825j4780J9487
$$ -1250 1379 -1522 1682 -1866 2073 -2314 2595 -2929 3333 -3835 4474 -5321 6504 -8276 11211
67A1211k8178M9446j97465k83690L90165K16471j78152p6618K70152J30957r5156
$$ 11211 -16967 32479 -164986 -448676 -58511 157960 -20192 -96810 173342 304299 209143
78B09143j08527Q3396J24694q6214k28934k0460J55297k6604j78073N6295J74322
$$ 209143 100616 184012 308706 222492 -6442 -26902 128395 101791 -76282 -19987 154335
89A54335l4762j63617o64R0240n4814j47447n2762N1417L1627r1392n1624J51595
$$ 154335 119573 -44044 -44708 45532 -9282 -156729 -209491 -158074 -126447 -217839 -269463 -117868
101a17868J63129o5667j04994J14514J20801r5942q2924Q5816P1792n9156p4225
$$ -117868 45261 -20406 -125400 -10886 109915 13973 -68951 16865 88657 29501 -44724
112d4724K4661J22942J06004m5343p7460P4996N5535j44867j28030O8435N1034
$$ -44724 -20063 102879 208883 163540 86080 161076 216611 71744 -56286 12149 63183
123F3183j09722p3930O8922P3144j5362m1742K5487N8975m2006j40876m1765J03053
$$ 63183 -46539 -120469 -51547 21597 6235 -35507 -10020 48955 6949 -133927 -175692 -72639
135g2639J7574j16281j989J51829O2318o6858J7065J22775K8711j06264p9258
$$ -72639 -55065 -171346 -173335 -21506 40812 -26046 -8981 113794 142505 36241 -43017
146d3017M4787O3247n3027q4567O3478J28094k7492r8055O1944J18122n2813j25045
$$ -43017 1770 65017 11990 -72577 -9099 118995 91503 -6552 55392 173514 120701 -4344
158d344p04N0697n2212j03148q599Q9770M6144o2758l2032R1284N9868p9039n7190
$$ -4344 -5048 45649 -6563 -109711 -118310 -28540 17604 -45154 -77186 14098 73966 -5073 -62263
171f2263O3862J6555j09485n3042Q8930P2624l5023k4536P1475P0753l1060o1651
$$ -62263 1599 18154 -91331 -144373 -55443 17181 -17842 -42378 29097 99850 68790 7139
183G139K3404N1280n4791j05137R934R0526M920n6120L0508Q6180K223o7589k0569
$$ 7139 30543 81823 27032 -78105 -68171 22355 27275 -28845 1663 87843 90066 22477 1908
196A908L5215k105o9078m8534L3331M4514k4521k4628N8294O2200k8791n4157
$$ 1908 37123 35018 -34060 -82594 -49263 -4749 -29270 -53898 4396 66596 37805 -16352
208a6352J1307K9829k8494n1775k523L5528L080l1242J1845O9694L6166l6335
$$ -16352 -5045 24784 -3710 -55485 -58008 -22480 -19400 -50642 -38797 30897 67063 30728
220C0728k5303L0537Q342n7879m1215L5117M0383l0037m2090M0159P9863O825
$$ 30728 5425 35962 44304 -13575 -54790 -19673 20710 -9327 -51417 -11258 68605 75430
232G5430n2751k624M3832k2281q4338k0848N5110R222n8133p127P5365M1083m2016
$$ 75430 22679 20055 63887 41606 -42732 -63580 -8470 752 -57381 -64508 10857 51940 9924
245I924k1243N1692J7941q0882o5128M3229N0316m3320m3508N9957P4754k2604
$$ 9924 -11319 40373 58314 -22568 -87696 -44467 5849 -37471 -80979 -21022 53732 31128
257C1128m8943L8313O6288l1261q6793o268N7180j2069o9405J5307R2972J8654
$$ 31128 -17815 20498 86786 55525 -31268 -37536 19644 7575 -61830 -46523 46449 65103
269F5103o6511q231O9530J5239p2630m2376L5615J3325o0350l4374O2059O1445
$$ 65103 -1408 -9639 59891 75130 2500 -39876 -4261 9064 -51286 -85660 -23601 37844
281C7844l1183m1224M5773N2228m2338n9855K2607L9600m0928o5236K0163P7056
$$ 37844 6661 -34563 11210 63438 21100 -38755 -16148 23452 -17476 -82712 -62549 14507
293A4507K1600l8738Q31O0075J6767o3097l6476L9545J7833n7794l9702M1537
$$ 14507 36107 -2631 -1800 58275 75042 11945 -24531 15014 32847 -24947 -64649 -23112
305b3112M7407j4441k2048L4570M7011k1541o5130j1597M0839j0335o6707q938
$$ -23112 24295 9854 -12194 22376 69387 47846 -17284 -28881 11958 1623 -65084 -74022
317g4022O1740K0381l8748M446O7215K7558n0772m2191K3632K5770l9853m8172
$$ -74022 -12282 8099 -30649 -26203 41012 68570 17798 -24393 -761 25009 -14844 -63016
329f3016L1117N9851j6044m7183L6764P8588o893o8345p470M3466j6792p4864
$$ -63016 -31899 27952 11908 -35275 1489 80077 73184 4839 -2631 40835 24043 -50821
341e0821j6572O4276K9293n3217k4013P1119N0398n4259m9339M4894L0935p0933
$$ -50821 -67393 -3117 26176 -27041 -51054 20065 70463 16204 -33135 11759 42694 -28239
353b8239o2726M5725O1711k6749m5219M0408P3742p264o0036O832O0034j5189
$$ -28239 -90965 -45240 16471 -10278 -55497 -15089 58653 51389 -8647 -1815 58219 43030
365D3030q5854j6063O7234J5662n5663l29P6246K8284n6929l1027M6528K6539
$$ 43030 -42824 -58887 8347 24009 -31654 -31983 44263 72547 15618 -15409 31119 57658
377E7658n9013n7654K6654L9411l3622l9822M7839O8166j5994n3225J0987M4525
$$ 57658 -1355 -59009 -32355 7056 -26566 -66388 -18549 49617 33623 -19602 -8615 35910
389C5910j4568n7990j3101L6498Q523l5953k473N9527M1612k7117k5104K9077
$$ 35910 21342 -36648 -49749 -13251 -4728 -40681 -43154 16373 57985 30868 5764 34841
401C4841J9831m3586m3449J8086K9074k2753l7014K2035N7332R962l6427j942
$$ 34841 54672 11086 -32363 -14277 14797 -7956 -44970 -22935 34397 44359 7932 5990
413E990L6998o856o3506k7995L8186J6526m3508k4033M8134M7649j8261k6640
$$ 5990 42988 36132 -27374 -55369 -17183 -657 -44165 -68198 -20064 27585 9324 -17316
425a7316L5419M1688l6579o2873Q668M5269j5511m6836J7416O1190Q467l7848
$$ -17316 18103 59791 23212 -39661 -30993 14276 -1235 -48071 -30655 30535 39002 1154
437A154P228N4209O273o1535l3513L0287Q112n1258j8200N8607L7056m0652k5765
$$ 1154 8382 62591 68864 7329 -26184 4103 12215 -39043 -57243 1364 38420 -2232 -27997
450b7997M9897M0521m2310n4891J2066K9494l2949m9374K5651O5849N60m3246
$$ -27997 21900 62421 20111 -34780 -22714 6780 -26169 -75543 -49892 15957 16517 -26729
462b6729J7244O0092l220n5402p308L5481r700n4831j1852N0071L1956k2505j0625
$$ -26729 -9485 50607 47387 -8015 -15323 20158 10458 -44373 -56225 -6154 25802 3297 -7328
475g328M4515K9848l7936l6077K5758K1596m3215m3821J8811L3057r444j6524
$$ -7328 37187 67035 29099 -6978 18780 40376 -2839 -46660 -27849 5208 -4236 -20760
487b0760K4410L8006n569l9543j1931K4538k565m6741k1512L0406J6697k1556
$$ -20760 3650 41656 36087 -3456 -15387 9151 6586 -40155 -61667 -31261 -14564 -36120
499c6120J450M4166K6679j8176k1915O649J3527j5042l0522K467L3197K868k4308
$$ -36120 -34670 9496 36175 17999 -3916 2733 16260 1218 -29304 -26837 6360 9228 -15080
512a5080J7932N5168J1623l5811j2579J8711q028m2429k2865K1876J9283k2717
$$ -15080 2852 58020 69643 33832 21253 39964 31936 -10493 -33358 -11482 7801 -14916
524a4916k4315L1084M2005j7845l7522J6306K5820l6424n0694J2129L6395q711
$$ -14916 -39231 -8147 33858 16013 -21509 -5203 20617 -15807 -66501 -54372 -17977 -26688
536b6688k7041J7809M8929J2967k7442L47M2898Q093n3576k5338M0474J8632l7923
$$ -26688 -53729 -35920 13009 25976 -1466 -1119 41779 49872 -3704 -29042 11432 30064 -7859
549g859p307N0928K4928l1519j6751L0163J8287l6655m7531J676K2196k2622l7558
$$ -7859 -15166 35762 60690 29171 12420 42583 60870 24215 -23316 -21640 556 -22066 -59624
562e9624K4468N1239r215l9186J4810L8039j6123m5757m478K5409k683l0637J440
$$ -59624 -35156 16083 6868 -32318 -17508 20531 4408 -41349 -45827 -20418 -23101 -53738 -52298
575e2298M7646L2957j6846q272L8678K1138l6297k8688K2592J4313l0792k3321
$$ -52298 -4652 28305 11459 3187 41865 63003 26706 -1982 20610 34923 4131 -19190
587a9190K2424L0023k241j5553P392K2136q884m2594j8532J9385m085m0607j1696
$$ -19190 3234 33257 31016 15463 22855 44991 36107 -6487 -25019 -5634 -9719 -50326 -62022
600f2022L1614J5895j5716R44L0341J8013j9183k8070L964K2384r023k9995J0958
$$ -62022 -30408 -14513 -30229 -29285 1056 19069 -114 -28184 -24220 -1836 -10859 -40854 -29896
613b9896M3524Q598j9357J6105M2415M734l4737j6848J3632J82l3914k2798K4663
$$ -29896 13628 22226 2869 18974 61389 66123 31386 14538 28170 28352 -5562 -28360 -3697
626c697K7535j9618k3225L0822L5862k7738m4834Q879K1108l1054m3887J1908
$$ -3697 23838 4220 -19005 11817 47679 19941 -24893 -16014 5094 -25960 -69847 -57939
638e7939M2644K938k7347J0851N0107J4184l8518j1891L8087N663n1097k0298
$$ -57939 -15295 -12357 -39704 -28853 21254 35438 -3080 -14971 23116 28779 -22318 -42616
650d2616M3326K5754k6055r702L9777K9620k3061k8453J6012K1695l0812m8212
$$ -42616 710 26464 409 -9293 30484 60104 37043 8590 24602 46297 15485 -32727
662c2727M439L2422j0463l0098J8456M2877l128l4474L34K7285n446m0842j7983
$$ -32727 -28288 4134 -6329 -36427 -17971 24906 21778 -12696 -12362 14923 9477 -31365 -49348
675d9348K2746J4149j8934o446L8239L4164j3262j9976J7323J8345k1754l0688
$$ -49348 -26602 -12453 -31387 -37833 406 34570 21308 1332 18655 37000 15246 -15442
687a5442L609J8888n464j9336Q201L5695J4917k0599j1245J8067K304l4987k4495
$$ -15442 -11833 7055 1591 -17745 -9544 26151 41068 20469 9224 27291 29595 -5392 -29887
700b9887J4545J2515k0332j7818K1407L3026j406j9631P791K3841j1318l8965
$$ -29887 -15342 -2827 -23159 -40977 -19570 13456 12050 -7581 210 24051 12733 -26232
712b6232o961K8028L378k8359r64L9163K1122j8652o806K8961J4243l3509l2724
$$ -26232 -33193 -5165 -1787 -30146 -31110 8053 29175 10523 3717 32678 46921 13412 -19312
725a9312J3039J9770k1608k5997K2494L6068q193k4899J6289L2192j3824m2254
$$ -19312 -6273 13497 -8111 -34108 -11614 24454 16261 -8638 7651 39843 26019 -16235
737a6235p190K2123o388l3578O36M0324J6001k4420l400L4932J2666l1765k0762
$$ -16235 -23425 -1302 -7690 -41268 -40632 -308 15693 -8727 -12127 22805 35471 3706 -17056
750a7056J7641Q300k8547j9033K6592L1138p426j5461J8855K5966j3837k9694
$$ -17056 585 8885 -19662 -38695 -12103 19035 11609 -3852 15003 40969 27132 -2562
762b562J968J5685j5515l1093J628K7777Q808j3495L052K4851P116k2655j5608
$$ -2562 -594 15091 -424 -31517 -29889 -2112 6696 -6799 -3747 21104 28220 5565 -10043
775a0043J0654M191k2536j7672J3418J8033k772l600J8348K1322m648j9331m900
$$ -10043 611 4802 -17734 -35406 -21988 -3955 -6727 -10327 8021 29343 24695 5364 464
788D64Q905n335k2448o610J7690R265r924K123K5377J5030j4574j7554K760N081
$$ 464 9369 4034 -18414 -25024 -7334 1931 -7993 -5870 19507 34537 19963 2409 5169 10250
802A0250j7216k2093N683K0245j186j4335J2315L0524L658k2138n045J3862o333
$$ 10250 -6966 -29059 -23376 -3131 -4317 -18652 -6337 24187 27845 5707 662 14524 8191
815H191k8827r751K0659J1705j4958m577K6406K0640j4313j5169J4748R471k7574
$$ 8191 -20636 -30387 -9728 1977 -12981 -17558 8848 29488 15175 6 14754 24225 -3349
828c349k7565J2244K0061j0976j3794J8821K7946l778j9041O719J9714j1197l3261
$$ -3349 -30914 -18670 1391 -9585 -23379 -4558 23388 19610 569 7288 27002 15805 -17456
841a7456o910K0033l55k0244O935L2480Q774j9128k629K0403L099k7373j7751
$$ -17456 -24366 -4333 -4688 -24932 -17997 14483 23257 4129 1500 21903 25002 -2371 -20122
854b0122J0364O470j8175q577K4982K3869q930j1823J3946J4550j5349k2707J648
$$ -20122 -9758 -3288 -21463 -30040 -5058 18811 9881 -1942 12004 26554 11205 -11502 -9854
867i854J0213r368j7081P351K4910R754r943M80J6761J106k1870j3564Q435K590
$$ -9854 359 -9009 -26090 -18739 6171 15925 5982 6462 23223 24329 2459 -11105 -2670 -80
881h0j5952r761J4114J7680Q29m986R374J2746r013k2258n950J0303l441j7770
$$ -80 -16032 -25793 -11679 6001 6830 1844 11218 23964 14951 -7307 -13257 -2954 -6395 -24165
895b4165j335J9860J1651o226J017J8633R472j7390j9599M004R261j4049j7400
$$ -24165 -25500 -5640 6011 -215 802 19435 28907 11517 -8082 -4078 5183 -8866 -26266
908b6266J1682K3256j717j2622J3413K4757m656k6293o751J3095n761k5901m788
$$ -26266 -14584 8672 6955 -5667 7746 32503 27847 1554 -5197 7898 2137 -23764 -28552
921b8552K5767J2009j7549m390K7705J4752k3015j8864J3252P585k5465k1067
$$ -28552 -2785 9224 -8325 -12715 14990 29742 6727 -12137 1115 8700 -16765 -37832
933c7832J7809K4484o671j4281J7547K7925o626k4949L596J8797j1945l1150m90
$$ -37832 -20023 4461 -2210 -16491 1056 28981 22355 -2594 1002 19799 7854 -23296 -23786
946b3786K5293N599j5324M630K7270Q536k0624j1190J4365L450k6456k0645J2071
$$ -23786 1507 7106 -8218 -3588 23682 32218 11594 404 14769 18219 -8237 -28882 -16811
959a6811J3745j0721p354J9593K1273o978j5887L596J1012j0118k2107m051J4294
$$ -16811 -3066 -13787 -21141 -1548 19725 12747 -3140 456 11468 1350 -20757 -24808 -10514
972a0514L056j1123M699K4990J2546j0225o605R876L699j6555j6186M916J0782
$$ -10514 -7458 -18581 -13882 11108 23654 13429 6824 16700 20399 3844 -12342 -7426 3356
985C356n537j1242J0072K3094L844j4725k245J1564n287k4521j1722J1532N893
$$ 3356 -2181 -13423 -3351 19743 23587 8862 6617 18181 12894 -11627 -23349 -11817 -5924
998e924j3493o962J9236J9947n460j2434J0226J3188j6344k5048L597J7299m613
$$ -5924 -19417 -26379 -7143 12804 7344 -5090 5136 18324 1980 -23068 -19471 -2172 -6785
1011f785j5554R703K6937O141j3578J899K0394M12k6976j4252J4587N225k0485
$$ -6785 -22339 -12636 14301 20442 6864 8763 29157 29569 2593 -11659 2928 8153 -12332
1024a2332p916K3478J6159j3549j0024J6438J2136j8374k3127L098J0275j2812
$$ -12332 -20248 3230 19389 5840 -4184 12254 24390 6016 -17111 -14013 -3738 -16550
1036a6550j7919J1787K5350K53j3642Q646K1002l644k0810k749J1358l525j7100
$$ -16550 -34469 -22682 2668 2921 -10721 -2075 18927 15283 -5527 -8276 3082 -443 -17543
1049a7543p66K0374J3369o778k143J5920Q700j5215j4457M737K597j5607j3065
$$ -17543 -18309 2065 15434 8656 6513 22433 31133 15918 1461 6198 8795 -6812 -19877
1062a9877O700J2381J000m048N874J0830j032j3986p714M671k165j3725n704J1064
$$ -19877 -13177 -796 204 -3844 2030 12860 11828 -2158 -9872 -5201 -7366 -21091 -26795 -15731
1076a5731J0071p39K499J2663J0018l930j0906k606M980m131j3738n28J4227N193
$$ -15731 -5660 -6399 -3900 8763 18781 14851 3945 1339 6319 2188 -11550 -12078 2149 7342
1090G342o430L933J6578M686j3317r784K502j062j4271j1634P257J1854m665p223
$$ 7342 912 4845 21423 26109 12792 3008 5510 4448 -9823 -21457 -14200 -2346 -7011 -14234
1104a4234J2700J7572n206j4600K206P270j1190j7817K656J5052K252p695N692
$$ -14234 -1534 16038 10832 -3768 -1562 5708 -5482 -23299 -20643 -5591 -3339 -11034 -5342
1117e342K0462O724j2437m240J1105j591k1516r854J2639O786j0289r99J7292
$$ -5342 15120 21844 9407 5167 16272 14681 -6835 -16689 -4050 2736 -7553 -8552 8740
1130H740J0894q432q466P206M530j4849j7492K211Q860n696q088J2560J8104j331
$$ 8740 19634 11202 2736 9942 14472 -377 -17869 -15658 -6798 -12494 -20582 -8022 10082 8751
1144H751r121N007R326o506j5031m191N958n60q323K981J6362R698m363j920Q201
$$ 8751 -370 4637 13963 7457 -7574 -11765 -5807 -6367 -14690 -11709 4653 14351 9988 8068 16269
1159A6269J459j2544j0500J466J053p383m737P630J1514L652k647K415N327l603
$$ 16269 17728 5184 -5316 -3850 -2797 -10180 -14917 -7287 4227 7879 5232 7647 12974 9371
1173I371j3096o687K952o66p834j587J0454J0135J363p66O475O225o746j3104
$$ 9371 -3725 -10412 -7460 -8126 -15960 -17547 -7093 3042 4405 3639 10114 16339 9593 -3511
1187c511k973N101k926r869K843J4059N735m422K113J1897J852j4652j1171L905
$$ -3511 -6484 -1383 -4309 -14178 -11335 2724 8459 4037 6150 18047 19899 5247 -5924 -2019
1201b019J340j1948p042J1863J2874m836n517J2305J2307q917j6246R86O885r334
$$ -2019 -679 -12627 -19669 -7806 5068 232 -5285 7020 19327 10410 -5836 -4850 2035 -7299
1215g299j4985N158J8038K752r261N618J7863K003j6017n235R690l086j8072o088
$$ -7299 -22284 -17126 912 3664 -5597 21 17884 19887 3870 -1365 8325 5239 -12833 -18921
1229a8921J4289R159o767j846J4797R645j1014j0860N666M375j4537j4354N508
$$ -18921 -4632 4527 -2240 -4086 10711 20356 9342 -1518 4148 8523 -6014 -20368 -14860
1242a4860J1697k117m719J0087J4558j581j1156p91O604m692j4547m025Q774L859
$$ -14860 -3163 -5280 -9999 88 14646 13065 1909 1118 7722 3030 -11517 -15542 -6768 -2909
1256b909m579K634J3809Q066n091o573K199J444r137j0642l11O142l4m158N047
$$ -2909 -7488 -4854 8955 17021 11930 5357 7556 9000 -137 -10779 -11090 -4948 -4982 -9140 -4093
1271d093J2999M920o230m136L121j409j1358q609L452O830l077l889R309J4349
$$ -4093 8906 13826 7596 3460 6581 5172 -6186 -14795 -11343 -4513 -7590 -11479 -2170 12179
1285A2179Q30q243Q82O364o516j5086l581Q895K524p984L05J5402R123p414m570
$$ 12179 13009 4766 5648 12012 5496 -9590 -13171 -4276 -1752 -9736 -9431 5971 15094 7680 3110
1300C110Q350L123j5722j3313N598P473p545o852J1285J4861k353q220N892R954
$$ 3110 11460 14583 -1139 -14452 -8854 -1381 -8926 -15778 -4493 10368 8015 -205 5687 15641
1314A5641p528j7125k481Q884k514j1352M743J7301M897q075Q31J1065P91j4021
$$ 15641 8113 -9012 -11493 -2609 -5123 -16475 -11732 5569 10466 2391 3222 14287 15078 1057
1328A057q720M692J091r720m322J2103J1756k937l935P825O583p885j0803l64
$$ 1057 -7663 -2971 -1880 -11600 -15922 -3819 7937 5000 1065 8890 15473 7588 -3215 -3579
1342c579K319o160p834L438J0579M757j653K582P745O99q606o060J088j448p163
$$ -3579 -1260 -7420 -15254 -11816 -1237 3520 1867 4449 12194 12893 4287 -1773 -685 -2133 -9296
1357i296l497N126O944K657J064M061N082j751q174n017M82j374p332k456P158
$$ -9296 -12793 -7667 -723 1934 2998 7059 12141 10390 2216 -2801 -2319 -3693 -11025 -13481 -6323
1372f323O310O39J190O815N416m751r388k066K246m679q425J901R974L028l548
$$ -6323 -13 626 1816 8631 14047 9296 -92 -2158 88 -4591 -13016 -11115 -1141 1887 -1661
1387a661M575J1169J302r545n622K489k267j0950m262Q275O221l633j131J1064
$$ -1661 2914 14083 15385 5840 218 2707 440 -10510 -14772 -6497 -276 -3909 -5040 6024
1401F024Q275o572p791K910J579j0797r336M771Q553j200l181Q008J0877m96p788
$$ 6024 14299 7727 -64 2846 4425 -6372 -15708 -10937 -2384 -3584 -6765 1243 12120 11624 3836
1416C836P58M359o250j2285j645P599O69m023M611J1324K932n697j428L535k054
$$ 3836 4594 8953 2703 -9582 -11227 -3628 -2959 -6982 -2371 8953 11885 6188 4760 8295 6241
1431F241j0497o498K833J807l521R73R550P073j777k134K818P35o336p389j405
$$ 6241 -4256 -10754 -7921 -6114 -9635 -8662 888 7961 6184 4050 6868 7603 1267 -6122 -7527
1446g527R46j811j064N063Q040M228L2M50J202k025o263n254j139m34j812p5M340
$$ -7527 -6581 -8392 -9456 -4393 3647 7875 7907 8357 9559 7534 1271 -3983 -5122 -5556 -7368 -7443 -3103
1463c103O698L402l5n3J371k983p457n458L34L60k724m90O678P260R72p46L694
$$ -3103 3595 6997 6962 6909 8280 5297 -2160 -7618 -7284 -6924 -9648 -10138 -3460 3800 4772 4026 7720
1480G720K496o100q674j366K816k904m126M083R244L217k279K988O447j647j0969
$$ 7720 10216 4116 -4558 -5924 -3108 -6012 -10138 -6055 3189 6406 4127 7115 13562 11915 946
1495I46n242L095j696q190n24R960N180l602N03Q479L103q323q082K070O27q405
$$ 946 -4296 -1201 -2897 -11087 -11611 -1651 3529 -73 430 8909 12012 3689 -4393 -2323 -1696 -10101
1511a0101n750P639Q695r20k205Q059P749l949q279Q10K399o639q547J923Q547
$$ -10101 -15851 -8212 483 -437 -2642 5417 13166 9217 938 1748 4147 -2492 -11039 -9116 -569
1526e69K008k304M267Q931K20p127l541K339l000r627l586M352L241o33J860P183
$$ -569 1439 -865 3402 12333 12553 5426 1885 4224 1224 -8403 -11989 -7637 -4396 -5029 -3169 4014
1542D014M557k448m459p8j32n008o579m9L922J439O64M532O875L341j945k766
$$ 4014 8571 6123 1664 1586 1454 -3554 -10133 -10182 -6260 -4821 -4157 375 7250 10591 8646 5880
1558E880n63j560m886n655j65L668J123p88L913P293K073m239k968M96k630p756
$$ 5880 5317 3757 -1129 -6784 -6949 -3281 -2158 -2946 967 8260 10333 6094 3126 3622 992 -6764
1574f764m813L015M013k032p13P581Q459j745m842J892K520o914r509J494N953
$$ -6764 -11577 -8562 -4549 -6581 -7294 287 8746 7001 2159 4051 6571 -343 -9852 -8358 -2405
1589b405n22l800M564J0769K272n490l12N681k881j1647m941M740J453n960K71
$$ -2405 -2927 -6727 -2163 8606 10878 5388 5076 10757 7876 -3771 -8712 -3972 -2519 -8479 -8208
1604h208R914O099m243k245N073J974q432q514J304L076l913l335P357Q942N03
$$ -8208 1706 7805 3562 1317 6390 8364 -68 -8582 -7278 -4202 -8115 -11450 -4093 4849 5352
1619E352k694L505M548m248p939k339K461k796m433K071P521M181r68J182L845
$$ 5352 2658 6163 10711 6463 -1476 -3815 -1354 -4150 -8583 -6512 1009 5190 4222 5404 9249
1634I249n21n794m520j184j322l970j894L548N186K759J614K131J963j212m571
$$ 9249 8728 2934 -1586 -2770 -4092 -8062 -9956 -6408 -1222 1537 3151 5282 7245 6033 1462
1649A462l739j265j084k605r25L297N462K701J265K426K208j669n800m262K1j043
$$ 1462 -2277 -3542 -4626 -7231 -8156 -4859 603 3304 4569 6995 9203 7534 1734 -2528 -2507 -3550
1665c550m255o49N480M668K76L34M886K629m813o528r46O22m689l854L268O692
$$ -3550 -7805 -8454 -2974 1694 1970 2304 7190 9819 5006 -1522 -2468 -1846 -6535 -10389 -7121 -429
1681d29J399j250M341O204j811o381k019J093m036o217J05O504K420j867K776
$$ -429 970 -280 4061 10265 8454 2073 54 1147 -2889 -9106 -9001 -2497 -77 -1944 832
1696H32P184J707n307k890J119k616p405k569L729L134m22J632O421L619k501
$$ 832 8016 9723 4416 1526 2645 29 -7376 -9945 -6216 -3082 -3504 -1872 4549 8168 5667
1711E667k131J250j203o238m695Q30K252n91J327N371M809J15j589M58p23m257
$$ 5667 3536 4786 3583 -2655 -7350 -6520 -4268 -4859 -3532 1839 6648 6763 5174 5632 4909 652
1727F52m774j500K8p21N23M096M482K021P60M36j007l010l221k499k053j134O53
$$ 652 -4122 -5622 -5594 -6315 -5792 -1696 2786 4807 5567 6003 4996 1986 -1235 -3734 -5787 -6921 -6268
1744f268K093K818L381L214J825p42k143j746k630l757k398K51J804N44J973N348
$$ -6268 -4175 -1357 2024 5238 7063 6321 4178 2432 -198 -3955 -6353 -6102 -4298 -3754 -1781 3567
1760C567L465o69r79k39k154m730l762m29J066o09O56M768M904L06r09J954j76
$$ 3567 7032 6363 5384 5145 2991 -1739 -5501 -5930 -4864 -5473 -4817 -49 4855 5161 4252 6206 6030
1777F030n012n547j45N73k427p39M751N237O00k95K890K223l486o080j975Q01
$$ 6030 1018 -4529 -4674 -4101 -6528 -7267 -2516 2721 3321 3026 5916 8139 4653 -1427 -3402 -2601
1793b601k192l467L005O028J773p90K539M309j775n278k406k67k389m404Q8N067
$$ -2601 -4793 -8260 -5255 773 2546 1756 4295 8604 6829 1551 -855 -1122 -3511 -7915 -7827 -2760
1809b760L251l95K120M532J032m363k909O6j865n070j731K845K917R12K073M345
$$ -2760 491 96 2216 6748 7780 3417 508 574 -1291 -6361 -8092 -5247 -2330 -1418 655 5000
1825E000K611j200l085p32j366m158l361K32J746J007J616L922K861R68r01j329
$$ 5000 7611 6411 3326 2594 1228 -2930 -6291 -6059 -4313 -3306 -1690 2232 5093 6061 5160 3831
1841C831k296k570l017j842r08J400K107K608K464K988K112r98k887k385j168
$$ 3831 1535 -1035 -4052 -5894 -6802 -5402 -3295 -687 1777 4765 6877 5879 2992 607 -561
1856e61k475l372R9L396K037K86K867M626J387l936k160k0k463n273k511L223
$$ -561 -3036 -6408 -6309 -2913 -876 -590 2277 6903 8290 4354 2194 2174 -289 -5562 -8073 -4850
1872d850K133o08Q19N986L572k061k657J319p83o096m857K069L323j279o09N340
$$ -4850 -2717 -3325 -2506 3480 7052 4991 2334 3653 2870 -3226 -8083 -6014 -2691 -3970 -4579 761
1888G61N768n50k291J229J315m559o364n38K441q58j792L240O197J326j943M94
$$ 761 6529 5979 3688 4917 6232 1673 -4691 -5229 -2788 -3646 -5438 -2198 3999 5325 3382 3876
1904C876K194k405n796k793Q46l45k255J200N300L474L3O52J562M2l938l624p69
$$ 3876 6070 3665 -2131 -4924 -4078 -4423 -6678 -5478 -178 3296 3329 3981 5543 5585 1647 -1977 -2746
1921b746q38j773k74K890L753K022J511J162O2j321k897k865k031j459o29K62
$$ -2746 -3584 -5357 -5631 -2741 1012 3034 4545 5707 5769 4448 1551 -1314 -3345 -4804 -5433 -5171
1937e171J646L124L097J550K39k32k31l196l621j155j90q98l44K596M402K148
$$ -5171 -3525 -401 2696 4246 4485 4253 4022 826 -2795 -3950 -4140 -5038 -5382 -2786 1616 3764
1953C764n14J440J736j699m815l117Q63q87k966R63M706K938m65J014L308K96
$$ 3764 3250 4690 6426 4727 -88 -3205 -2342 -3229 -6195 -5232 -526 2412 1947 2961 6269 6565
1969F565m504l892J83n53l781j316M495L512NJ82M039K516l103m092k11o75m148
$$ 6565 2061 -1831 -1648 -2201 -5982 -7298 -2803 709 714 896 4935 7451 4348 256 45 -630 -4778
1986d778k246K034L652Q20K23L639L279r42k961q07m86l748l660j18K472J274
$$ -4778 -7024 -4990 -1338 -518 -295 3344 6623 5681 2720 1913 1427 -2321 -5981 -6099 -3627 -2353
2002b353N25L408L580M89j596r77n43k807l435j114J85N87R67K627L569J045M22
$$ -2353 -1828 1580 5160 5649 4053 3076 2533 -274 -3709 -4823 -4638 -4051 -3084 -457 3112 4157 4579
2019D579k4o36k730k876j484q47j411O88K496K936J653J508J608m21k410k028
$$ 4579 4555 3919 1189 -1687 -3171 -4018 -5429 -4741 -2245 691 2344 3852 5460 5039 2629 601
2035F01j488j818k230o75J857K202J389K451K531Q75j843k172o26k154l473q67
$$ 601 -887 -2705 -4935 -5610 -3753 -1551 -162 2289 4820 5695 3852 1680 1054 -1100 -4573 -5440
2051e440J649Q30Q87K055L768J790j029j124j71k158l983j880Q53N32j77J791
$$ -5440 -3791 -2961 -2074 -19 3749 5539 4510 3386 3215 1057 -2926 -4806 -3953 -3421 -3598 -1807
2067a807L921K130m25L60M84j688l866k708k08k03j264J155L876K473L01Q64J739
$$ -1807 2114 4244 3819 4179 4663 2975 -891 -3599 -3807 -4010 -5274 -4119 -243 2230 2531 3395 5134
2084E134j41l610k965n78j208k089K76L486K660M75J507K196P05k679k751p84
$$ 5134 4993 1383 -1582 -2160 -3368 -5457 -5181 -1695 965 1440 2947 5143 5848 3169 418 -366
2100c66j542k917j511K910K327O25J368L251J293j706j752r62j336l108k166Q89
$$ -366 -1908 -4825 -6336 -3426 -1099 -474 894 4145 5438 3732 1980 1018 -318 -3426 -5592 -4703
2116d703J733M98J902L328K298m61j186l23j378k996k558j65K56r1J499L178K407
$$ -4703 -2970 -2472 -570 2758 5056 4595 3409 3086 1708 -1288 -3846 -4011 -3755 -3846 -2347 831 3238
2133C238O21l5K57j658k887k072q95q41o32J272K622J798J312J587J672j331k560
$$ 3238 3859 3824 4081 2423 -464 -2536 -3431 -4272 -4904 -3632 -1010 788 2100 3687 5359 4028 1468
2150A468j806n28k243k077J385K249R39J023K352K740m41k276j275m89k675l712
$$ 1468 -338 -866 -3109 -5186 -3801 -1552 -613 410 2762 5502 5061 2785 1510 1021 -1654 -5366
2166e366p5K609P53k4K315L853N30j874m19J4k415l657j479J463J222p74K117
$$ -5366 -5441 -2832 -2079 -2103 212 4065 4595 2721 2302 2316 -99 -3756 -5235 -3772 -2550 -3324 -1207
2183a207M144J994j276p17J242j300l973k425l0K14n80J102L598K390K28k40P90
$$ -1207 2937 4931 3655 2938 4180 2880 -1093 -3518 -3548 -3334 -3914 -2812 786 3176 3404 3164 3954
2200C954l72k599l251o98o44j332L44K672K834J097J197J161m13j699j772j510
$$ 3954 3582 983 -2268 -2966 -3610 -4942 -4598 -1926 908 2005 3202 4363 3950 2251 479 -1031
2216a031j849r44L4J077J614J553K335J686J38j484q44j746k274j910l34Q12k9
$$ -1031 -2880 -3824 -3790 -2713 -1099 454 2789 4475 4613 3129 2285 539 -1735 -3645 -3979 -3167 -3196
2233c196J076K980K675J11n63M25p68l170k814k02N73p00j91K829L694P84p38
$$ -3196 -2120 860 3535 3646 3083 3508 2740 -430 -3244 -3446 -2873 -3573 -3764 -935 2759 3543 2805
2250B805J239O07k732l587j149O48j241j490J951L650J374m18J333K074j438l562
$$ 2805 4044 4651 1919 -1668 -2817 -2169 -3410 -4900 -2949 701 2075 1657 2990 5064 3626 64
2266F4j998L79j252k243O04L305K082j95J732K231J10k591j776q41j384k474j14
$$ 64 -1934 -1555 -2807 -5050 -4446 -1141 941 746 2478 4709 4819 2228 452 -389 -1773 -4247 -4361
2283d361J748J791L74J696K760K65j240j286p14j331l176m40N53M27J239J940
$$ -4361 -2613 -822 -448 1248 4008 4273 3033 1747 1033 -298 -3474 -3914 -3361 -2934 -1695 245
2299B45K590Q30j20m49n81j994k543n52m23o95K39K155K903P16M12J225j16k240
$$ 245 2835 3665 3545 3096 2515 521 -2022 -2574 -2997 -3692 -3453 -1298 1605 2321 2733 3958 3842 1602
2317A602k196r26r09j261p22J564K447J138R55K068J197k083k430o86o16k456
$$ 1602 -594 -1520 -2429 -3690 -4412 -2848 -401 737 1692 3760 4957 2874 444 -242 -858 -3314
2333c314j316J155K264P45P89K438J956r02j946q71n33k395k489N90J815K68M52
$$ -3314 -4630 -3475 -1211 -466 323 2761 4717 3815 1869 998 465 -1930 -4419 -3829 -2014 -1746 -1294
2350a294K574K616J13j328mp61k318k606n33P96j16M47K205K635R43m82O87l15
$$ -1294 1280 3896 4009 2681 2677 1916 -402 -3008 -3541 -2745 -2861 -2414 -209 2426 3369 2887 3574 3259
2368C259k056k930r80q9q71J30J832K567R81M14R76P18j642k747q50q58j572n99
$$ 3259 1203 -1727 -2707 -2796 -3667 -3537 -1705 862 1843 2257 3233 3951 2309 -438 -1288 -2146 -3718 -4317
2386d317J400K802M84J088J699J413j163k395l53r61k421j473P59J817R92P08
$$ -4317 -2917 -115 369 1457 3156 4569 3406 1011 658 -303 -2724 -4197 -3438 -1621 -629 79
2402G9K230J926n92j471q73p16k169k424M10R60K94N52K396K525L83q59j66m10
$$ 79 2309 4235 3643 2172 1299 583 -1586 -4010 -3600 -2640 -2346 -1794 602 3127 3510 2651 2485 2075
2420B075k048k472p04N43n17O47J968K482J027k11O72n76j569k297q77m32j098
$$ 2075 27 -2445 -3149 -2606 -3123 -2476 -508 1974 3001 2790 3462 2886 1317 -980 -1857 -2289 -3387
2437c387k19K116K160O56N83J419L37j604j902r15r16j975k81J290J812K69J324
$$ -3387 -3606 -1490 670 1326 1909 3328 3665 2061 159 -756 -1672 -3647 -3928 -2638 -826 -557 767
2454G67K195J425j649j295m38r57k648j505J218J326J34R06K549J527m86j008
$$ 767 2962 4387 2738 1443 1005 48 -2600 -4105 -2887 -1561 -1427 -521 2028 3555 3069 2061
2470B061J28r07k568k131L63P64j70M95K701J960J60o91P70n50k360k181m32K02
$$ 2061 2189 1282 -1286 -3417 -3054 -2290 -2460 -1965 736 2696 2856 2165 2935 2385 25 -2156 -2588 -2386
2488b386q73N9K312K481O97J37P56K53k094k173l62q38j080k45J724J444J161
$$ -2386 -3259 -3200 -888 1593 2290 2427 3183 3436 1342 -831 -1193 -2031 -3111 -3356 -1632 -188 973
2505I73R02J617N9j472j552q13j004j755m51O83J317O29J468J993J130j245j010
$$ 973 1875 3492 3551 2079 527 -286 -1290 -3045 -3496 -2813 -1496 -867 601 2594 3724 2479 1469
2522A469m6j658k425p66R12N60k55J579K457J632o92l00J92q68k948j588N56J57
$$ 1469 1423 -235 -2660 -3426 -2514 -1954 -2209 -630 1827 3459 2767 2467 2659 1791 -1157 -2745 -2189 -2032
2540b032r62R60K435K032j73j86J155o61k617j984j98j36r15J80K240K224K38
$$ -2032 -2994 -2034 401 2433 2260 2074 3229 2568 -49 -2033 -2231 -2367 -3282 -3102 -862 1362 1600
2557A600J33J282M32j706k097n57n80j323o59J721J698Q18Q04J509L27r20j510
$$ 1600 1733 3015 3447 1741 -356 -913 -1493 -2816 -3475 -1754 -56 762 1566 3075 3402 2482 972
2574I72p40r51j872j288J103Q23R67J406J636O76j69r19m00j294j823r71L57J85
$$ 972 232 -719 -2591 -3879 -2776 -1953 -986 420 2056 2732 2563 1644 1244 -50 -1873 -2844 -2487 -2302
2592b302M05J547K169J045j95K08J93j557k021j169k83k97q53J254K623O18N2
$$ -2302 -1897 -350 1819 2864 2669 2877 3070 1513 -508 -1677 -1960 -2257 -3110 -1856 767 1385 1437
2609A437J042N62j273j852j455m2p23j388M50K202J350j4J554J887k5k368j306
$$ 1437 2479 3041 1768 -84 -1539 -1581 -2304 -3692 -3242 -1040 310 296 1850 3737 3712 1344 38
2626C8J0j119j595k32J829J181P5J048K063N58j740j225l34j020k322r54J138
$$ 38 48 -1071 -2666 -2898 -1069 112 187 1235 3298 3856 2116 891 557 -463 -2785 -3739 -2601
2643b601O45L63J041K160R18k23l89o33r85j894q40K29L09J48R24K317J431o1
$$ -2601 -1956 -1593 -552 1608 2526 2303 1914 1281 296 -1598 -2438 -2209 -1900 -1752 -828 1489 2920 2859
2661B859Q2J08j175j585j764k13l48q98J210J788R31K89P53N49p19j747j225k78
$$ 2859 2941 3049 1874 289 -1475 -1688 -2036 -2934 -1724 64 995 1284 2037 2586 1867 120 -1105 -1383
2679a383j556n87M56K106P82O33J350J487l38j334r21j08j425j622r0J302P87
$$ -1383 -2939 -3526 -3070 -964 -182 451 1801 3288 2950 1616 695 587 -838 -2460 -2550 -1248 -461
2696d61K43J525J661J92j174o18m35j165k168p13O88J45J52J473J805Q25j66L
$$ -461 -218 1307 2968 3160 1986 1368 933 -232 -2400 -3113 -2425 -2280 -2128 -655 1150 1975 1809 1812
2714A812n22r58j936p92L02P1k51J351K139Q71K61M56O16j717j297j219o01n17
$$ 1812 1290 332 -1604 -2396 -2094 -2023 -2274 -923 1216 2087 2348 2804 3420 1703 406 -813 -1414 -1931
2732a931n98Q63J343Q73M55J007P55o42k134o61m93j479j114R68J398P50M15J777
$$ -1931 -2529 -1666 -323 550 1005 2012 2767 2125 -9 -670 -1163 -2642 -3756 -2788 -1390 -640 -225 1552
2750A552J365k95j318q1p18j496j421J84J199L21L37J318K001j54p45l87k35j655
$$ 1552 2917 2622 1304 1223 505 -991 -2412 -2228 -1029 -708 -371 947 2948 2794 2049 1662 1427 -228
2768b28k006l89N82j73J16J454J977N97n37K86J06j082k333m77L51m38j33J134
$$ -228 -2234 -2623 -2041 -2214 -2098 -644 1333 1930 1393 1679 1785 703 -1630 -2107 -1756 -2194 -2327 -1193
2786a193K028R88K35N22L25r78j610j115k69o03q87P68J307J050N54P26O16n78
$$ -1193 835 1823 2058 2580 2905 1927 317 -798 -1067 -1670 -2557 -1789 -482 568 1122 1848 2464 1886
2804A886j611p00n39j114j078M70J061Q46N45J698J091Q4j073k29m58j778j426
$$ 1886 275 -425 -964 -2078 -3156 -2686 -1625 -779 -234 1464 2555 2639 1566 1337 879 -899 -2325
2821b325K09P68K21P02J339J422J80o21p9p4j802j658l57M56n47O4J405J865L72
$$ -2325 -2116 -1348 -1127 -425 914 2336 2516 1895 1816 1742 -60 -1718 -2075 -1619 -2166 -2102 -697 1168 1540
2840A540k23L49K51j410j743n30q8n07k20J287J718O63J72J045O30q77j557q49
$$ 1540 1317 1666 1917 507 -1236 -1766 -1854 -2361 -2581 -1294 424 1087 1259 2304 2934 2057 500 -349
2858c49k95j073r37Q89J313N74O62J211N49l46j296o81p80j282j007M67R96M12
$$ -349 -644 -1717 -2654 -1765 -452 122 784 1995 2544 2198 902 221 -559 -1841 -2848 -2381 -1385 -973
2876i73M75J447J212j04q33Qo18j440r98J06K29N1N25J617J362J07n42N39l32
$$ -973 -498 949 2161 2057 1224 1232 614 -826 -1824 -1718 -1489 -1438 -913 704 2066 2173 1631 2170 1838
2895A838j869j120m76o4o20K27J618J350J98J06Q46K98k055j418j95l33o75k90
$$ 1838 -31 -1151 -1627 -1691 -2311 -2084 -466 884 1082 1188 2034 2332 277 -1141 -1336 -1669 -2344 -2634
2913b634J008K002K93J02J579K52p51j425j21p96j133p51P58J017N05O25J175
$$ -2634 -1626 376 669 771 2350 2602 1851 426 305 -491 -1624 -2375 -1617 -600 -95 530 1705
2930A705R64m82j352j97m90j688q77j68R07M28O67J418J145j45k17j15p68j248
$$ 1705 2669 2187 835 638 148 -1540 -2417 -2585 -1678 -1250 -583 835 1980 1835 1618 1503 735 -513
2948e13j150k04L27L8O71J353Q77L87L41m7k91j430j243j98n71o68M20J244J011
$$ -513 -1663 -1867 -1540 -1502 -831 522 1399 1786 2127 2080 1789 359 -884 -1082 -1653 -2321 -1901 -657 354
2967C54P23K15O79r0j499r11k73m17j136m65J728Q77J80R71J225L88j107n06m98
$$ 354 1077 1292 1971 1881 382 -529 -802 -1219 -2355 -2820 -1092 -215 -35 936 2161 2549 1442 936 438
2986D38o61j637n31R55P73J9O95J374J099r26o71J00q15j609j157O93L05J77N38
$$ 438 -223 -1860 -2391 -1436 -663 -644 51 1425 2524 1598 927 1027 212 -1397 -2554 -1861 -1556 -1379 -841
3005h41J464R98J39l11L26o09j694j075k39J56P3L91J235J264K88L30K56l56j285
$$ -841 623 1621 1760 1449 1775 1166 -528 -1603 -1842 -1686 -1613 -1222 13 1277 1565 1895 2151 1795 510
3024E10j231l29k51q88K15J241J151K08N96P80k05j215o53k55q11j198J86J421
$$ 510 -721 -1050 -1301 -2189 -1974 -733 418 626 1222 2002 1797 582 -71 -326 -1137 -2335 -2149 -728
3042g28O33k23R00J440j3n40n83j88j180j162o22R14K76K96O73J708N86p22k15
$$ -728 -95 -318 582 2022 2009 1469 886 698 -482 -1644 -2266 -1352 -1076 -780 -107 1601 2187 1465 1250
3061A250j27p42j630q83M79L52l96Q60J540J021l88N2K31m30j423r97k04N9n95
$$ 1250 1123 381 -1249 -2132 -1653 -1301 -1697 -837 703 1724 1336 1388 1619 1189 -234 -1231 -1435 -1376 -1971
3080a971M96J626O26M91K14L78l97r22j072l67n14n76J42J141Q22M06O17O89J40
$$ -1971 -1475 151 777 1268 1482 1860 1463 541 -531 -898 -1412 -1988 -1846 -705 117 523 1140 1829 1969
3099A969q26p25k95q76j275P0O56N92M01J021R61M82r84k52k10j145j283j2N19
$$ 1969 1143 418 123 -753 -2028 -1958 -1302 -710 -309 712 1673 2155 1171 919 709 -436 -1719 -1731 -1212
3118a212J42l1J028J484K73m95M86l05p86j562n71M03j79N5O45J420N34j52N23
$$ -1212 -1070 -1101 -73 1411 1684 1189 1675 1370 584 -978 -1549 -1146 -1325 -1270 -625 795 1329 1177 1700
3137A700L55r07j485o83k26k04o93M16J368J135l71P56P50j91j099j066r1n14
$$ 1700 2055 1148 -337 -1020 -1246 -1450 -2143 -1727 -359 776 405 1161 1911 1720 621 -445 -536 -1050
3155a050r31L86N90R59M19O10J002l3n71o16m41j038p07k84M81K80L09P92J605
$$ -1050 -1981 -1595 -1005 -46 373 983 1985 1952 1381 765 324 -714 -1421 -1705 -1224 -944 -635 157 1762
3174A762J09q01N4n44o07j473l28K01L78j58J052J426J71J36R2j38j127q88o22
$$ 1762 1871 1070 1124 580 -27 -1500 -1828 -1627 -1249 -1407 -355 1071 1242 1378 1470 1332 205 -683 -1305
3193a305K01k0j73N93R97O01K91N40K74n78j407n45l61m83n00N19J104Q95JN32
$$ -1305 -1104 -1124 -1297 -704 293 894 1185 1725 1999 1421 14 -531 -892 -1375 -1875 -1356 -252 643 644 1176
3213A176Q34l16j263m06n93o77o60L56P91L75L61Q93O98L97j006k25m28r51q96
$$ 1176 2010 1694 431 25 -568 -1245 -1905 -1549 -758 -383 -22 871 1569 1966 960 735 307 -644 -1540
3232a540J7M52K75K40J060Q61L67o15r7j98r42r66j34o4q0K43Q17J215K55p0J53
$$ -1540 -1523 -1071 -796 -556 504 1365 1732 1117 1020 822 -120 -1086 -1220 -1284 -1364 -1121 -304 911 1166 1096 1249
3253A249L42j169j199j28j57r26P6R42J310K51L51O54L73j149r22j67J72j116
$$ 1249 1591 422 -777 -905 -1062 -1988 -1912 -970 340 591 942 1596 1969 820 -102 -269 -97 -1213
3271a213n71O58Q99L36K27R54N80m26j177R1m27r86p36M7R96O10k09Q66Q35K74
$$ -1213 -1784 -1126 -227 109 336 1290 1870 1444 267 358 -69 -1055 -1791 -1744 -748 -138 -347 519 1354 1628
3291A628o58j15l44q38j065Q5M50j11M7J307Q95K39o3j54p8j061j284qj36j43
$$ 1628 970 855 511 -327 -1392 -1307 -857 -968 -921 386 1281 1520 1457 1303 1225 164 -1120 -1128 -1264 -1407
3311a407J34Q83J406J31J5M39k96o41j165j09m76m61j44Q91P23P16M4O73J08k56
$$ -1407 -1273 -390 1016 1147 1162 1601 1305 664 -501 -610 -1086 -1547 -1691 -800 -77 639 683 1356 1464 1208
3331A208q41l43o00p82k66L45R39M66K34J208J6l50o35p4l03j171q11K77N39L03
$$ 1208 367 24 -576 -1358 -1624 -1279 -340 126 360 1568 1584 1234 599 525 222 -949 -1760 -1483 -944 -641
3351f41J93J168Q34l3m49l20j77j043r62j1L22L9L94O73J373L4j1k14Op74j091
$$ -641 -448 720 1554 1521 1072 752 575 -468 -1430 -1441 -1119 -1080 -686 -13 1360 1394 1383 1169 1175 401 -690
3372f90k56R1l21k40Q33J212K85J68M25j40r31p28m46k50l76l67P68Q79K55O63
$$ -690 -946 -855 -1176 -1416 -583 629 914 1082 1507 1367 436 -292 -738 -988 -1364 -1731 -963 -84 171 834
3392H34M71L12o90m74n27m20o98k52M60O56J78M38R31M87m80l46n5p67q04n73
$$ 834 1305 1617 927 453 -74 -494 -1192 -1444 -984 -328 -150 288 1219 1706 1226 880 825 58 -746 -1319
3412a319P5L58j27L93J400O54k04m20K23k55j258o81j0K89k40K09R26J102j66
$$ -1319 -1244 -886 -1013 -620 780 1434 1230 810 1033 778 -480 -1161 -1171 -882 -1122 -913 13 1115 949
3431I49K15J77j6j301n93j78r8o41K80N80J283l0J53O78M0q96o73l90l91n31l82
$$ 949 1164 1341 1325 24 -569 -747 -845 -1486 -1206 -626 657 627 780 1458 1498 602 -71 -461 -852 -1383 -1765
3452a765P13P77L26L21R07j62k39l11l08m57q48l70K09M27O84K39R46M56l0l39
$$ -1765 -1052 -275 51 372 1279 1117 878 567 259 -198 -1046 -1416 -1207 -780 -96 143 1089 1545 1515 1176
3472A176l98k77j275n12J34l0O1N97Q02O58m5j5L39m46j195p08J35j26j40O0J092
$$ 1176 778 501 -774 -1286 -1152 -1182 -1121 -524 278 936 891 876 1215 769 -426 -1134 -999 -1125 -1265 -1205 -113
3493a13N99J67M69O06n18p40p71m5k70p05R5J015O39O0L39O95N9o24p98k75m70
$$ -113 486 653 1122 1728 1210 470 -301 -346 -616 -1321 -1226 -211 428 488 827 1522 1581 957 159 -116 -586
3514e86q36L1K98P20K32M93N41L88l90k23m13l11j057k69K80L96p9R02R82L11
$$ -586 -1422 -1391 -1093 -373 -141 352 893 1281 891 668 255 -56 -1113 -1382 -1102 -706 -785 117 1099 1410
3534A410k65l01M46q52p98o31Qo9J23K73J055O03k21J44P5l46j075k91k44j60
$$ 1410 1145 844 1290 438 -360 -991 -983 -1052 -929 -656 399 1002 781 925 1000 654 -421 -712 -956 -1116
3554a116m24M64J058N72L0M12L96J3j050p38J81l78p20P9J114M69J92L07O78J26
$$ -1116 -1540 -1076 -18 554 584 996 1392 1405 355 -383 -202 -580 -1300 -1221 -107 362 554 861 1539 1665
3574A665q74o00p9m20j184L39K32N93J95J77J115j01j14l47j28o13j005k01n6
$$ 1665 791 191 112 -308 -1492 -1153 -921 -328 -133 44 1159 1058 944 597 469 -144 -1149 -1350 -1406
3593a406N98R1Q96P21M86j48Q9j21o61p52o92j58J28k73N57J159L64l2m1L25n31
$$ -1406 -808 -717 179 900 1386 1238 1327 1206 545 -207 -899 -1057 -929 -1202 -645 514 878 846 805 1130 599
3614E99q94l63o6o26k70L80J048M37L6Q79J79m51n40j45m21m53p27K82P64J95
$$ 599 -295 -658 -724 -1350 -1620 -1240 -192 245 281 1160 1339 888 348 203 -218 -671 -1398 -1116 -352 -157
3634a57L41P17O29l17o75J08l42r52o02L8N15k3J63O83R40k23j79k0j93o06o70
$$ -157 184 901 1530 1213 538 646 304 -648 -1250 -1212 -697 -720 -557 126 1066 843 664 644 451 -155 -825
3655h25n97O05j27m2P77R20M85j52kl7m17p50k00m12K3j06J89R64K54J48O27l18
$$ -825 -1422 -817 -944 -986 -209 711 1196 1044 1042 1005 588 -162 -362 -774 -751 -857 -668 296 550 698 1325 1007
3677A007m23n25n25k13m17k98J59P51M42JP46L02k71n18Rn20o20n21N68N61l09
$$ 1007 584 59 -466 -679 -1096 -1394 -1235 -484 -42 -41 705 1007 736 218 227 -293 -913 -1434 -866 -305 -614
3698f14N03Q30O78P9o14n2n53o79p83J17L88r8r5Q47J017j83j7ml57n23o05o09
$$ -614 -111 719 1397 1476 862 810 257 -422 -1205 -1088 -700 -798 -893 -46 971 788 771 767 410 -113 -718 -1327
3720a327K75oJ63N10P45M35J17K00J13n68j011j86J7m75j53M91N49Q15QM32J21
$$ -1327 -1052 -1058 -895 -385 360 795 912 1112 1225 657 -354 -540 -523 -998 -1151 -660 -111 704 712 1144 1265
3741A265m40o68o78k31j24p15J97J271P2J79N64P25l60p74k21j62o96k02PM88
$$ 1265 825 157 -521 -752 -876 -1591 -1394 -123 -51 128 692 1417 1057 283 62 -100 -796 -998 -991 -503
3761e03nL95O29P46j00j78m13J61j009m56K2J30j83K61O44P62j14P0o3p3q47n62
$$ -503 -508 -113 516 1262 1162 984 571 732 -277 -733 -711 -581 -764 -503 141 903 789 859 796 723 -124 -686
3783f86l5k59j44j40R81O57L52j56N44J84o44r88j42k48j06l99P11N78L38J96
$$ -686 -721 -980 -1124 -1264 -283 374 726 570 1114 1298 654 -334 -476 -724 -830 -1229 -518 60 398 594
3803E94M26K87l99p29n00J02r32k60Q26K92j82N76O21L26l6k40m55j30p83m74
$$ 594 1020 1307 908 179 -321 -219 -1151 -1411 -585 -293 -475 101 722 1048 1012 772 317 187 -596 -1070
3823a070K37j07M80P24M92L99L3k40r7j84p17q71L81p6n06N08P32M96J8K21Q7
$$ -1070 -833 -940 -460 264 756 1155 1188 948 851 667 -50 -921 -540 -616 -1122 -614 118 614 632 853 940
3844I40j23q19m38k40R0n44J12O78O93M23j92L95N0m57n28j74l04n62m5M98M62
$$ 940 817 -2 -440 -680 -590 -1134 -1022 -344 349 772 580 975 1025 568 40 -134 -438 -1000 -1045 -547 -85
3865h5L94J13N03N61o11o67j40n00l38n18N04M24l8M01M24M09M8k68m4m31q48
$$ -85 309 422 925 1486 875 208 68 -432 -770 -1288 -784 -360 -398 3 427 836 884 616 572 141 -707
3886g07l38L31J16R1K40O87M09J89j23K2l86o62o47mJ49j74J37L70O26J38M03
$$ -707 -1045 -714 -598 -507 -267 420 829 1018 895 917 531 -131 -778 -782 -633 -807 -670 -300 326 464 867
3907H67J40l66n98n27k10p0m42J11N51N39L78K00L22pm30l52l85k8n60k46M60
$$ 867 1007 641 43 -484 -694 -764 -1206 -1095 -544 -5 373 573 895 888 458 106 -279 -307 -867 -1113 -653
3928f53N02R4K05J054j15l21k07l53n49k94k44M48L2n6M11M17Q13l77m26J20k87
$$ -653 -151 -57 148 1202 1087 766 559 206 -343 -637 -881 -433 -401 -457 -46 371 1184 807 381 501 214
3949B14q66n31K53K27j85O06O76M66j71O2J96k45o16n90Q4l80l75P43J89O96J61
$$ 214 -652 -1183 -930 -703 -888 -282 394 860 689 751 947 702 86 -504 -420 -800 -1175 -432 -243 453 614
3970F14J21M07k27q19n13J12n15j11j1L83N26L46L33M94k61m60l94K48o14o68
$$ 614 735 1142 915 96 -417 -305 -820 -931 -942 -559 -33 313 646 1140 879 419 25 273 -341 -1009
3990a009l5N44k84P34L31M67L36m25r0k37m32p33n7J38J22m3O57M39K74J36q9
$$ -1009 -1044 -500 -784 -50 281 748 1084 659 569 332 -100 -833 -890 -752 -630 -673 -16 423 697 833 744
4011G44rm07o13l58n7J5k86K94P87M49R6J78J19k38n17n00j24l94m03L43M32O24
$$ 744 735 328 -285 -643 -700 -685 -971 -677 110 559 655 833 952 714 197 -303 -427 -821 -1224 -881 -449 175
4033A75N9K79M62k25o17k73k26k16m07j59O65L37L70J41N83J28m11n67K8o97l34
$$ 175 234 513 975 750 133 -140 -366 -582 -989 -1148 -483 -146 224 365 948 1076 665 98 126 -571 -905
4054i05j09N92j4k18R16K72K43j68k44o0k06p44j66Q5R3J5L73P78J11N7J90l04
$$ -905 -1014 -422 -436 -654 262 534 777 609 365 305 99 -645 -811 -726 -633 -618 -245 533 644 701 891 587
4076E87k93o13j87J2o6m05N79L70N73K05oL21n12o56n7k00m68l1Q0L88N13J35
$$ 587 294 -319 -506 -494 -560 -965 -386 -16 557 762 756 1077 565 -91 -148 -348 -816 -847 -767 -379 134 269
4098B69K68M63J5p82q0l15l41n62J61N08J06M14L55M39J5k95j94k79m58m20j85
$$ 269 537 1000 1015 233 153 -162 -503 -1065 -904 -396 -290 124 479 918 933 638 444 165 -293 -713 -898
4119h98J50K73J32O22M25K26l73J73j04q86j77l88j89K68R0O03L72K34J35R2J26
$$ -898 -748 -475 -343 279 704 930 557 730 626 -260 -437 -825 -1014 -746 -656 -53 319 553 688 780 906
4140I06n16n75k42J94m16l15L11J102M5K27J2O60m81j065l8p8l34l46J42M75K28
$$ 906 390 -185 -427 -233 -649 -964 -653 449 494 721 733 1393 912 -153 -191 -269 -603 -949 -807 -332 -104
4161a04J46L62O33j20o63j63j14n64n46L15M92J31J37L12M33Q0k02Q6l01m61n99
$$ -104 42 404 1037 917 254 91 -23 -587 -1133 -818 -326 -195 -58 254 687 767 565 651 350 -111 -710
4182g10j48L46q4J83M51K20J77J47q8J17n95n43j43j68K23j5L02Q14J90l6L06
$$ -710 -858 -512 -596 -413 38 258 435 582 494 611 16 -527 -670 -838 -615 -630 -328 486 676 640 946
4203I46p4m53m75l89R8k86k80M56O88j75N23L15j64j54o99K32k51m74l93M37L87
$$ 946 872 419 -56 -445 -347 -633 -913 -457 231 56 579 894 730 576 -123 109 -142 -616 -1009 -572 -185
4224a85o5J93L78M64j9l75P0m00n11k94j15L50P0K49K75R14l56o6L45m40m61n08
$$ -185 -250 -57 321 785 766 391 461 61 -450 -744 -859 -509 -439 -190 85 999 643 577 922 482 21 -487
4246d87k46K92J39j88L32O49J51j98L81n66k16l59j92m0l7l76O39L09M12J10P6
$$ -487 -733 -441 -302 -490 -158 491 642 444 825 259 43 -316 -508 -548 -585 -961 -322 -13 399 509 585
4267E85N3l3m87o18Pl53j79O09K15L55L96M9L64k56k94l26n18j08k54K00L22j90
$$ 585 638 605 118 -500 -493 -846 -1025 -416 -201 154 550 599 963 707 413 87 -431 -539 -793 -593 -271 -461
4289d61M90K20L85K0k13Qm93k81n35L25j42L3O87K29K23K20m2k19j31k94n63J06
$$ -461 29 249 634 654 441 449 -44 -325 -860 -535 -677 -644 43 272 495 715 673 454 323 29 -534 -428
4311d28P0m82L89L43N26j45K16L55n3n31m88k85k20J48j71L72N79P4K31K31l9
$$ -428 -358 -840 -451 -108 418 273 489 844 791 260 -228 -513 -733 -585 -756 -384 195 269 500 731 692
4332F92m84p8l99k60k87oM04L11n9K02P29n4M8n33n1j23o69l53J36M45J84J44
$$ 692 208 130 -269 -529 -816 -822 -418 -107 -166 36 765 711 759 226 175 52 -617 -970 -834 -389 -205 -61
4354f1N19M44j35m20K63o17l80k51J45L05k93J41N95K90O5j43K11l39l39l59j19
$$ -61 458 902 767 347 610 -7 -387 -638 -493 -188 -481 -340 255 545 610 467 678 339 0 -359 -478
4375d78n8j22L07J78L04M13Q7J1M3p19l34j22o8j19j55M38M02l7L44J68M23m46
$$ -478 -536 -658 -351 -173 131 544 631 642 685 -34 -368 -490 -558 -677 -832 -394 8 -29 315 483 906 460
4397D60m41P3n98m03l6O01LL58L47L04K98l59m84Q6l32l75l22K85j40J46N54N66
$$ 460 19 92 -506 -909 -945 -344 -341 17 364 668 966 607 123 209 -123 -498 -820 -535 -675 -529 25 591
4419E91m5J40p3k99j13n92j0k47k1kK93O63K35l8L21n1j69m71l54L0j04j34k96
$$ 591 546 686 613 314 201 -391 -401 -648 -669 -671 -378 285 520 482 803 752 583 112 -242 -212 -316 -450 -746
4442g46N67N12r4M23K29k10m63k02q9m00n99L70M96K17Q8M08J07k2p4l51%m75
$$ -746 -179 333 239 662 891 681 218 16 -73 -473 -1072 -702 -206 11 99 507 614 592 518 167 167 -308
4464c08n24L3L16K7K20K57O83K3k87k05K58o07j86k90j93L05K41K43N44J64k92
$$ -308 -832 -799 -483 -456 -236 21 704 727 440 235 493 -114 -300 -590 -783 -478 -237 6 550 714 422
4485D22j35M11o50m11j76j84j58J46J86P29K94n0J12K23l29n11k40j0l12l14N07
$$ 422 287 698 48 -363 -539 -723 -881 -735 -549 180 474 424 536 759 430 -81 -321 -331 -643 -957 -450
4506d50L56N12m3J34L97L7q93J23m6m49n17P0M54Q3j80O13L20K74m20l56p9l43
$$ -450 -94 418 375 509 906 943 50 173 127 -322 -839 -769 -315 -232 -412 201 521 795 375 19 -60 -403
4528d03l21J6L83k9K3N99K40J98j32p6p4j79n94k63J63j10Q4Q5P55L66q9oo0l56
$$ -403 -724 -708 -325 -354 -331 268 508 706 574 498 424 245 -349 -612 -449 -559 -475 -390 365 731 642 636 576 220
4552B20l28k96n1l85k1N00N51P6M5K41j23n3l06l33M1k25k23l9M78P0O93LJ44
$$ 220 -108 -404 -455 -840 -861 -361 190 266 311 552 429 376 70 -263 -222 -447 -670 -709 -231 -161 532 535 679
4575F79K13n96j80q0l41k84k27O90j54K42J20M56k6j94nm01r5m78J37j49L69q2
$$ 679 892 296 116 36 -305 -589 -816 -126 -280 -38 82 538 512 318 313 -88 -183 -661 -524 -673 -304 -386
4597c86M42K39K63q1j72K05o1o55j70j24J65o5K77K65K21J83K59j9o59m10o7J77
$$ -386 56 295 558 477 305 510 449 -206 -376 -500 -335 -400 -123 142 363 546 805 786 127 -283 -350 -173
4619a73m80o0R3Q97j18J01R9K20j46k61j82j66m19p0J95K29J80N8M30O71k81l50
$$ -173 -653 -713 -620 277 159 260 359 579 433 172 -10 -176 -595 -665 -470 -241 -61 -3 427 1098 817 467
4641D67Qn42j95k46m26O22L8J70M01L52J88n67o9jk40n80k98M18J06K63o3M19
$$ 467 475 -67 -262 -508 -934 -312 -274 -104 297 649 837 270 201 200 -40 -620 -918 -500 -394 -131 -194 225
$$ [...]
8191e0
##END NTUPLES=NMR FID
##END=
