##TITLE=1H_SL7-mCPBA(f8)
 CDCl3, 8 sc, 
 30.06.2021
##JCAMPDX= 6.0         $$ Bruker NMR JCAMP-DX V2.0
##DATA TYPE= NMR FID
##DATA CLASS= NTUPLES
##ORIGIN= UXNMR, Bruker Analytische Messtechnik GmbH
##OWNER= root
$$ XWIN-NMR		Version 3.5
$$ Wed Jun 30 08:59:16 2021 Russian Standard Time (UT+4h)  she@DPX200
##.OBSERVE FREQUENCY= 200.131506
##.OBSERVE NUCLEUS= ^1H
##.DELAY= (6, 6)
##.ACQUISITION MODE= SIMULTANEOUS
##.ACQUISITION SCHEME= undefined
##.AVERAGES= 8
##.DIGITISER RES= 18
##SPECTROMETER/DATA SYSTEM= spect
##.PULSE SEQUENCE= zg30
##.SOLVENT NAME= CDCl3
##.SHIFT REFERENCE= (INTERNAL, CDCl3, 0, 15.7039)
##AUDIT TRAIL= $$ (NUMBER, WHEN, WHO, WHERE, WHAT)
$$ ##TITLE= Audit trail, XWIN-NMR		Version 3.5
$$ ##JCAMPDX= 5.01
$$ ##ORIGIN= Bruker BioSpin GmbH
$$ ##OWNER= she
$$ F:/spectra/data/she/nmr/H-F/1/audita.txt
$$ ##AUDIT TRAIL=  $$ (NUMBER, WHEN, WHO, WHERE, WHAT)
(   1,<2021-06-30 08:58:09.90 +0400>,<she>,<DPX200>,
      <created by zg, POWCHK disabled, PULCHK disabled
       configuration hash MD5:
       00 E9 B6 7A A2 85 ED C7 34 08 36 98 17 FE 4E 26
       data hash MD5: 16K
       FF 68 95 79 9B 2E 58 24 1C 89 C6 D8 E5 A2 B8 B9>)
$$ ##END=
$$ 
$$ hash MD5
$$ B3 92 B1 F7 51 54 BC 27 5E 1F 98 17 71 0C 97 4D
##$RELAX= 
##$RELAX= 
##$RELAX= 
##$RELAX= 
##$RELAX= 
##$RELAX= 
$$ Bruker specific parameters
$$ --------------------------
##$DU= <F:/spectra>
##$EXPNO= 1
##$NAME= <H-F>
##$PROCNO= 1
##$TYPE= <nmr>
##$USER= <she>
##$AMP= (0..31)
100 100 100 100 100 100 100 100 100 100 100 100 100 100 100 100 100 100 
100 100 100 100 100 100 100 100 100 100 100 100 100 100 
##$AQSEQ= 0
##$AQ_mod= 1
##$AUNM= <au_zg>
##$AUTOPOS= <>
##$BF1= 200.13
##$BF2= 200.13
##$BF3= 200.13
##$BF4= 200.13
##$BF5= 200.13
##$BF6= 200.13
##$BF7= 200.13
##$BF8= 200.13
##$BYTORDA= 1
##$CFDGTYP= 0
##$CFRGTYP= 5
##$CHEMSTR= <none>
##$CNST= (0..31)
1 1 145 1 1 1 1 1 1 1 1 1 1 1 1 1 1 1 1 1 1 1 1 1 1 1 1 1 1 1 1 1 
##$CPDPRG= <>
##$CPDPRG1= <>
##$CPDPRG2= <>
##$CPDPRG3= <>
##$CPDPRG4= <mlev>
##$CPDPRG5= <mlev>
##$CPDPRG6= <mlev>
##$CPDPRG7= <mlev>
##$CPDPRG8= <mlev>
##$CPDPRGB= <>
##$CPDPRGT= <>
##$D= (0..31)
0 1.2 0 0 0 0 0 0 0 0.06 0 0.03 0 0 0 0 0.0002 0 0 0 0 0 0 0 0 0 0 0 0 
0 0 0 
##$DATE= 1625029089
##$DBL= (0..7)
120 120 120 120 120 120 120 120 
##$DBP= (0..7)
150 150 150 150 150 150 150 150 
##$DBP07= 0
##$DBPNAM0= <>
##$DBPNAM1= <>
##$DBPNAM2= <>
##$DBPNAM3= <>
##$DBPNAM4= <>
##$DBPNAM5= <>
##$DBPNAM6= <>
##$DBPNAM7= <>
##$DBPOAL= (0..7)
0.5 0.5 0.5 0.5 0.5 0.5 0.5 0.5 
##$DBPOFFS= (0..7)
0 0 0 0 0 0 0 0 
##$DE= 6
##$DECBNUC= <off>
##$DECIM= 32
##$DECNUC= <off>
##$DECSTAT= 4
##$DIGMOD= 1
##$DIGTYP= 9
##$DL= (0..7)
0 120 120 120 120 120 120 120 
##$DP= (0..7)
150 150 150 150 150 150 150 150 
##$DP07= 0
##$DPNAME0= <>
##$DPNAME1= <>
##$DPNAME2= <>
##$DPNAME3= <>
##$DPNAME4= <>
##$DPNAME5= <>
##$DPNAME6= <>
##$DPNAME7= <>
##$DPOAL= (0..7)
0.5 0.5 0.5 0.5 0.5 0.5 0.5 0.5 
##$DPOFFS= (0..7)
0 0 0 0 0 0 0 0 
##$DQDMODE= 0
##$DR= 18
##$DS= 0
##$DSLIST= <SSSSSSSSSSSSSSS>
$$ [...]
##$SUBNAM2= <"">
##$SUBNAM3= <"">
##$SUBNAM4= <"">
##$SUBNAM5= <"">
##$SUBNAM6= <"">
##$SUBNAM7= <"">
##$SUBNAM8= <"">
##$SUBNAM9= <"">
##$SW= 20.0188882624521
##$SWIBOX= (0..15)
0 0 2 0 0 0 0 0 0 0 0 0 0 0 0 0 
##$SW_h= 4006.41025641026
##$TD= 16384
##$TD0= 1
##$TE= 0
##$TE2= 300
##$TE3= 300
##$TEG= 300
##$TL= (0..7)
0 120 120 120 120 120 120 120 
##$TP= (0..7)
150 150 150 150 150 150 150 150 
##$TP07= 0
##$TPNAME0= <>
##$TPNAME1= <>
##$TPNAME2= <>
##$TPNAME3= <>
##$TPNAME4= <>
##$TPNAME5= <>
##$TPNAME6= <>
##$TPNAME7= <>
##$TPOAL= (0..7)
0.5 0.5 0.5 0.5 0.5 0.5 0.5 0.5 
##$TPOFFS= (0..7)
0 0 0 0 0 0 0 0 
##$TUNHIN= 0
##$TUNHOUT= 0
##$TUNXOUT= 0
##$USERA1= <user>
##$USERA2= <user>
##$USERA3= <user>
##$USERA4= <user>
##$USERA5= <user>
##$V9= 5
##$VALIST= <valist>
##$VCLIST= <CCCCCCCCCCCCCCC>
##$VD= 0
##$VDLIST= <DDDDDDDDDDDDDDD>
##$VPLIST= <PPPPPPPPPPPPPPP>
##$VTLIST= <TTTTTTTTTTTTTTT>
##$WBST= 1024
##$WBSW= 4
##$XGAIN= (0..3)
0 0 0 0 
##$XL= 0
##$YL= 0
##$YMAX_a= 95965
##$YMIN_a= -145588
##$ZGOPTNS= <>
##$ZL1= 120
##$ZL2= 120
##$ZL3= 120
##$ZL4= 120
##$ABSF1= 10
##$ABSF2= 0
##$ABSG= 5
##$ABSL= 3
##$ALPHA= 0
##$AQORDER= 0
##$ASSFAC= 0
##$ASSFACI= 0
##$ASSFACX= 0
##$ASSWID= 0
##$AUNMP= <proc_1d>
##$AZFE= 0.1
##$AZFW= 0.1
##$BCFW= 1
##$BC_mod= 2
##$BYTORDP= 1
##$COROFFS= 0
##$CY= 11.3945322036743
##$DATMOD= 1
##$DC= 2
##$DFILT= <>
##$DTYPP= 0
##$F1P= 15.9154993809931
##$F2P= -4.1035820241983
##$FCOR= 0.5
##$FTSIZE= 0
##$FT_mod= 4
##$GAMMA= 1
##$GB= 0.15
##$INTBC= 1
##$INTSCL= 1
##$ISEN= 128
##$LB= 0.24
##$LEV0= 0
##$LPBIN= 0
##$MAXI= 10000
##$MC2= 0
##$MEAN= 0
##$ME_mod= 0
##$MI= 1.114404
##$NCOEF= 0
##$NC_proc= 0
##$NLEV= 6
##$NOISF1= 3.799351
##$NOISF2= 2.8
##$NSP= 1
##$NTH_PI= 0
##$NZP= 0
##$OFFSET= 15.70392
##$PC= 1
##$PHC0= -11923.47
##$PHC1= 19.40101
##$PH_mod= 1
##$PKNL= yes
##$PPARMOD= 0
##$PSCAL= 0
##$PSIGN= 0
##$REVERSE= no
##$SF= 200.130013532006
##$SI= 16384
##$SIGF1= 3
##$SIGF2= 2
##$SINO= 400
##$SIOLD= 16384
##$SREGLST= <1H.CDCl3>
##$SSB= 0
##$STSI= 0
##$STSR= 0
##$SW_p= 3612.71676300578
##$SYMM= 0
##$S_DEV= 0
##$TDeff= 0
##$TDoff= 0
##$TI= <>
##$TILT= no
##$TM1= 0
##$TM2= 0
##$TOPLEV= 0
##$USERP1= <user>
##$USERP2= <user>
##$USERP3= <user>
##$USERP4= <user>
##$USERP5= <user>
##$WDW= 1
##$XDIM= 8192
##$YMAX_p= 0
##$YMIN_p= 0
$$ End of Bruker specific parameters
$$ ---------------------------------
##NTUPLES= NMR FID
##VAR_NAME=  TIME,          FID/REAL,        FID/IMAG
##SYMBOL=    X,             R,               I
##VAR_TYPE=  INDEPENDENT,   DEPENDENT,       DEPENDENT
##VAR_FORM=  AFFN,          ASDF,            ASDF
##VAR_DIM=   8192,          8192,            8192
##UNITS=     SECONDS,       ARBITRARY UNITS, ARBITRARY UNITS
##FACTOR=    0.0002496,     1,               1
##FIRST=     0,             0,               0
##LAST=      2.0444736,     0,               0
##MIN=       0,             -145588,         0
##MAX=       2.0444736,     95965,           0
$$ Real data points
##PAGE= N=1
##DATA TABLE= (X++(R..R)), XYDATA
$$ [...]
1870fK17L37p48J19M52m50JK79n79K26P04r27j03P93m92j34O89r99j27J064k54
1891F2o51N33k95k87M20jq32Q74j68o35P35J00n41M96Q9p06L52N53o19J79L74
1912C2l52k18L80p4l48K04J06K5L72m48J29o7M09m11P7M33l93J62L24m91n8O04
1934C97l36j04J83J49j77J4n7l6K13p0K14J37k56P1L61j16q08P12l37K64j73K9
1956B74L82k1k96j23M49m47K8L58j11n63L04M95m88K34P4o34L40j39j83M54j24
1977B63l58M50Nl50K32M12j024J47N92p74K59J8k07K36M53r14M36M97p78m09J235
1998D21q09j7P42m93k34L40l30k59N11k50J31L53l23l02R09m74m08M80L8m33O42
2019B35j49l37K90Q2n30Q64o01l82O71j87l40M01K32n24N13r7l49M73M2m85K47
$$ plain form
1870 -6 211 548 -200 -81 371 -79 -78 201 -378 -152 552 -375 -478 315 -177 -311 378 -621 -748 316 62
1891 62 -589 -56 -351 -638 -218 -219 -1051 -177 -345 -980 -245 -145 -686 -190 -101 -807 -455 98 -521 -342 32
1912 32 -320 -538 -158 -232 -580 -376 -270 -245 127 -321 -192 -259 150 -261 -184 249 -144 18 342 -149 -207 397
1934 397 61 -43 140 289 112 126 69 33 246 176 390 527 271 342 703 587 -221 491 154 418 245 274
1956 274 656 635 339 216 665 218 246 604 493 -70 234 729 241 475 549 -85 255 116 -67 387 263
1977 263 -95 355 360 10 242 654 -370 -223 369 -405 -146 -128 -335 -99 354 -560 -124 373 -405 -814 421
1998 421 -388 -405 337 -156 -390 -50 -380 -639 -128 -378 -247 106 -217 -519 390 -84 -492 -12 26 -407 235
2019 235 86 -251 39 121 -409 455 -146 -528 143 -44 -384 17 249 -275 238 141 -208 265 307 -178 69
2040F9K02p92O89o3l78N60J94p57J49L7p3J42L97p63J52N20l05r6N77m16k67L39
2062A17o04O1P00l82j55K94m80M32K89o45m9M65om89O52m84j13M02j75k48O8K0
2084c30j55K80j84k27O71k62l15P00o1o96N23O0m48J38L69m56N43r4n38M78j31
2105a35k24J45O93r19N56L38n5j29L29l11k90M85m48Q2M75m45L2K81k67L5N34
2126G62j93n83O64m76jN12j87j76P1K13k85Q2l24j61L84K79n79N42L1l61j02N02
2148F14o38J42L5j26J64j74k32O13k4m97K87m1l43Q6M03m36l03N83l6Q0l33P8
2170i8n8L22l85K7J33m24L7M73o73K64J70k91P5L31n36m4R10n84j3P01o42l62
2192f67P09n29k73Q49j76n20R52k05o57N68Po48N12N9n69M60J26l93K95K74l94
$$ plain form
2040 69 271 -521 168 105 -273 287 481 -276 -127 -90 -163 -21 376 -387 -235 285 -20 -116 461 45 -222 117
2062 117 -487 -426 274 -108 -263 31 -449 -17 272 -373 -422 43 37 -452 200 -284 -397 5 -170 -418 -350 -330
2084 -330 -485 -205 -389 -616 55 -207 -522 178 117 -579 -56 4 -444 -306 63 -393 150 56 -482 -4 -135
2105 -135 -359 -214 479 -440 116 454 399 270 599 288 -2 483 35 117 592 147 179 460 193 228 762
2126 762 569 -14 650 174 173 685 498 322 393 606 321 403 79 -82 302 581 2 544 575 214 112 614
2148 614 -24 118 153 27 191 17 -215 398 374 -123 164 123 -220 -134 269 -167 -470 113 77 157 -176 -98
2170 -98 -156 166 -219 -192 -59 -483 -446 27 -646 -382 -212 -503 -428 -97 -633 -677 233 -351 -364 337 -305 -667
2192 -667 42 -487 -760 89 -87 -607 345 140 -517 51 58 -590 -78 -19 -588 -128 -2 -395 -100 174 -220
2213b20J13L64j012O24M74n45k18J001l09j26L06m19m00O47j45l37N69m27l1L68
2233B77j80k79M92m1m16K02r3k75L75J75j37L57l42k75M74q35Q6P82m80j89M53
2254A31j36k76P67l02l78K11j77r8P80m44m01O78j33p95M83K19j012Q11K74n11
2274c09K68L8j38K77N6n91O58k9m80J1K22l72M82M68m74l71N34k35Q9l4J19k11
2296b2J28O3J89k22oK04K18l58j08o7L55k78q6L85o9Jk93K63k54j53P58l14n10
2319a76L97L6k10M88k90l55L22j41j82L29L7o59K76P99o59k94N18k10k74L24j85
2340a09j76M48P6p26J65L78j07k33J79l30J0N14k31l73L41m0M7J10K4p78K26N78
2362gm14P1K09r3JM36o26p7M76k28j63M31l86j32N34J70p37N34O6o58O56j07l90
$$ plain form
2213 -220 -107 257 -755 -131 343 -202 -420 581 272 146 452 33 -367 280 135 -202 367 -60 -91 277
2233 277 97 -182 310 269 -147 55 -38 -313 62 237 100 457 115 -160 314 -521 -435 347 -133 -322 131
2254 131 -5 -281 486 184 -194 17 -160 -258 522 78 -323 355 222 -573 -90 129 -883 -72 202 -309
2274 -309 -41 -3 -141 136 192 -399 259 230 -250 -239 -17 -389 93 561 87 -284 250 15 104 70 189 -22
2296 -22 106 169 358 136 130 334 552 194 86 19 374 96 10 395 326 327 34 297 43 -110 648 334 -176
2319 -176 221 257 47 535 245 -110 212 71 -111 218 255 -404 -128 671 12 -282 236 26 -248 76 -109
2340 -109 -285 163 239 -487 -322 56 -51 -284 -105 -435 -425 89 -142 -515 -174 -214 -167 -57 -33 -811 -585 -7
2362 -7 -421 -350 -141 -234 -233 203 -423 -500 -24 -252 -415 16 -370 -502 32 202 -535 -1 65 -593 63 -44 -434
2385d34J95N41m38J85j9m17N83l43N7j17M7K32r4L80m56K20L04n69K70j96k06
2406b75Q96n49k57N42l38jO39l02j044J054L9o86N14J09l80K78J63m39K46M33
2426F42j063P54P5r68P36N40p28k87N71m88MP24n83j35L12n1j12N28n02k47O99
2447D21p56mP36m41m76P33n8m87K27L13l70K6n3NK13j24k49O85k37k33K44p9l00
2470b64N17j98l00O12o04L49K54j45k62L80k89l91P29j19k63M16j29m26L14K32
2490D13r54M10O92j017O98J02l34r4M11l21j77R18r10r7N30k57m61Q46j7n71M10
2511B20k35J95m49J62K01J36k93J36j25j9l7O6Mk11R9k20K40q6j25J04P3Q8k9
2534a05j12j79M78m72L02j12L1j46J88n2K48n35M53o8l43M38k65M0K08j7j32K83
$$ plain form
2385 -434 -239 302 -136 49 30 -387 196 -147 -90 -207 -160 72 -22 358 -98 122 426 -143 127 -69 -275
2406 -275 621 72 -185 357 19 18 657 355 -689 365 404 -282 232 341 -39 239 402 -37 209 642
2426 642 -421 333 408 -560 176 716 -12 -299 272 -216 -212 512 -71 -206 106 55 -57 471 -31 -278 421
2447 421 -335 -339 397 -44 -520 213 155 -332 -105 208 -162 -136 -189 -184 29 -95 -344 341 104 -129 115 36 -264
2470 -264 253 55 -245 367 -237 112 366 221 -41 339 50 -341 388 269 6 422 293 -133 181 413
2490 413 -541 -131 561 -456 242 344 10 -84 327 6 -171 747 -163 -260 270 13 -448 398 381 -190 220
2511 220 -15 180 -269 -107 94 230 -63 73 -52 -71 -108 -42 -38 -249 -150 -370 -130 -216 -341 -237 -164 -76 -105
2534 -105 -217 -396 82 -390 -88 -200 -169 -315 -127 -179 69 -466 -13 -81 -424 14 -251 -211 -3 -20 -152 131
2556A31l6m3k67L59n69K68L35j23PK13Ql38R8l62M19r0K4k0K75l7j16K26J15m03
2580G4q6K90j87K19j99k9J77K09m63J40m2o5M53j92j32k66O04l31L6j65J14j94
2602c5J49j09J40R1j18K67j97m31K10L82m67p6P77o46K22j86K34m22L93k03J02
2623G7j06J55k22m2K74l59K07q4k21N77k58l73L60Q1m17K42K50j37m3O3k74K79
2645B9j7l55L07k3k26J64J8j4OK50j51k10Jp2M26j38j56L60R9k43q7J22l89L20
2669B1P8m4k37K07M5l07M23l14P3K95j31l37J72J01k94N94r1k86J2J72k10J26
2691F8l8l08L66J01j05l81M57k14J87j1n23J93L84m96K91m2j0l10J79J86k20J1
2713b35lJ40j34J55k23L10l14K22J30j19n65O57j94%L2p8K16M0p7j25L32l73J12
$$ plain form
2556 131 95 52 -215 144 -425 -157 178 55 62 275 283 -55 43 -319 100 10 34 14 289 252 136 362 477 74
2580 74 -12 278 91 310 111 82 259 468 5 145 103 38 491 299 167 -99 505 174 210 45 159 -35
2602 -35 114 5 145 236 118 385 188 -243 -33 349 -118 -194 583 -63 159 -27 207 -215 178 -25 77
2623 77 -29 126 -96 -138 136 -223 -16 -100 -321 256 -2 -375 -15 66 -351 -109 141 4 -39 24 -250 29
2645 29 12 -343 -36 -59 -285 -121 -103 -117 -111 139 -12 -222 -221 -293 133 -5 -161 199 298 55 -32 90 -299 21
2669 21 99 55 -182 25 70 -237 186 -128 -55 240 109 -228 -56 45 -249 345 254 -32 -20 152 -58 68
2691 68 30 -278 88 189 84 -297 160 -54 133 122 -401 -208 176 -320 -29 -71 -81 -391 -212 -26 -246 -235
2713 -235 -238 -98 -232 -77 -300 10 -304 -82 48 -71 -636 21 -173 -173 -141 -219 -3 37 -40 -165 167 -206 -94
2736i4J70q7p8K79j7m71K70J43M0j40J05n1J25m7k74J26l7j97M7M82k87Q8J95
2759B90m7j2j86K38k86L03j35j22k58N07J59j61J09l79M78k21m46O50l46J9J80
2780C34l63J49J10j71q1K99o6m83M79J18n44L69J66n44M10m7m37J40K02J01j44
2801cN5j37qM28m61k78O2J72M04k93pk46K03Q5k49L20j18j58K77j28J77k39J35
2824gj1J09l34K05J73k53j22L81k30L7M16o41R6L01l38j0M90m66K18O3l43K36
2846c0L09l18j5L16o55J77J6L2K58J44l85j35M27M1p06P45k03l76K49K29m10K40
2868e0M62p48K68K39k99K6K25j05j30NJ04j98K54j54mK43nm28L88K68q19L32M22
2891B96k97j47j7J66r3J96l38J95oj61J80P8j41J00k71M47k43J94j55L34p28L64
$$ plain form
2736 -94 76 -11 -89 190 173 -298 -28 115 155 15 120 69 194 147 -127 -1 -38 -235 -188 294 7 95 290
2759 290 243 231 45 283 -3 300 165 43 -215 292 451 290 399 20 498 277 -169 481 135 154 334
2780 334 -29 120 230 59 -22 277 211 -272 207 325 -219 150 316 -228 182 135 -302 -162 40 141 -3
2801 -3 52 -85 -93 335 -126 -404 -342 -170 234 -59 -66 -312 -109 -24 -273 47 -71 -229 48 -80 97 -142 -7
2824 -7 -18 91 -243 -38 135 -118 -240 141 -89 -52 364 -277 -181 120 -218 -228 262 -204 14 77 -266 -30
2846 -30 279 -39 -54 262 -393 -216 -200 -168 90 234 -151 -286 141 182 -524 221 18 -358 -109 120 -290 -50
2868 -50 412 -336 -68 171 -128 -102 123 18 -112 -107 -3 -201 53 -101 -105 138 133 -295 93 361 -458 -126 296
2891 296 -1 -148 -165 1 -92 104 -234 -39 -45 -206 -26 52 -89 11 -260 187 -56 138 -17 317 -411 -47
2913d7N03p41k4N88m17N8L04q7j77M13j20k78L47J6n45N46j6l98Q7K37k36q9L78
2936C02k48j9L72l29p9J93j09j78L32k4r3j3lp9p0K47k18M67j89o0k26J08K52
2959C36j87J60n07K20L07l05J53j28Jq6R4J96l63j38O6L32k9r3j97L5k07M81l58
2982b17J07J82m58J29K5J81j46L26m30j37L10Q9j05q4j63M0P9K18j64J20k87L04
3004h1M9n7k47K13N4j36K76P2k95j82M27k6j61k27K71R9K7p8j54R5M73n33j89
3027c10M55k12j30P09l51nq2J91k53j13N43l62J53j70p9K78j43k94M45m1l32J99
3049I6M08l98m7L2k2j31o5J56m2J17J74j22j34j24L03j10j73L66k75q9K23l1J18
3072B30k99j64J94J36k18j52J65J79l83J68K08k41r9M11l4l96M76j23l32L68r3
$$ plain form
2913 -47 456 -285 -309 279 -138 -80 224 137 -40 373 253 -25 322 338 -207 339 323 -75 12 249 13 -76 302
2936 302 54 35 407 78 -1 192 83 -95 237 213 120 107 104 25 -45 202 -16 451 262 202 -24 84 336
2959 336 149 309 -198 22 329 24 177 49 50 -36 58 254 -109 -247 -181 151 122 29 -168 -133 -340 141 -217
2982 -217 -110 72 -386 -257 -232 -51 -197 129 -301 -438 -128 -39 -144 -228 -391 -351 -272 -54 -218 -98 -385 -81
3004 -81 -32 -89 -336 -123 -69 -205 71 143 -152 -334 93 67 -94 -321 -50 49 76 -2 -156 -61 412 -121 -310
3027 -310 145 -67 -197 512 161 156 74 265 12 -101 442 80 233 63 -16 262 119 -175 270 229 -103 96
3049 96 504 106 59 91 69 -62 -127 29 -13 104 278 156 22 -102 201 91 -82 284 9 -80 143 112 230
3072 230 -69 -233 -39 97 -121 -273 -108 71 -312 -144 64 -177 -276 135 101 -295 181 58 -274 94 1
3093AJ14O9l58J21M96l89L3R5M1l86J52J46j96O5J23K4Nm8J3J93k79k32J51L0
3117a6n1L54q4m30L86j9M0J65j27l49K45l5j60Q6K10j07l5K77l43K73K49n14K74
3140B89m17j92M19J4k12O3J05k74L0J41j30K48m1k61L03R6l27O6J93n34K58l0
3162a93K12k68K67j17o3J66m89K94K43k20l80N83k58j31J24M6O4J84k09j44L44
3183E5J3m08K57R1l55K36M94p48M65J5j27j29J53j4J9J71k74Q1K62j65j55r9J54
3206hP8J66j10J67k29J40l99M26j19k9J77m01L66k80N6J89qk7Q7M1k41m4K74k79
3230gq0J05R1r8M63k75m7J00n14L0L04L86n66L07J09o25K11J30J07j16J45l67
3252b07J54m6p5L65K3k20k68L08j65p4N29k03j35l6j94L96j20n11L49R0J39k97
$$ plain form
3093 1 115 184 -174 -53 443 54 87 182 223 -163 -11 135 -61 4 127 151 156 108 121 314 35 -197 -46 -16
3117 -16 -67 287 203 -227 159 140 180 345 218 -131 114 79 -81 5 215 108 73 350 7 280 529 15 289
3140 289 -128 -320 99 113 -99 -36 69 -205 -175 -34 -164 84 43 -218 85 181 -146 -80 113 -421 -163 -193
3162 -193 19 -249 18 -99 -162 4 -485 -191 52 -168 -548 35 -223 -354 -230 -184 -120 64 -145 -289 55
3183 55 68 -340 -83 8 -347 -111 383 -365 100 115 -12 -141 12 -2 17 188 -86 -5 257 92 -63 -162 -8
3206 -8 70 236 126 293 64 204 -195 231 112 83 260 -141 225 -55 1 190 182 155 242 283 42 -2 272 -7
3230 -7 -87 18 109 11 474 199 152 252 -262 -232 72 458 -108 199 308 -317 -106 24 131 15 160 -207
3252 -207 -53 -99 -174 191 214 -6 -274 34 -131 -205 324 121 -14 -50 -244 152 32 -479 -130 -40 99 -198
3274a98K75j82k2M44k48j91J32n3l2K91l35m1K01p0K0j2p7K76l2r5j94O2J2J25
3298E6K01M3k54P6j02k44M76Pl36L69L9k05l90K36j18L67j90o5K79l11K16m90
3320c40L27N5k69K75oo8J66j19m60J12K25j49K97j0p7J65m93M07J27r6r0j32J0
3343a43j2L32j07Kq7l33m2M08k50O3J0K34k51N6J16l68J03J97j15L3K54l08K88
3366H0qk51L56j43l65M7M43k48j28L51o9j62K52k38J41J39k72k53K87J26J57M4
3388B86n8k72J93L2k33K8M12j71k0m2O2k21J89k97K59K8o1p3K65k40loJ37l31
3412a37K82K2J18jqj29n0J05k5M0k28P0N9J88k41L6j07R7p0o6nM8k7L45m35p7
3438a96m8K54Q0J8K5m13J81n5K66j65p5L53j66j47o2m1J03k2L0J82l8n79K20L08
$$ plain form
3274 -198 77 -105 -127 317 69 -122 10 -43 -75 216 -119 -160 41 -29 -9 -21 -98 178 146 51 -143 -81 -69 56
3298 56 257 300 46 122 20 -224 252 259 -77 292 331 126 -264 -28 -146 221 31 -34 245 -66 150 -340
3320 -340 -13 42 -227 48 42 -26 140 21 -439 -327 -102 -251 46 36 -41 124 -369 38 165 69 -21 -153 -143
3343 -143 -155 177 70 72 -15 -348 -390 18 -232 -169 -159 75 -176 -120 -4 -372 -269 -72 -187 -154 100 -208 80
3366 80 72 -179 177 34 -331 -284 159 -89 -217 134 65 -97 155 -83 58 197 -75 -328 -41 85 242 286
3388 286 228 -44 149 181 -52 -24 388 217 197 155 217 -4 185 -112 147 175 114 41 306 66 63 57 194 -137
3412 -137 145 167 285 284 276 147 97 202 177 217 -11 59 118 306 65 101 -6 91 21 -45 -50 -2 -29 316 -119 -196
3438 -196 -244 10 90 108 133 -280 -99 -154 112 -53 -128 225 59 -88 -150 -191 -88 -110 -80 102 64 -515 -295 13
3462A3k08J77q3l01J69K17n9l81O31k20J4j00k8m3L33k52pJ60J36j28J64l62R3
3485f5K16J40j43k19p2O2K56j64l2k83M06j39r4J39j17K4q2o0K05j10J25oj99
3508b12K99l2l3j93K05k25j83K61L68n74K03K25m07L07J09k88J30J58m37M55q2
3529E4l38M94K49l73k32L39k67l96M76j50j73L72o4n9j9J61j32J56j56l37L10
3550h5l4J56q2K68m25N21l77J53j50m9J5K7P2J47J98k29K3p9q2K61k09O9l63L81
3574A27k50J83K43j9j58j39J28k02M62j63j70K93j74p2q5K26k24J76J54n39K31
3595B8K94m96L49M23p61K44J34l64N0K25j17l13M51q1j0K37l99J25p8l8l07K78
3617a26J28jJ00j52j09j12J27j29q4K05L8K03j06L0K61n91J65Q8j24k0nJ00o5
$$ plain form
3462 13 -195 -18 -101 -402 -233 -16 -75 -456 175 -45 -31 -131 -159 -202 131 -121 -128 32 168 40 204 -158 -65
3485 -65 151 291 148 -71 -143 -81 175 11 -21 -304 102 -37 -131 8 -109 -85 -167 -227 -22 -132 -7 -13 -212
3508 -212 87 55 22 -171 34 -191 -374 -113 255 -319 -116 109 -298 9 118 -170 -40 118 -319 136 54
3529 54 -284 210 459 86 -146 193 -74 -470 6 -144 -317 55 -9 -68 -87 74 -58 98 -58 -395 -85
3550 -85 -119 37 -45 223 -202 319 -58 95 -55 -104 -89 -62 10 157 355 126 149 70 -12 249 40 109 -254 127
3574 127 -123 60 303 284 126 -13 115 -87 375 212 42 335 161 89 4 230 6 182 336 -203 28
3595 28 322 -174 175 598 -163 81 215 -149 -99 126 9 -304 147 66 56 293 -106 19 -59 -97 -404 -126
3617 -126 2 1 101 -51 -160 -272 -145 -274 -358 -153 -115 88 -18 12 273 -318 -153 -65 -189 -209 -214 -114 -179
3640a79L10r4j03o0K9j1J71j57Q5PK36m76J60J81l07J02J68j06J15j5pj7%K26
3664B58l55j8J45j96M12m27M3L69k57q8J15P6J6j44k4j4qK6J0R1j29K42j49J19
3688A13k36N7L09k96RJ07j58Q0J85k6m16L72Jl66q2J63K64o8k09RR4L9n2L39k9
3713B03k25j6R2K03k86P5j34K77l35M8L64k03K81k87j15l3j01M07M6k29q8J23
3735F7L8k8q3K69k39O1j30O3J34j58J07J91p0q5op4J26j66J56P6m8j76K69k19
3759G5P2K67m01Q5L24m29r1J38J44q4J52Jl84J39L09j14j23r1O7j21J01l6P0p9
3783il49K34j82J3J75J23k73J66M1O4k43J98k19J47J52l7n1j03j1o9L66o29L20
3806a76Q9j14K0J34K42m85L26j05K4J63k96P1R4K06j87j9k17L7K67l5j56R7J34
$$ plain form
3640 -179 131 37 -66 -126 -97 -108 63 -94 -9 -2 234 -242 -82 99 -208 -106 62 -44 71 56 49 32 32 258
3664 258 -97 -115 30 -166 246 -181 -138 231 -26 -114 1 77 93 -51 -75 -89 -97 -71 -61 30 -99 143 -6 113
3688 113 -123 -66 243 -53 -44 63 -95 -15 170 144 -272 100 101 -265 -347 -184 80 12 -197 -188 -94 -55 -107 232 203
3713 203 -22 -38 54 257 -29 46 -88 189 -146 -98 266 63 344 57 -58 -91 -192 215 261 32 -56 67
3735 67 105 77 -6 263 24 85 -45 18 152 -6 101 292 222 137 131 57 183 17 173 249 201 25 294 75
3759 75 147 414 13 98 422 -7 -98 40 184 100 252 253 -131 8 317 203 80 -11 56 -65 36 0 70 -9
3783 -9 -358 -124 -306 -293 -118 5 -268 -102 -61 3 -240 -42 -261 -114 38 1 -50 -153 -164 -233 133 -496 -176
3806 -176 -87 -201 -181 -47 195 -290 36 -69 -45 118 -178 -107 -13 193 6 -13 -230 -193 74 39 -117 -20 114
3829A14j5Mj38qn9J30k21n8L14k33nJ30N4K6J19k12k26M05J36k93K86l89L82j7
3853B26k13l0K1L0j79K48k63L9R9L05k64o5j3O3J47O6j77L6k29K08J75q0l53L0
3877a73L54q4j1J5M7m3m2k9l9k2q5OJ89k52n1L33j45o2l7q6L93O9k62K27m9P3
3903B34l53L15k43k0K21j57L9pj17O5L19k80n5qJ97P9k04j47L6j0P5kJ01j44K04
3928A38J3j21j18L6K82l63K14K7m7k92L26K32n39K15J71Kpk33J95k63J86L57m99
3951h8j7K12o9j30P7O6m37P44k58l93K16Q4q5J65R3k76k17P05p72K58k7J12j33
3974a70J83k32k0K48j85Q4O0n9r9J27j30j99N38k54n1q4J96P7l09J46PJ99o3k
3998Hk57M8K99k24N2n8l2J33j97K90n28M37q8K13m2O8j18k01J56r5K92j02R8j8
$$ plain form
3829 114 99 103 -35 -43 -102 28 -193 -251 63 -170 -175 -45 9 35 154 -58 -284 121 257 -36 250 -139 243 226
3853 226 13 -17 4 34 -145 103 -160 -121 -22 283 19 -46 -59 4 151 217 40 76 -153 55 230 150 -203 -173
3877 -173 181 97 86 101 148 105 63 34 -5 -27 -112 -106 83 -169 -220 113 -32 -94 -131 -217 176 245 -17 210 161 234
3903 234 -119 196 -47 -67 154 -3 36 29 -88 -23 296 16 -39 -47 150 229 25 -122 -86 -96 -21 -23 78 -66 138
3928 138 151 30 -88 -52 230 -133 81 108 61 -231 95 327 -212 3 174 176 169 -64 131 -132 54 411 -88
3951 -88 -105 107 38 -92 -15 51 -386 358 100 -293 -77 7 -78 87 180 -96 -313 392 -380 -122 -149 -37 -170
3974 -170 13 -219 -239 9 -176 -92 -32 -91 -190 -63 -193 -392 146 -108 -159 -243 -47 30 -279 -133 -126 73 10 8
3998 8 -249 -201 98 -126 -74 -132 -164 -31 -228 62 -466 -29 -117 96 54 122 4 -197 -41 -136 156 54 152 134
4022A34J57k87o3K18j50L65l21K62m44L70J11l98J54q0l9K06K68o44J85J98j81
4043B1j52KJ16j34K52k4J9R2j55j40M08j18j21r8LK52m14K50p2J42l26K75l00
4066b22L93M2k30K7n8J19j46P6j88O1K70J3k83L0n0q1J79j57o1J53O4q5K30r9
4090cq2j63J34m1j30L87J93n28K45L33m78L74k09J77m27LJ51K84j42j45k71O10
4112B72O4l35j51Mn0K91R1n66L32M3k44L24K11l16J23R6%m04K14Jj24J84R5k87
4136a32K14J32m32J58MJ5k03K37K90k32k07J39n3K50l21Q1J87r9k46J02NK36j84
4159e9j92M35l16k49M71j41k06J72J09n6p5l9K13m8J48k95m0K24J08j74L6l34
4181c08M62j70j46j02M07j17J03q5Rm5p2J60PN8k1p5K28m46K06K3p2Q0J21J02
$$ plain form
4022 134 291 4 -59 159 9 374 53 315 -129 241 352 -46 108 28 -11 195 463 -181 4 202 21
4043 21 -131 -129 -13 -147 105 81 100 192 37 -103 305 187 66 -32 -29 223 -191 59 -13 129 -197 78 -222
4066 -222 171 213 -17 10 -48 71 -75 1 -187 -126 144 157 -126 -96 -146 -227 -48 -205 -266 -113 -49 -134 96 -3
4090 -3 -85 -248 -114 -155 -285 102 295 -233 12 345 -133 241 32 209 -218 -215 -64 220 78 -67 -338 272
4112 272 336 1 -150 -146 -196 95 186 -380 -48 -5 -249 75 286 -30 93 189 189 -215 -1 0 -124 60 155 -132
4136 -132 82 214 -218 -60 -56 -41 -244 -7 283 51 -156 -17 -70 180 -141 -60 127 28 -218 -116 -111 125 -59
4159 -59 -251 184 -132 -381 90 -51 -257 -85 24 -32 -107 -146 67 19 167 -128 -168 56 164 -10 26 -308
4181 -308 154 -16 -162 -264 143 26 129 44 53 8 -64 96 103 161 140 65 293 -153 53 76 4 84 205 307
4205C07l26j17M11q9q9l1K2J56n4j91O8P0j87O8j9N2J15Mk10O0J64k32J76q5K49
4230B92k43J7PL18j82k58J01j70P9R2j92O3J61M4n60L92Q3k0qj06Q3n3kK6n4J7
4256g3KJ51l46P8J21k7M8p8P5K58j37j80O9j02J14k61j00M54l48K94k51L30k34
4279a43Q9n7Rn6L5P6p3M1J38J10k48J71n4m1n8K36l8m97L86M6j68R2K10k03j23
4304a20J01J56Qk29Q1j48M02J1j74O3k11KOj20j2L36j96j18L1k74L72J81k9k46
4328a27K5Q1P7j67M8j45K16j48J10L36j91l10J29L9j80J84J18l37K56n7j6J21
4350F2J33m28L97j84R4K26o7k03j48J63K27n19M24k22L3L27m02kJ27L4k06L58
4372B24k8M5k52M7nJ15L2J3Pk56K39p1l1M35k62J42m85N3M3J25J31k29M4rL03
$$ plain form
4205 307 -19 -136 275 186 97 66 88 244 190 -1 67 137 -50 18 -1 51 166 170 -40 20 184 -48 128 43 292
4230 292 49 66 73 391 209 -49 52 -118 -39 53 -139 -76 85 129 -431 -39 44 24 16 -90 -7 -60 -62 -36 -90 -73
4256 -73 -71 80 -266 -188 -67 -94 -46 -124 -49 209 72 -108 -39 -141 -27 -288 -388 66 -282 12 -239 91 -143
4279 -143 -54 -111 -102 -158 -123 -47 -120 -79 59 169 -79 92 38 -3 -61 175 137 -360 26 72 -96 -4 206 3 -120
4304 -120 -19 137 145 -84 -3 -151 251 262 88 151 -60 -58 -52 -172 -184 152 -44 -162 -131 -405 -33 148 119 -127
4328 -127 -102 -21 56 -111 -63 -208 8 -140 -30 306 115 -195 -66 -27 -207 -23 95 -242 14 -43 -59 62
4350 62 195 -233 164 -20 74 300 233 30 -118 45 272 -247 177 -45 -12 315 -87 -89 38 72 -134 224
4372 224 196 241 -11 36 31 146 178 191 198 -58 181 110 79 514 252 394 -91 -38 5 130 261 32 76 67 370
4397C70m80J24J69l41J94J52J10K8m73K39l19J70J36K32l61JK0K54k61M4J87l55
4419a60K16K32j66j51j58L49k08O0L4j61K28j06j7m5j91L62l82K90j37J17L2k94
4441b56R4j77M49l40K73l86L1Q8pL59k33J26o5n2K46J16k03Q0n16Q3L65L0l9k50
4465a84NL8r4K59L0m22M61k77J72O6j61L58r5k83J64L22j87l29L02J30k26k51
4487b02R6K10k3j66L36k90N5j3K47j23l5K11n7k92Q5p5L22n0n80N72j34J6m7j76
4511a13K49m27J59j1J00K20l3m29K02J27j6j29m6O1j96K25J66l90j7M75j93M5
4533B9j7q2n2J97p3m2L5r7J05R7j33j0L04l79j03K35R1j8P8r7j68K01l10J75K30
4558A96j68j50J16K00j81K39j89k15P5L0L42k94L56l40j70k6K07j26K24j99o5
$$ plain form
4397 370 -110 14 183 -158 36 188 298 326 -147 92 -227 -57 79 311 -50 -49 -29 225 -36 8 195 -160
4419 -160 56 288 122 -29 -187 162 -46 14 48 -113 115 9 -8 -53 -244 118 -264 26 -111 6 38 -256
4441 -256 -162 -339 110 -230 43 -343 -312 -224 -231 128 -105 21 -44 -96 150 266 63 143 -373 -290 75 105 66 -184
4465 -184 -179 -141 -235 24 54 -368 93 -184 -12 54 -107 251 156 -127 37 359 172 -157 145 275 49 -202
4487 -202 -106 104 81 -85 251 -39 16 3 250 127 92 303 246 -46 39 -36 286 236 -344 228 94 110 63 -113
4511 -113 136 -291 -132 -143 -43 177 144 -285 -83 44 28 -101 -147 -86 -282 -57 109 -281 -298 177 -16 29
4533 29 12 -70 -122 75 2 -40 -5 -102 3 100 -33 -43 261 -118 -221 14 105 87 165 68 -100 101 -209 -34 196
4558 196 28 -122 -6 194 13 252 63 -152 -77 -47 295 1 357 17 -153 -179 28 -98 126 -73 -138
4579a38J29K80k37lJ38k87K25J02k31J8J88j23q9k37J02K8L46j40j51j20M7K13
4601F0j44k19J29R2K72j43j77o3L60k51j12J11l3k46M05j20j64j00N80j19l51
4622b33KL5J50j77K79k99k2L9J38q4qK1K25l96J8L78j38q6K75r0k85J55J7J30
4646D4O5m19L49J36J33l85j07M41j53J29l28L02k42J04K60l53J98j76J04Q6k0
4667A68j30j32K33k9K09j49j70q0L8Po0K03J75r4l21K73L0P9l9k61PJ93J23k92
4691a9J1J39p3o7R5MK04m07L71k80k7K3J46pp4j35L43j75j09N2J44j78J11j40
4715d8N7J38j24K7R0O4k17k16J32J20m7K8r9K80j02j95J20q8j54L27j07j37K13
4738F2k20N8k31M92j25j21J14J67j33j88L01k52R8J32l01K37j25j12R7M3J23j48
$$ plain form
4579 -138 -9 271 34 31 169 -118 107 209 -22 -4 184 61 -28 -265 -163 -135 211 71 -80 -200 -153 60
4601 60 -84 -303 -174 -82 190 47 -130 -193 167 -84 -196 -85 -118 -364 41 -79 -243 -343 237 118 -233
4622 -233 -231 -196 -46 -223 56 -243 -265 -226 -88 -172 -180 -159 66 -330 -312 66 -72 -158 117 27 -258 -103 -86 44
4646 44 109 -310 39 175 308 -77 -184 257 104 233 -95 207 -35 69 329 -24 174 -2 102 188 168
4667 168 38 -94 139 110 319 170 0 -80 -42 -35 -95 108 283 189 -132 141 171 250 211 -50 -43 150 273 -19
4691 -19 -8 131 58 -9 86 90 294 -113 258 -22 -49 -26 120 113 39 -96 247 72 -37 15 159 -19 92 -48
4715 -48 9 147 23 50 140 204 -13 -229 -97 23 -24 4 -95 185 83 -112 8 -80 -234 93 -14 -151 62
4738 62 -158 -100 -331 161 36 -85 29 196 63 -125 176 -76 22 154 -147 90 -35 -147 -50 -7 116 -32
4760c2r9J91lr1P8j14L1R1n2J11k05J30J05m12K75k9o6j49L60k41QP9j74N3K82
4785A27j27j64k3K59r1J9L6j58r2Q5j27Q5J91j68J01r2L4o6K76m8k06R6R3Q4j58
4810c4R8J01m34k4L44pN7k08j5j1K94p2j93J29k39N06k25J85j17o5R6j56J60j81
4834a1P2K88l10pK31l9j17p9K12j12J47j34j54pJ7J96q4J75l44j18K87Q3k63o7
4858a38J16o2J05K68j90J73k79J29r8q4o5K13nl65K08J06l86K48N5j04L7J29p0
4881e9k6nO7J41j01J18l05K10j52m6J8K32r6Lj49r2J48l34L11K07k07j47L28k31
4905a67L1K71K8k15p2K20j01l04J97J90N5l39J16J89k12J17k17K54k22M42l49
4926h8R7q9j32L02j32K50j20j01kJ7J04j78K53l1l46J2K12p6J07K16l40Q7j54
$$ plain form
4760 -32 -131 60 57 -34 44 -70 -39 52 0 111 -94 36 141 -271 4 -25 -91 -240 120 -121 -113 -34 -208 -155 127
4785 127 0 -164 -187 72 -19 0 36 -122 -214 -129 -256 -171 20 -148 -47 -139 -105 -171 105 57 -149 -53 40 124 -34
4810 -34 64 165 -269 -293 51 44 101 -107 -122 -133 161 89 -104 25 -214 292 67 252 135 70 166 10 170 -11
4834 -11 61 349 39 32 263 224 107 28 240 128 275 141 -13 -20 -3 193 109 284 -60 -178 109 192 -71 -138
4858 -138 -22 -84 21 289 99 272 -7 122 24 -60 -125 88 83 -282 -74 32 -354 -106 -51 -155 -118 11 -59
4881 -59 -85 -90 -23 118 17 135 -170 40 -112 -158 -140 92 -4 -1 -150 -242 -94 -428 -117 90 -117 -264 64 -167
4905 -167 -136 135 163 -52 -124 96 -5 -309 -112 78 133 -206 -90 99 -113 4 -213 41 -181 261 -88
4926 -88 9 -80 -212 90 -42 208 88 -13 -15 2 106 -72 181 150 -196 -184 28 -48 59 275 -65 22 -132
4949a32N8K16j75o5M8M7J48j36j82O0J53q6rk50L20l0N0QP1j04K29k35j41j2K87
4974A38j51J25k10j12L30j30J26k36k7O9J46K0p5%K13l75P7L39j42j94J4J99k88
4997a44K39J5J16q2o2M9q4J01k73J78Qm1K61q6l20k1K33j37rL67k42J21O9l64
5021a08J41JL8K64n1r7j15L35p1l96J79k55K95k37Q9J78j12J44o05L71r2Jk2M13
5045B88k66J0J40k63K17k73J62k2M2j70O2k35J45J17m3MJ31k24M7N3l67K68q8
5068b65N44l61m5J27J18j98j08O6J69n2l0j90J51OK66J7j36j38jr8J04j97P4M0
5092a37J03p1j23K97j46m8K07k0J16J9J03j19j37K03j25r6j67J54m3j30K52j93
5114a01R9J18k06K01J00j20k47N31m86j7J25j8l1j01mj43M94n5m3j70J24M2m3
$$ plain form
4949 -132 -74 142 -33 -98 -50 -3 145 9 -173 -113 40 -46 -55 -305 15 -15 35 43 114 10 239 4 -137 -149 138
4974 138 -13 112 -98 -210 120 -10 116 -120 -147 -78 68 88 13 13 226 -149 -72 267 125 -69 -55 144 -144
4997 -144 95 110 226 144 82 131 47 148 -125 53 61 20 281 195 -125 -146 87 -50 -59 308 66 187 256 -108
5021 -108 33 34 72 336 285 188 73 408 337 -59 120 -135 160 -77 12 190 78 222 -383 -12 -104 -103 -125 288
5045 288 22 32 172 -91 126 -147 15 -7 35 -135 -73 -308 -163 -46 -89 -85 46 -178 -131 -78 -445 -177 -265
5068 -265 279 -82 -127 0 118 -80 -188 -122 47 -5 -35 -225 -74 -68 198 215 79 -59 -60 -158 -54 -251 -177 -137
5092 -137 -34 -105 -228 69 -77 -125 82 62 178 197 300 181 44 247 122 26 -141 13 -30 -160 92 -101
5114 -101 -2 116 -90 111 211 91 -156 375 -111 -128 -3 -21 -52 -153 -157 -300 194 139 96 -74 50 92 49
5137D9QJ00l54M76k03n3j41J88M7j00J36l48J22K18k07r3J28J76k09J6K60j13
5159A03L27l69l04J96RK10q0M4l7j61Q5j23j0L35p2j00o7m0K11l4k20J72p7J07
5183A05k9j10J4pj59L89k46J07k0L02k63j19K93j81N6n1j61N9M78j50l01K77p8
5206B05o2q9J24l59J68J06j3N6n1j31J81nj27K4J0N3j83K50k43L57l10J87j10
5229C8m5K4k3n7j54l0j15L36j21J28n4k5K35l18q0K45n0J47l67m4J88R3R4j90
5253a45J63m5k9Q7k34K5K16j08Nj53J06J82k00J71J88j52k53J18J44J8J17k82
5275f1n0J31k23K12O7R9k38J28J18j35R8k92p5M56k79k0L19k39j39J16j8P4o0
5298a1p7k9L33q4l10J78K14M8rj22j67n0L32l01K51l4j35q3jJ3K6J78N1R0j85
$$ plain form
5137 49 57 157 -197 279 76 23 -118 70 117 17 153 -195 -73 145 -62 -155 -27 149 -60 -44 216 103
5159 103 430 61 -243 -47 -38 172 92 136 99 -62 23 -100 -110 225 153 53 -14 -54 157 123 -97 75 -2 105
5183 105 76 -34 -20 -27 -186 203 -43 64 44 346 83 -36 257 76 132 81 -80 -21 457 307 6 283 205
5206 205 143 54 178 -181 -13 93 80 136 85 -46 135 130 3 27 37 90 -93 157 -86 271 -39 148 38
5229 38 -7 17 -6 -63 -217 -247 -362 -26 -147 -19 -73 -98 137 -181 -261 -16 -66 81 -286 -330 -142 -49 45 -145
5253 -145 18 -27 -56 31 -203 -178 38 -70 -65 -218 -112 70 -130 41 229 77 -176 -58 86 104 221 -61
5275 -61 -111 20 -203 9 76 175 -63 65 183 48 146 -146 -221 235 -44 -64 255 16 -123 -7 -25 49 -11
5298 -11 -88 -117 216 132 -178 0 214 262 253 131 -36 -86 246 -55 196 162 27 -56 -57 -44 -18 160 211 301 116
5323A16P4k92J57j10r3O4K73j63N5j46J54k05J00n3q5L64m06K99l3Q5l32LL12
5346A38j46M9l1R9r0J3N0o1m15M60M9R5l62N1K47k01K56j17l9k6J61L9j50j49
5370h0J5J32k09K6Q4P8Q7J23j18k49K19j20J16j34J91j84R1n4J11k01JJ59j05
5393b1J71l23J00K50J00j45k7l4L5j58N9J60k82m1j1J80k84K2K02N5q8J20k10
5416a70l3J32N1j53J47K09l13p2M6K32j36N8j03NJ87J98k29p0m5mJ20J32o5p7
5440D7r2J88k56j13L86k01k1j20n4K56J8J64k19K46k74pK00k25p1jK14J16J0n7
5464A34m2p0k1j08M9j14Q2K0J8L31l25K62Km59L09K00l06j06K87L3j17o6L2J56
5488A81r9k20L84k05j58r2J58J02j02K9K86k01p8l2Q3q3M2J57k92K58L3k46N8
$$ plain form
5323 116 190 -102 55 -55 -148 -84 189 26 81 -65 89 -116 -16 -69 -154 210 -196 103 70 155 -177 -174 138
5346 138 -8 41 10 109 19 32 82 21 -394 66 115 210 -152 -101 146 -55 201 84 45 19 180 219 69 -80
5370 -80 -65 67 -142 -116 -32 46 133 256 138 -111 108 -12 104 -30 161 -23 68 14 125 -76 -75 84 -21
5393 -21 150 -173 -73 177 277 132 105 71 106 -52 7 167 -115 -156 -167 13 -271 -249 -47 8 -80 40 -170
5416 -170 -203 -71 -20 -173 -26 183 -130 -202 -156 76 -60 -2 -105 -100 87 285 56 -14 -59 -63 57 189 124 47
5440 47 -45 143 -113 -226 160 -41 -62 -182 -236 20 38 202 -17 229 -45 -52 148 -77 -148 -149 65 181 191 134
5464 134 92 22 1 -107 -58 -172 -90 -70 -52 279 -46 216 218 -241 68 268 -38 -144 143 176 59 -7 25 181
5488 181 82 -138 246 41 -117 -209 -51 51 -51 -22 264 63 -15 -47 36 -47 -5 152 -140 118 151 -95 -37
5511c7L14l52Q6J59j64J55l40L24k10J8J0k78L56k84j5J43J31N8j90j90M0K56
5533a0J72k07J38n0j24j1j04L50j80m7Q5j40P6J32j85J39J08j19j7k46M46j9j74
5556A3k0K56k51K00j82j5J4J5j35J16R9N3k26k26K70p1J50J14j17Q5j88K72j56
5579G0O3k17l5K3r3K8j56K38N1J86j76J38j74J65l80K38k21K10j79L9K12m6k10
5602b26J60J3OJ87l28K55M1k01j07M7K54N6k45L16j98k03R8PL34m37J75J64j59
5625Ij73K91k6j42L1k26J82O6J89K8k30l1k5n8K17Q5j86J8L3j08J90Or1Q8l48
5650b11L17J97p9j77J23k11K06k6j69O3K50j10n3n7O5r5O6o1j98K00K28k40p5
5673d7J13J00j76l7j44J01L18m45L59j93j10l6J96J12Q5j49K08k39o7m0J48P9
$$ plain form
5511 -37 277 -75 11 170 6 161 -179 145 -65 -47 -37 -315 41 -243 -258 -115 16 74 -116 -306 -266 -10
5533 -10 162 -45 93 43 -81 -92 -196 154 -26 -73 12 -128 -52 80 -105 34 142 23 6 -240 206 187 13
5556 13 -7 249 -2 198 16 1 15 30 -105 11 110 163 -63 -289 -19 -90 60 174 57 142 -46 226 70
5579 70 133 -84 -119 -96 -189 -161 -317 -79 -28 158 -18 120 -54 111 -269 -31 -252 -42 -221 -182 30 -16 -226
5602 -226 -66 -53 -47 140 -188 67 108 -93 -200 -153 101 157 -88 228 30 -173 -75 -68 266 -171 4 168 9
5625 9 -164 127 101 -41 -10 -236 -54 12 201 229 -1 -32 -57 -115 102 187 1 19 52 -56 134 140 49 137 -211
5650 -211 106 303 224 47 170 -41 165 139 -30 33 283 173 120 63 128 33 99 38 -160 40 268 28 -47
5673 -47 66 166 -10 -47 -191 -90 228 -217 142 -51 -161 -197 -1 111 196 47 255 16 -51 -91 57 136
5695A36j58K51k99n4J68k25K7j16N1K5K44j45k46O18k32q6J08k78J72k04O49o07
5717b01J65Nj65p7K01J5l6J23l76R2L46J31l39nJ91k16P8N4J72l45K9L60j95j38
5741a31KJ79K06k79J66j36QK3J34j18j16J76J03k72M3L55j83q7j02N1j99p9K09
5764d7K63l63M65o00K80J0J58n6P2j06pk6j30J71l14M78k30n6L8k32k9L45rk3
5788E2m6ol25K53J55k33L09J0j01j97K88k20J64O6j95L76n89j8M71j07j48o3j
5811a05P9m3R5Pr2J83k02K7k6k1Q3q0o7J83K61k25k70K32l0J34m0m6L7J25k34
5836c5o2k42N04n5J10j99r7n4J1N0j12O2J2p2L34L0k57q0K70K81l87j6j08O3k39
5861b88P0r2K01n1K08l68N41l93N0j5K12j35o5r5l2K31K08j2l22Q2L9R0j27J27
$$ plain form
5695 136 -22 229 -70 -124 44 -181 -154 -270 -219 -194 50 -95 -341 277 45 -41 67 -211 -39 -243 406 -201
5717 -201 -36 -31 -196 -273 -72 -57 -93 30 -346 -254 92 223 -116 -121 70 -146 -68 -14 158 -187 -158 202 7 -131
5741 -131 -129 50 256 -23 143 7 15 38 172 54 -62 114 217 -55 -12 343 160 73 -29 22 -177 -256 -47
5764 -47 216 -147 318 -282 -2 8 166 110 182 76 69 43 -87 84 -230 248 18 -38 0 -232 -261 84 75 52
5788 52 6 0 -325 -72 83 -150 159 169 68 -129 159 -61 103 169 -26 350 -239 -257 214 107 -41 -104 -105
5811 -105 -26 -69 26 33 -59 124 -78 -51 -77 -98 -15 -95 -162 21 282 57 -213 19 -11 123 83 37 74 199 -35
5836 -35 -97 -339 165 110 220 21 -76 -130 -119 -69 -181 -119 -107 -179 155 185 -72 -152 118 399 12 -4 -112 -49 -288
5861 -288 -218 -310 -109 -160 48 -320 221 -172 -122 -137 75 -60 -125 -220 -252 -21 187 175 -147 -65 -26 64 -63 64
5885F4J11j26j3l92J46L47m3j94M79l25M5R5n2k19r0M64l66P1k12r1L88l1j45
5908h9J16l1m8J63J4o3j08j55N86m50J35M8o9j32j85M30k00J04J58l71J79j48
5930a16L34L2m10K33q5J85l57K42j23J19q5n2J53p0k28L80j12J23k68J32l2j08
5952a13K29j78L34k30o7K7rp6K3K82j25k10L29k76j28K89j05oM8j38J37p2L19
5975B84j33k70K66j49K8J96k44Q0j79K37l54K76m3J1J63l57pK99k56J34n7OJ62
5998I3m7J87J3n8j34l6j64K52l3M4p9J40M1k90j56L74j47%J4Q0j6o6l8q8jJ61
6024D6l18L83N5j39K1j13k02K6L4J74Kj06R6J6J09P7j21j24n8l3K16j90N9J87
6048I7j50Rn5L2J49k15J90M2j44j77M9K24K0j25j21K50%k51j1K48N8j49J35j81
$$ plain form
5885 64 175 49 36 -356 -210 137 94 -100 379 54 99 194 142 -77 -167 297 -69 2 -210 -301 87 56 -89
5908 -89 27 -4 -52 111 125 62 -46 -201 385 -65 70 118 49 -83 -268 162 -38 66 224 -147 32 -116
5930 -116 218 250 -160 73 -12 173 -184 58 -65 54 -31 -83 70 0 -228 152 40 163 -105 27 -5 -113
5952 -113 116 -62 272 42 -25 2 -7 -83 -60 222 97 -113 216 -60 -188 101 -4 -10 38 -100 37 -35 284
5975 284 151 -119 147 -2 26 222 -22 58 -121 116 -238 38 -5 6 169 -188 -195 104 -152 -18 -75 -69 93
5998 93 46 233 246 188 54 18 -146 106 73 117 38 178 219 -71 -227 147 0 0 14 94 78 12 -26 -114 -115 46
6024 46 -272 111 166 27 48 -65 -267 -241 -207 -33 -31 -137 -41 -25 84 161 40 -84 -142 -175 41 -149 -90 97
6048 97 -53 -44 -99 -67 82 -133 57 99 -45 -222 -173 51 71 -54 -175 75 75 -176 -187 61 119 -30 105 -76
6072g6J24k37q3J76N00m51j31J79J85O0l60J94r9K43j74K54l82p9K0K43r3%j24
6095a11R2K8M0L20n30K63k9j58K95o2m09J20J83K86m6l45J94l34K79J53l02J32
6117E9R2k99K60k0j55j9J60J02l04L47r3K00k35k33J85o4J09k82J96J10J36o9
6139A83k31K16k83L3j28q7J43q1K36Kj04J13j96N7P8J92j62J24l36K69J0p0L7
6162A5k55L32k2P8j89K33j83o0P6j10K4j3n1K13p8j58K08p8n4k07K58p1m0J80
6186D8L8qk62j28M40N3l46J70o5J4L21m70L35r3n4O2j5J26j95j25K39J63K2n6
6210B14pl85J18L12l11j08J18l6J46j05J56k71J16o0J52o2l4j95L45o6K11j37
6232A11k00m7N3j49J43l6K98j29N3l61J56J54N6l65k3N69l70J51n7o7J73k00j
$$ plain form
6072 -76 48 -189 -272 -96 404 -47 -178 1 186 246 -114 80 -19 224 50 304 -78 -157 -137 106 13 13 -111
6095 -111 -19 9 49 369 -161 102 73 -85 210 148 -261 -141 42 328 282 -63 131 -203 76 229 -73 59
6117 59 151 -148 112 92 -63 -82 78 180 -124 223 130 330 95 -138 47 -17 92 -190 6 116 252 183
6139 183 -48 168 -115 -82 -210 -297 -154 -235 1 3 -101 12 -184 -127 -49 143 -19 105 -231 38 48 -22 15
6162 15 -240 92 70 148 -41 192 9 -51 25 -85 -61 -74 -125 88 10 -148 60 -18 -72 -279 -21 -92 -132 48
6186 48 86 78 -184 -312 128 181 -165 5 -60 -46 275 -195 140 47 -7 55 40 166 -29 -154 85 248 270 214
6210 214 207 -178 -60 252 -59 -167 -49 -85 61 -44 112 -159 -43 -103 49 -13 -47 -242 103 37 248 111
6232 111 -89 -136 -83 -232 -89 -125 173 44 97 -264 -108 46 102 -263 -286 283 -87 64 7 -60 113 -87 -88
6255h8L24j41p4k25K63j01l7M48m24L7Q3j0j44N2J70j1k6j33M02m88N1K15J2j73
6279a8M6j03J49k10L76k69Mj31J68K3J2j7K2J85k59L9M5j73J82K28j69J3J43l23
6303c7JJ40j00j40L97l11j09Q1j6P9k15K70K1m10L53j02J00k02m5J36J81J03k54
6326g9L54j95j26q3J43j53J79j85J95l1J8Ok19L18l48J29m50N86l52J93j18K15
6348cj61J78l28J43L42o1k20J3L40m42R8K58l38K63K1k28K62k77k0J95Q7j01l6
6371a5K4N7N2k36J13%K76k78O3k23K98j20j28J04r8L89l04K4J32K81k99J02l52
6394a38L04m1K4k00l3J30j31J30j14k8J0j14J94J3J56k32K25K3k06L63m98L54
6416A91k00K12j90r7%K45N5j04k01o1K44j81L1n1J13J31j78N0N9k4K9k5j11j06
$$ plain form
6255 -88 236 95 21 -204 59 -42 -79 369 -55 -18 65 55 -89 -37 133 122 96 -37 365 -123 -72 143 155 -18
6279 -18 28 -75 74 -136 240 -29 -25 -156 12 35 47 30 52 237 -22 17 62 -111 71 299 130 143 286 -37
6303 -37 -36 104 4 -136 261 -50 -159 -78 -94 -15 -230 40 61 -349 4 -98 2 -200 -245 -109 72 175 -79
6326 -79 275 80 -46 -129 14 -139 40 -145 50 19 37 43 -176 142 -206 -77 -527 59 -293 -100 -218 -3
6348 -3 -164 14 -314 -171 171 110 -110 -97 243 -199 -101 157 -181 82 103 -125 137 -140 -160 35 122 21 -15
6371 -15 9 66 118 -118 -5 -5 271 -7 56 -167 131 11 -117 -13 -111 278 -26 -2 130 411 112 214 -138
6394 -138 166 125 149 -51 -84 46 -85 45 -69 -97 -87 -201 -7 6 162 -70 155 178 -28 335 -163 191
6416 191 -9 203 13 -84 -84 161 216 112 -89 -150 94 -87 -56 -107 6 137 -41 9 68 44 73 48 -63 -169
6440a69K74l4mJ88j51Okr2K80k62J8J30k22K7J89j34o5j32K0K69l47K26Q7P4j68
6465FJ33q1k04Q8J18q1l1j40J64K53k61K8K7RNJ89Q2o32J38J63R7k09L1K64j78
6490b2O4O1m0J02l61o8L79k72M0J09m8L8j59J47l59P2K05L08j76j2j8J44k35J65
6514F4j94J23j78J52K7k13K81j47OJ20k90L15j43p4L70l34J46r6J07J72j50M3
6536A07j68J14j43J64k08o7R8O2J55L1j79Q5q3J9L9L4K6l2n1n5J95j34P9m70L88
6561Fj52L20n4Q0l18K21j0k94Q8M10j84k00L13k83J6K53m05J22O7Q0n5o8j25J30
6585d2l49K72J78k88K74l50M75j93nO4r3J71o4KJ31l11J83j55lJ67j85J21k26
6608b26L56j21r4J47J02l3l45K00j40J41J23l21J15K67p2l61N97Pn17O5Q4j12
$$ plain form
6440 -169 105 71 67 255 104 110 108 16 296 34 52 182 -40 -13 176 42 -23 -155 -135 134 -213 13 100 174 6
6465 6 139 58 -146 -58 60 -21 -52 -192 -28 225 -36 -8 19 28 33 222 304 -328 -190 -27 70 -139 -108 156 -22
6490 -22 42 103 63 165 -196 -264 115 -157 -117 -8 -56 -18 -177 -30 -389 -317 -112 196 20 8 -10 134 -101 64
6514 64 -130 -7 -185 -33 -6 -219 62 -85 -79 41 -249 66 -77 -151 219 -115 31 -65 42 214 64 107
6536 107 -61 53 -90 74 -134 -201 -103 -41 114 145 -34 51 -32 -13 26 60 86 54 3 -52 143 9 88 -382 6
6561 6 -146 174 120 200 -118 103 93 -201 -113 297 113 -87 226 -57 -41 212 -193 -71 -4 76 21 -47 -172 -42
6585 -42 -391 -119 59 -229 45 -305 170 -23 -28 36 -57 114 50 52 183 -128 55 -100 -103 64 -121 0 -226
6608 -226 130 9 -85 62 164 131 -214 -14 -154 -13 110 -211 -96 171 99 -262 335 342 -175 -110 -26 -138
6630a38M6L29j22k23J98j2j79K15q5R8j21K84l7m87K05j8J13l53K47J01j08J05
6652E8j84j46J04J71q6l20Q9L86l99L91j62J40Lk97N01l04M4j08O4J57N9K2k98
6675a15L52j68k43N0K22J17k89j80J98k23M5Q8l8K21l66K50Q0k68J91P2j38K72
6697A30j75J63k21K04k11K10k1j17J60l28m0K95J39j97qQ5l1j76M2k6L11k08r6
6720a16L67k31L0Q1k18L46m57J39KK46j28n8k10J39K55j39J21j9k51K44k59J73
6742E7q7J67j65o4L25l94n4K27O7J7l8j03p1Q5P5m6J20j57K16k95K73Jk05J1L99
6767C61k23j84J77N1k17j30j44K74M3o9P6k1J31j71K4J4j25R9o5K43j61J20k21
6790a18J79k25J41J21k39L67j95l30M65l59P8j77M39m78K95O9m38N46p4k79K18
$$ plain form
6630 -138 -92 237 115 -108 90 78 -101 114 29 127 6 290 253 -234 -29 -47 66 -287 -40 61 -47 58
6652 58 -126 -272 -168 3 -83 -403 -314 72 -327 64 -98 42 45 -252 249 -55 -11 -119 -55 102 161 183 -115
6675 -115 237 69 -174 -124 98 215 -74 -254 -56 -279 -234 -146 -184 37 -329 -79 1 -267 -76 -4 -142 130
6697 130 -45 118 -103 101 -110 100 79 -38 122 -206 -246 49 188 -9 -17 68 37 -139 -97 -123 188 -20 -116
6720 -116 251 20 50 131 -87 259 -198 -59 -57 189 61 3 -207 -68 187 48 169 150 -101 143 -116 57
6742 57 -30 137 -28 -92 233 -161 -215 12 79 96 58 -45 -116 -31 44 -2 118 -39 177 -118 155 156 -49 -38 361
6767 361 138 -46 131 182 -35 -165 -309 -35 8 -61 15 -6 125 -46 -22 -8 -133 -34 -99 144 -17 103 -118
6790 -118 61 -164 -23 98 -141 226 31 -299 166 -193 -115 -292 147 -331 -36 33 -405 141 67 -212 6
6811FQr9J96qj90J29k2j53J26M6j29K77m62K86J19k50K91j89J20Lq9j11J36J56
6835A97k8k21k16J84lM04l31j74P4m3N4J65J45j09J6K6k40r7M1K88k47K80m30
6858b65K03K53n61M57n4J99l3k62q2J2L18n04L67k09K82m01L32p4K08l21k3J01
6880e7KJ31J22l8k73J55Qp7J77k42L05j1p4J3n73L24J22j86J40R7J15j6l66J11
6904i1J43K7p6L38j89J78m23J25p0J36P1m48K95M5k4J29Nk69l1J34o0K0J00MJ13
6929A82k66J42j60J0j22K07m9J39K5j8K8m22J65R2j58K28j74j9K50L6j41J21j60
6952f4q4OP2k48J45N3J48P4j57J94J14l20M4o5J31O8o5J13m4j86J08k52L25m0
6976G0k8J8l77L29l1J81j20J32N5k41J49k03R7k66L50l30K05j13Q2kJ17j21l1
$$ plain form
6811 6 14 -85 111 103 -87 42 20 -133 -7 39 -90 187 -275 11 130 -120 171 -18 102 105 16 -95 41 197
6835 197 169 -52 -268 -84 -87 317 -14 -188 -114 -157 -103 62 207 98 114 140 -100 -197 -156 132 -115 165 -265
6858 -265 -62 191 -370 87 33 232 199 -63 -145 -133 185 -319 48 -161 121 -280 52 -22 186 -135 -158 -57
6880 -57 -55 76 198 160 -113 42 50 -27 150 -92 213 202 128 141 -432 -108 14 -172 -32 65 180 164 -202 -91
6904 -91 52 79 3 341 152 330 -93 32 -38 98 169 -279 16 61 37 166 171 -98 -129 5 -55 -35 65 69 182
6929 182 -84 58 -102 -92 -214 -7 -56 83 108 90 118 -304 -139 -47 -205 23 -151 -170 80 116 -25 96 -64
6952 -64 -148 -142 -70 -318 -173 -120 28 102 -55 139 253 -67 -23 -88 43 111 46 159 115 -71 37 -215 110 70
6976 70 42 60 -317 12 -19 162 42 174 229 -12 137 -66 31 -235 115 -215 -10 -123 -41 -43 74 -47 -78
6999g8Q5J02O4j23N3k59K85l31L74L9j96oj40J14r3L47k99r6K06j82J25J99l90
7022b00O3NJ64l19M10j96J90J6p7L7j36J45j50%O8k63L20p8l4l97P05l32J55j09
7046a3o9J46k06J19L2J96j08j06nn7j59j14K26p0J33k43J64K53j58J10m2o8J1
7069b8j7j62k2L16j68m7O4Q0j21M5J09j80L88j53M9k05J96k77K29j68J98k9J14
7092B11j60M7J1p6q9J60j29L8K25j87n5J80l34J48J90j37Kj83L81n77K18n4M3
7115a27J6n6K6Qo7K98j60K15o1j88K27Q1k21j24J70j26L2Nj15L07j3j31k12R9
7139a17J13l6m2R3K7l26J29Q0Q3j59J34J04p5j38p1K11l36L57P3n0J26j06l24
7162b50J70j34K45o6J76q3m1r3j5J94N0j26p2P0l4K11m28K91k36R5m2J46O4J55
$$ plain form
6999 -78 7 109 173 50 103 -156 129 -202 172 211 15 9 -131 -17 -110 237 -62 -158 48 -134 -9 190 -200
7022 -200 -137 -132 32 -287 123 -73 117 133 56 93 -43 102 -48 -48 20 -243 77 -1 -35 -432 273 -59 96 -13
7046 -13 -82 64 -142 -23 9 205 97 -9 -14 -71 -230 -344 -118 -188 -55 -298 -134 119 -39 71 29 -39 -28
7069 -28 -45 -207 -229 87 -81 -128 -64 16 -105 -60 49 -131 257 104 153 -52 144 -133 96 -72 126 97 211
7092 211 51 98 109 33 -56 104 -25 13 238 51 -4 176 -158 -10 180 43 45 -138 243 -334 -116 -170 -127
7115 -127 -111 -167 -141 -133 -200 98 -62 153 92 -96 131 212 -9 -133 37 -89 -57 -52 -167 140 127 -4 -216 -117
7139 -117 -4 -40 -82 11 38 -288 -159 -79 4 -155 -21 83 8 -130 -201 10 -326 31 104 54 180 74 -250
7162 -250 -80 -214 31 -35 141 58 17 -76 -91 103 153 27 -45 25 -9 202 -226 65 -171 -76 -118 28 92 247
7186B47q3n13M66k40J3K64j44rO5k35J50L2j08M33n03L26n3j09K7j70J34o2K28
7209A56k66k0K31m08L45n9J8q8K27m4Q8lm62K24J06k42J40j25K25J1q1O3Q8l59
7233b35K0M41k69J37j69L0J45j95R3j79n2K03o3J59j52P7J59m5m2kJ43j87K04
7256B21jl82J55qK8N3k47J82K00j08l3J10l87J87J18J84k49k13L96l65k27M84
7278I8o0l95M77O2J02k62M1j43L20j42r8Q5p5j38L33l86K67L6O6l16K21j76L8
7301d5J76k21l2J20N6q9K45k99N1M4j11O2M9j16k7K82rk50QN4L0m3l0J37k63J04
7327a17J49J26n25M99k36l9M9J81n5q6k41M71j41J18r3k29j1J34j4J79k85j19
7349b85L50P8j18rK0q2j1J88k27K70j81q8J50k34Q9l2Q2n4o3J91o4Q2J26k22l73
$$ plain form
7186 247 164 -349 117 -123 -110 154 10 1 66 -169 -19 13 -95 338 -165 161 108 -1 26 -144 -10 -72 156
7209 156 -110 -130 101 -307 38 -21 -3 -91 136 92 180 177 -285 -61 45 -197 -57 -182 43 54 -27 36 124 -235
7233 -235 -215 226 -43 94 -75 -45 100 -95 -2 -181 -233 -30 -93 66 -86 -9 150 105 63 61 204 17 221
7256 221 220 -162 -7 -15 13 66 -181 1 201 93 60 170 -217 -30 88 272 23 -190 206 -159 -386 98
7278 98 38 -357 120 182 284 22 63 -80 240 98 0 85 10 -128 205 -181 86 122 188 -128 93 -83 -45
7301 -45 131 -90 -122 -2 54 -35 210 -89 -38 6 -105 -43 6 -110 -137 145 136 -114 -106 -52 -22 -65 -95 42 -221 -117
7327 -117 32 158 -367 132 -104 -143 -94 87 32 -54 -295 176 35 153 60 -169 -180 -46 -60 119 -166 -285
7349 -285 65 143 25 16 36 -46 -57 131 -96 174 -7 -95 55 -179 -90 -122 -40 -94 -157 34 -30 52 178 -44 -417
7374d17L90K64j47j33l5m6L9K01p5j53M7K7m2J82l9j87J67J97r5J17n10J16J75
7397D3r0J59n8K88j47J8k05l58M57r3Nq5J38j93J04J03m7R3j09j83Q5J0q1J48
7421BJ37j31k41L83l58j11K29J88jl34K22j77J30J87m0R4r2l37L68Pl18L20j56
7444b9O4k28M1L55j37j15K6K89k34J77j3j77j30K60q7p1J24k85N01n50M20n32
7466c31J81P8M2n5K2o3lJ41L6j2j12k3K48K64n71J83m0j09J17J18m3k16N6K63
7490A71l19l6n8J85P3p5R0J05k46N3p4J93n8j56L1K70k53k36L28K27mm56L59k54
7514a40J11k73J42j0K15O1N9j63j20k03J02L07l00K06K07l18K44l81K28j47J96
7535B3j1J38k32J69l10K62o7n4K63J13j39l24K69p7J20Qj86m4j8K18j29o8O1M6
$$ plain form
7374 -417 -27 237 90 -43 -78 -124 -85 116 41 -112 -65 -38 -80 102 63 -124 43 240 145 262 -248 -132 43
7397 43 -47 112 54 342 195 213 8 -350 107 14 19 -66 72 -121 -17 86 39 132 23 -160 -75 -65 -146 2
7421 2 139 8 -233 150 -208 -319 -90 98 97 -237 -15 -192 -62 125 85 179 87 -250 118 125 -193 127 -29
7444 -29 35 -193 -152 203 66 -49 -23 266 32 209 196 19 -111 149 62 -9 115 -170 331 -219 201 -331
7466 -331 -150 -72 -30 -85 -63 -126 -129 12 48 36 -76 -99 149 413 -158 25 -15 -124 -7 111 68 -148 -92 171
7490 171 -148 -184 -242 -57 16 -59 31 136 -110 -57 -131 62 4 -152 -121 149 -104 -340 -12 215 211 -245 114 -140
7514 -140 -29 -302 -160 -170 45 106 165 2 -118 -321 -219 88 -212 -6 201 -117 127 -254 -26 -173 23
7535 23 12 150 -82 87 -223 39 -28 -82 181 294 155 -169 100 23 143 151 -35 -79 -97 121 -8 -76 -15 31
7559C1k5j77L91m69M90l92L58kp5L7k85L7r8L42l04K53J07l73M39l89J51j3l7
7582cJ79l72N42l66L6M7L7k11L1M5L2j91J61J5R1j60k46M51O9k02J03J3K3j24
7606@L00k19j06k1J21l03L39R2l28R9K61j98k37L51q4j05J93l09J77J10k64J81
7628E0j34K45P7j96j1k1J35l06Q6L9K13k40J72pm3N0j89lL00k42l1K45j29k26
7652a66L86j46K74l04J31o4J3Jj79O5%j78K73L9M3l68M59m51L52m8m14K90J28
7675A36L2j81j37K93n6j45L50j62j69J4R6j1l16M45k19j81K76k55J50p7oJ50K
7698B9k05J82l72M52j31J23R1k94j3j34M63l52o9o9L43k1N1r8J88l31J85o4J57
7721A11j0J9j30k47J82J45m2P1k90L14q1m38O10j93l44M84j62n6j17LK18K10l53
$$ plain form
7559 31 6 -171 220 -249 241 -151 207 205 130 167 -118 -81 -179 163 -141 112 219 -154 285 -104 47 34 -3
7582 -3 176 -196 346 -20 16 63 100 -111 -80 -35 -3 -194 -33 -18 73 -87 -333 118 187 -15 88 101 124 0
7606 0 300 81 -25 -46 75 -228 111 203 -125 -26 235 37 -200 151 67 -38 155 -154 23 133 -131 50
7628 50 -84 161 238 42 31 10 145 -161 -75 -36 177 -63 109 102 59 109 -80 -83 217 -25 -56 189 60 -166
7652 -166 220 74 348 44 175 111 124 125 -54 11 11 -167 106 145 188 -180 279 -172 180 132 -282 8 136
7675 136 168 -13 -150 143 87 -58 292 130 -39 -25 71 60 -256 189 -30 -211 65 -190 -40 -117 -123 27 29
7698 29 -176 6 -366 86 -45 78 169 -125 -138 -272 191 -161 -230 -299 44 23 74 -24 164 -167 18 -46 111
7721 111 101 120 -10 -257 -75 70 28 99 -191 123 42 -396 214 21 -323 161 -1 -57 -174 -171 47 257 -96
7744i6J17PQ8j27L1L07k27j38K53j57l6j40K45J59Qk70j21l5K82k33L8J73J9k52
7768a05j98K68m1q0K73j19k21J96J82l1j89K87j56Q6P5m32K26K84m06J25k5n0
7790e1o5K01j96K7J06J32j29j44P3R6j31L2J08j91K33n3l1o1L8j29j11M42j86
7813A0j07K53k36J11N4l8k11J7l3L09l08K20K67l54q6L68j68J19l25K30k07J6
7835i9j73Q8J56o1K08o0j56K40j78J58k95L17j90k6J2J83m6j33K5J6j40J80M9
7858G5j30j8m3k15L50j51n1k8J73L5p6K32k20M9j08N7J71Ll21K90J12k07O7Ok34
7883a82J72n6m9J40J55q3j60M0p1K4R5m0O1j51k6Q0J04P2q1K3J18k81K28j45l4
7908d7K20r5PJ1j06J49p3r2J83k00J20j01Q9l79M31M1j8q4o1j1M3K14M1l51J69
$$ plain form
7744 -96 21 28 116 -11 20 327 100 -38 215 58 22 -118 127 286 294 24 -97 -132 150 -83 -45 128 147 -105
7768 -105 -303 -35 -76 -156 117 -2 -223 -27 155 124 -65 222 66 152 227 -205 21 305 -101 24 -1 -51
7790 -51 -116 85 -111 -84 22 154 25 -119 -46 50 -81 -49 59 -132 101 48 17 -44 -6 -135 -246 196 10
7813 10 -97 156 -80 31 85 47 -164 -147 -180 129 -179 41 308 -46 -132 236 68 187 -138 92 -115 -99
7835 -99 -272 -184 -28 -89 119 59 -97 143 -35 123 -172 145 -45 -71 -59 124 78 -55 -30 -14 -154 26 75
7858 75 -55 -73 -116 -331 19 -132 -183 -211 -38 -3 -79 153 -67 -18 -126 -69 102 105 -216 74 186 -21 46 52 -182
7883 -182 -10 -66 -115 25 180 97 -63 -23 -94 -70 25 -15 46 -105 -131 -51 53 125 44 67 185 -96 132 -13 -47
7908 -47 173 78 85 96 -10 139 66 -26 157 -43 77 -24 65 -314 117 158 140 56 -5 -16 27 241 282 -69 100
7933A00j33M7N5j77Q1J09j95J49J45j97J02j1n2p0O2J49P6j94O1j40j70O2J15
7956b6J81j84l6n3K98j14L1j4j34j04K50j74N2J43Mj87o9K12P8l5m72L82Q1o9
7980D1o3J42q5k91K49R4k05j05m4Q2J06O9J2Q4j00j47j6k04L27O9J71n6j19j5
8004dk9K47n23O17l02J11m3j09k8J67j77J32k62j1K71j05J44Qm1Nj82J80J8k74
8028a90K57j10j15J49q1L01l14po6J16M30o70J78m6J59K25m07K13K29l14N5j32
8050a40J86j73K79n7L8j43r8J20K4j0k67J17L58k22Mr6j46kR7j09J72r8K16k58
8074b08J40j73L67k12k74L15m0K49k41J33O7l23P0K42P5m09K26J78k43L3Q3j02
8096d7j25N4J95m3J04r9k07L14n1n8j91J93M27l47k18J61k6Q4m3q4N0k00J55k75
$$ plain form
7933 100 -33 14 69 -108 -27 82 -113 36 181 -16 86 75 23 -47 15 164 240 46 107 -33 -203 -141 -26
7956 -26 155 -29 -65 -118 180 66 97 83 -51 -155 95 -79 -27 116 120 -67 -136 76 154 119 -353 29 110 41
7980 41 -22 120 35 -256 -7 87 -118 -223 -267 -185 -79 -10 2 86 -14 -161 -177 -381 -54 15 186 130 11 -4
8004 -4 -33 214 -309 308 6 117 74 -35 -63 104 -73 59 -203 -214 57 -48 96 104 63 68 -114 66 84 -190
8028 -190 67 -43 -158 -9 -90 211 -103 -110 -176 -60 370 -300 -122 -168 -9 216 -191 22 251 -63 -8 -140
8050 -140 46 -127 152 95 133 -10 -108 12 36 26 -241 -124 234 12 16 -80 -226 -228 -131 -240 -68 -166 50 -208
8074 -208 -68 -241 126 -86 -360 -45 -85 164 -77 56 123 -200 -130 112 187 -222 4 182 -61 -28 55 -47
8096 -47 -172 -118 77 34 138 39 -168 146 95 37 -154 39 466 119 -99 62 36 120 77 -7 43 -157 -2 -277
8120b77M21m3j87J0J37N7j51j94K44N1k89K56l9R9k68K14J7K5M3k5l18J42Q5n
8144Ek47K06p0NJ11n4J92j12J4p8r2J24O3k23K93j59lp4J53M8k31L2J92j30J62
8169A27J9R3k80J16pl98K58K59k27J56r6K4j48j18M7M71lk96p0M8J62k54
$$ plain form
8120 -277 144 101 -86 -76 61 118 -33 -227 17 68 -221 35 -4 95 -173 41 58 83 126 101 -217 -75 10 5
8144 5 -242 -36 -106 -101 10 -44 148 36 50 -28 -120 4 67 -156 137 -22 -25 -99 54 102 -129 -97 95 -35 127
8169 127 146 239 -41 75 68 -330 -72 187 -40 116 20 44 -104 -222 -175 296 293 -3 -73 -25 137 -117
8191a17
$$ Imaginary data points
##PAGE= N=2
##DATA TABLE= (X++(I..I)), XYDATA
0@%%%%%%%%%%%%%%%qJ6j6J6j6J6k4L2l2M0m8N5o3P2q5R4j06J22j38J55j75J97
37A04k20K46k74L04l37L75m15M58n06N59o17O79p47Q22r06J001j105J220j353
56g12J505j679J881k121K410k767L221l820M647n859P810j1435K0260p8159q0770
71a45588K21052m2787j14314J04076J0153q9593O6536J6027n8058K8875O746k6492
83b3367M0659j8999l1474N2123j3434n1314N2362J0916n5762K4906L1972l4296
95a5708p775J3820Q703J4099j1598j1934J3804r452k197J5514k2712l565L3908
108A4907k0211j3393L7461j7113k5066L1708j0793j6779M2363j1276l5956L7350
120A3202M870l4422K8194O360l7002K2363J0126l6035K2137K0486l6043J0538
$$ plain form
0 0 0 0 0 0 0 0 0 0 0 0 0 0 0 0 0 -8 8 -8 8 -8 8 -16 16 -16 24 -24 31 -32 40 -45 49 -57 65 -73 82 -93 104
37 104 -116 130 -144 160 -177 198 -217 241 -265 294 -323 356 -391 431 -475 526 -579 641 -712
56 -712 793 -886 995 -1126 1284 -1483 1738 -2082 2565 -3294 4516 -6919 13341 -64818 -145588
71 -145588 75464 32677 -81637 22439 32592 -57001 9535 25562 -32496 -3621 3125 -23367
83 -23367 17292 -1707 -33181 18942 5508 -45806 6556 17472 -38290 -13384 18588 -15708
95 -15708 -23483 -9663 -960 13139 1541 -10393 3411 -6041 -8238 7276 -15436 -19001 14907
108 14907 -5304 -18697 18764 1651 -23415 8293 -2500 -19279 23084 11808 -24148 13202
120 13202 18072 -16350 11844 18204 -18798 3565 13691 -22344 -207 20279 -15764 -5226
132e226K9955k3692n586J6697j3353J401J2519j7683J69K1648p824r750L726r573
146f572J183J5024p937j1399Q709P065k720k275M226L190p859l234J1312n340
160C373j3351Q580N647q913M866L901j0027N456Q159j2250n354P824L299M934
174F144K60r994L508P756q378j861N470q433k926J0331k251l693Q961k530r731
189g367R611P630j0625k289Q174l165m830N889L415l618j93j083m510J284L275
204A598j741k62m3J339P097r64p151O481M724j4424j473J3436l193q005N241l53
220B307m881O016K162m970k022j012K184M256k640L77N037o716k768J1058m170
235D218j2637N660M336o648R18K947N79K302l632l273N656j440l539O021l906
$$ plain form
132 -5226 24729 1037 -4549 12148 -1205 196 12715 -4968 -4799 16849 9025 -725 3001 -6572
146 -6572 -5389 9635 1698 -9701 -992 6073 3353 1078 5304 8494 635 -2599 8713 3373
160 3373 -9978 -1398 4249 -4664 202 4103 -5924 -468 7691 -4559 -9913 -2089 1210 6144
174 6144 6404 -3590 -82 7674 -704 -2565 2905 -5528 -8454 1877 -374 -4067 4894 2364 -7367
189 -7367 2244 9874 -751 -3040 5134 1969 -2861 3028 6443 2825 2632 1549 -2961 -1677 1598
204 1598 -143 -405 -448 891 7988 7024 -127 6354 11078 -3346 -4819 8617 5424 -2581 2660 2307
220 2307 -2574 3442 5604 634 -1388 -2400 -216 4040 1400 1777 6814 98 -2670 8388 4218
235 4218 -8419 -2759 1577 -5071 -4153 -1206 -627 1675 -1957 -5230 426 -1014 -4553 1468 -2438
250b438o417J0662J912j0948N252M011j0593N91N194m328L344J178o560O812N537
265C209p938K183M050q642J629O050o871J691O489p834K76P215m833j346M333
280c39o395J477P980n892N91R107n824l398O741m328j581N624p317k039R673l829
296B51k908Q603m001m218P944m868l009J0355m738p912J1356R3q013P910j381
311E464r098P224J94q567Q338K366q935O734K946p149P203J062j2212O949N985
326H504j1510K757Q356q452M7N767o760J420N195q442J76P197o174J222P952p487
342b32j744Q626o479n037Q478k726o848N007M85j318L798l087k082O077m448l836
358e366Q674k080o423O647R37n968N447J463p448J494K922l561K283k40k204O073
$$ plain form
250 -2438 -8855 1807 3719 -7229 -1977 2034 -8559 -7968 -2774 -7102 -3758 -2580 -9140 -2328 3209
265 3209 -4729 -2546 1504 -7138 -5509 541 -6330 -4639 1850 -5984 -5708 1507 -3326 -4672 -339
280 -339 -6734 -5257 2723 -3169 -2578 6529 705 -2693 4048 -280 -1861 3763 -3554 -5593 4080 251
296 251 -2657 5946 1945 -2273 5671 803 -2206 8149 3411 -4501 6855 6948 -1065 6845 5464
311 5464 -3634 3590 3784 -4783 3555 5921 -3014 3720 6666 -483 6720 7782 -4430 2519 8504
326 8504 -3006 -249 8107 -345 -298 5469 -1291 129 5324 -3118 -2942 4255 -1919 -697 7255 -232
342 -232 -1976 6650 171 -4866 3612 886 -5962 -955 -470 -1788 2010 -1077 -3159 2918 -1530 -5366
358 -5366 3308 1228 -5195 1452 2389 -3579 1868 3331 -4117 -2623 299 -3262 -979 -1219 -3423 2650
374B650o45p500P416M478j0171J570O295o070k72O021l979m42L385l824L97L406
390B715m925P61M385n644P66R536n496n899Q268m24p177L435K001l659P29M0q
407e96K832k608j223M320k950l943N741l20n269M461J670m353K136J867k570j65
423i70k720q76N547k329m663P510l08p373N618K390p457M161L399p859L734M502
439B306p527K445L998p657M023O145r802J435Q415r646r94J1442m892m334Q115
454C472m283l989P217l891m185P903k131l702O843k611l755O191l203m788Q639
469C727k14n491M677m31l755M788o75l015M971k652l354O271l281m189Q030k257
485C150n107R192k073q224P762L68q349P051J632o669P428k32j0367Q018L077
$$ plain form
374 2650 2005 -5495 1921 6399 -3772 -2202 4093 -1977 -2249 3772 -207 -649 2736 -1088 -691 2715
390 2715 -2210 -1449 2936 -2708 -1942 7594 2098 -3801 4467 4043 -3134 301 2302 -1357 -628 -588 -596
407 -596 2236 -372 -1595 2725 -225 -4168 1573 1253 -4016 445 2115 -2238 -102 1765 -805 -970
423 -970 -3690 -4566 981 -1348 -6011 1499 1191 -6182 -564 1826 -5631 -1470 1929 -5930 -2196 2306
439 2306 -5221 -2776 1222 -6435 -2412 3733 -6069 -4634 3781 -5865 -6859 4583 -309 -4643 3472
454 3472 -811 -4800 2417 -1474 -5659 2244 113 -3589 3254 643 -3112 3079 -124 -4912 3727
469 3727 3513 -1978 2699 2268 -1487 3301 2626 -389 4582 1930 -1424 4847 1566 -2623 5407 3150
485 3150 -1957 7235 5162 -3062 4700 5068 -3281 3770 5402 -1267 6161 5929 -4438 3580 6657
500F657j1259O966M934j1480N778P331j2167K076R013r013K46P283p788n70O971
515D978p512j29P942o865j795Q894n787n187P159k013k908M696k058j833M158
530A740k438k501L466k681L26L879m162k068N064j265j355J016j948J738K928
545A739m797Q50L852o674P73Q524n589m126Q267k254n593N471o84l595M892j69
561H87l289L297j353j533N064l938m844Q429J733p972L124L266o608K921N914
576E098n392k391M439l56k458J483n63q63K062l4j158M18k7r33J310l57k586J957
594c51L814k690l590K356K71j343L074r08m353K649L179l007l61Q09k252K759
610E6K133l984k42L282k948q10L365k038j588L930r45k816N41J530K36p6j114
$$ plain form
500 6657 -4602 2364 7298 -4182 1596 8927 -3240 -1164 7849 -1164 -918 6365 -1423 -1993 4978
515 4978 -2534 -2663 5279 -1586 -3381 5513 -274 -5461 1698 -315 -3223 1473 -585 -2418 1740
530 1740 -698 -3199 267 -2414 -2088 1791 -2371 -4439 625 -640 -1995 -979 -2927 -1189 1739
545 1739 -3058 -2208 1644 -5030 -4257 4267 -1322 -5448 2819 565 -5028 443 -241 -3836 1056 887
561 887 -2402 895 -458 -1991 3073 -865 -5709 2720 4453 -3519 -395 2871 -3737 -816 5098
576 5098 -294 -2685 1754 1398 -1060 423 -140 -1003 1059 1025 -133 285 258 -675 635 278 -2308 -351
594 -351 3463 773 -2817 -461 -190 -1533 1541 633 -3720 -1071 2108 -899 -1260 -451 -2703 56
610 56 2189 -1795 -2037 1245 -1703 -2513 852 -1186 -2774 1156 211 -2605 -2064 -534 -298 -374 -1488
627a488L66J062p89J737l56l926K298L874k981q58J030j029J163J288k310J068
643A49J238k620L726N50n886L567M509o400L93N461n006j72O247n021l393O713
659D055j556l055M256l357j322O444k814l670M893j816l038N999k428n353N805
674C043N64m666L656p33l701N386o29n073M181P84m500L584J047n499L135K626
690C205l785K93K18j983L624o47m659L828P15l982M643N64o927M017L872n603
706b607Q72K636m115K103J291m557L306J733n297L521K318p148L767N836q039
721d380R06O279n591O1N565o539o27O334m569r52N718n713o94P603m693l291P177
738B594l511k608O320k492l774O029j885l661N177j867l931O100j430n674N828
$$ plain form
627 -1488 -1122 -60 -849 888 532 -3394 -1096 2778 -203 -1061 -31 -1060 103 1391 -919 149
643 149 1387 -1233 2493 3043 -2843 724 5233 -1167 -774 4687 -319 -491 5756 735 -2658 4055
659 4055 2499 -556 3700 343 -979 5465 2651 -1019 3874 2058 -980 5019 2591 -2762 3043
674 3043 3607 -1059 2597 1864 -1837 3549 2920 -2153 2028 2812 -1688 1896 2943 -2556 579 3205
690 3205 -580 -287 -69 -2052 1572 925 -3734 94 809 -3173 1470 2034 -4893 -876 2996 -2607
706 -2607 -1735 901 -3214 -1111 180 -4377 -1071 662 -4635 -1114 1204 -5944 -2177 3659 -4380
721 -4380 -3474 2805 -2786 -2725 2840 -3699 -4326 2008 -2561 -3513 2205 -3508 -4202 3401 -1292 -4583 2594
738 2594 -917 -3525 2795 303 -3471 2558 673 -2988 2189 322 -3609 2491 1061 -4613 1215
753A215N01l994M411J06m634M295O66m137L508j66l812M410L19n006L455J386
769B523m593K958J122m597L285J974m418K607K092l948K468J382m750J740K514
784B359m183J415K293m378J937L127l963K72L570l838J9L543k989o26L744k461
800a59p53K918k917m81K969l422l05L725k544j481M850j255l217L653m76k596
816a491K542j69j929K340o26j426K344j041k202L171n95k991K690J504k840R75
832B56K265j867M02J151j383J81p9j164J106O19k114J287J783k153n38J853p29
849H76p66J122L1n76R87r0j55j54j679Q98Q55k041m99J785o95j187K027J76j552
868f37J038L62j205o3K07n80P85j13j167J516l55k439J662Q78k902Q35K004j559
$$ plain form
753 1215 1716 -2278 2133 2239 -2395 1900 2566 -1571 1937 1771 -2041 2369 2688 -2318 1137 2523
769 2523 -2070 888 2010 -2587 698 2672 -1746 861 2953 -995 1473 2855 -1895 -155 2359
784 2359 -1824 -409 1884 -2494 -557 2570 -1393 -1121 2449 -1389 -1370 2173 -816 -1442 2302 -159
800 -159 -912 2006 -911 -1392 1577 -1845 -2150 1575 -969 -2450 2400 1145 -2072 1581 1105 -1491
816 -1491 1051 882 -1047 1293 667 -759 1585 544 -1658 1513 918 -2073 617 2121 -719 256
832 256 2521 654 1056 2207 824 1005 926 -238 868 1487 -627 660 2443 290 -248 1605 876
849 876 110 1232 1263 687 1674 1584 1429 1275 -404 494 1349 -692 -1191 594 -101 -1288 739 915 -637
868 -637 401 763 -442 -505 -298 -878 -93 -206 -1373 143 -212 -2651 -989 -111 -3013 -2178 -174 -1733
886a733J37J708j119m00J279j192l67J194j733P0J819j714k71K088j108j512K577
903b77o97j823J916P10j129P70L10j66Q14j029p22J134q66j471K605j65k026K320
921B08J082j682Q96N60j077K11O79p14J134n03j084K233l49k613J612R06k328
938h29P10J896j950K12K295q58k55J072j542O31P28k964J375J958k990M4L135
955B668k252j442K656p57j825J786p4q13J285j11k39J416k044j086K067j039k125
972a929K455J87l013K357J222j915L69Q71o79r7J57p07R66J93j379J809l6k089
990a258Q58O61k103Q28J231j373J167Q64r69O66O82j942Q12J037k193K43K241
1007A452k191j20K141j585q31J977n05j023J144m87n97K179n62j174K199m83k432
$$ plain form
886 -1733 -1596 112 -1007 -1407 -128 -1320 -1687 -493 -2226 -2156 -337 -2051 -2322 -234 -1342 -2854 -277
903 -277 -974 -2797 -881 -171 -1300 -530 -220 -386 428 -601 -1323 -189 -1055 -2526 79 -86 -2112 208
921 208 1290 -392 504 1064 -13 198 877 163 1297 794 -290 1943 1594 -1019 593 1499 -829
938 -829 -119 1777 -173 39 2334 1476 1221 2293 751 1382 2110 -854 521 2479 -511 -467 2668
955 2668 416 -1026 1630 873 -952 834 760 -53 1232 1121 882 2298 254 -832 1235 196 -1929
972 -1929 526 713 -2300 57 1279 -636 -267 604 -75 -172 -15 -722 244 437 -942 867 831 -1258
990 -1258 -400 261 -1842 -1014 217 -1156 11 875 -94 572 1254 -688 124 1161 -1032 -789 1452
1007 1452 -739 -859 1282 -303 -1134 843 338 -685 459 -28 -625 1554 992 -182 2017 1534 -898
1024h98J544N09l003J161J842k002Q29J635j639kP70j094N70Q90j701M59J378
1041A248j531r9J798j531j424K123j150j552J543j26k22J109l42l26J358j429
1057e53n67J555j438j198K360n16j905J726L71j342J079n72j587J576K89j028
1073a750J666o43n34K041l80k192J407J72k226J794P10k135J342J373k206J258
1089c03J066k259J557J004k743J375J882k408J520J577l552J106K505l112l86
1104a171K117k204J082K964k487l03L096k593r36L291k712j011L589j418k106
1119h02L221r87j863K362q84k189K727j79j568K011n87j382L138q73k655J845
1135A335Lk174J476q2j935J997Q11j310J036o15j395J659m60j711K439n74j761
$$ plain form
1024 -898 646 1155 -1848 -687 1155 -847 -18 1617 -22 -24 746 -348 222 1112 -589 -130 1248
1041 1248 -283 -382 1416 -115 -1539 584 -566 -2118 -575 -701 -923 186 -156 -482 876 -553
1057 -553 -1120 435 -1003 -2201 159 -357 -2262 -536 -165 -1507 -428 -1000 -2587 -1011 -722 -1750
1073 -1750 -84 -727 -1261 780 400 -1792 -385 -213 -2439 -645 65 -2070 -728 645 -1561 -303
1089 -303 763 -1496 61 1065 -1678 -303 1579 -829 691 2268 -1284 -178 2327 -785 -1171
1104 -1171 946 -1258 -176 2788 301 -2 3094 501 -435 2856 144 -867 2722 1304 -802
1119 -802 2419 1432 -431 1931 1047 -1142 1585 1406 -162 1849 1262 -120 3018 2145 -510 1335
1135 1335 1338 -836 640 558 -1377 620 1431 121 1157 542 -853 806 346 -1365 1074 500 -1261
1152a261K959q46k964L049l5l146J734N23k618L392M26l539J874K255l295K083
1168E91P91m355K126K730l939Q96K659l421R44K941l604n37L328k639k88L135
1184A358k091o96L653j684k328K500k91j614J834r47j472J949N29q94L78o07J0
1201d13J347q31j006J144k62J23J063j197M2R61j015k74L80j189Q99J570j996
1218f54r5K436k261J95K434k655j729L526m04k158J969m14j934K686J6l066J449
1235f59P17j931J635P21k378J733J775k360o4J618j608n14J501q66j035K044K1
1252C50j398M24M44q43J149K77j716K79J599o84j29J185j038j185J998J28k462
1269a622N66J900j127M0P31l01K72P88r16J31K75r24Q44P32j409j23J943n35j230
$$ plain form
1152 -1261 1698 852 -2112 937 902 -2244 -510 13 -2605 787 1213 -2326 -452 1803 -1492 591
1168 591 1382 -2973 -847 1883 -2056 -1160 1499 -1922 -978 1963 -1641 -2178 1150 -1489 -1777 1358
1184 1358 -733 -1429 2224 540 -1788 712 421 -1193 641 -306 -1778 171 700 -194 184 -423 -413
1201 -413 934 103 -903 241 -21 102 1165 -32 10 971 -44 -318 62 -1127 -228 1342 -654
1218 -654 -749 1687 -574 -379 2055 -600 -2329 1197 793 -1365 604 190 -1744 942 958 -2108 -659
1235 -659 58 -1873 -238 483 -1895 -162 1613 -747 -811 807 -801 -1315 186 -680 -1715 329 350
1252 350 -1048 -624 -180 -1023 126 403 -1313 -1034 565 -119 -248 937 -101 -1286 712 840 -1622
1269 -1622 -1056 844 -283 -243 488 187 459 1247 331 462 737 -187 657 1389 -20 -143 1800 1265 35
1288C5P73q4p46L78Q30n27m26O17J214m94q95K74L45o19j70J52m89P12J43o47
1308C76L31J10r43J561q0k410J099J698j747j31J958j794l36J957j736o52J241
1325E02j343L1J827j788o00K822j316j854K443o40k340K480M78k678J799P13j891
1342a355J147L35j811J093K87j487J105P77j683J394O66j457N71M73j278M50L25
1359d48j056P24O69p05R02k24j228J385L32j873J015J104j352Q41O44j529R69
1376A70P64k130R64P19k018J198J275j947P59J841k062J88J687j578p16K080j597
1393d03j28J875j104l48J937k057p73K193r84j269J651m73q52J757m25j394J483
1410F86M6j537J016L4j335J394p4r93J329j7j805J623R0j284R30M15j504J128
$$ plain form
1288 35 808 724 -22 356 1186 659 233 850 2064 1570 675 949 1294 675 505 657 168 880 1023 376
1308 376 707 817 -126 1435 1355 -1055 44 1742 -5 -136 1822 28 -308 1649 -87 -739 502
1325 502 -841 -810 1017 -771 -1371 1451 135 -1719 724 84 -2256 224 702 -1976 -177 536 -1355
1342 -1355 -208 127 -1684 -591 -304 -1791 -686 91 -1592 -198 468 -989 -418 55 -1223 -773 -448
1359 -448 -1504 -780 -111 -816 86 -138 -1366 19 351 -1522 -507 597 -755 86 730 -799 170
1376 170 934 -1196 -232 487 -1531 -333 942 -1005 -246 1595 -467 -279 1408 -170 -886 1194 -403
1393 -403 -531 1344 240 -108 1829 -228 -1001 1192 208 -1061 590 117 -735 1022 597 -797 686
1410 686 732 -805 211 245 -1090 304 230 -763 566 549 -1256 367 457 -827 103 518 -986 142
1428A42O14j238N92K69j097Q10k6j352J506N02j848J036J367j910M61J123j348
1445c97J25J190j072MJ029r99J13R92r93j6J226j485k71J811j018q99J467L40
1463A147j231P13l64q4O21m31m89J256p73l02J063l33r45J054k67j199J204J95
1481H35j214P31N62q78O53M7p89N87O9j346J045P64j496R28M88j092JP31j402
1500g76L06J123j109J19P39r43M2J041q86q15J443r86o28J342n07n32R79n64l72
1519i84J023p37p48J304l67q52Q97o4n08P20J42j118J109J73j318N46Q24j144
1537a102R47j71r25Q43O69j263M27R03j297L00J120j237N77J097j479L28J101
1554H38q85k87Q64p45k14J094p48p0J225q54l85R36p30k60J177m88o08J029l63
$$ plain form
1428 142 756 -482 110 379 -718 92 66 -1286 220 722 -1126 -90 1277 -633 -172 951 -397
1445 -397 -272 918 -154 -150 879 -120 -7 985 -8 -24 1202 -283 -554 1257 239 -660 807 1147
1463 1147 -84 629 265 181 802 371 -118 1138 365 63 1126 793 -152 902 635 -564 640 835
1481 835 -379 352 914 36 689 736 -53 534 603 -743 302 1066 -430 498 986 -106 -105 626 -776
1500 -776 -470 653 -456 -337 402 -541 -499 542 -344 -1159 284 -702 -1330 12 -495 -1027 -48 -612 -984
1519 -984 39 -698 -1446 -142 -509 -1361 -464 -528 -1036 -316 -174 -1292 -183 -10 -1328 -782 42 -1102
1537 -1102 -155 -326 -1251 -408 261 -1002 -575 328 -969 -669 451 -786 -209 888 -591 -263 838
1554 838 -47 -334 530 -215 -429 665 -83 -153 1072 218 -167 769 39 -221 956 468 -140 889 526
1573E26o23R23k55m46O53l33l09O94l26p91J388l63j079Q53L11q38L94k05m46
1592b72O95l5l44M43j28p52J066l49j015J061K14j036Q03M39j203N36J33p59N63
1611F0K14p12K95O25j054L76P84j055P4J414j084q38J591m37j019O05L74o21Q24
1630D16l23n97Q50l52l87O21O2n89P74J22o95K75L51l55j08J63J94l64k37P56
1650E77j53o30L75L88m19j18Q8K4L84J68q10kR33o54k61O03o35o02J322k63j077
1671g62P13L29p03K19O73p21J6N68m39j97K99k71k56P91r81j39P88J51j047P35
1691b34J51j007R78M29j348P8J316q68l81Q18q40k50J431o77r34J314J31j051
1709i44Q73j94r01J182Lp64N75J98r41R08L63j252L84O75m93K27K05p91M85O90
$$ plain form
1573 526 -97 826 571 125 778 445 136 830 504 -287 1101 738 -341 512 823 -15 379 174 -272
1592 -272 423 388 44 487 359 -393 673 324 -691 370 584 -452 351 790 -413 123 256 -503 60
1611 60 274 -438 -143 482 -572 -196 588 -467 -393 1021 -63 -901 690 253 -766 -161 213 -408 416
1630 416 93 -504 346 -6 -393 228 290 -299 475 597 -98 177 528 173 65 228 422 58 -179 577
1650 577 424 -206 169 557 138 20 108 132 516 684 -126 -128 805 151 -110 493 -142 -744 578 315 -762
1671 -762 -49 280 -423 -204 469 -252 -236 332 -107 -304 -5 -276 -532 259 -722 -861 -73 78 -969 -234
1691 -234 -83 -1090 -112 317 -1031 -953 363 -505 -886 -68 -908 -1158 273 -404 -1338 -24 107 -944
1709 -944 -71 -265 -1166 16 19 -745 -170 28 -913 -5 358 -894 -510 165 -328 -101 104 -687 -202 488
1729D88m20k3j95k0J028o22m70P33k03J62Q3k05q39J101K38j122Q65k23q77J416
1749H95K29j604Q07R66j286P97O76j797O42J274j870L78R20j604M25J858j973
1766b67m80K534j331q09J331o08o77J609p54j230J318l74p18J469j032j012J761
1783G30k79j173Q00K1r07J344J31j327M20K65K0J02l86n70J025j94q11J050l31
1802g0q99J048j20o91O28J09n17Q14m45p78J424j11j305J127k05j183J370N69
1820G65j758M29J267q72J01Q33j450P55Q28j485M20Q71j003J28J103j481k5J697
1838A123j284n00J248n25n15R36j07r27Q02j98k54P80o18n98J265o01m44M30j37
1857a24n65Q52n7o87K93M9k3L12m52pP03m44l45J95o5r4L79k42k40N82j39l86
$$ plain form
1729 488 68 45 -150 -170 858 236 -234 499 296 458 541 336 -503 598 836 -286 579 356 -521 895
1749 895 1124 -480 327 1293 7 804 1480 -317 325 1599 -271 107 1027 -577 -152 1706 -267
1766 -267 -747 1787 456 -353 978 370 -307 1302 548 -682 636 262 -456 1013 -19 -1031 730
1783 730 451 -722 78 99 -808 536 667 -660 -240 25 45 147 -239 -809 216 22 -789 261 -70
1802 -70 -969 79 -41 -732 -104 5 -512 302 -143 -921 503 392 -913 214 9 -1174 196 765
1820 765 -993 -564 703 -169 -68 765 -685 70 898 -587 -167 704 -299 -171 932 -549 -574 1123
1838 1123 -161 -661 587 62 -453 483 376 -551 251 53 -201 579 -39 -637 628 27 -417 13 -124
1857 -124 -689 163 106 -581 -288 -239 -262 50 -402 -409 294 -150 -495 -300 -365 -459 -80 -322 -562 20 -119 -505
1879e05O49j69q04Q46m1n96R78n30p30J133k04q98O08L16o35M14K03q00Q40N2
1899A27l73J53L19l53L35M13p54k25P91l62N2K27r1m68M76J46l62L03k63Q7M28
1920F06R1m42M81l65k10M02k51k43K60L08j74k83J14N08m24J11p9ROj64J31L66
1942G58m18l37M13k06o4l8J90j20k05K61j20J00r2L79j13m33K49K4l08j19J89
1963a0J63m43J6L48n59K73J30l99L74J37k91K71Kl93N68n4p73J93N30n33m38M57
1985d31m2j46N82k26k3N77o84j11J073q32m62R10m20k72P21k29m09Q77n56p44
2005h47Q93k38j18O63p3p12P51Jr50R95j27l69K51J74m09L20N3l69M9J03m48M54
2027D7L09n95M10M53q17M20K70p29K57J12l80j6M59m58J54N88r36K00N88n84o9
$$ plain form
1879 -505 144 -25 -829 17 -24 -620 358 -172 -902 231 27 -871 -263 53 -582 -168 35 -765 75 127
1899 127 -246 -93 226 -127 208 621 -133 -358 433 71 123 350 259 -209 267 413 51 354 91 178 606
1920 606 697 255 736 371 161 563 312 69 329 637 463 180 294 802 378 489 410 419 425 261 392 758
1942 758 340 3 416 210 146 108 298 178 -27 234 114 214 122 501 388 -45 204 228 -80 -199 -10
1963 -10 153 -290 -274 74 -485 -212 -82 -481 -107 30 -261 10 12 -381 187 133 -640 -447 83 -450 -888 -431
1985 -431 -473 -619 -37 -263 -286 291 -393 -504 569 -263 -725 185 -235 -507 214 -15 -424 453 -103 -847
2005 -847 46 -192 -310 353 280 -432 319 320 -630 365 238 -131 120 294 -115 205 258 -111 -62 41 -407 47
2027 47 356 -239 171 624 -193 227 497 -232 25 137 -243 -259 200 -258 -104 484 -452 -252 336 -248 -317
2048c17N59l47k45P53l07j60M53p52l66J013k25n42M93P5o87P14L6n31L85J58
2068A60k09K89k76k28L27K15p08M33K78o16L43j8j14J70Q1o6L2K96l53K98J91
2089E25n43L11K63n33k80Q04k34k16M54m04K8L40k30O2P7l10J54M35o31L03J58
2110E33n16j11O79l73k30J02J56j52J94j00q1J46kn05P61k95k67J12n3k33M24
2131A89K77p98L98j21m02L34j94M4K69K44l98L10Q4o24j0L25j35l28M38o0l6m3
2153b37m46N37M98p16J74J06p65J61P58l07m44Q48m22Q8Rm13M7L24k18M2K76q5
2175a85l95P11n0n88O23q6o80P92J9o99Q87k20l33M57n6k44L38p6p06P01J29o52
2197c13M22P65j063N24K77r39N82L30r23J76P74p78K55N89r22K94M67m50j97O57
$$ plain form
2048 -317 242 -105 -350 403 96 -64 389 -363 -729 284 59 -483 10 85 -602 112 148 -383 2 160
2068 160 -49 240 -36 -264 63 278 -430 3 281 -335 8 -10 -124 46 127 61 93 389 36 334 525
2089 525 -18 293 556 23 -257 547 313 97 551 147 175 515 285 347 424 114 268 703 72 375 533
2110 533 17 -94 585 212 -18 84 240 88 282 182 101 247 245 -260 501 206 -61 51 -2 -235 189
2131 189 466 -332 66 -55 -457 -123 -317 -273 -4 240 -158 152 236 -388 -398 -73 -208 -536 -98 -158 -194 -237
2153 -237 -683 -146 352 -364 -190 -84 -849 -688 70 -237 -681 167 -255 -167 -158 -571 -524 -200 -418 -376 -100 -185
2175 -185 -580 131 81 -507 116 30 -650 142 161 -538 349 129 -204 253 197 -47 291 215 -491 210 339 -313
2197 -313 109 874 -189 335 612 -327 255 585 -338 -162 612 -166 89 678 -244 50 517 67 -130 527
2217E27n34k80R06o10OM95m26l71N41j92l12K67J04l13P93p07k59N49k55k46M68
2238A51j5l18K12J23k72J85l24K53M46n15l11M47j22m52N78R6m47N24p0m04K45
2259A0j31j71M99j10l95L36K63n60L10P6m82Q4O01k73m5K67m8r2K13l72N9M50
2281D89r55L25Q04k72j93M63k36o26M63k5l45R7J37K57k10J24j44r6j17n6J32
2302A6j43j10M40P8j8m11K56k2J4l24K53j54o9K78nn06J7L58k57L11j74j91L0
2325c33M18l64J57j77Ll9M83j16o69M33J25k95k65N26n64L87M19k74j53P7K51
2346C0n24K97m26L60J72J95j70N6M01n15j62P08r83J52R57k25p70P45l19n88J032
2367D23l12m99Q16J45p72M26j3k49K80K82r09M70M31o25K86J24n18J04O49q4m63
$$ plain form
2217 527 -7 -287 619 9 15 510 84 -287 254 62 -250 17 121 -192 601 -106 -365 184 -71 -317 151
2238 151 136 -182 30 153 -119 66 -258 -5 441 -74 -385 62 -60 -512 66 162 -285 239 169 -235 10
2259 10 -121 -292 207 97 -298 38 301 -259 51 127 -355 -271 330 57 12 279 231 139 352 -20 39 489
2281 489 -466 -141 663 391 198 661 425 -201 262 237 -108 -11 126 383 173 297 153 57 -60 -116 16
2302 16 -127 -237 203 281 263 -148 108 86 100 -224 29 -125 -194 84 79 -427 -410 -52 -309 2 -172 -363 -333
2325 -333 85 -279 -122 -299 -296 -335 148 32 -637 -204 -79 -374 -639 -113 -677 -290 129 -145 -298 -221 30
2346 30 -494 -197 -623 -263 -91 104 -66 -10 391 -124 -286 422 -561 -409 548 323 -447 298 -21 -609 423
2367 423 111 -388 428 573 -199 227 214 -35 245 527 -382 88 519 -106 180 304 -214 -110 539 455 -8
2388hK24J3Pj99J47j87K83M9n45L99r2K94j74L7m0k66J14Q1j24j81M67k96l40
2411c37M50O7o50O71K11o46k1M34k72J18M41r00N04J37n68L49M81p55J5R00j054
2432d25l22J247l29p34Q20j63n00P35q6l02K69m70J23M62k12o41Q54k8m96L28
2452A30k4n34M73K45n57J61R0R1J80m72J60K71n7k04n8n0J90L6M13o00M49l40
2474gk23N03r6p19N39K78n99Q60l40o73O41L3l11j25O43o24JN09o20J75M52m08
2496a11j91O30o55j2O29l43m78L60L4j41OM1l10K42J34n27O36o9l24Q8j57J90
2518c28O5K13k61L7K40k64K82p9o7Q6rQ2N1r7l52K67P8n5P6M1l09L02R5k8J84
2543B50n1l39L20j55K9j57M09J33j34N0l65J85J24m90J19M67j05j16K49J12k65
$$ plain form
2388 -8 216 229 236 37 184 -3 280 329 -216 183 91 385 211 248 208 -58 56 137 13 -168 299 3 -337
2411 -337 113 180 -470 201 412 -234 -255 179 -93 25 466 -434 70 207 -361 -12 469 -286 -271 629 -425
2432 -425 -747 500 171 -563 257 94 -406 329 243 -59 210 -260 -137 325 113 -528 326 298 -198 130
2452 130 106 -428 45 290 -267 -106 -16 75 255 -217 -57 214 157 -47 -105 -155 35 71 484 -116 333 -7
2474 -7 -230 273 177 -542 -3 275 -324 536 196 -477 164 197 -114 -239 404 -220 -219 290 -330 -155 297 -111
2496 -111 -302 328 -327 -339 290 -53 -531 -171 -137 -278 -272 -231 -541 -299 -165 -692 -56 -125 -449 -361 -518 -328
2518 -328 -263 -50 -311 -274 -34 -298 -16 -95 -162 -76 -85 -3 48 -49 -401 -134 -56 -111 -35 6 -303 -1 94 66 250
2543 250 199 -140 180 25 54 -103 306 439 305 355 -10 175 299 -191 -72 395 290 174 423 535 270
2564B70L9j95j85L63j1Q2K32j43p66O91j02m10L79ql35K29R7j20J93l54J60O3
2586A69j57j37L43l95J63K1J91m77J78Q8j51j64M07Nl13K01J01k37O1l1k0K01
2608D7r9r2K25j51l49L43J93m46n2M82m50M42j42j50J83j63j85L30ll55L80q7
2630i9j02k6j16K17j21K29j57K55N1k54MJ2J48Jo2J04l72L31P6j89J69n3k75L78
2654A49l13K13q2J34j76J53k44n3N57j47m81K61J01l90L89m5k8O2j00j13P7L54
2676B78l71K88j17l02j2N80o03LL73l31J81m2o2j0K26%p8j93K41p0Q5j27R5m3
2700a1l22L52J75n15P2K05J13n43L91K2o2L57r7l93N74m26K41J12l16QL88j75
2722A50m24N45o0m27M86k12j81L61M1k29OK62l97M72j08l15L73J00m27j35N73
$$ plain form
2564 270 309 114 -71 292 281 363 595 452 -314 377 275 -135 244 236 -99 130 227 107 300 -54 106 169
2586 169 12 -125 218 -177 -14 7 198 -279 -101 -13 -164 -328 79 84 -229 -28 73 -164 -103 -134 -154 47
2608 47 -52 -144 81 -70 -419 -76 117 -329 -381 101 -349 93 -49 -199 -16 -179 -364 -34 -37 -392 -12 -99
2630 -99 -201 -227 -343 -126 -247 -18 -175 80 131 -123 -119 -107 41 42 -20 84 -288 43 119 -70 99 46 -229 149
2654 149 -164 49 -33 101 -75 78 -166 -219 338 191 -290 -29 72 -318 71 26 -2 60 -40 -153 -76 278
2676 278 -93 195 78 -224 -236 344 -259 -256 117 -214 -33 -75 -137 -147 79 79 1 -192 49 -21 64 -63 32 -11
2700 -11 -333 19 194 -321 -249 -44 69 -474 -83 -61 -123 234 137 -256 318 -108 133 245 -71 -63 325 150
2722 150 -274 271 211 -216 270 58 -123 238 279 50 56 318 -79 393 285 -30 343 443 16 -119 454
2743D54k32l06M33k15K20k80J58KJ17k34j08J82K0j57L65m56K0j87K82M0ql4k55
2766a79J29L4j16K59k79J43J03j97L1M7l7n7P6J13j6j86j17J03P8j32r8K59Pl13
2790c45N9M53p30L70K28n71J42M33k87k2J90n56N13K31l64k49O25l70n7M80l65
2811a92l74P49j15k73j26L89p9j69K55j75Q5K40n4k06J64k10R8o6M6M7j43K37
2833A28l8n8j29K52m9Qo8k13J29M42m02j79N06j56l18N23l3n07L29K53l86j16
2855h2J24m60N71J42n99M44P0m38Q0N10m91k03R92o97n49R10l36k14L99l10q4
2876b21N03j02k49L86m75k25N30K5p90M34N70n97K36J1J94k96M9n5j16M62l07
2897c3J67r9J18k62L54k77K61k03L6O6j9j6J4m31N84J10q1m44L60R1l98N08l14
$$ plain form
2743 454 222 -84 349 134 354 74 232 234 351 117 9 191 211 54 419 -37 -17 -204 78 118 110 76 -179
2766 -179 -50 -16 -132 127 -152 -9 94 -103 -72 -25 -62 -119 -43 70 54 -132 -249 -146 -68 -200 -298 -39 -32 -345
2790 -345 -286 167 -563 -193 35 -536 -394 39 -248 -270 -80 -636 -123 108 -256 -505 120 -250 -307 173 -192
2811 -192 -566 183 68 -205 -331 58 -21 -190 65 -110 -25 215 161 -45 119 -91 7 -59 -13 34 -109 128
2833 128 90 32 -97 155 106 114 46 -167 -38 404 2 -177 329 173 -145 378 345 -162 167 420 34 -82
2855 -82 42 -418 153 295 -304 140 210 -228 -148 362 -129 -332 660 -37 -586 324 -12 -226 173 -137 -221
2876 -221 282 180 -69 317 -158 -383 147 172 -618 -184 386 -211 25 36 230 -66 -17 -72 -188 274 -33
2897 -33 134 35 153 -109 245 -32 229 26 62 128 109 93 107 -324 260 370 289 -155 205 296 -102 406 92
2920I2k05L24ql04M26j62R2j07K23n65K64M09n21J95K97l91m03Q56m18k26J14
2941a8R9P9p7J11o70N30n4N0j75J05J55k95M03k68j50J65j31J04L7k32M2K98J1
2964A19j03l08J61K54%l07k78M39k12J06j94R5P1p1K8Q1k32J47P2lk75L75j72
2987b07J47K36k54k77J90M31n81L34M3j87J7L17l50K58J5o0j19J29l23J14M07
3008B80j66K9K15qk01k81N52n98J63K38k35r7K66l28P4M12k25Q2OJ2j45L42q8
3031B99l72M31l34P1m9J05R8m14J2J90K40l06K31j97q4J56n9k9k00J58o2j43M06
3054A48qp5j38k67L86j09N0N0j45N7r9J10j34J41j7r8n5L53j52j94O7K94j87R4
3078G2R8j19j57K68n4l14L36o2k60K89J34k44J69N7l27M03j70j41L53j70k16K08
$$ plain form
2920 92 -113 211 203 -101 325 163 255 148 371 -194 70 479 -42 153 450 59 -344 512 94 -132 -18
2941 -18 81 160 83 194 -476 54 0 50 -125 -20 135 -160 243 -25 -175 -10 -141 -37 0 -232 -190 108 119
2964 119 16 -292 -131 123 123 -184 -462 -23 -235 -129 -323 -228 -157 -228 -200 -119 -351 -204 -132 -135 -410 -35 -207
2987 -207 -60 176 -78 -355 -165 266 -315 19 62 -125 -108 209 -141 117 132 72 -47 82 -241 -127 280
3008 280 114 143 358 350 149 -132 420 -178 -15 223 -12 -109 157 -171 -97 315 90 172 178 190 45 387 299
3031 299 -73 358 24 95 46 151 249 -165 -153 37 277 -29 202 5 -79 77 18 -11 -211 -53 -115 -258 148
3054 148 140 65 -73 -340 46 -63 -13 37 -108 -51 -150 -40 -174 -33 -50 -148 -203 150 -2 -196 -129 165 -22 72
3078 72 170 51 -106 162 108 -206 130 68 -192 97 231 -13 156 213 -114 289 119 -22 331 161 -55 153
3100A53j2m59L75J23k04J44J69j37k38K21LP4j61j28Q2o4k03J53K38l79K28K54
3122B32k52j11M24l02M0n2J32j34J15l82J76Kl32N8P78n87q5J03Rj55J38J5J03
3145f7j7m47L04K81j67k16K40q3j69L89l41j04O01k24j26J64m20L78J3j27k3n8
3167b19L32l57L74k11k1L43J0l55K22J00rL8j90j01J34k92L49L5rj02J35R9l58
3190e3O7J8n6l0J85r2L81p1J2r2k00L3p5M15p05L41K91k13k92L25J23j03k50l7
3214g8J69P9k23jM88n04J58L18k79k79J54RM9j14K77j89K81l60O4j23o3R6j91
3237b62L31r5J16j24J92p5Q8k31Rp0l3R4p6P4OP8m3k1Jj32j28J31K50k20K54J4
3263A28j15j04K7q0M3J51J6K4j11o6J76J46j39n7j24o4P4L17j70j39K18k59L27
$$ plain form
3100 153 141 -318 57 180 -24 120 289 152 -86 135 138 212 51 -77 5 -59 -262 -109 129 -250 -22 232
3122 232 -20 -131 293 -9 31 -21 111 -23 92 -290 -114 -112 -444 -386 392 -195 -280 -177 -168 -323 -185 -170 -67
3145 -67 -84 -531 -227 54 -113 -329 -89 -172 -341 48 -293 -397 204 -20 -146 18 -402 -24 -11 -138 -161 -219
3167 -219 113 -244 130 -81 -102 241 251 -104 118 218 209 247 57 -44 90 -202 147 182 173 71 206 305 -53
3190 -53 14 32 -24 -54 131 39 420 349 361 269 69 102 27 442 -263 78 369 156 -136 189 312 209 -41 -78
3214 -78 91 170 -53 -54 434 -70 88 406 127 -152 2 11 60 -54 223 34 315 -45 19 -104 -167 -71 -262
3237 -262 69 -26 90 -34 158 83 171 -60 -51 -121 -154 -60 -136 -62 -56 22 -21 -42 -41 -173 -301 -170 80 -140 114 128
3263 128 13 -91 -64 -144 -101 50 66 90 -21 -87 89 235 96 39 -85 -149 -75 242 72 -67 151 -108 219
3286B19l72J29J6K01m0nj3l91J75L01m68K86k17O6K6R0j28J67N6j25j25lJ49R3
3310H7k43N0j71K25n3k32M11j7j48o7K60k60j60K39J14j24k50L68jk69m9J99n9
3333a50j96M30k02R6k10KJ14L17k47J29l64K03j39L5K00n9L47j02l34K25L5j00
3355C0Q4k79J81J30k45J08P6k23L47j00K95j48n50O53k45j39M29j93k17M16j19
3376B91k23n6J83k65N18l44k40M43R0l93K4K60n0k39J40j97J6K41p1j38K67k56
3398AQ7j79K14J16j52l02j4L13K6l18qL53N0l40n8J42k28L22j0j15l01M33l25
3421b93N8k92M49k38M18j62k04R1K99k27k56K27j50K03J14j76J9L82m89K20k21
3442b28K13m7m9k8j70K42J99l80J50L36k47j20M10o16L21n4n8K44p0M1k71M09
$$ plain form
3286 219 -153 -24 -8 193 153 148 135 -256 -81 220 -248 38 -179 -113 -87 3 -125 42 98 -27 -152 -155 -6 87
3310 87 -156 -106 -277 -52 -105 -337 74 57 -91 -158 102 -158 -318 -79 35 -89 -339 29 28 -241 -290 -91 -150
3333 -150 -346 84 -118 -22 -232 -230 -116 201 -46 83 -281 -78 -217 -182 18 -41 306 204 -130 95 130 30
3355 30 114 -165 16 146 -99 9 85 -138 209 109 404 256 -294 359 114 -25 404 211 -6 410 291
3376 291 68 12 195 -70 448 104 -136 307 397 4 28 288 238 -1 139 -58 -42 199 128 -10 257 1
3398 1 88 -91 123 239 87 -215 -229 84 110 -208 -216 137 187 -153 -211 -69 -297 25 15 -100 -401 32 -293
3421 -293 -235 -527 -78 -316 102 -60 -264 -173 126 -101 -357 -130 -280 -77 37 -139 -120 262 -227 -7 -228
3442 -228 -15 -62 -111 -139 -309 -67 132 -248 -98 238 -9 -129 281 -335 -14 -68 -126 118 48 89 -182 227
3464B27Q3k53O1j3j66R8L01k80LQ8k98J87J54m14L54j47l12J26M06j33r4K33k18
3487gk13L37j13M7j09K7n8K20p2qp9K46j50k5j32O7j9P2J19r4J26k38M4N1rj91
3513a61r9K99L73n20j77L46j45J01J22r9J44l01L58m11L49j71l47O68m19m55N88
3534D3J76l34K40m27K57O0O5l13K56K92l36K88K57p21J20N97m15J47Nm90K44R2
3556A03J58j46K36k71r0J0k17N33Pm5k42J46k53K7N7O2Q4qj28K91l88RJ1J91m75
3581c38M37O0n02M43j24j91K74J30l96P3L47k48p3K0k0o8L44m02j5K53j79j87
3603c62K62nk00K15j8j13J09R1k53k0J05J06r6K07l40M91k22n5j29k54M26N4k32
3626b33J06k68N24O5l9m21m2MM83q2N8k19j76M88J35l97J18j26n3K99j65P2M9
$$ plain form
3464 227 310 57 118 105 -61 37 338 58 61 149 -149 38 192 -222 132 -15 -327 -201 205 72 -22 211 -7
3487 -7 -220 117 4 51 -58 -31 -89 131 59 51 -28 218 68 43 -89 -22 -41 31 150 56 182 -56 -12 39 30 -161
3513 -161 -260 39 412 -108 -285 61 -84 17 139 40 184 -117 241 -170 179 8 -339 329 -90 -545 43
3534 43 219 -115 125 -302 -45 15 80 -233 23 315 -21 267 524 -197 -77 520 105 252 257 -233 11 103
3556 103 261 115 351 80 -10 0 -217 316 323 278 36 182 -71 -44 13 75 159 151 23 314 -74 -65 -54 137 -338
3581 -338 99 159 -343 100 -24 -215 59 189 -207 -134 213 -35 -108 -88 -108 -176 168 -234 -249 4 -175 -362
3603 -362 -100 -105 -305 -90 -108 -221 -112 -21 -274 -294 -189 -83 -179 28 -312 179 -43 -98 -227 -481 -55 -1 -233
3626 -233 -127 -395 129 194 155 -266 -308 -304 179 97 155 -64 -240 248 383 -14 104 -22 -75 224 59 131 180
3649A80j79P4K95j99L6l23K34K1k42K12R0m39N28j42j64L20m02K1N3M8j61K79
3671A40k11N6j32K02N7j57J11n2J8j16N4J07l99J77o3J29M0j98K14L6O2O8k7j38
3695b2j56J07n4J48J9lj66o0L12j92K5P2Q3j83l36L19N10j82l54J72K6m3J04j95
3719d9n7J45m5J33k12n6K00k4L8R7l46M70k32J13j08L12l53j06K77L2j99j41K35
3742A24n1k32K52k61J32J99j68O2J07n56M83j25L6J33k6j66j68O0Q6l1o6J00m7
3765a23K56j09j49l29N13j33j17K4k5K30j08j65j5N2P4j04O2q9J46j27L25l85
3787b96M14j98N6j35k70N23k70K09j03K6k67K68l18J48K26l3J00l32J78l4j06
3808b14K35m5N9p9K82j24J49m55J17L07j19N6Q7m39J37J59N0k40K36k11R8P5R7
$$ plain form
3649 180 1 75 370 171 207 -116 118 139 -103 109 199 -240 288 146 -18 302 -100 -79 -26 22 -139 140
3671 140 -71 -15 -147 55 112 -45 66 14 32 -84 -30 77 -322 -145 -208 -79 -39 -237 -23 13 75 143 116 -22
3695 -22 -178 -71 -125 23 42 39 -127 -187 125 -67 -42 30 113 -70 -406 -87 423 241 -113 59 85 42 146 -49
3719 -49 -106 39 -6 127 -85 -141 59 35 73 170 -176 294 62 175 67 379 26 -80 197 229 30 -111 124
3742 124 73 -159 93 -168 -36 163 -5 57 164 -392 91 -34 2 135 109 -57 -225 -165 -79 -110 -176 -76 -123
3765 -123 133 24 -125 -454 59 -74 -191 -167 -192 38 -70 -235 -250 -198 -124 -228 -166 -255 -109 -236 89 -296
3787 -296 118 -80 -24 -159 -429 94 -176 33 -70 -44 -311 -43 -361 -213 13 -20 80 -252 -74 -108 -214
3808 -214 21 -24 35 -44 238 114 263 -192 -75 232 113 169 256 -183 -46 113 163 -77 159 -52 46 121 218
3831B18K9K9q2m35M34K41l56j57K74o3k80K84R6J4j69L05n98K52R9P0j80J62l47
3854a60M49k17n0L45l64J92j62n3L43m39J44J61l18J61k7J81l04J02k19L08k11
3875a38K38rk79K76J21k55J5J77q7l52L01Kk3j80m8J45j0m6K3L05L9j58l02J73
3899g2K6k4l4K77j28p7K71q6j87J4R3l6j34K95%Q1P3m05J06oK94l78pL88n90M27
3925A81l2q5j97K36K0j81K36r0k52J58K3j45J30k88L07N9q5L4Q4m17L43j4j81
3948a56oJ32l07L19nk01J87r6Q0j58j90M0N65j9m12N4M82o77K08L40j76j91K12
3971B5m9l22M55k61k4M01j39k27J65K0l03K72j35j85J28K42L3l3J90k19J1L2r0
3994a3J07q4K76o2j8k35k7K84j16J43m88M61m5J9R5r6N8r4j64q4J53J74k01l8
$$ plain form
3831 218 247 276 194 -241 193 434 78 -79 195 132 -148 136 232 246 77 382 -216 36 135 205 25 187 -160
3854 -160 289 72 22 367 3 195 33 -20 323 -116 28 189 -129 32 5 186 -118 -16 -235 73 -138
3875 -138 100 91 -188 88 209 -46 -31 146 59 -293 8 10 -13 -193 -241 -96 -106 -152 -129 176 215 57 -245 -72
3899 -72 -46 -70 -104 173 45 -32 239 153 -34 -20 73 37 -97 198 198 279 352 -53 53 47 341 -37 -44 344 -246 181
3925 181 149 64 -133 103 123 -58 178 88 -164 -6 17 -128 2 -286 21 80 -5 29 113 -304 39 25 -156
3948 -156 -162 -30 -337 -18 -23 -224 -37 -133 -53 -211 -401 -361 204 185 -227 -173 309 -368 -160 180 4 -187 25
3971 25 -24 -346 109 -152 -176 225 86 -141 24 44 -259 13 -122 -307 -179 63 96 63 253 34 45 77 -13
3994 -13 94 10 286 224 206 -29 -56 228 112 255 -233 228 183 202 297 201 259 165 1 -83 70 244 43 5
4018EO07l59j61K55m44K68m31L13j84M66q9j96J57j8k56J72m5q4M43j95k80r2
4040a48K73K5l96K62j44l15O17J73n05o7J00J95K5o9j61j92N83k79m7J0J89k07
4062g8J62k46n7J13P3r7K98k21k76L51p5r9j81K63J61l86J57Q7j35j93M28r8K02
4085A53K55k29j33j21O6j10J73O8k34J41j61n2J16j10K70Lj16n0K33k12J89k55
4107a16M25j82l46L32J09j33k69K89M2l8NP0k81J17K66k04q8J42k15K46j13k69
4129b11P1Q6j51J56M6j54K9O7j19L76l66%Q3j64J27j9N2J86k44rK08k67K41J81
4153B05l52J08Q2rj09QJ52j6m37O76l12j71N0Q3j1RR2P5l9J68k77K3L45k00Q0
4178B23J54o16M44M3k88Q2K73j47K4j9l84L26j19K32k48M10j64l33L55k49K02
$$ plain form
4018 5 612 253 92 347 -97 171 -260 53 -131 335 246 50 207 189 -67 105 60 -24 419 224 -56 -148
4040 -148 125 150 -246 16 -128 -443 174 347 -158 -225 -125 70 95 26 -135 -327 256 -23 -70 -60 129 -78
4062 -78 84 -162 -219 -106 -33 -130 168 -53 -329 22 -53 -152 -333 -70 91 -295 -138 -51 -186 -379 49 -49 153
4085 153 408 179 46 -75 -9 -119 54 122 -112 29 -132 -184 -68 -178 92 95 -21 -71 162 -50 139 -116
4107 -116 309 127 -219 113 222 89 -180 109 151 113 118 188 -93 24 290 86 -2 140 -75 171 58 -211
4129 -211 -140 -54 -205 -49 -3 -157 -128 -61 -180 196 -170 -170 -87 -251 -124 -143 -91 95 -149 -158 50 -217 24 205
4153 205 -147 -39 43 34 -75 -67 85 69 -368 308 -4 -175 -125 -42 -53 -44 48 123 84 252 -25 -2 343 143 223
4178 223 377 -239 205 248 -40 42 315 168 192 173 -211 115 -4 228 -20 390 226 -107 248 -1 201
4199B01P8j03j83J15m9p3Pm6q2k1K82j73j1J88r2Q1k6k55L6L09m02pJ47j66l6
4224b81K05j99L95k84m3K29k59K45jJ06r0j42J40J19l12K50k51K11j31k07J38
4245a62J51l01J09L36j35L68p89N45k95J83k88K97K9l03K36q1nk23M19j58K7K40
4267B00k28n9K27l15K32J12O7k14j28K83j39N2j84K89j73L1j24J50K55k33r7K48
4289B52n36J68J69Q9l7q1K19k11p5K65M4k55j22Q2J7K0J3L35m40K55Ok53J40o2
4313Bq6J21k52O5J47j51l9L83L06l59l8k17k00N96l79N9K3K7j9L9j8J77p0k59
4337a42j48J46K78N4k49j14K67J00o3l70J79j01PJ65J08K13l55j04K44o0J18J5
4359A88q5j3L8J46l60K85l29J75J13j37j60J24p1L18j03n9J45o1J36k06j57Q4
$$ plain form
4199 201 279 176 -7 108 59 -14 -7 -53 -135 -156 126 -47 -58 130 38 119 93 -162 -126 183 -219 -226 -79 -245 -281
4224 -281 -76 -275 120 -164 -207 22 -237 8 7 113 23 -119 21 140 -172 78 -173 38 -93 -300 -162
4245 -162 -11 -312 -203 133 -2 366 -423 122 -173 10 -278 19 48 -255 -19 -100 -105 -328 91 -67 -40 200
4267 200 -28 -87 140 -175 57 169 236 22 -106 177 38 90 -94 195 22 53 -71 79 334 101 4 252
4289 252 -284 -116 53 142 105 24 243 32 -43 222 266 11 -111 -29 -12 8 21 356 -84 171 177 -76 64 2
4313 2 -84 37 -215 -150 -3 -154 -193 190 496 137 99 -118 -318 278 -101 -42 -19 8 -11 28 10 187 117 -142
4337 -142 -290 -144 134 188 -61 -175 92 192 129 -241 -62 -163 -156 9 117 330 -25 -129 115 55 173 188
4359 188 103 90 128 274 -86 199 -130 45 158 21 -139 -15 -86 232 129 70 215 154 290 84 -73 11
4381A1N8Nk46L06L2J49n08p2L69p1J60k50O0o2K66k79L8l1j24K02P4k38n7m2P3
4406a77l5L25k34J0lj79J03N5o1j24K43o4J29Q3L4l30o5K54PJ39j79k9n6N6k5
4431a23J47m0k05R8J50J01k23J94k89j14K52O8p7q2L70q2k64J16j79K88K21m83
4453a56K10j85K1K96p3K12l93l5J76j41R3K30j74m1n8O0k2N7R1Mj29L11k42J13
4477B25r9r8K00k66J61l14L00J12j82J66l48n0J67J64j83J77k24J69K7l8l0l15
4499b79K53k0j64K65j12JL5j25K40Q2lp4j47J68j07j76J33J39k18j6J28k58K15
4522d0R5l5P1q4j24J52J93l21J22K11j53P1l10L0J84M9J47j41k6k13J58r2K5J59
4546A28pl7p6L8j93K07k15K47l02J63M6J93l63K92q6j55J5K85l09p0J45m1j1K70
$$ plain form
4381 11 69 74 -172 134 166 315 -193 -265 104 33 193 -57 3 -59 207 -72 -34 -65 -189 13 87 -151 -208 -250 -177
4406 -177 -212 113 -121 -111 -114 -293 -190 -135 -196 -320 -77 -141 -12 71 105 -225 -290 -36 -29 110 -69 -98 -154 -98 -123
4431 -123 24 -16 -221 -123 27 128 -95 99 -190 -304 -52 16 -61 -143 227 145 -119 -3 -182 106 327 -156
4453 -156 54 -131 -110 186 113 325 -68 -103 73 -68 25 255 81 40 -18 42 20 77 168 172 43 354 112 225
4477 225 126 28 228 -38 123 -191 109 221 39 205 -143 -193 -26 138 -45 132 -92 77 104 66 36 -279
4499 -279 -26 -46 -210 55 -57 -56 -21 -146 94 176 173 99 -48 120 13 -163 -30 109 -109 -125 3 -255 -40
4522 -40 55 20 91 7 -117 35 228 -93 29 240 87 158 -152 -122 62 111 258 117 91 -122 36 -56 -31 128
4546 128 121 84 8 46 -147 60 -155 92 -210 -47 -1 192 -171 121 35 -120 -105 180 -129 -199 -54 -95 -106 164
4570A64j32l9m7J69l68J99J53p1K2l18M30j84M0j66j19J10j94M21j75R3l97Q3
4592c26K24j7n2j28J56Q4o2m4J43l87L64k3j38j1Q8o2K24k24P1q6J13l57M70n0
4616c0k76K50K94l41r0K19l14M43j5j08M9O6M1m60L16J14k62L55n4k18K07J81
4638C67j92M4pk42L33k76k86L74r8J13J11j40j54N9M4K26k19j07J29L3M35k02
4660C45m24J90l48L36J46k43l03J54J45J74l29j98O79l70n3J24j32r0K91j58j41
4681b05M47k84K8lK46l05k48L42j13m5q3j9L16m36P6J76K21k14n1J94N1j90L29
4704B30l53P7N0P7j41P9K03l81K63j5j84p0L4J48j01P8l76L00J66k82K93M8q6
4727E7k02L26p0l02J07K2o1R7J81O5l10L7K42m9l51J03O5j02N2r8N0N1L20j45
$$ plain form
4570 164 32 -7 -54 115 -253 -54 99 28 50 -268 162 -22 18 -148 -267 -157 -351 70 -105 -12 -409 -326
4592 -326 -102 -119 -171 -299 -143 -59 -121 -165 -22 -409 -45 -68 -206 -217 -129 -191 33 -191 -120 -206 -93 -450 20 -30
4616 -30 -306 -56 238 -103 -193 26 -288 155 140 32 81 147 188 -272 44 158 -104 251 197 -21 186 367
4638 367 175 219 212 -30 303 27 -259 115 17 130 241 101 -53 6 50 276 57 -50 79 112 547 345
4660 345 -79 111 -237 99 245 2 -301 -147 -2 172 -157 -355 324 -46 -99 25 -107 -197 94 -64 -205
4681 -205 242 -42 -14 -17 229 -76 -324 18 -95 -140 -223 -242 74 -362 -286 -110 111 -103 -154 40 91 -99 230
4704 230 -123 -46 4 81 -60 19 222 -159 104 89 -95 -165 -131 17 -84 -6 -382 -82 84 -198 95 143 57
4727 57 -145 181 111 -191 -84 -62 -123 -26 155 220 -90 -53 189 140 -211 -108 -43 -145 -93 -191 -141 -90 230 85
4751H5k22K77k59L12j5l67L39j62Q0l09K69Q5J07j68n4j53j7J22O5n8m4j97K88
4774DJ05j33l47J10K64j56R8J0k06K26O6j02n4L3j06R1P5j15l3L11k20L35l23
4797f7O6k8l6J16K7K65m18M60k96o5j1j60L56M3Qj48j25J40R4j88qj34J32k7O4
4822F0K70q1M3k52J60P3j19j18L7j54J15oJ6R7J14j92R0j2L3J00l8k52m9j01J43
4847b3Q0j64J23j5Q4k34J25P7jj24o9J43Pj38j98L19J79k93N7p8K33j93Q8j14
4871a29K03k77M80k59j38r7J96pj75K02o7k73J71lJ39k00J39j3K26J72n33O6R0
4894h7k1J10Mp0J9m47O89j88q1j6K09L25m27M2R3k14L53j51o5J73j29j14n7L25
4918B75j13k60J87m4j19Q9q9L05j45j28r8r6K81Q7k3j91j02J05l4L0J61L9l48
$$ plain form
4751 85 -137 140 -119 193 178 -189 150 -12 68 -241 28 113 220 52 -2 -155 -172 -50 15 -43 -87 -284 4
4774 4 109 -24 -371 -261 3 -153 -55 -45 -251 -25 41 -61 -115 -82 -188 -97 -22 -137 -170 141 -79 256 -67
4797 -67 -1 -29 -65 51 78 343 -75 385 89 24 13 -147 209 252 260 112 -13 127 221 33 25 -109 23 -4 60
4822 60 330 249 292 40 200 273 154 36 73 -81 34 28 44 141 255 63 153 141 174 274 236 -16 -65 -166 -23
4847 -23 57 -107 16 1 85 -149 -24 53 52 -72 -141 2 9 -129 -327 -8 171 -122 -65 -143 90 -103 -15 -129
4871 -129 74 -203 277 18 -120 -217 -21 -28 -203 -1 -68 -341 -170 -173 -34 -234 -95 -108 118 290 -243 -177 -87
4894 -87 -108 2 6 -64 -45 -492 197 9 -72 -88 121 446 19 61 154 -60 293 142 77 250 121 7 -50 275
4918 275 162 -98 89 45 -74 15 -74 231 86 -42 -140 -236 45 132 109 -82 -184 -79 -113 -83 78 117 -231
4941b31K55j69K10J94m17L70k51j00p3J54K25l19L43l18K5J2j03K60j53K36j87
4962c7k36J92k3K22j48j94M79j88J09l31K94p8j58M19j91K05j66k10r8K6K73k15
4984e4K55l66Q1O2L13l72J9O9J06J38j82l8M8L7l04J04K29p0o1J43q6j89K73k46
5008i1J27R6j67j31k5L14j50O1k53K20o9L27l22N5l58M60oJk91L88m43K25o3r6
5032a91j24L35j26k80N47k57p7p3j68M07qm08L57Nk97J98J54k09L34J65n70K68
5054a8k11J00J14J20k93K45q6k7L4P8o3j23j5J28J11j0o9p0k66L56Nj67J84m1
5078A6J13j52J69l02K49k10K65O5j7k71m9P7O6M7r5J70M9j10K48l3j93Q3k1q0
5102H4j25R7m9K66m67L22K56n16K46Kj95K1K0J78l2j00J08j02p0J72j0n6k23L84
$$ plain form
4941 -231 24 -145 65 259 -158 212 -39 -139 -212 -58 167 -152 191 -127 -102 -90 -193 67 -86 150 -37
4962 -37 -273 -81 -104 118 -30 -224 255 67 176 -155 139 61 -97 322 131 336 170 -40 -138 -112 161 -54
4984 -54 201 -165 -84 -22 291 -81 -62 7 113 251 69 31 79 116 -188 -84 145 75 14 157 71 -118 155 -91
5008 -91 36 132 -35 -166 -191 123 -27 34 -219 1 -68 259 -63 -8 -366 94 88 89 -202 186 -257 -32 -95 -191
5032 -191 -315 20 -106 -386 161 -96 -173 -246 -414 -7 -15 -423 -66 -61 -358 -160 -6 -215 119 284 -286 -18
5054 -18 -229 -129 -15 105 -188 57 -29 -56 -22 56 -7 -130 -145 -17 94 84 15 -55 -321 35 40 -127 57 16
5078 16 129 -23 146 -156 93 -117 148 213 196 -75 -124 -47 19 66 -29 141 190 80 328 295 102 185 164 84
5102 84 -41 56 7 273 -194 128 384 -132 114 116 -79 -58 -38 140 108 8 116 14 -56 116 106 50 -173 211
5126B11l70O7M7Qj41O38l86k01J88j68M8P4j01J92L2j72p1J63O1l03J85o0j72
5149b31J86J02n0O9j2k30L47j75j39K80Q9k99P3K20j13j98K08k09k23O45o13J07
5171a66L34k4m43M09J14l79K00O9j23o7J62J84l88L74j67k08J81j26N8n3L29k48
5193B2p0O4L6j04J42j3j84J97k51J92k62L11k46P7n7J06j14L20j5jj44k8P3pj31
5218h7l08J4M12J60l15j21J37j09K22k71J21K19k33J17j8j3r9P2K32k37l0N06
5240C71n69J47k30N7k8K77J32r3K81l07O2j3o6j63K49j49J66j86r9J5J72Q3J00
5263B09k61K63j23J32Nl12J13P9L1k2Jq9Q2j93J14o0P5Q4k1j52J40L01m83P5Q8
5288G6j7N0k6Q6j11J44k00J0j95P7r0K53Mj70J35Jr8o0K33k03o5J05k14L43q5
$$ plain form
5126 211 -159 -92 -45 -37 -178 460 74 -127 61 -107 -59 15 -86 106 138 -34 -105 58 119 -184 1 -59 -231
5149 -231 -45 57 7 76 64 -166 181 6 -133 147 236 -63 10 230 117 -81 127 -82 -305 340 -273 -166
5171 -166 168 144 -299 110 224 -155 45 114 -9 -76 86 270 -118 256 89 -119 62 -64 -6 -59 270 22
5193 22 -48 16 52 -52 90 77 -107 90 -161 31 -231 80 -166 -89 -146 -40 -154 166 151 150 6 -22 51 44 -87
5218 -87 -395 -381 31 191 -124 -245 -108 -217 5 -266 -145 74 -159 -42 -60 -73 -172 -100 132 -105 -135 371
5240 371 -198 -51 -281 -224 -252 25 157 64 345 38 100 87 21 -142 107 -42 124 -62 -161 -146 26 109 209
5263 209 -52 211 88 220 225 -87 26 105 136 114 115 26 108 -85 29 -31 44 128 107 -45 95 396 -87 -12 76
5288 76 59 109 83 169 58 202 2 12 -183 -106 -196 57 61 -109 26 27 -71 -131 102 -101 -166 -61 -275 68 -17
5313a7j79K21r9Ok0J68j95k3j09L81j07j87K57L4m57M05q4j40O0M8n1q1K56j45
5337e8Q4l4j20K07k54K78k89J22K54r2K15l36j79L11J8k23q7K67k88K69k16Q1
5359g0J6j58P1O7Q9j41K22m9r3J37k6j81l5K07j17l4Q4o9l2q5N20m53M6K64m47
5384b67K88k22P4K18j81j49N2K01k63K33j89R6R2k39J85k19J9K36N9j41O9J25
5406G7N2p7j5p3o6n0K79m4k3nk24J54p8J10Qk7R3j20J22J16j22l79L29O3m7J88
5432B41K21l70o0J66k7k83L61m24J62L0r4J30J1k29L57Kl20qL18j7j22P8m9Nl65
5457b86M06j29KJ52J07l27R9J3P2j61J54j61J78j77J00j27n9J68RN3q1L5J17k93
5481a36K5k8J95O7k36J62k72J95L4j20J92j31J01k69K5R7J53k20J43j12K68l06
$$ plain form
5313 -17 -196 25 -74 -68 -88 80 -115 -138 -247 134 27 -160 97 131 -326 79 -5 -145 -85 -37 -88 -169 87 -58
5337 -58 26 -8 -128 79 -175 103 -186 -64 190 98 313 -23 -202 109 127 -96 -183 84 -204 65 -151 -70
5359 -70 -54 -212 -141 -74 15 -126 96 47 -46 91 65 -116 -151 56 -61 -95 -11 -80 -112 -197 323 -130 -84 180 -267
5384 -267 21 -201 -127 91 -90 -239 -187 14 -249 -16 -205 -109 -17 -256 -71 -290 -271 -35 24 -117 -48 77
5406 77 129 52 37 -36 -102 -152 127 83 60 55 -169 -15 -93 17 25 -2 91 -29 93 209 87 -292 37 100 53 241
5432 241 462 92 32 198 171 -112 249 -175 -13 17 -77 53 64 -165 192 194 -126 -134 184 167 45 123 74 79 -286
5457 -286 120 -9 -7 145 252 -75 24 37 109 -52 102 -59 119 -58 42 -85 -144 24 33 86 5 40 157 -136
5481 -136 -111 -139 56 123 -113 49 -223 -28 6 -114 78 -53 48 -221 -196 -99 54 -166 -23 -135 133 -173
5503a73J43o7J69j47N4n6O5K70j88k33L38k56J34P6r3j37k9J63j49J0o7O5j5J03
5527b0O7m00K12k7J64J55k31K02Lj65R0j67m7O8n6L3J90NJ7K00k82j10J67K1L2
5552A21l35K85o4o2o6J34j32O2j0J20J31J91l30k8L5P5k05M07k41j69J45k52O2
5575a26q7J69Pp3K50k42J18l5kJ50p8r0K88j75k00J25k34K02J53j75j58L98l48
5598a63N2L88l90J16mJ55o3O2q3K1k33K25j60J47j8j29J46j07J26k65J89J4l1
5621eL47m37n7L60J9O5k77QN7J67j27j87K97l5j94k66J58pJ4K35k82K27j63J15
5645C2j25k11J93J92J5Qr3j48o4L9LK70j7l38K56L6j47j06J73o2R5J02M7j24N6
5670H2q2j77K96k2l58J25J69k70J11R4R9k33L42m00r2L10J0L3O7m00K80m20J93
$$ plain form
5503 -173 -30 -97 72 -75 -21 -77 -12 258 70 -163 175 -81 53 129 36 -101 -130 33 -116 -106 -173 -108 -123 -20
5527 -20 47 -353 -141 -168 -4 151 -80 122 125 -40 50 -117 -164 -96 -152 -119 71 76 93 293 11 -99 68 89 121
5552 121 -214 71 7 -55 -121 13 -119 -57 -67 53 184 375 45 17 52 127 -78 329 88 -81 64 -188 -126
5575 -126 -213 -44 -37 -110 140 -102 16 -19 -21 129 51 -39 249 74 -126 -1 -235 -33 120 -55 -213 185 -163
5598 -163 -111 277 -113 3 -1 154 91 153 70 91 -142 83 -77 70 52 -77 69 -38 88 -177 12 26 -5
5621 -5 342 -95 -152 208 227 292 15 23 80 247 120 -67 230 195 1 -265 -107 -114 -100 135 -147 80 -83 32
5645 32 -93 -304 -111 81 96 104 11 -137 -201 -162 -159 111 94 -244 12 48 -99 -205 -32 -94 1 103 150 26 82
5670 82 0 -177 119 97 -261 -136 33 -237 -126 -32 67 -166 176 -224 -316 -6 4 37 104 -296 -16 -436 -243
5693b43K93l1R7q5O1j90J47K9M4k46J94Nq0p4J14M3N4j54j78J99j89K71o7J04
5717A18j06N5P2k91K64L3pl2j5N3j28j71R4k12K70K3o7j69p2L60J47k75J01N9
5741A04J10j24J86k69j62K68j70m0Q9K33q6j39J25k95J74L05k35K04k31j39Q6
5762fJ5j40N6kj8J20n6Q4j21K08m0q5N4p3j99K05j3mJ89j80J98j31j07LN9o3J70
5789A23m43M12Q8k32L4j67K87K5n8q2q5R7K6J6J35j83j84L24M8N0o1l90Q2J97
5813E9n2k65J88J34p6p1J21q1J1n3L8n5K08L6m0j04J9R3o2lj84k2l0R6J96j74
5839g3J49l5n5N4j37K0j19K20k29K82l24K09p7L9K16j31k1j98j21K21j83J63K21
$$ plain form
5693 -243 50 19 116 31 92 -98 49 78 122 -124 70 75 -5 -79 35 78 132 -22 -200 -1 -190 81 14 118
5717 118 12 67 139 -152 112 145 138 106 91 144 16 -155 -61 -273 -3 20 -47 -216 -288 72 219 -56 45 104
5741 104 214 90 276 7 -155 113 -57 -97 -8 225 139 0 125 -170 4 309 74 278 47 -92 -6
5762 -6 9 -131 -75 -77 -95 25 -31 53 -68 140 100 15 69 -4 -203 2 -11 -15 174 -6 192 61 -46 -43 16 -47 123
5789 123 -320 92 180 -52 -18 -185 102 127 69 -13 -98 -1 25 41 176 -7 -191 133 181 231 170 -220 -138 59
5813 59 7 -258 -70 64 -12 -83 38 -43 -32 -85 -47 -102 106 142 102 -2 17 110 48 45 -139 -161 -191 -95 101 -73
5839 -73 76 41 -14 40 -97 -77 -196 24 -205 77 -247 -38 -115 -76 140 9 -12 -210 -331 -110 -293 -130 91
$$ [...]
8191c9
##END NTUPLES=NMR FID
##END=
