##TITLE=1H_SL7-mCPBA(f4)
 CDCl3, 8 sc, 
 30.06.2021
##JCAMPDX= 6.0         $$ Bruker NMR JCAMP-DX V2.0
##DATA TYPE= NMR FID
##DATA CLASS= NTUPLES
##ORIGIN= UXNMR, Bruker Analytische Messtechnik GmbH
##OWNER= root
$$ XWIN-NMR		Version 3.5
$$ Wed Jun 30 08:54:25 2021 Russian Standard Time (UT+4h)  she@DPX200
##.OBSERVE FREQUENCY= 200.131506
##.OBSERVE NUCLEUS= ^1H
##.DELAY= (6, 6)
##.ACQUISITION MODE= SIMULTANEOUS
##.ACQUISITION SCHEME= undefined
##.AVERAGES= 8
##.DIGITISER RES= 18
##SPECTROMETER/DATA SYSTEM= spect
##.PULSE SEQUENCE= zg30
##.SOLVENT NAME= CDCl3
##.SHIFT REFERENCE= (INTERNAL, CDCl3, 0, 15.7039)
##AUDIT TRAIL= $$ (NUMBER, WHEN, WHO, WHERE, WHAT)
$$ ##TITLE= Audit trail, XWIN-NMR		Version 3.5
$$ ##JCAMPDX= 5.01
$$ ##ORIGIN= Bruker BioSpin GmbH
$$ ##OWNER= she
$$ F:/spectra/data/she/nmr/H-F/1/audita.txt
$$ ##AUDIT TRAIL=  $$ (NUMBER, WHEN, WHO, WHERE, WHAT)
(   1,<2021-06-30 08:53:11.26 +0400>,<she>,<DPX200>,
      <created by zg, POWCHK disabled, PULCHK disabled
       configuration hash MD5:
       00 E9 B6 7A A2 85 ED C7 34 08 36 98 17 FE 4E 26
       data hash MD5: 16K
       6D E1 7F 23 FE E8 FC 1D 87 C1 66 86 8C A1 00 6D>)
$$ ##END=
$$ 
$$ hash MD5
$$ F1 15 97 A5 8F A6 10 87 36 AE D3 16 AD BD AB 55
##$RELAX= 
##$RELAX= 
##$RELAX= 
##$RELAX= 
##$RELAX= 
##$RELAX= 
$$ Bruker specific parameters
$$ --------------------------
##$DU= <F:/spectra>
##$EXPNO= 1
##$NAME= <H-F>
##$PROCNO= 1
##$TYPE= <nmr>
##$USER= <she>
##$AMP= (0..31)
100 100 100 100 100 100 100 100 100 100 100 100 100 100 100 100 100 100 
100 100 100 100 100 100 100 100 100 100 100 100 100 100 
##$AQSEQ= 0
##$AQ_mod= 1
##$AUNM= <au_zg>
##$AUTOPOS= <>
##$BF1= 200.13
##$BF2= 200.13
##$BF3= 200.13
##$BF4= 200.13
##$BF5= 200.13
##$BF6= 200.13
##$BF7= 200.13
##$BF8= 200.13
##$BYTORDA= 1
##$CFDGTYP= 0
##$CFRGTYP= 5
##$CHEMSTR= <none>
##$CNST= (0..31)
1 1 145 1 1 1 1 1 1 1 1 1 1 1 1 1 1 1 1 1 1 1 1 1 1 1 1 1 1 1 1 1 
##$CPDPRG= <>
##$CPDPRG1= <>
##$CPDPRG2= <>
##$CPDPRG3= <>
##$CPDPRG4= <mlev>
##$CPDPRG5= <mlev>
##$CPDPRG6= <mlev>
##$CPDPRG7= <mlev>
##$CPDPRG8= <mlev>
##$CPDPRGB= <>
##$CPDPRGT= <>
##$D= (0..31)
0 1.2 0 0 0 0 0 0 0 0.06 0 0.03 0 0 0 0 0.0002 0 0 0 0 0 0 0 0 0 0 0 0 
0 0 0 
##$DATE= 1625028790
##$DBL= (0..7)
120 120 120 120 120 120 120 120 
##$DBP= (0..7)
150 150 150 150 150 150 150 150 
##$DBP07= 0
##$DBPNAM0= <>
##$DBPNAM1= <>
##$DBPNAM2= <>
##$DBPNAM3= <>
##$DBPNAM4= <>
##$DBPNAM5= <>
##$DBPNAM6= <>
##$DBPNAM7= <>
##$DBPOAL= (0..7)
0.5 0.5 0.5 0.5 0.5 0.5 0.5 0.5 
##$DBPOFFS= (0..7)
0 0 0 0 0 0 0 0 
##$DE= 6
##$DECBNUC= <off>
##$DECIM= 32
##$DECNUC= <off>
##$DECSTAT= 4
##$DIGMOD= 1
##$DIGTYP= 9
##$DL= (0..7)
0 120 120 120 120 120 120 120 
##$DP= (0..7)
150 150 150 150 150 150 150 150 
##$DP07= 0
##$DPNAME0= <>
##$DPNAME1= <>
##$DPNAME2= <>
##$DPNAME3= <>
##$DPNAME4= <>
##$DPNAME5= <>
##$DPNAME6= <>
##$DPNAME7= <>
##$DPOAL= (0..7)
0.5 0.5 0.5 0.5 0.5 0.5 0.5 0.5 
##$DPOFFS= (0..7)
0 0 0 0 0 0 0 0 
##$DQDMODE= 0
##$DR= 18
##$DS= 0
##$DSLIST= <SSSSSSSSSSSSSSS>
$$ [...]
##$SUBNAM2= <"">
##$SUBNAM3= <"">
##$SUBNAM4= <"">
##$SUBNAM5= <"">
##$SUBNAM6= <"">
##$SUBNAM7= <"">
##$SUBNAM8= <"">
##$SUBNAM9= <"">
##$SW= 20.0188882624521
##$SWIBOX= (0..15)
0 0 2 0 0 0 0 0 0 0 0 0 0 0 0 0 
##$SW_h= 4006.41025641026
##$TD= 16384
##$TD0= 1
##$TE= 0
##$TE2= 300
##$TE3= 300
##$TEG= 300
##$TL= (0..7)
0 120 120 120 120 120 120 120 
##$TP= (0..7)
150 150 150 150 150 150 150 150 
##$TP07= 0
##$TPNAME0= <>
##$TPNAME1= <>
##$TPNAME2= <>
##$TPNAME3= <>
##$TPNAME4= <>
##$TPNAME5= <>
##$TPNAME6= <>
##$TPNAME7= <>
##$TPOAL= (0..7)
0.5 0.5 0.5 0.5 0.5 0.5 0.5 0.5 
##$TPOFFS= (0..7)
0 0 0 0 0 0 0 0 
##$TUNHIN= 0
##$TUNHOUT= 0
##$TUNXOUT= 0
##$USERA1= <user>
##$USERA2= <user>
##$USERA3= <user>
##$USERA4= <user>
##$USERA5= <user>
##$V9= 5
##$VALIST= <valist>
##$VCLIST= <CCCCCCCCCCCCCCC>
##$VD= 0
##$VDLIST= <DDDDDDDDDDDDDDD>
##$VPLIST= <PPPPPPPPPPPPPPP>
##$VTLIST= <TTTTTTTTTTTTTTT>
##$WBST= 1024
##$WBSW= 4
##$XGAIN= (0..3)
0 0 0 0 
##$XL= 0
##$YL= 0
##$YMAX_a= 205837
##$YMIN_a= -309076
##$ZGOPTNS= <>
##$ZL1= 120
##$ZL2= 120
##$ZL3= 120
##$ZL4= 120
##$ABSF1= 10
##$ABSF2= 0
##$ABSG= 5
##$ABSL= 3
##$ALPHA= 0
##$AQORDER= 0
##$ASSFAC= 0
##$ASSFACI= 0
##$ASSFACX= 0
##$ASSWID= 0
##$AUNMP= <proc_1d>
##$AZFE= 0.1
##$AZFW= 0.1
##$BCFW= 1
##$BC_mod= 2
##$BYTORDP= 1
##$COROFFS= 0
##$CY= 11.3945322036743
##$DATMOD= 1
##$DC= 2
##$DFILT= <>
##$DTYPP= 0
##$F1P= 15.9154993809931
##$F2P= -4.1035820241983
##$FCOR= 0.5
##$FTSIZE= 0
##$FT_mod= 4
##$GAMMA= 1
##$GB= 0.15
##$INTBC= 1
##$INTSCL= 1
##$ISEN= 128
##$LB= 0.24
##$LEV0= 0
##$LPBIN= 0
##$MAXI= 10000
##$MC2= 0
##$MEAN= 0
##$ME_mod= 0
##$MI= 1.114404
##$NCOEF= 0
##$NC_proc= 0
##$NLEV= 6
##$NOISF1= 3.799351
##$NOISF2= 2.8
##$NSP= 1
##$NTH_PI= 0
##$NZP= 0
##$OFFSET= 15.70392
##$PC= 1
##$PHC0= -11926.43
##$PHC1= 23.20101
##$PH_mod= 1
##$PKNL= yes
##$PPARMOD= 0
##$PSCAL= 0
##$PSIGN= 0
##$REVERSE= no
##$SF= 200.130013532006
##$SI= 16384
##$SIGF1= 3
##$SIGF2= 2
##$SINO= 400
##$SIOLD= 16384
##$SREGLST= <1H.CDCl3>
##$SSB= 0
##$STSI= 0
##$STSR= 0
##$SW_p= 3612.71676300578
##$SYMM= 0
##$S_DEV= 0
##$TDeff= 0
##$TDoff= 0
##$TI= <>
##$TILT= no
##$TM1= 0
##$TM2= 0
##$TOPLEV= 0
##$USERP1= <user>
##$USERP2= <user>
##$USERP3= <user>
##$USERP4= <user>
##$USERP5= <user>
##$WDW= 1
##$XDIM= 8192
##$YMAX_p= 0
##$YMIN_p= 0
$$ End of Bruker specific parameters
$$ ---------------------------------
##NTUPLES= NMR FID
##VAR_NAME=  TIME,          FID/REAL,        FID/IMAG
##SYMBOL=    X,             R,               I
##VAR_TYPE=  INDEPENDENT,   DEPENDENT,       DEPENDENT
##VAR_FORM=  AFFN,          ASDF,            ASDF
##VAR_DIM=   8192,          8192,            8192
##UNITS=     SECONDS,       ARBITRARY UNITS, ARBITRARY UNITS
##FACTOR=    0.0002496,     1,               1
##FIRST=     0,             0,               0
##LAST=      2.0444736,     0,               0
##MIN=       0,             -309076,         0
##MAX=       2.0444736,     205837,          0
$$ Real data points
##PAGE= N=1
##DATA TABLE= (X++(R..R)), XYDATA
0@%%%%%%%%%%%Qj6J6k4L2l2M0n6O4p2Q8j07J31j53J77k08K42k81L24l71M25m84
33b57N49o21P00p89Q86r92J109j235J373j524J690j872K069k284K521k781L063
50A605l374L717m095M517m985N509o104O782p563Q474r551J0851j2458J4499j7196
65i372K0943k6535L5889n5370J65958k46471r6268M17063k29358r4182K25454
76A07751r9771j31140K14012l2477j12017N9777l982j6705P5797p3138k6747P4049
88C5409l2404j9675N2728o1693n053O3422m2022j4513L9267n3140J4660O0939
100C7925n0878r194N2780l1911M345K3043n3774J1092L1247n4504K6298M2276
112B8745o2232J9375M7743o1925J9268M5252p4566K0564O9616p8464n801P8817
$$ y = [0, 0, 0, 0, 0, 0, 0, 0, 0, 0, 0, 0, 8, -8, 8, -16, 16, -16, 24, -32, 32, -40, 48, -59, 72, -81, 96, -112, 130, -151, 173, -198, 227, -257, 292, -329, 371, -418, 468, -524, 585, -650, 723, -801, 889, -983, 1086, -1198, 1323, -1458, 1605, -1769, 1948, -2147, 2370, -2615, 2894, -3210, 3572, -3991, 4483, -5068, 5783, -6675, 7824, -9372, 11571, -14964, 20925, -34445, 131513, -114958, -211226, 205837, -23521, -117703, 107751, 7980, -123160, 90852, 58375, -53642, 6135, 2153, -14552, 61245, -11893, -38640, 35409, 3005, -16670, 36058, -25635, -30688, 32734, -9288, -23801, 15466, -37674, -23014, 37925, -12953, -22147, 30633, -1278, 3067, 26110, -27664, -16572, 14675, -39829, -13531, 28745, -33487, -14112, 33631, -28294, -9026, 36226, -38340, -17776, 51840, -26624, -32425, 46392]
124D6392n6951k3912O8852l6629k7303M9712k5286j6871L2607l1809J686M8792
136B9280l2486m343M8145l8004k6010L9252j7549j3957L0697j8218j0138K7545
148A4214j2124l992J0818k6920J1466L4825k8493j1910K3505j1320J0266J6408
160B6743m1536n908L7997j0742p853P539k6780Q586L1468k3552o689K1307j5765
173e185J1328K7764l9730j9757L5549n504j4309J4668j1670l003K6609j3226k1835
186a8301J3699M471k289Q935j0356q105J8472P379j1708p624J980P313l923r860
200i917O807L99j0417J0581Q663j1332O083R945j0540j303N528q133L181N472
214E017j0150K962R922q356k814O910n381l738M321P05K178M649j341n11L34P18
$$ y = [46392, -10559, -34471, 34381, -2248, -29551, 20161, -5125, -21996, 10611, -21198, -19512, 29280, -3206, -7549, 40596, 2592, -23418, 15834, -1715, -15672, 15025, -3193, -13331, 14214, 2090, -1902, 8916, -18004, -6538, 28287, -206, -12116, 11389, 69, 10335, 26743, -14793, -20701, 17296, 6554, -1299, 6240, -20540, -11954, 19514, -4038, -10727, 10580, -5185, 6143, 33907, -5823, -25580, 9969, 4465, -9844, 4824, -6846, -9849, 16760, 3534, -18301, -4602, -131, -2420, 6515, -3841, -11946, 6526, 13905, 2197, -5427, -3447, 3866, -57, -9917, -3110, -2711, -13128, -2547, 6116, -5216, 867, 10812, 272, -1031, 4497, -3636, -455, 5017, -5133, -2171, 7751, -605, -3419, 3491, -1890, -5628, -1307, -602, 1576, 6225, 4884, 4373, 4707, 5425]
230E425J449m493m699L144K228l946n704J38J0889L359r674M636R376p766p56
245C606L641j2451M42J4270p248n762P205n957J079R857j1631m229J1151o744
259b771r74J1885r156k329J5637p757r961O969n573j220P260j1677k321J4571
273B583n710j836J1479p903k293J1072j0917n232J1510r080l668J3549q472k382
287g300J4041j1127p371J6071o197j0204J1602k024m676J1856m209o610J0410
300D262j268n920L748r029l025J2419j519m506N410k476K514Q369r494m154P804
315C135m357M76O241r250Q6J1221o376k120O717o990J502O954j2665m20J3875
330H029p157j211J1282q598j677J1842j0922p654J1724n100o113R394l264k185
$$ y = [5425, 6874, 2381, -2318, 826, 3054, -892, -6596, -6458, 4431, 7790, -1884, 2752, 12128, 4362, 3606, 7247, -5204, -4762, 9508, 2260, -3502, 3703, -2254, -1175, 8682, -2949, -7178, 3973, -2771, -3745, 8140, -1016, -3345, 12292, 4535, -5426, 1543, -4030, -5250, 2010, -9667, -11988, 2583, -3127, -4963, 6516, -1387, -3680, 7392, -3525, -8757, 2753, -6327, -9995, 3554, -4918, -7300, 6741, -4386, -11757, 4314, -1883, -12087, -485, -2509, -7185, 4671, 462, -6148, 4262, 2994, -2926, 822, -8207, -11232, 1187, -332, -4838, 572, -1904, 610, 8979, -515, -4669, 3135, -1222, -746, 5495, -3755, -3669, 7552, 1176, -944, 5773, -1217, 285, 7239, -5426, -5846, 8029, 872, -339, 10943, 2345, 668, 12510, 1588, -6066, 5658, 558, -5555, 3839, 575, -1610]
344a610J1301n214q436P371Q68m703K654j333O16L972m958j629L767l607J440
359D99K495p566J202O839m775k198K893p3O349N73q269L004Q15r172O431L315
375B362j2704P327R945j1749O60Q469q085J583N462r728N451R407j2056m87J0353
390F210r117k305R804p902m252J0229j267p505K219N081L017k497k749M419L30
405C715m045K375l367o429P422L491m212K796q30k968O974m436r017J1675M258
420G402r289O114P30j0179Q367M118j3170K143N822l609M965k150r548Q509N859
435F084p482K939L416o258L765J499q076n97J907J287M523m939j970Q292n179
450g89m220R276q155o278J5803k935r789J2696m133j1515J3408j402j2727J3144
$$ y = [-1610, 9691, 4477, -3959, 3412, 4280, -423, 2231, 898, 1514, 5486, 528, -1101, 2666, -941, 499, 2994, -4572, -3370, 3469, -1306, -3504, -611, -684, 5665, 6238, -2031, 973, 1788, -7384, -953, 2362, -10342, -3015, 6930, -4819, -4159, 4310, -3775, -2192, 3270, -6458, -1007, 8400, -3656, -4143, 6210, -2907, -5212, 4592, -3310, -7562, 2667, 1400, -6105, -3886, 1195, 4212, 1715, -1034, 3385, 3715, -330, 2045, -1322, -7751, -329, 3162, -1050, 1746, 916, -2052, 4922, 486, -8531, 3144, 7402, -1887, 4227, 4957, -5222, 3145, 7263, -5907, -3764, 2058, -1551, 3414, 1264, -8284, 225, 6084, -1398, 1541, 4957, -1301, 2464, 3963, -4113, -4710, -2803, -1516, 3007, -1932, -3902, 4390, -789, -5009, 4267, -3888, -10166, 5637, 2702, -7087, 5609, 1476, -10039, 3369, 1967, -10760, 2384]
464B384r01j2549J3764L33j4607J3283L287j3269J2876K697j7379J0134O387j5838
478i398N311P860q510P020L570j1292M084L901o100N921j505p282J0344K324r700
493c452N286J141n112Q035k712q534R854j570p640R952m817q113J7463j030j4729
508e978J1443J787j1957R397q46j1878J3632J460j2181J2075J11j4839J1850K777
522F853j7010J0834R602j3034L602N244q607N182K347r161M744J964n650O839
536C749j962j0689R545M288q032L781K36l286P172m453o934R109m333n626J3939
551F504n671j1372J4797j708j1992J2084k267j1417J5319m08j3392J3480j253
564B704j4571J6416J742j9505J3208P176j6403Q100N738j5280R221R628j3506
$$ y = [2384, 1483, -11066, 2698, 3031, -11576, 1707, 4994, -8275, 4601, 7298, -10081, 53, 6440, -9398, -4087, 3773, -4737, 2283, 5853, -5439, -1355, 2546, -3554, 2367, 862, -6420, 3924, 6248, -3452, 1834, 2975, -2137, 5898, 3186, -5348, 4506, 2936, -4704, 5248, 431, -7682, 9781, 8751, -5978, 5465, 7252, -4705, 4692, 3846, -8032, 5600, 7060, -5121, 6954, 7065, -7774, 4076, 6853, -10157, 677, 10279, -2755, 847, 6091, -2516, 2666, 5013, -4148, 596, 2560, -3090, 3749, 1787, -8902, 643, 4931, -3101, 680, 916, -2370, 4802, 349, -6585, 2524, -1809, -7435, 6504, 833, -10539, 4258, 2550, -9442, 2642, 375, -11042, 4277, 3869, -9523, 3957, 2704, -11867, 4549, 6291, -13214, -6, 7170, -9233, -1133, 4605, -10675, -1454, 8174, -5332]
577e332M041O449j1020N643P545j4108J160J0502m992k73K204n802K994M165m251
592a075N91p13K69P892m608q466P505J426l996N719n394o333J2422L84j0427O552
608A748m65p153J2247O02j4171Q152N741j0446M552K481r448P265O019j0500J289
623b087N526n424L163J725q574M543P117o166j145K554m548L102L998o258o98
638c172L933j092P78L65k901N24K441J96o75l143L31M724k538k133K902k144j53
655a757O261l724n122N100n68j438M445m645l150Q645j767n623N761j003o054
670d639P871P85q321L792M544l585J013k27l301M226J694n731K531J770m091K609
686I40L059n041o76N733r7l787j316J829K162j128j928J86n01J139K611j330l961
$$ y = [-5332, -1291, 5158, -5862, -219, 7326, -6782, -5622, 4880, -112, -385, 1819, -3983, -989, 3176, -1075, -484, -1197, -928, 6964, 2356, -6110, 1395, 2821, -1175, 4544, -850, -7183, 5239, 5623, -4804, 1748, 1283, -5870, 6377, 6979, -7192, 960, 6701, -3745, 807, 3288, -6160, 1105, 7124, -3376, -2087, 3439, -1985, 1178, 2903, -5671, -1128, 5989, -177, -1322, 1232, -3316, -214, 3784, -2474, -3172, 761, -331, 447, 812, -2089, -1565, 876, 1072, 397, -2746, -2415, 2309, -229, -2362, 540, -1604, -1757, 4504, 780, -4342, 758, 190, -1248, 3197, -1448, -4598, 4047, 2280, -3343, 2418, 1415, -4639, 3232, 4017, -4304, -512, 4032, 447, 1460, 1233, -2068, 2158, 3852, -1879, 652, 2422, -1669, 940, 3999, -1042, -1718, 4015, 3918, 131, -1185, 644, 2806, 1678, -250, -64, -565, 574, 3185, 1855, -2106]
703b106J219L676P7l362j759K307J474k035K23M60r80J341J087k842j167K340
719d7J020j631j769K30K569O59j761J3j370L77J906l8k712j33J135J337N12k936
737b639J16L140j471j380K220k691r65N037j468l520L188k97j071L597k756k829
753c789N021p60l410N209k784m860P153O90o267M815O17m254N801q62o566N199
769I53J732n294M620P71n740N190J762o624L362J334m350N210J051o353L542K864
785D030n085L070R21n041L617J838m739K540L96l604M859l33n784N246K258n391
801a202L048K74m681M466N48n915M649R66n905N474J126p310N536L133p752L172
817c73L527n678K813K241o434L640L096o376K842L356p280L320M466o387J536
$$ y = [-2106, -887, 2789, 2866, -496, -2255, 52, 1526, -509, -286, 174, -806, 535, 1622, -1220, -2387, -47, 973, -658, -2427, -2197, 372, 1031, -730, -717, -2087, -1710, 196, 158, -2554, -2687, -1552, -215, 297, -2639, -2523, 617, -854, -2234, -14, -2705, -3670, 1367, -101, -3621, -433, -730, -1801, 1796, -960, -3789, 1232, 472, -2938, 2271, -513, -5373, 1780, 2470, -3797, 1018, 1635, -2619, 3182, 2320, -4246, 953, 2685, -2609, 2011, 2782, -2958, 2232, 3994, -2630, 732, 2066, -2284, 2926, 3977, -2376, 1166, 4030, -1055, 2015, 2936, -2105, 1512, 3350, -1389, 1151, 1547, -2057, 2802, 2469, -3315, 1931, 4189, -1202, 1846, 2120, -2561, 1905, 2453, -3462, 1187, 2153, -3752, 1722, 2848, -4462, 1074, 4207, -3545, -373, 3154, -2524, 289, 2530, -3904, -264, 2832, -3544, -702, 2654, -4626, -1306, 3160, -3227, -1691]
832a691M580l843P06J817l637K059J267m576K293K346m385K992K397n259J826
847a108L307l215J073J666l515J788Q78k632L607m06m943M226K159m932K277J848
863B078m551K698J791m089L102J436l637L094O78n513L399K383n576K221L149
878B663m404J527K722m242J449K357l074O94J882l108J852K004l812K65K770j824
894b79q1L05j822J709L48k053J762L12j877K332O01l216J705R00k688J156R26
911D0j808J667J93k723K104J074k410J313N42j879J895J191j956N02O32j149O56
928a16j27j310J061N48j460R04N80n33O86O00j30N04j902Q05J503j862P28J591
946B070k984L98L007k534q07K495j915k12K773j925P4K684k354k28K453k400o19
$$ y = [-1691, 2889, -954, -248, 1569, -2068, -9, 1258, -3318, -1025, 1321, -3064, -72, 2325, -2934, -1108, 2199, -1016, 57, 1723, -1792, -4, 874, -1758, 1849, 1443, -3500, 726, 2885, -2047, 230, 2078, -2473, 225, 2016, -2073, 1029, 2465, -1172, 1922, 2600, -2913, 486, 2869, -2707, -486, 2663, -1741, -214, 2508, -1734, -285, 2072, -1002, -308, 1574, -1534, 318, 2322, -1490, -1225, 1545, -279, -360, -55, -1877, -168, 180, -1873, -111, 201, -1676, 656, 1257, -1959, -254, 646, -2042, -886, 40, -1768, -101, 92, -2631, -527, 547, -1863, -550, -8, -1887, 8, 1199, -757, -255, 377, -772, -116, -243, -1553, -492, 56, -1404, -500, 80, -453, 233, 833, 703, 1207, -695, 110, 1613, -249, 479, 2070, -914, -516, 2491, -43, -850, 1645, -270, -482, 2291, 366, 440, 3124, 770, 542, 2995, 595, -24]
963b4K228k603m40L029k711R7L002l011P7L863k492j221K595k346n3K689l143
980d64n81L372k412q46K363l165j28M209l215j038L273j534M1K137k852L78K522
997B060m174L87L587n037L65M872m145j343N745k758k195M400k715q93L832k986
1013i98j209L608l262q52M771l574k204N191k123k352L553q05j462K857j431m06
1029f98K580k375n96L026l000j343L617j927j372L286j852n81L322j829m70K545
1045B333k935k19M032l958r48M479k952j512M387k212k332L691j718j698L100
1060A538k176o9L944k416k154M446k266k042K989k688j324M075j937k403L070
1075E87o05p26K839j873k073K940j40j176P44j782M74K404j934q91J176j093M73
$$ y = [-24, 2204, -399, -839, 2190, -521, -424, 2578, -433, -356, 3507, 1015, -206, 2389, 43, -10, 2679, -464, -1045, 2327, -85, -931, 1432, -1733, -1861, 2348, -867, -1905, 1368, -166, -125, 2012, -840, -462, 2060, -2114, -1727, 1860, -3177, -2812, 2060, -2085, -3428, 2317, -441, -2636, 1764, -951, -1844, 1988, -998, -2207, 1401, -1861, -2713, 2058, -1516, -3720, 1471, -652, -3004, 549, -256, -1718, 1139, -292, -698, 1882, -493, -1089, 1937, -1063, -2406, 1211, -716, -2088, 1198, -654, -1235, 2087, 258, -212, 2333, -602, -821, 3211, -747, -1695, 2784, -168, -1680, 2707, 495, -1837, 1854, 136, -1562, 1538, -638, -707, 3237, 821, -1333, 3113, 847, -1195, 1794, -894, -2218, 1857, -80, -2483, 587, -18, -744, 2095, 222, -1851, 1089, 949, -227, 517, -1265, -791, 1613, -321, -1212, -36, -1129, -656]
1092f56J515k677K34K595j276K99J293k456J549K466m259k76K944k458r21L174
1108A090k310r68L566p53j679K092j410m13L142k581j406L541q43j665K377j279
1124E01k063J777N90j929O07L78Q71R04p91j98Q37m26J40J63j358n91L40L81R46
1143A079r49j064K138J11j612P74L62j767K063L73k119J445Q01j347M14p24k161
1160b183K510Q13l585J556J362k032K359J737l736l68L498j104j921qk84N12P74
1177a00o35r19M78P97N45m79j682M55J221R81r62j722J812J614j945k18O54k341
1195b446M57K978k500j614L519J7q49K282k937j027M756j598l406K943m24k391
1211b240L790r33l583L172J813k978O34Q29j263J562N57j894J216P30l2L46j183
$$ y = [-656, 859, -1818, -1584, 1011, -265, 34, 1327, -1129, 420, 2886, -1373, -1649, 1295, -1163, -2084, 1090, -1220, -2188, 1378, 625, -1054, 1038, -372, -785, 2357, -224, -1630, 1911, 1068, -597, 1780, 501, -1562, 215, 805, -1124, -517, -139, 732, 1636, 845, 647, 1484, 1058, 1198, 1361, 3, -588, -248, 133, 1079, 130, -934, 1204, 1315, -297, 477, 839, -928, 1135, 1508, -611, 834, 1635, 288, 702, -22, -2183, 327, 1140, -2445, -889, 473, -1559, 800, 2537, -1199, -1567, 1931, 827, -1094, -1102, -1386, -874, -100, -735, -1654, -1176, -379, 166, -313, -1995, -1540, -319, 662, -300, -2022, -210, 1404, -541, -759, -105, -2446, -1989, 989, -1511, -3125, 394, 411, -438, 1844, -1093, -2120, 2636, 1038, -2368, 575, 151, -2240, 1550, 617, -2966, 206, 2019, -959, -325, 504, -759, 803, 1360, -534, 682, 1412, 1380, 1726, 543]
1228E43j230J156n03k55Q90j543Q80K120j326j45J571k244K13K650k867l82K410
1245A938k638j79L879l493j325M882k854k460M284k184j985N439k706l305N327
1260B620j176k786L673k780l534N339m01m405L739N75k750L500n99l612L380M51
1276A234k068J641j128j652L481q28l144K140P6m18K430k795j404L438j468q44
1292a309L502k654j575N540k453m097M425j658k204L383j610j869N227j843l385
1307b580N106j812m150O220j038n040M760P27m718L438O11m097L509R90m174K812
1323E64M54l507L366J302l478K234J095k395J787r26k051J729m68j710K903q66
1339C3k030L812n95k859K770p77k064L122o46k798K862o39j960K659q92k560L968
$$ y = [543, -687, 469, -34, -289, 601, -942, -62, 2058, 732, 587, 2158, -86, 127, 2777, -90, -472, 1938, -700, -879, 3000, -493, -1818, 3064, 210, -2250, 2034, -150, -2135, 3304, 598, -2707, 2620, 1444, -1342, 2331, -449, -3983, 1356, 955, -3450, 289, 864, -1886, 1614, 1015, -2597, 783, 1234, -834, 807, -321, -1973, 1508, 680, -2464, -324, -248, -666, 1764, -1031, -2435, 1003, -465, -1309, 2193, -461, -2036, 3504, 1051, -3046, 1379, -279, -2483, 900, -710, -2579, 2648, 805, -2580, 2526, 714, -3436, 2784, 1746, -3294, 1466, 2193, -2525, 913, 1524, -2573, 936, 1926, -2248, 564, 1018, -2489, 877, 2179, -1299, 935, 2030, -365, 1422, 496, -1555, 174, -294, -2004, 899, 33, -1997, 1815, 1220, -1639, 1131, 354, -1710, 1412, 766, -2032, 830, 191, -1769, 890, -2, -2562, 1406]
1356A406r80l459L337l91k639M041k58l141L473K59l276J916o20k949L505K57
1372D81l212K822J207k171J467p6k526K328O59k207J789k90j277K310l57k728
1388a781K514K7k142J792m9j531J815L0j543K816m33j414K217j540k218K446j74
1405H32k628K612k22j532L091n65k664K281O38l058K303M02k420J930P67k376
1421f09J100P92j615R52j98j709J901j78j885J946R44j428J046K84j850J198k22
1438D69j761Q43K37p08J717k29j978J649J71j603R53Kr57J196K91j317J246J16
1456C37j477J234p9j756Q89P46j738L45J267l4J32N8R9K13m41m39M25m61m97J110
1476f7L82r12L27N72r8p67j83N29K22j97N70j53m52M53P01r40n12O33q2m14M5
$$ y = [1406, 426, -3033, 304, -87, -2726, 1315, 1057, -2084, 1389, 1648, -1628, 288, -332, -3281, 224, 481, -2731, 91, 1298, -873, 594, 518, -2008, 320, 979, -1228, 561, 271, -1006, 1304, 947, -1781, 733, 760, -1382, 410, 361, -1170, 645, 675, -868, 1948, 1515, 101, 2318, 778, -1440, 1006, 832, -1796, 816, 594, -938, 2153, 1588, -1076, 1205, 1843, -1215, 1088, 1490, -930, 1000, 1767, -609, 491, 1283, -332, 620, 422, -1287, 614, 436, -1449, 497, 1441, 13, 1059, 1343, -507, 691, 469, -1292, -449, -212, -920, 797, 568, -1410, 239, 410, -1193, -240, -238, -1195, 1, 292, -1025, 221, 337, -1140, 94, 15, -1741, -852, -106, -1844, -1499, -232, -266, -134, -76, 23, 236, -205, -644, -219, -680, -1177, -67, 315, -597, -270, 302, 204, -563, -746, -217, 5, -192, 378, 225, -227, 226, 927, -13, -525, 108, 26, -388, -343]
1497c43n33J086N84r37K92Q78n00J04K65j188l0P73n25M4K8n41J134J25j138N75
1517A53O38j177L54M25m90M76L88l56j91k1m59M69j13j367R16M38j118J101O96
1536G62q25N68rj245O82N22j156M27N13r49M03Q52j174L66M48r66R12k20j237
1555a326J365R08j611R82N56j318Q57J16j499M20P57j200O65R22j018J008L90
1572I74j574J041Q27j562L96P60j169O77M45j403R61O70j364L21M52j305J057
1589B04M45r18L85R89o85N44O1j392Q73j41j554J340M08j289J065P07j418L74
1607bP29q72K6L75r00Q78K47j102M64P73j164K67O67q53l15R39o00l91L90K45
1627a99K65J26n24M11o3j022Q0%k65M21R17n07j2p9L73L40j322l39J416k14p63
$$ y = [-343, -876, 210, 794, -143, 149, 1027, 527, 631, 896, -292, -322, 451, -74, -30, -2, -543, 591, 716, -422, 153, 791, -386, -32, 393, -97, 379, 767, 411, 220, 199, -260, 209, 96, -1271, -355, 83, -1035, 66, 762, -63, 505, 496, -749, -67, 455, -701, -274, 239, -710, -307, 545, -629, -263, 185, -781, 131, -89, -1326, 39, 947, -664, 318, 874, -444, 413, 529, -970, -550, 207, -993, -328, 594, -424, 584, 974, -600, 441, 1268, -294, 102, 862, -307, 370, 815, -588, 373, 1043, -321, 0, 452, -853, 204, 649, -269, 116, 1105, 420, 964, 1025, -367, 506, 365, -1189, 151, 559, -730, 335, 1042, -376, -2, 727, -145, -119, 256, -644, 234, 481, -621, -157, 616, -548, -281, 386, -467, -782, 157, -443, -834, -444, -199, 66, 192, -332, 79, 16, -1006, -926, -926, -1191, -770, 147, -360, -372, -451, -78, 262, -1060, -1399, 17, -197, -960]
1648i60J601o66j234J435j07p93K33J69k72O44l68n43J262m58l79J162q5j204
1666e63N31K41n88l9J52P4O89J02K8J01q62M34K35p10M31N6m79J351o4j888J527
1687G59M69k068J198Q25k174J046J715k672L96J981j595M95J498k612J44K579
1703A984k463j096K793j319j38J978j781j538K728r22j453J514o52q7J881j025
1719D04j507J365Q8o68L81p20nJ368r37l05K59m73J206Q20k163L00J610j675M37
1738b15L78k086J055K686k559L78J782k203L69K262l205j87L440k069o27K715
1754A914k534p72L113j868j451K953j729j291L580j931j696K962n36j750K566
1769A530r00j549J507o56q43J699j026m31K345j176j433J771o97j056J858j182
$$ y = [-960, 641, -25, -1259, 176, 69, -724, -491, -322, -594, 50, -318, -861, 401, -57, -436, 726, 641, -563, -32, 209, -379, -418, -266, -192, 497, 599, 627, 728, -134, 300, 535, -175, 256, 312, -167, 1184, 1120, -768, 759, 1228, -840, 358, 1183, -991, 55, 1770, -902, -506, 1475, -120, 375, 1873, -739, -595, 1984, -479, -1575, 1218, -101, -239, 1739, -42, -1580, 1148, 226, -1227, 287, -365, -452, 1429, 404, -1103, 262, 350, -318, 63, -657, -662, 706, -231, -536, -277, -750, 456, 1276, -887, -587, 1023, -652, -215, 163, -1923, -868, 1818, -741, -363, 1419, -784, -415, 1847, -1358, -1545, 1895, -174, -801, 1914, -620, -1392, 1721, -147, -1598, 1355, -374, -1665, 1915, -16, -1712, 1250, 714, -1036, 1530, 630, -919, 588, -68, -911, 788, -238, -669, 1676, 500, -933, 838, 141, -915, 943, -239]
1785b39l58J507p50j89Q61j997P18K512k861q58K507j029q65K383k122j124L170
1802A266q45j439J785j404r49L288k140k452M255l70k582K518q78k316L072m50
1818C59k606J866Q63j081J677r67k023J986O66j976R69O7p88J594k92j243P97
1835a32O39l40L52q00k47J455n81q17R46o38j70J928j401j051J832o69j102J989
1853A193j104r36K464q50j466J885j94j826K028k17j959J815J63j836J649L82
1869A191j807J069O67j396N65N83j353Q69N13j259N92K56m69M88M02j515L83K93
1887G2j12p9k7j29N81j63l01K38o91L1J065o78r28J030J04l67M45o47K49O62n55
1908b00p25P29j06m12J357p40j115J314N03j394M18r7J3L60%n98N32M20n90L88
$$ y = [-239, -597, 910, 160, -29, 832, -1165, -447, 2065, -796, -1654, 853, -176, -1041, 1342, -780, -1904, 1266, 421, -1018, 767, -637, -1586, 1702, -438, -2890, 1365, 995, -1587, 931, 53, -2263, 809, 359, -2247, -381, 482, -599, 1078, 111, -1912, 74, 740, -1236, -267, -200, -988, 606, 314, -929, -132, 507, 167, 519, -281, -528, 927, 346, -471, 475, -163, -333, 1595, 194, -857, 975, 306, -796, 1193, 89, -847, 1617, 767, -699, 1186, 992, -834, 1194, 977, -982, 833, 996, -840, 809, 1191, -616, 453, 1120, -276, 289, 872, -481, 388, 901, -358, 234, 490, 21, 509, 911, -604, -221, 72, -40, -119, -146, -275, 306, 143, -158, 80, -611, -580, 485, -193, -1121, -91, 13, -354, 91, -556, -307, 355, -200, -925, -196, -302, -714, 643, -97, -1212, 102, 605, -789, -371, -468, -455, -95, -95, -693, -161, 259, -331, 57]
1928E7J78p86K1P54l90q22Q54L61l73q4M70j01J2K63o06J91k2m5K85j63k72M24
1950B06N09p11m46P14J46n32J3M96p5m09L32k68l7Q9Q4N2j79j98P08m42N7k4L05
1973C90j30l56j31L29pl95j22Q62o24q6P94o36m84Q30J21p80L42o7j2O51n34j
1995d6J94j89n14Q42m51o09J420o50l01J59O01l63J01l93k22Q18l24n02K35J07
2015h7k81O33Po08N97J85n86L61k16j0Q03p55l94L89M16n90L87k43l72J017k43
2036D10o92L91N2k02O99n05l70Q47K24j075M88p4j76N33k26m02M38R5p43N00k17
2057ej06N99n7n02N4K09p6K28q17K08N27m51k48M31j67k49M43l52n8K25M17l67
2079a14M3l75N6J50j37m34O49K21o91M45l16JK44l2J61l1k50L23O96j352J15Q09
$$ y = [57, 235, -551, -530, 224, -166, -988, -134, 227, -146, -230, 240, 139, 151, 414, -192, -1, -23, -68, 217, 54, -218, 206, 715, 4, -442, 272, 418, -114, -101, 395, 320, -89, 243, -25, -62, 27, 111, 163, -16, -214, 494, 52, 109, 85, 390, 260, -96, -227, 102, 95, -300, -422, 440, -184, -270, 524, -112, -596, 234, 355, -425, -83, -150, -162, 489, -45, -46, 148, -41, -555, 287, -164, -773, 647, -3, -304, -145, 456, 93, 194, -199, -421, 397, 73, -429, -194, -87, -368, 265, 272, -336, 261, 446, -140, 221, 5, -5, 798, 43, -351, 38, 454, -136, 251, 8, -364, 653, 410, -282, 109, 161, -41, 658, 153, -217, 630, 854, -221, 267, 193, 17, 550, 324, -78, 360, 455, -288, 212, -5, -111, 488, 431, -71, -17, 192, 116, 344, -473, -265, 262, -189, -437, -6, -173, -422, 21, -331, -389, -164, 253, -114, -71, -446, -390, -240, -377, -811, -162, 59, -632, -187, -503, -502, -258, -290, -129, -160, -410, -87, 609, -743, -628, 181]
2101A81j07p84N74j78o0L59n70j0Q01l12P1O00q05k00J114o49n37R27l32l6o6
2122a9K04l48L79k61m6M42o5R5N51q18QN18l49l16m2j07N82J55n62NL27n39M30
2145B24O55r01j55J064l43o22K50N9j67L64r48M57O76q27l23J017o18p9Q59o97
2165e5o8R15j048RL19n40j7P28l01r7M05n79J66M12p84L96O10o55N03O9j024M47
2187a89O42r37J68N99q01K31L74o27L11Q18j254P11O03j338O22R20j385J1J158
2206F37q45K21N73r93K60L48o71J58J280j212q1J168l21m96K90q3l39M87l44j13
2226g6r2j8M08J03r30K19J021n14L18j35m48L44J13o79L05J96r95J250N61j992
2246a041P05J176j488J61Q23o19K31J058j501L40M08q92P97K65j141j23J361r40
$$ y = [181, 74, -710, -136, -314, -374, -15, -585, -595, 206, -106, -35, 565, -240, -440, 674, 25, -512, 415, 83, 47, -19, 185, -163, 216, -45, -91, 351, 286, 381, 932, 114, 122, 640, 291, -25, -67, -174, 408, 563, 1, 6, 333, -206, 224, 879, -22, -177, 887, 544, -78, 172, 231, 64, 428, -520, -63, 613, -214, -537, 480, -138, -217, 642, -55, -123, 792, -256, -247, 72, -468, -485, 243, -58, -155, 250, -329, -163, 249, -535, -139, 471, -184, 319, 388, -636, -189, 453, -484, -316, 283, -518, -287, 87, -540, -229, 589, -665, 46, 649, -689, -67, 853, -532, -521, 637, -208, 13, 586, -407, -147, 201, -470, -312, 968, -244, -325, 843, 522, 26, 316, 233, -106, 381, 37, -76, -168, -186, 222, 325, -605, -386, 635, 121, 439, 304, -144, 200, 313, -366, -61, 135, -860, 390, 951, -1041, -336, 840, -648, -487, 336, -283, -52, 1006, -495, -155, 253, -639, 158, 423, -718, -841, 520, -420]
2264d20k63Q48m09o2P59l62m79N25l42KJ61p76O88M28o07k3K26k45M75k18k98
2285c92M01j1j53N89j10j102J098L11j158M81N14r71N75N52j316J060K78q67M03
2304A82Q06j582P45R43j270K13R35j057J70R49r09o28Q11m05o2J012j098q5J252
2323I22n18k52J81m42N45j48k37Qj69J56L00j78o13M82L93p18J043j072l64J173
2343D92N8j413J125j20p86R78J89j671O54J075j163n9J002r65Q71K90j285J12
2361f16J217p31k55Q28j348J38J328q15o74Q82j39l9M27l19k86L81p1j36l5Q0
2381a83N9M96l91M6k30O1L70k34o13P07M46o83L90L60j141P13L28p04K80J43m49
2402b29K15M98r79N19P02j256K31R32j062K29Q19l00n62N66k06m07Q37n64j66
$$ y = [-420, -683, 165, -244, -306, 453, 91, -388, 137, -205, -203, -42, -818, -130, 298, -309, -332, -106, -351, 124, -94, -392, 9, -2, -155, 434, 324, -778, 320, 631, -527, -46, 468, -503, 72, 624, -692, 368, 646, -221, 182, 988, -594, 151, 1094, -176, 37, 972, -85, 85, 1034, 125, -503, 308, -97, -159, 853, -245, -330, 922, 404, 152, 333, -109, 436, 288, 51, 59, -110, 46, 346, 168, -445, 37, 430, -288, 755, -317, -681, 492, 550, -863, 262, 142, -644, 334, 523, -1148, -494, 581, -582, -641, 361, -604, 267, 557, -728, -616, 601, -130, -385, 443, -905, -767, 561, -254, -928, -46, -185, -224, 203, -116, -402, -21, -92, -228, -263, -183, -124, 372, -19, 27, -203, -142, 228, -6, -619, 88, 534, -149, 241, 601, -540, 173, 501, -203, 77, 220, -229, -14, 484, -495, 24, 726, -530, -299, 633, -429, -200, 619, 319, -243, 323, 117, -290, 547, -17, -183]
2421a83j68N26o7K24m74k62O46N47j077L7N00k24r3q1K35o54L76N28q08j95N87
2442h0n7j50Q4k10R7R70o09j60M16m25J70J13m60k68N45N48p25P5k94K92L51k27
2464dj21M39j96J38j10m21J0M33l8K6L5o70J085q8j070M43M78m40L24L66p57j3
2486a51O64p75K09N90r52K07O07q03K50P53p94K70P97o24k49O67q19J10O78q16
2506a81k52P45l41j97N96l86l69N33l05k44N34k59P3M05n76r6O24p26j25K74k46
2527e19%N64l35j41M02m28M78J43o36J39O97n95m80R59o38J45L93l94k27N94n39
2548d18J15M45o73M3J084r70k56R64l49m28O47l60m08O68n22J32M63l17j7N91
2568D34m46o50J047p2n63M63l85J01L43j54m8M07o69j31P35q06K69P40n49j26
$$ y = [-183, -351, 175, 108, 332, -142, -404, 242, 789, -288, -251, 249, 25, -68, -149, 86, -568, -192, 336, -472, -667, -80, -137, -287, -203, -413, -316, 654, 45, -115, 301, -124, 46, 159, -301, -569, -24, 524, -201, -126, -420, -128, 223, -4, -125, 314, 118, 256, 146, -275, -265, 168, 130, 156, 191, -479, 606, 518, -552, -109, 369, -71, 253, 619, -138, -151, 513, -262, -53, 537, -415, -208, 399, -404, -154, 599, -195, 75, 872, 248, -1, 666, -153, -43, 635, -181, -433, 312, -29, -226, 370, -16, -385, 148, -157, -401, 133, -126, -53, 352, -224, -320, 304, -422, -547, -273, -519, -519, 45, -290, -431, -29, -457, 21, 164, -472, -333, 364, -231, -711, 248, -390, -245, 148, -246, -473, 121, -418, -303, 142, -531, -488, 596, -374, -630, 334, -15, -443, 204, -156, -564, 104, -418, -286, 177, -140, -157, 434, -12, -662, 385, 313, -250, 213, -172, -71, 272, 118, 70, 477, -192, -323, 412, -394, -125, 615, 66, -60]
2588f0N17m9j80L03o14K82K42n89l29R98o51L2J34J2m66Q45m57k05P14p50L83
2609A12M79p04J11L90m53j33M35m36m33Q32m62m8L49o8p8L70l64J59K94o40j27
2630d15O69l50j46L53k94J38J50j27r3K02k03l08R43q37L9J38j08K84j00R9j34
2651a00J6j8K11l22J30O2M05k22j61L10l96K12j79MR0r2o3k26N86n05M14J98m12
2674e8J53J16j97O6L22n03J55L6r5J46k6m42O6K15k28M70j35j39P0K04j73L11
2696C34m18j84J58L13n46J66J28m41L81J01m77N49J27l14K05J21n40N4N84k26
2716G5l76K55j19k88M02j93K4j90r5L94Q0l90O83l04j85L83q7j67J26j56r4M16
2738A94j57l11O24k15o55Q63k33m91N11K55n36O45pp36N76j07n67K82K66l58J89
$$ y = [-60, 457, 408, 228, 531, -83, 199, 441, -148, -477, 521, -130, -98, 36, 48, -418, 427, -30, -235, 479, -271, 112, 591, -113, -2, 388, -65, -198, 237, -199, -632, 200, -262, -310, 39, -29, -107, 263, -101, 58, 352, -288, -415, 254, -96, -242, 111, -183, -45, 105, -22, -115, 87, -116, -424, 519, -318, -279, -141, -249, 35, -65, 34, -100, -84, -102, 109, -213, -83, -21, 384, 162, 1, 311, -85, 127, -52, -48, 42, -50, -113, -339, 247, -258, 156, 354, -58, 95, 211, 14, 80, 402, -101, 54, 90, -5, 141, 115, -327, -261, -46, -274, 196, 61, -78, -8, 196, 23, 334, -84, -268, -110, 203, -343, -177, -49, -490, -109, -8, -485, 64, 191, -123, 82, 203, -337, -283, 301, 75, -301, -46, -165, -453, -51, -244, -220, -410, -505, -111, -31, -421, 262, -42, -227, 156, 69, -98, 28, -128, -222, 194, 37, -274, 350, 135, -520, 343, 110, -381, 130, 385, -151, 494, 487, -249, 327, 220, -347, -65, 201, -157, 32]
2759C2O72r37K25O00q41M11K50m33N7q0J7M1K5l45P79k15k41J0J00k11L01M0k23
2782C4J37l1l3L00l32o51R05J3p68M48J59q24Q45O1p61O08J70o91O39r3o08M30
2804d3L73p66M33J87p47N97J19n21q6O79l89M8K33m03R6L68k65k45N8K92k58j91
2826d31k52K44L66J80Kk54k52N41k80k50M41k33M1L44j81m52Q36m12k88O34l69
2847b5l74M25M64q31Q6L90k09O70k48q02N24J35l51M31R0p15K64M31k15l16M15
2868B39J82n39P6J59q2j66M13l70j30J08M42l53J64m30K48j83N33o83J29M12m00
2889b31J30O07m54m70Q62o60j51L09j28K04L15j32m82P38m18n87M13Q7k20N32
2909B64P6k96k56K87o6j33M9k25J26J14M2lk57K56K06P4R3k08l42M06J49o81M89
$$ y = [32, 704, -233, -8, 592, -249, 162, 412, -21, 36, -44, -27, 14, 39, -306, 473, 258, 17, 27, 127, -84, 217, 257, 34, 171, 140, 107, 407, 75, -576, 329, 342, -426, 22, 181, -643, 202, 263, -498, 110, 280, -411, 228, 135, -473, -43, 330, -436, -3, 184, -563, 34, 153, -368, -454, 225, -164, -116, 117, -286, -190, 178, -87, -332, -274, 18, -240, -431, -683, -439, -73, 107, 109, -145, -397, 144, -136, -386, 55, -178, -137, 207, 26, -426, 410, -2, -290, 344, -25, -399, 26, 490, -341, -255, 135, -74, 596, 348, -454, 70, 205, -146, 285, 375, -340, -76, 355, 140, -176, 239, 421, -118, -42, 117, 35, -131, 282, -88, -218, -110, 332, -21, 143, -287, -39, -222, 311, -372, -243, 169, -231, -101, 506, 52, -418, 444, -216, -367, -58, -186, 18, 333, 201, -281, 457, 39, -548, -135, -48, -268, 264, 340, 44, -212, 75, 9, -124, -75, -300, -174, -60, -18, -21, -278, -22, 184, 258, 351, 143, -199, 207, 356, -325, 164]
2932A64J56m09J60L02n24J34N05l57n8J12m29N73L42q43NQ60o47J70J56n56N3
2953a31M97j78n12K54K2M13k04p4l08J72J28l74K50r9J72j81J65J47k27l31N45
2974A46k05n55M75K23l86K26Ol26M77M0n05L54J86n63J08P73j020K51N91o03m
2995c11N19o78L94L29o20q5M12j15M0M67o42j20P43m71o9J51k72m3M93l0J0j74
3017g2o2K52K32k96k84L63j54J53p1k47K92J15k60L14j70j93J20M64p98N35J80
3038D13p17L18N52r43O65R0o80L02K21n38M50K46n55j79Q73p91p5N11J9n41Q64
3059E05p72oN41k91k8N16m81k35P17m45m11O01j11OK51k50j49J49m34J98K62l88
3081b55O7J26k31N4M52l46j40L73l31L02o4j33L36q6l81J28L95l35q9L28k75l13
$$ y = [164, 320, -89, 71, 373, -151, -17, 488, 131, 73, 185, -244, 329, 671, -172, -167, 693, 46, 216, 372, -184, -131, 366, 188, -324, -70, -48, 365, 161, 87, -221, -49, 79, -295, -45, -144, 28, -153, 12, 159, -68, -399, 146, -59, -614, -139, 84, -302, -76, -70, -396, 81, 121, -384, -30, 156, -407, -299, 474, -546, -295, 296, -307, -311, 208, -470, -76, 253, -367, -452, -40, -155, -115, 352, -290, -410, 333, -138, -207, -56, -328, -371, 122, 92, 102, -72, -134, 118, 350, 54, -230, 133, -21, 132, 61, -186, 106, 221, -39, 275, 105, -88, 32, 496, -302, 233, 413, -304, 14, 566, -377, 288, 378, -302, 0, 221, -317, 133, 379, -176, -355, 518, -273, -348, 163, 182, -359, 505, -267, -273, 268, -23, -51, 465, -16, -251, 466, 21, -390, 211, 100, 106, 357, 107, -42, 107, -327, -129, 133, -255, -188, -62, -293, -239, 213, -133, -273, 100, -231, 71, 7, -126, 210, 124, -257, -129, 266, -69, -158, 170, -105, -418]
3103d18R10o01l57P31m38O3O05o76oL10o2j47M22n23O7M39k61p0J38k73J20L34
3125C07n00J48K30j14k99K08K1L17j89m71K28L23l98K73R7l57K36J2r5j42L79
3146B14j28k20L17l23m06M83j94J56J78j18j34L26m00K21j85K74l34L60q9L15
3166C13o6k87l08J64J42j35M3q6K26j39K45l56J80R1n4k6o3n2K21l0j72j24J61
3189a12K25j32j7L08l09j02K23p1k38J75K69j16k50M67O3m46m5O7M2K34k02J96
3211B29k02k2K49o7j57%K17k9j72J56N1l68k5K64L15n03J43J33l98K72k69J09
3233g4L21r9j03K43J04m47j32K51j86j14N50j41m84M89j51j51mK53j41j10o3k3
3255b12M26k27J63k09Q0o2M7j31j71R8l2J62J83l95K26j63n5L90k49k9QJ06k06
$$ y = [-418, 492, -109, -466, 265, -173, -110, 495, -181, -187, 123, 61, -86, 336, -187, -120, 319, 58, -12, 126, -147, -27, 307, -193, -45, 185, 71, -228, -20, 1, 318, 129, -342, -114, 209, -189, 84, 181, -176, 60, 72, -23, -165, 214, 86, -134, 183, -140, -546, -63, -257, -101, 77, -41, -175, 151, -249, -28, -213, 61, -273, 87, -2, 313, 247, -40, -348, -184, -42, -177, -134, -220, 6, -133, 112, -244, -64, 27, -27, -53, -116, -168, 53, 23, -149, -273, -112, 113, -19, -36, 272, -37, -139, 84, 13, -225, -50, 219, 103, -147, 320, 383, -63, -108, -41, 1, 235, 33, 229, 27, 5, 254, 187, 30, 30, 247, 218, 46, 202, 253, -115, -140, 124, 439, -64, 79, 212, -186, 86, -183, -74, 247, 148, 45, 288, 392, -55, -187, 64, -122, -236, 314, 173, -311, 178, 27, -124, -128, 125, -16, -126, -189, -212, 214, -13, 150, -59, 21, -41, 6, -125, -296, -198, -230, -68, 115, -280, -54, -217, -272, 118, -131, -160, -152, -46, -252]
3278b52pO24n05J4L07l50p8K92n8l67O83m96j3M04m60K57J31l27M4K68p7Q0j07
3301Gj66oL71q4jj51K1q7J32m4l74M83j1n9j19J4J13JJ13qK59n13M25j48p2k71
3327a75M54n44J66L98k59l01J65K1k18L17j38K5L40l39K25L7n40K95K81m30J24
3348i6N9K2L5k03J1q0K57m1lJ70J5l77K60J57m51Q1K43k4j13Mk1m1N0J71n5j69
3374a39M06Oj27J07m1k61J41k01jJ91M03m15J35j05l00K99L40m64J21R8j22j25
3396e4L93p27L35M42l35J08R7j24J13j11M5k40j7K45k55L82l67P2R9k34R8J6J70
3419A51j76j18J27K31o00L63L77m72k07M28j84k38M69m33k13P55k1q28M84j36
3439b41m14Q15n4l20J30K92n11K84j21k57J23M30p38M56l8j72M50J88p77K09N16
$$ y = [-252, -259, 365, -140, -126, 181, -169, -247, 45, -13, -380, 303, -193, -206, 198, -262, -5, 126, -201, -157, 111, 34, 114, 7, -159, -165, 206, 122, 121, -30, -9, -96, 36, -8, -382, 101, 90, 31, -88, -74, 39, 40, 153, 145, 404, -109, 316, 168, 96, -175, 279, -265, -99, 299, 40, -261, -96, -75, -293, 24, -114, -89, 251, -88, 137, 174, -366, -71, 210, -220, -96, -37, -15, 20, -183, -172, -252, 5, -36, -39, 131, 146, -231, 29, 186, -265, -184, 59, 35, -78, -74, -95, -136, -86, 85, 30, -139, 267, 273, 146, 253, 212, -49, 92, -109, -110, 81, 484, 69, 204, 99, -201, 98, 438, -26, 95, 193, 71, -54, 339, -388, -53, 389, 54, 162, 259, 135, 248, 137, 182, -58, -75, 170, -85, 297, -70, 2, 101, -133, -35, -19, 151, -25, -143, -16, 215, -385, -22, 355, -117, -324, 104, -80, -318, 151, -282, -495, 260, 239, -589, -105, -241, -655, 160, 106, -214, -84, 208, -303, -19, -140, -397, -274, 156, -582, -126, -164, -336, 114, 302, -475, -266, 250]
3460B50j03k61KJ55J15j02O8l18J8K07J59q8o30M70J12J55j47J26l22M36k67k00
3482a65L96j17j31N58l20n96P54J85o58N52l11l35O47j40n40N30j40l26K72J05
3502B20o25K03P90n84j76M99k97k01L12J41m49M26M5Q7j69k85K58O7p6j9j21j38
3524i2J9p3M7K88l20O9M87k53l02K62j86m23L50J68p84J018j38o37L37J02m85
3545e46Q53k17p91N92O23m12Rj5k32O2L57n85O3K86l62L00J35l85J52M75J02o57
3567a93L3K41j12j51M45j09k47J5K41k16k53L00M04m48K74k90J61q8K90m68M39
3588B68j96l60P03m70j91N24L4p89L00J93P4l33K09j64J48L73l65p0P2j80l0L82
3610A32l92L5J80k19LJ54j6L4N9j29J6L48n48J61J45J08M8m03n4K68K45n01M79
$$ y = [250, 147, -114, -112, 43, 158, 56, 124, -194, -176, 31, 190, 102, -528, -58, 54, 209, 62, 188, -134, 302, 35, -165, 231, 114, -17, 541, 221, -375, 379, 564, -94, 458, 147, -188, 459, 319, -221, 309, 169, -157, 115, 220, -405, -202, 588, 4, -172, 327, 30, -171, 141, 282, -167, 259, 304, 391, 222, -63, 195, 262, 186, 167, 46, -92, -73, -146, -99, 189, -131, -62, 425, 172, -130, 132, -54, -477, -127, 41, -743, 275, 137, -500, -163, -61, -546, 307, 90, -701, -109, 514, 102, 111, 96, -136, -74, 283, -302, -239, 47, -315, -15, 120, -265, -113, 362, 464, -193, -160, 81, -31, -182, 263, 154, -93, -78, 163, -53, -306, -6, 398, -50, 224, -66, 95, 7, 297, -171, 268, 72, -288, 415, -55, -246, 278, 312, -477, -177, 16, 90, -243, -34, -198, -50, 323, -42, -112, -40, -220, -250, 132, -260, -225, -45, -264, -261, -107, -123, -89, -30, -159, -143, 205, -343, -182, -37, 71, 119, -284, -338, -70, 175, -326, 153]
3633A53l55K5J11K00m59L06K97k92K06l95n6K26o2K29oj49q1L49l2l37J86M8R0
3656B02o4K1l0r3k4j57K13o8R4o8J40Km3K86J2l18o1Q6Q3j61%J40J03j80L1j82
3682c6PK20l8j82j49J17J93k9J6qP1j61p9K17k81j21K49N2J0j08p2J55J02k77
3706a32j8K97m37L36N5n22pK73J30M2l46J71O0p7k76K47K04O2N3k15J60k08J07
3729d1R1k39K91l81K85N9j79j59L02R3j35q3J35k6J29M4l04L71l41j89K93j68
3751a52K6k7J08O7J2L5l4K81k30k44K91m23L41J07k66K33j25o6N1N1R6q0J33j91
3775fJ22j9j33j12L36k39j9J62k50J01L83m02J53j90k0J07k95J26M07j26j1K06
3797B81j87l38J12lj99K63p8J44l9q8PK23K8k60L09J05m00L3K47l09K10k26J60
$$ y = [153, -202, -177, -66, 134, -325, -19, 278, -14, 192, -203, -259, -33, -95, 134, 128, -21, -102, 247, 215, -122, 64, 112, 202, 138, 159, 129, 36, 12, -145, 68, 0, 94, 26, 166, 168, 125, 411, 423, 105, 44, 130, 213, 52, 52, 192, 295, 115, 146, -36, -29, 191, 153, -29, -178, -61, 132, 103, 119, 111, 182, 21, -58, 159, -122, -243, 6, 58, 68, -40, -112, 43, 145, -132, -150, 147, -290, 46, 101, -421, -428, -155, -25, 17, -329, -158, -98, -175, -451, -204, 0, 62, 115, -100, 60, -148, -41, 50, -189, 102, -279, 6, 65, -114, -273, 29, 122, -13, -96, 39, 13, 142, 186, -118, 253, -88, -277, 16, -152, -126, -153, -45, 22, 34, 69, 35, 316, 86, -158, 133, -290, 51, 158, -108, 125, 0, -66, -15, 36, 132, 52, 185, -6, 116, 97, -36, -148, 188, -51, -70, 92, -158, -57, 326, -76, 77, -113, -133, -26, -321, -195, 212, 86, 75, 281, 94, -244, -132, -135, -334, -71, -149, -5, -44, -132, -125, 98, 126, -134, 175, 280, -120, -87, 160, -149, 61, -165, -5]
3820eK19j81m81N24j37P9O5j7k64J86M1m5P9l07K58J45J43m91L75Kk82R0K0p9
3844f3J44O1k7N3j1r5J70j90k19K21k02j04J59L83j47L6j74j19J32J58n9j45J37
3867I9K21k04k4j80K0J51j27l95N74k83J54j29l15O26l49j92L76k53o6K01m2l2
3889a69r1L0m7rK34k25L11k6m24K50L37l56K54Q3m28J62m9M71l92O4k67K89k0
3912a8j00O4j86J15J8K76k57J51j63Q6O2l31L78k1j14o2J13L1j71M61k92q1L44
3935C03m5m79M34m83J79L79k42j88N32k00m23L13k6n6J68j62j19L47r9l37M97
3956B93j05k84L02j86o6o2J89jQ0k76K46J04k94Q4J99m25K54j38k3p2J64L7j03
3979h3M02n48J8M21o94J94N23k80k57O61j12l66L68k7o13M12m3l44L38j58l91
$$ y = [-5, 214, 33, -448, 76, -61, 18, 83, 66, -198, -12, 29, -16, 63, -244, 14, 159, 302, -189, 186, 188, -94, -4, 16, -63, 81, 142, 115, 168, 157, 62, 232, 42, -177, 44, -158, -262, -103, 280, 133, 169, -5, -124, 8, 166, 107, -38, 99, 320, 116, 92, -88, -68, 83, -44, -439, 135, -148, 6, -123, -438, 188, -161, -353, 23, -230, -296, -95, -137, -169, -260, -230, -277, -286, -52, -277, 34, 8, -416, -166, 171, -185, 69, 152, -276, -114, -163, 308, -84, -20, -287, 2, -18, -118, -54, -240, -125, -107, 169, -88, 63, -100, -14, 48, -283, 95, 74, -40, -102, 11, 42, -129, 332, 40, -41, 303, 258, -221, 213, -270, -91, 288, 46, -142, 390, 190, -233, 80, 54, -2, 166, 4, -115, 232, 133, -204, 293, 188, -96, 206, 20, -46, -108, 81, 80, 160, -116, 130, 234, -60, 24, 223, -202, 52, -86, -109, -181, -17, 20, -83, 319, -229, -211, 210, -484, -290, 233, -47, -304, 357, 245, -121, 247, 220, -393, 19, -24, -368, -30, -188, -579]
4000e79M63Q7j08J19k7N9m4J20l09M6j6K31J06n87M42J63m8j99k1O2J28j6M4m
4024A12L03n06R2P0k35R6J88l22J88J27l62J39N75n42j70L72k30j31K25l4m91
4045e36Q10q1o95P40l36K1k1J53k86K64J10j91j94L44j51r9K36k04j48j09J81
4066a92K52k58K48K17m78J31K67l73rJ79p1j15J38p9k5K29n1o2r4J19j91K95j85
4089a08j33M66j42l19L04J03j1R2k27j05J28J61l77L00n4p9J13K67l93k97P07
4110C96m02j40L86r7J6j07M9pj92k8K00N2K23j96k87M29j6n76M25j78K55l57L88
4133B36l80J22M72m94j40K88p1k54K91m8j01P4Lk22J73oq2M88o5o36Q6J59J42
4156C5k06K72k08J41q8j39M09l48k11M68j28m5j97P6K69l05J42K00k50j55J08
$$ y = [-579, -116, -29, -137, -18, -45, 14, -30, 90, -219, -173, -189, 42, 148, -439, 3, 166, 118, -81, -102, -40, 88, 72, 116, 112, 415, -91, 1, 71, -164, -68, 120, -202, -14, 113, -249, -110, 465, -77, -247, 125, -105, -236, -11, -45, -536, 274, 193, -502, 238, -98, -77, -98, 55, -231, 33, 143, -48, -242, 102, -49, -148, 88, -116, -264, -373, -192, 60, -198, 50, 267, -211, -80, 187, -186, -195, -16, -87, -202, -64, -143, -168, 61, 10, -52, -146, -27, -218, 77, -108, -241, 225, 83, -236, 68, 171, 160, 252, 25, -80, 48, 209, -168, 132, 78, -1, 112, 379, -14, -311, 396, -6, -146, 240, 143, 159, 52, 101, 94, -98, -126, 74, 126, 349, 153, -134, 295, 279, -297, 128, -50, 205, -152, 236, -144, -22, 450, -44, -184, 104, 33, -221, 70, 22, -79, -5, -2, -224, -51, -57, -139, 349, 284, -352, -266, -107, 35, -171, 101, -107, 34, -54, -193, 216, -132, -343, 125, -3, -48, -245, -169, 100, -205, -63, 137, -113, -268, -160]
4177a60j13Q6jK06j04p1J56j79K94j86j06K22J18l38K45M7j71K1Q9l8j64N6O3
4200b8N9P5J3l9J25j11N0MO3R3q8k3k84k00M65Q2l21K2K37l6J9p0q2k40K75L04
4226C64k78K34m36o2L47j40l94M13K60m94K07j22L7J36qo9m0J6k8O6J68l52nO6
4250a14j77K99l8j08K72K36k51q5j81jJ09L5J4j30N49o54L79j13k04k9J39nJ17
4273E9j66r6M03J05k83n5M8k32K17K88l59r0K14k81N16k51j35L87j11j15n5M18
4295D26m99K72j06M7l01L54j18K31j38l9L1J25k77j03P0j53J16J53j12M4m2j63
4317a82J41j01L6J40J57l70J89J36l90K24P0o5l51L05rK85l04K70k20j07j9j13
4339b78L70n80M08L16k60j42M9M03l87r5p0J6J89q8j44l9L83m08N2J36O2k42K08
$$ y = [-160, -273, -187, -188, 18, -86, -157, -1, -180, 114, -72, -178, 44, 162, -176, 69, 116, -55, -34, 55, 17, -147, -91, -28, 31, 106, 119, 80, 205, 94, 144, 148, 211, 304, 216, 193, -91, -291, 174, 256, -65, -43, 194, 158, 177, 107, 25, -215, 60, 364, 86, 320, -116, -178, 169, 29, -365, 48, 308, -186, 21, -101, -64, 72, 64, -5, -45, -29, -57, 9, 177, -175, -180, -114, -291, 8, -30, -138, 134, 370, 119, 34, -147, -148, -39, -4, 10, -120, 429, -225, 154, 41, -163, -192, -53, -58, 59, -107, -203, 200, 305, 22, -33, 15, -217, 0, 288, -71, -161, 53, -228, 288, 37, -98, 289, 178, 63, 8, 426, -73, 199, 93, 140, -161, 193, 75, 306, 168, 129, 160, 285, 8, -95, -25, -178, -62, 91, -21, 23, -19, -182, -41, -142, -106, 34, 191, -179, 10, 146, -244, -20, 50, -15, -366, -61, -70, 215, -89, 181, -39, -146, -165, -278, 92, -488, -80, 236, -24, -166, -117, 286, -101, -196, -266, -250, -61, -149, -293, -332, 51, -357, -305, -169, -107, -349, -141]
4362a41K3P8k53M10n1P7k58J33j87J38o9k09N8J51mJ40K90m73M81m01k8K31k44
4385a08K17j24L28k57J16n9j39J55k61N9J66j24R7o3j91K29j40R9K79j76j51J58
4407A10J04k61o0j14K76j36M60l95Pj1k2j15K94j14q0M42l48m6LK47k69J24n04
4430d08N56q9l55L14J22k15KK29k76J06M6j7j75j58M64m17K97j04j88L99m40J50
4452a57J67jk84J43K51k02K01k14R0kj6J79j23k42J68J25n2J17j69J12k07M4j11
4475a83J86K45j18p4K45m00j01P80n79J2J36Q4k85K8J33o0k6k04R7J67K2p9J88
4498B14o8j80o5J20J6k5k50K29k8K88o9po51O22qR7r3J18k33Kj77J34J38k36O0
4523e2k9R8j75J25K99o38J55K13j83K5J94N4k37R6k0l4J95j1j22P3k1j1n5K5J26
$$ y = [-141, -118, -40, -293, 117, 66, 143, -115, 18, -169, -31, -100, -309, -251, -100, -104, 36, 326, -147, 334, -67, -95, 136, -108, 109, -15, 313, 56, 172, 113, -26, 129, -132, -73, 93, -31, 66, 3, -188, 41, -99, 0, 279, 103, -48, 110, 214, -47, -107, -221, 55, -81, 379, -16, -9, -20, -42, -157, 137, 23, -57, 385, 37, -9, -6, 241, -28, 96, -408, 148, 59, -296, 18, 140, -75, -73, 156, -120, -14, 32, 15, -160, -318, 146, -271, 26, -78, -266, 133, -307, -157, 10, 9, -275, -132, 119, -83, 118, -96, -6, -8, -24, 155, 32, -210, -42, 83, 31, 148, -21, 91, -116, -72, -183, 3, 248, 130, 56, 301, -99, -200, 580, 1, 13, 149, 233, -52, -24, 109, 49, 23, -181, -84, 83, 105, 26, 214, 146, -34, -99, 21, 37, 12, -238, -9, -37, 251, 182, 175, -476, 146, 138, 235, 142, 260, 27, 29, -148, -14, 124, -112, -52, -81, 17, -158, -33, 266, -372, -217, -4, -187, -162, 32, 86, -151, -55, -75, -109, 86, 75, -47, 26, 5, -6, -61, -36, 90]
4548I0j23Q1q1J4L64l22K20k2j69l68L42J21l04K48K24k56NK31l35j45M83k69
4570B9k1K97j80l73K28J60n0K39m9m48L94k05Q8M45l90j77J1K54l7k09n8P1J79
4593A98k06p5K13m8j68p8J20R3j5k18K72l00j3L81o5l94J1J52L3J63q6k49K90
4616A1j6m8Q0l23j08M62o1o4k43M40j37m91O38n62L47J09j28j87Q0J17n5J85J50
4639A96m72J59j14J75o3k57K75j44Q3K44j90Q2L30j46j33q5L64k06K49l31k91
4660b75M34j56l6k49O64l74K90p4k74J97m3L5j44K46q0n87O77k72r6J26J3k00
4682a78K58k38P3J79q3j24J45J63n01K04K10k23P2n2ML47m50J94j93K15J47l00
4704a31L16p0j03k35N74l71J3J13K30l65L01k09q4J27j35M5k14M7K09M0k5j34
$$ y = [90, -33, 48, -33, -19, 345, 23, 243, 221, 52, -316, 26, 147, -157, 91, 315, 59, 64, 295, -40, -185, 298, 29, 8, 305, 125, -248, -20, 140, 90, 329, 280, -168, 226, 21, 109, 554, 164, -13, -2, 252, 215, 6, -52, 19, 198, -8, -83, 130, 82, -86, -164, -44, 49, 34, -184, 88, -212, -225, 156, 91, -303, -292, -140, -107, 56, -30, -279, 11, -5, -53, 27, -296, -404, 58, -3, -67, -310, 130, -7, -498, 140, -422, -75, 34, -94, -281, -201, -84, -139, 46, 196, -276, -117, -231, -56, -119, -376, -101, -245, -162, 82, -108, -26, 304, 158, 25, -60, 304, 98, 347, 16, -275, 159, 3, -33, -282, 382, 8, 298, 224, -50, 147, 104, 139, -5, 241, 161, -426, 251, -21, -117, 9, 22, -178, 80, -158, -85, 94, 11, -113, 32, 195, -306, -102, 108, -115, -43, -95, -91, 256, -194, 0, -193, 22, 169, -131, 185, 115, 12, -223, 351, -20, -7, 106, 336, -29, 272, 63, -21, 106, -29, 16, -198, -151, 58, 98, 73, -61]
4726f1J24M20n46k86O79q6k61J42l36L36l16K34k2r1K44k19L70l96l5R2K29m66
4748b51M81k90P8P7p4K89l21j69L19Qk3P1j23j41J96n5j47K25nl86L16O2m8N3
4772A42o7l7j25M74k64k78J31J62kj44J46j84l7k26K24L03k78l90M23J92k66J79
4794G8J40m88J79k56j22J99L32j22j9Q4j31L0J3Q2j2k52Q2N6P1J88j59j87M66
4817B52j35k98j25N20j49J12O1k85K07k53QK60J5q0j99L83j29k66Q0R2L0Q2J65
4840C48n08J50J07o9K60l45m6K60j47lk0J09k71K67j69J98j24o0p4J89J82j59
4862G5k4j7k35K01J55l27Q3J29N4j76P5k12K37O6j44l9JN0K41k20l1j19L27m55
4886c05M22k29K76k77O4J35j57OK95j52K6j6j60K58l8k25N6j20M31k12L9qk29
$$ y = [-61, 63, 483, -63, -349, 330, 244, -17, 125, -211, 125, -191, 43, 21, -70, 174, -45, 325, -71, -106, -14, 215, -251, 230, -60, 18, 95, 21, 310, -11, -180, 139, 147, 124, 195, 72, -69, 127, 72, -75, 150, 145, -241, 75, 137, 89, 142, 75, 38, -87, 387, 123, -155, -24, 138, 136, -8, 138, -46, -83, -309, -85, 218, -60, -450, -27, 165, -101, 78, 218, -270, -91, -347, -469, -270, 62, -60, -79, 5, -126, -96, -83, -1, -13, -265, -183, -127, -56, 132, -27, -214, 252, 117, -181, -306, 214, 65, 177, 238, -47, 160, -93, -85, 175, 190, 110, -89, 294, 165, -101, -21, 71, 101, 183, 348, -160, -10, 97, 28, 288, -57, -103, 157, 10, 7, -13, 96, -175, 92, -77, 121, -3, -63, -137, 52, 234, 75, 51, 34, -201, 0, 155, -172, -89, 40, 94, -82, -7, -219, 18, 84, -60, -99, -98, -48, 193, -27, -58, -177, 150, -305, 117, -112, 164, -113, -49, 86, -71, -65, 230, 78, 104, 88, -72, 186, 148, -77, -21, -141, 290, 78, 117, 109, -120]
4909a20K32j08J42q4J1q9J66k6j67L79k41j78K56j09l0k25K80k3K0K0o8r6j64
4932b22K39PJ23rm66M83J59n49oK74j31J8k65L82r5N7K76r4j04l2N2rl57L87J12
4957B30l13j01J5J21R0j67L02k53k24J48m7K95Oj33j01%J67j3L4J27m30L12k46
4980a81R7L1O2j53L00k12j72K02m1j31M58n4k30J33j70l34L07J23Q4j70J13n42
5002d80O08NlJ46k18L9O0j66k4J04J82j56j83J44K15k40K11j02Q2m4o2q5K24j73
5026H4J21j58J01j69J1J17j6J08lK2j32K4L3j72j74J01L6P3R1j02j51K37j06o
5050c0nn1N2Rj74J18P4K39l47M1J50Lk56R6J67m03K06q0J29j16K73j18k9R7K5
5075G0l55J30J19K4m1j31k50L50m7L07k58j51J00LL74P7o22K73pj2k19K20j88
$$ y = [-120, 112, 4, 146, 62, 73, -16, 150, 124, -43, 336, 95, -83, 173, 64, 34, -191, 89, 66, 86, 106, 38, -58, -222, 17, 24, 147, 138, -328, 155, 314, -235, -241, 33, -98, -80, -345, 37, -58, -1, 275, 181, 77, 45, 97, 88, -269, 118, 230, -83, -184, -169, -48, 42, -125, 177, -76, -300, -152, -199, 96, 102, -31, -132, -132, 35, 22, 56, 183, -247, 65, -181, -84, -53, 9, -144, 156, -56, -228, -26, -67, -198, 260, 206, -24, 109, -61, -395, -88, 35, 119, -51, 62, -480, 128, 133, 130, 276, 58, 97, 157, -9, -33, 71, 253, 97, -86, 58, 273, 33, 244, 142, 224, 180, 118, 33, 257, 84, 205, 47, 148, -21, -10, 107, 91, 199, 196, 218, 86, 110, 143, -29, -203, -102, -66, 7, 98, -4, -155, 82, -24, -30, -35, -86, -34, -25, -199, -81, -7, 232, -115, -74, 76, 79, -177, -81, 86, -317, -111, -191, -62, -178, 95, -23, -52, 45, 70, -285, -155, -36, -12, -53, -184, -434, -84, -131, 176, -82, -233, -133, -130, 244, 321, -301, -28, -35, -47, -266, -46, -234]
5098b34L14q1n0m1J74j54k48J15L24m3K43m96K95k47M3J83l16J38J70J30k43J82
5120A58o59K99K95k98J96J64r1k89L37j88J5J75m66K63J39m16K02J27J05r5J0
5141a7J64j10n4j60R0k9L03k88J22n0p3J0j22O07n49R9N9j6lL19k46k20J02r2
5165a54K34j55M18m11Kq6K39L6Q8l15M3j92J18R5o2J13k32N47m50K78j36K62n28
5188b48L22P4kk62j05M03k89J75j31J63j4k63L00l4j45K61m1l89L88M2k74j41
5210b10L8K54P4j16j24rQ2L10j91j71M59k28l15L17m2k75K79J96l67j63L37k31
5232i6M0j45J41m3KO8J04n1o2l49J79O7J5R2L45j53m31L10j66o1L37j31k08mP1
5257a29J03O0l3n0j4j5J7o2K12k80R8K15K1j71Q6q9L79l67%j1J0K81m83L86j42
$$ y = [-234, 80, -1, -51, -92, 82, -72, -320, -205, 119, 76, 319, -177, 118, -129, -86, 97, -219, -81, 89, 219, -24, 158, -501, -202, 93, -205, -9, 155, 64, -225, 112, -76, -61, 114, -352, -89, 50, -366, -164, -37, 68, -27, -17, 147, 37, -17, -177, -87, -116, 187, -101, 21, -29, -102, -92, -214, 393, -156, -57, 2, -14, -17, 302, 56, -164, -62, -154, 80, -75, 343, -68, -66, -152, 87, 123, 211, -104, -61, -253, -135, -40, -102, 11, -221, 326, -124, 154, 18, 280, -248, 74, 148, 146, -116, -221, 182, -107, 68, -63, 100, 86, -177, 123, 89, -56, 205, 164, -225, 163, 205, -69, -210, -172, 82, 156, 40, -84, -93, -11, 299, 108, -63, 396, 168, -147, 170, 128, -147, 132, 328, -39, -202, 135, -96, -56, -201, -60, -103, -101, -33, 71, 20, -42, -391, -212, -145, -130, -38, 307, 154, -277, 33, -133, -194, 143, 12, -196, -200, -129, -26, 34, 1, -49, -63, -78, -61, -123, 89, -191, -93, 122, 143, -28, 58, -31, 348, -19, -19, -30, -20, 261, -222, 164, 22]
5282B2p1M6K10l95J66L1J40l2J5jk44J08N9j85K83j73O7J64j41K17j63p4K58k79
5306B8J52j53rj90J20J92l30L80k32L8MJ52k61J7J3N3R2J03l99K77j55J09J5j29
5330a13j69K35J48j31NJ02k1j00O5k66K11J88n11M78k29L24j37K74k68j98M5L09
5352B41k53J57j10j46P3l01K77J68j95M9K9j1k8j9K55j6n5l1M2k96J94K4L5j97
5376a14O3J66j70j59P8R7j47J17J07M7N8j35N0K39m17N1L22m25QJ67N6k66K88
5399H1J73m28J54N2j34k88O85l30j17K32j71mm9L6J20l0M77n84L08l41J26j21
5421a53j06L69K2k45j26N63n44L04p6j78K76k40J59j46J27J01k6j92J49Q9J36
5442B63k91j32K66q5kj53J23K19j11o4mj27j3J27K06N6k79R2K0L5j07J41N2k39
$$ y = [22, -49, -3, 207, -188, -22, 9, 149, 117, 132, 131, -113, -5, 54, -131, 152, -21, 46, 210, 69, 286, 123, 49, 307, 28, 180, 27, 18, -172, -52, 140, -190, 190, -42, -4, 0, 152, -109, -92, -79, -26, 66, 169, -230, 47, -108, 1, 16, -113, -282, -47, 101, -30, -25, 77, 56, -44, 21, -245, -34, 154, -357, 121, -108, 216, 79, 353, 85, -113, -68, 241, -12, 145, 35, -111, -38, -339, -62, 106, -89, -40, -11, -22, -50, -69, 186, 170, 115, 84, 126, -170, 24, 48, 83, -114, -51, 115, -55, -214, -136, -39, -186, -69, 38, 85, 143, 8, 58, 297, -120, -69, 253, -172, -164, 3, 59, -207, 81, 254, -174, -20, 32, -102, -390, 295, -35, -152, 80, -91, -95, -144, -108, 12, -18, 459, -125, 183, -158, -32, -153, -259, 110, 132, -113, -239, 324, -220, 84, 8, -170, 106, -134, 25, -121, 6, 107, 81, -111, 38, 127, 263, -28, -160, 106, 21, 19, -134, -11, 208, 97, 33, 29, -98, -111, 16, 222, 278, -1, 91, 111, 146, 39, 180, 232, -7]
5466gK22k06J27N5r7J25k11M7k39L79M9k65K58k59J06rL1K56k10N7k16K18j74
5489C7q6Q4J34k08n0J74j80LR2J15l60m0K45J45J31p7J35m94M84k70j19J69k93
5512b29Q6k06N57l12K05j01k5k00k8J83j37R6j50k0L20m08L88o6j49Q5k56K51
5534a16J14k07K09J68j41J47l3j84K66r9j24K4k18J36n4K60qj13o5o7J74j29j35
5557a95K97nn4k99L05L1l8n2O3k06O0L05j59k20J59J0k35L78j68k53M60j89lJ67
5581A59o7l7L3Mk45J64n5k70L63m6k10N44k62j83J6o5m3J83J01L5j66K01l62J55
5605e3L9j04P6j87L49J89l55J24q0n5N0j8L9J45j1K1k79J82m69K48N25k87j04
5628a5J24L8k26m0L30L4k84J07j11Q7M6k30K21q4J14J37J7j19j43q7R5k42J58
$$ y = [-7, 215, 9, 136, 191, 94, 219, 8, 55, -184, 195, 244, -21, 237, -22, 84, 75, 106, 362, 152, 209, -7, 211, 37, -49, 35, 169, -39, -89, 85, -95, -92, 0, 115, -245, -285, -40, 105, 236, 159, 294, -200, 284, 14, -105, 64, -229, -143, -349, 208, -104, 101, 0, -25, -225, -253, -70, -207, -111, -261, -281, 39, -369, 19, -47, -196, -111, -367, -116, -2, -209, 0, 168, 27, 174, 141, -43, 223, 124, 0, 24, -194, -58, -112, 148, 140, 27, -38, -105, 69, -60, -195, 102, 97, 43, -256, 49, 80, 42, -10, 53, -153, -93, 212, 53, -167, -8, 2, -233, 145, -23, -276, 184, -5, -8, 159, 92, 55, 88, 92, -153, 11, -44, -314, 49, 3, -207, 337, 75, -108, -92, -157, -200, -17, 84, 119, -47, 154, -208, -53, -14, -118, -42, -229, 120, 309, -46, 78, -2, -57, -7, -25, 14, 159, 148, 169, -110, 72, -397, -149, 376, 89, -15, 109, 147, -79, -119, 211, 245, -39, 68, -43, 44, 90, -140, 81, -3, 111, 248, 265, 146, 3, -84, 11, -231, -73]
5651g3p6o6L84k71L33n22k3K67J2K61l28r2R6K25k42L31l83J52J59j15k9Oj30
5674a24j31J80J34k60J43J37k49J47K66l58j66K73p8L06j95j1r4J36J2j63J06
5695A1p1N7kJ37m03J70L12q8j99k9MJ45M2J08k14j4RJ64j28j37K15Pm7J37L6k10
5721A2q4L8P2J42j84J11P7j00NO3m51J93n9L52j03R3k26J48J19m09J87K4J72k93
5745a01J85j55K24J18j90Q2k40K30N0Q1p8j30k17K13K89o33J41J90k13K79k79
5766a54J6N8L48k91j84J42j52L20j12p3J68P4k41O3q3M4Q6n2K93p0l64L70k57
5789e1n0j2m3J95J10l28RK30j00J41K6q3j42j5J02j8j48P1j12J39m9J29P5j39
5813f3K75k51j49j6P8l2L48q0j56J4j85L91K0o9l95K48j59J39lK4k68K82n2j19
$$ y = [-73, -149, -215, 169, -102, 231, -291, -314, -47, -35, 226, -102, -194, -98, 127, -115, 216, -167, -15, 144, 29, 0, 6, -124, -255, -75, 59, -201, -58, 79, -170, -23, 243, -115, -281, -8, -86, 220, 25, 14, -80, 56, 68, -95, 11, -60, -3, -5, 132, -271, -101, 211, 123, -76, -105, -101, 44, 86, 194, -20, -34, -25, 139, 11, -126, 89, 96, 49, 186, 222, 12, -72, -34, 38, 180, -4, 107, 184, 84, 89, 152, -299, -106, -165, 187, 84, 177, -49, 99, 218, -191, -4, 20, 192, -101, 84, -71, 153, 271, 81, 163, -77, 153, 203, 284, 206, 76, -141, 72, 361, -272, -131, 59, -154, 125, -154, -138, -80, 268, -23, -207, -65, -217, 103, -9, -82, 86, 160, -81, -18, -101, -57, 29, -23, 270, 200, -164, 206, -51, -101, -113, -156, 39, 149, -179, -170, 60, -40, 101, 127, 44, -98, -113, -11, -29, -177, -106, -218, -79, -128, 1, 76, -63, 212, -39, -188, -204, -126, -158, 190, 110, -46, -32, -217, 174, 194, 125, -270, -22, -181, -42, -45, -21, -289, -7, -59, -178]
5837a78K57K7l22K38J60m05Q5K38k8K7j61K24o4l5J01k81J36K8l9p1M3K71r9K0
5861A72l32K04M5o4L1k14J29J52j72n6m2j78L74k18q4K16k61K15K23q0j51K51
5883A60l6j83K0K04K3k16o2k31K16L92m9o9k0j7j51OJ10k75Q8Q7n9L31j84m3J03
5908A45L1l50K17j1n3J29O4k20j55L05j01m9N1K66k58l8K99o2j08j63M4J81q8
5931G6K6j08k10K65p6lO7k2j21m4k1L97p9m76L29J8o1j15L91j74K10l46K98l32
5955a11K11j26j11l38O63k29l3Q3rJ20l9j77Q4k06K27j5m54L79j2O7o0K94j80
5978B8J0k47O9K60j93Q9K13l70P7J75j66j91J85j18l1K13L6Rk08K22J04j20K00
6001B46l16K51k66OM26n04K0J66K9j11m8Q5P8N0k21M3n1J44J96j25J31p3J05k71
$$ y = [-178, 79, 106, -216, 22, 182, -223, -138, 100, 72, 99, -62, 162, 98, 63, 164, -117, 19, 47, 8, -63, -20, 251, 152, 172, -160, 44, 89, 25, 56, -158, -29, 123, -49, -105, -147, -325, 49, -169, -253, -37, -298, -83, 140, 60, -91, 160, 124, -59, -39, 165, 188, -28, -90, -321, -105, 287, 238, 169, 149, 132, -19, -13, 97, -178, -90, -3, -62, 269, 85, 42, 145, 176, -174, 43, 32, -21, 108, 172, -48, -203, 102, 1, -48, 3, 269, 11, -27, 272, 210, 102, -61, -17, 164, 76, 102, -6, -216, 49, -27, -30, 37, 15, -106, -150, -171, 226, 147, -329, 0, 18, -43, -158, 233, 59, 269, -77, 221, -111, 100, -26, -137, -475, 188, -41, -74, 9, 0, 120, 81, -96, -12, -218, 9, -6, -460, -81, -93, -26, -86, 208, 28, 38, -209, -140, 120, -73, 16, 229, -141, -64, 111, -55, -246, -61, -179, -210, 3, 39, 48, -160, 62, 166, 46, 246, -70, 181, -85, -79, 347, -157, -137, 29, 58, -53, -101, -16, 62, 112, -109, -66, -117, 27, 223, 98, 229, 156, 261, -10]
6025a0j0l4L8J75J77m66N2j57J81J36R0l00k1J42J45P5j50Q4O6J19n26L39k02
6048e7q7J04J14k39Q5j69K04M5n0k4L3J50k04j23J56p4K75j77K30k60j97J53J30
6071A8L0J72j37J25k60P3JmJ93l9r5k74M24J80k58J28k35J50k28j95L10K81l44
6094A6J9J72j96k2J7K22k04q2R1K0L8k16K04j4P2L8j61l7J78j78n7J59j21m1L9
6119d4J76mj91J90p0N4k41L51k75K76k40j72J76j39J14J96k61jL11n23j48M36
6141b9J8M2k53J0K23j60K32k77j9J64j47M54m96K12R9K24o89M30Q5k23K79k59
6163h0j04N27l82O9j34NJ63j1j21O9n2L06o8q5j53L28k05J48l02J89O0j52L19
6186C34l78J15k07M18j01j54L6j16k2JK68o7M0k9n7J7n5L3j39L63l02m4K68j64
$$ y = [-10, -20, -54, -16, 159, 336, -130, -78, -235, -54, 82, 172, -128, -149, -7, 138, 213, 63, 147, 213, 332, -194, 145, -57, -144, -40, 74, -165, -80, -249, -45, 0, -50, -74, -41, 109, -95, -218, -62, -136, 139, -38, 192, -68, -265, -112, 18, 48, 220, 83, 208, -52, 21, 22, 18, 211, 172, 77, -197, 227, 407, 149, 277, 42, 192, -36, -231, 79, 360, 16, 35, 207, 11, -11, 6, 228, 24, -58, 33, 53, 91, -125, 79, 65, 137, 175, 14, -23, 155, -23, -80, 79, -42, -83, -44, 132, 128, -63, 127, 57, 111, -130, 221, -54, 222, -18, -190, -14, -153, -39, 157, -104, -105, 206, -317, -465, -29, -11, 31, -222, -212, 11, -149, 83, -194, -213, -49, -196, 258, -238, -26, 73, 297, -392, 38, 123, -100, 179, -80, -184, 343, -39, 30, -104, -99, 64, 53, -68, 1, -51, 255, 187, 102, -51, 277, 72, 220, -82, 107, 167, 15, 334, -44, 71, -136, 282, 181, 27, 63, -53, -75, -74, 194, 127, 167, 138, 81, 98, 43, 76, -63, 300, -2, -46, 222, 58]
6210E8j03K16j7l5j16k17K56o4l8P8l2j10k8P4K44N9r1j82o5J99L0j66K3J60K27
6235C60m03J8M6pj23J26n5K18k22J34K9j15J26k56K67l80Q3J26K89m76K26l2k6
6258d7j76M73k62L0L28k22j22R2O5j22J86m10K43j78m8K65j80K12k92K80k93j58
6280c36N39k00o3L11j54m3M4k04o9L01L78m14O0j2j83Q8J21m10K61J03J30l02
6302e4j81J69K83j4l10K83m39K56l5J8K29p8N4m07K86L1Kq5k40K42j20j54K25
6325c9J72j01r7j42K60j33M9J71j17j46L7K36l59K39N6J01k55RmK17j29Rk1j24
6349a11K76l05L75j03O0j45Q6k73K59j69J49k29K59k12L8J44k4j35L22l41K52
6370A73P7r6O9J19n51K62j28J67lr6j11j52L66r2r3J37P1k77K05j90J41j37J79
$$ y = [58, -45, 171, 154, 119, 3, -214, 42, -22, -60, 18, -14, -124, -152, -78, 166, 225, 134, -48, -113, 86, 116, -50, -27, 133, 360, -43, -25, 21, 14, -109, 17, -38, 180, -42, 92, 121, 6, 132, -124, 143, -237, -154, -28, 261, -215, 11, -21, -47, -223, 250, -12, 18, 346, 124, 2, 94, 159, 37, 223, -187, 56, -122, -170, 95, -85, 127, -165, 115, -178, -336, 203, 3, -60, 251, 97, 54, 98, -106, -175, 126, 504, 90, 150, 138, -45, 43, 164, -246, 15, 118, 248, -54, -235, -66, 217, 203, -107, 176, -263, -7, -42, -24, 205, 127, 181, -226, 60, 91, 93, 8, -232, 10, -110, -264, -39, 133, 32, -65, -207, 53, -80, -31, 140, 23, -123, -86, 150, -209, 30, 86, 187, -68, -59, -63, 154, 25, 34, 13, -111, 165, -140, 235, 132, 192, 47, 133, -140, 119, -50, 99, -130, 129, -83, -45, 99, 75, -60, 262, -79, 173, 250, 154, 223, 342, -209, 53, -75, 92, 89, -7, -118, -270, 96, 4, -89, 48, 119, -158, 47, -143, -2, -139, 40]
6393D0L8Qj38p0M32n46M53k58N2j33qO8M4m6j34J67j90K01o6J08r1N2R6m2j85
6418a48L82k33J96o4k48n7N6K38J55l39O4M4k6RJ79j85j66J43k47J42o1J3K14
6441F1m05L70j45J55j72J39P2k87J78J5L5n6m2L2j62L64O0k75%J04m3L06l08j42
6465a46L43o0j09M0o8m5M3n7J82k62K77j96M5j8L0j08K4q1J78o0k19Q5P4R5j14
6490a27k00L85L2m4j04J24j10o5J87L6k63j48K90j38OJ61Q1j33j89M44q9nj57
6513b6k08N13j51l10L49l56n3K25N0K9q5J30pk6k46J39M4j33J31Kon0K67l68M47
6538C01k18j95K72o9Rn1J99p4j63r4J4J51N9Q4j44q4N1r6O2R2L3k27K50k1j71
6563c0l9J14m1M6O8J23o77K73K35Jj80j0K15j89K23N6k18j99J90o3K69j74K56
$$ y = [40, 78, 86, -52, -122, 310, -236, 217, -41, 11, -122, -130, -62, -18, -64, -198, -31, -221, -20, -86, 22, -69, -17, 79, 37, -148, 234, 1, 197, 133, -115, -172, -116, 122, 277, -62, 2, 46, 20, 29, 208, 23, -143, 0, -247, -105, -166, -153, 61, -344, 26, -119, 36, -136, 3, 75, -212, -34, -19, 16, -40, -82, -50, -212, 152, 212, -63, -63, 41, -2, 304, -4, -146, 197, 137, 28, 68, 0, -45, -2, -59, 123, -139, 138, -58, -13, -31, -1, -109, -85, -166, 12, -48, -267, -182, -108, -13, -127, -327, 58, 90, 46, -58, 66, -44, -109, 78, 114, -149, -297, -7, -145, -139, 22, 103, -30, -219, 225, 136, 131, -26, -234, 279, 128, -182, 167, -189, -242, -17, 33, 62, -23, 107, 100, 74, -172, -33, 11, -122, 9, 11, 5, -45, 222, -146, 301, 83, -112, 160, 91, 100, 49, 248, 174, 11, -83, -69, 82, 141, 225, 81, -3, 48, -48, 14, 106, 139, -88, 162, 141, -30, -69, 45, 4, 50, 118, 241, -436, -163, 72, 73, -107, -117, 98, -91, 132, 188, -30, -229, -39, -102, 167, -7, 249]
6586B49k45J2J37j51Lk74K09kj84N38k80j60j32K76N5j55j8J49r4n6J18q9O2o4
6610i6K90l99N7p6P7L16j50k8j73O4J78j65M38j39j30m2N2O5j1lr2j39J11l5r
6635c9J71J72k82J65k90mN26l45J36j27j49j12L38j52j07K07N3j48K35k65r6j14
6657b27L10j63Q1J75l03J79k8j83K25l84M81J98l04l0R4P9m35J19mj00K66Q2j30
6680bK3k22K81l1K3j76l5J56J97m27J93j98J09J42p0K46k62K6M7O3j97O8Kj39
6704a83P3R2J62j37J14j59O3K42l20J14n2mk3q3j11K11J95j60LK28j76L6k79J04
6728e0m8J94j92K52j42O4p9R1j36J8q9K60j31j15M76k32r7j02K50j60L1q6PN6
6752D0q5k37K27J68M4m7j8q5P3j53J11J9m41N26k6k60K29n0q6p2L0N8Rrlj34J88
$$ y = [249, 4, 16, 153, 2, 5, -269, -60, -62, -246, 292, 12, -148, -280, -4, 51, -104, -122, 27, -67, -123, -5, -94, -32, -96, 194, -205, -148, -224, -147, 169, 19, -9, -182, -118, 60, -105, 333, 194, 64, 22, 74, 139, 128, 125, 33, -106, 5, -30, -39, 132, 304, 22, 187, -103, -107, 419, 74, 210, 83, -66, -178, 160, 8, -99, 108, 161, 13, 248, -17, -113, -227, 83, -80, 1, 176, -127, 52, 24, -159, 66, -318, 163, 361, 57, 27, 121, 200, -235, -116, -120, -220, 46, 128, -2, 21, -201, 80, 49, 72, -104, -139, 17, 214, -213, -20, -218, -109, 33, -37, 209, -53, -27, 20, 83, -114, -46, -44, -183, -110, -18, 144, 7, 121, -38, 25, 267, -53, 61, 9, 5, -18, -101, -212, -1, 194, 34, 37, 265, 89, 125, -154, -50, -98, 96, -96, 156, 14, 78, -1, 90, -46, -28, -117, 143, 12, -103, 373, 141, 44, -58, 192, 32, 63, -23, -16, 40, -45, -282, -55, 113, 157, 110, 92, 7, 80, -73, 38, 57, -384, 142, 116, -144, 85, 35, -51, -123, -93, -35, -26, -35, -38, -172, 16]
6779A6N4j46J62m1j93J68j07J11Q3l15K27o5j04M3o4J31j86K30L2RR7r3j64M5
6803g0K88k51K8k56L79N6Q0m35K32K10m54J17J5K8O2J76n7r1j19o7P6j27J62J5
6827cn1k3K86j28m3J14k20J2J11n6J06k05j31K29P0l07J27L2Q2J9j03K78j92l3
6851b9P8J78j58l0rj90J27K2J4J9M1j39K6Q7J89k88K31l56J26J04j20j16L73m07
6875b27J50q8m5L2J56K20l16k7J75k20L11j65j45Q4J69k05K3K14j59m6K97J96
6897C84m11L80m14KK57k41J53O9q7k0K5L3k47J04N6k2O5j16N2o7M0l9N9J58j87
6922a4J42j69K99l82J59O9j06k9J14o3K11m98M3J00L22n40L90k84L69k46J38N3
6944G8n6m2n9K59l22p6M5L8L04l12J53j42OK28j29j35L18l72L41J28l98K15r7
$$ y = [16, 70, -76, 86, 45, -148, 20, -87, 24, 107, -208, 19, -46, -150, -107, -171, -40, -226, 4, 36, 45, 142, 49, -115, -70, 218, -33, -5, -261, 118, 174, 254, -181, 51, 261, -193, -76, -61, -33, 29, 205, 148, 57, -62, -129, -53, -180, -18, -3, -54, -77, 209, 81, 38, 152, -68, -56, 55, -1, 105, -100, -231, -2, 68, -239, -112, -80, 2, 21, -82, 196, 4, -29, 49, 227, 69, 39, 30, -160, -33, -11, 3, 22, 63, -76, -50, 37, 226, -62, 169, -187, -61, 43, -77, -193, 180, -227, -77, -165, -210, -178, -22, 198, -118, -145, 30, -190, 121, -44, -189, -105, 64, -141, -118, 96, -63, -109, 188, 384, -27, 353, -61, -59, 198, -43, 110, 179, 92, 72, 97, 130, -117, -13, 43, 21, 86, -30, 22, -45, -5, -44, 15, 173, -14, 128, -41, 258, -124, 35, 104, -2, -31, 83, 20, 231, -267, -224, -124, 198, -342, 48, -236, 133, -113, 25, 78, 22, -20, -79, 180, -142, -218, -173, -135, 169, -143, 10, -132, -126, 102, -27, -162, 156, -216, 125, 253, -145, 70, -27]
6967b7j74J5L37k94K00J69q2m32K34L47j64k08J74j06K41m10J45J27Q1l97K32
6988Hj38j20K63l3J29l75K24n0J16P0j74P1J56K76k65j46K46m4l48R3k5Q1j9J4
7012A0q3R7j11J57J06m3j32j35K04l24M21j72l22K32J12j2l95M05p6J27j0k77
7034b21K18M6j23K41k10j68L94n04N07ql85K51J1K4J85k33j60K14J13j85K04k66
7056e5R0n7J65L7j38j76J49OK2j01mM20m50J83k17J68k2R8o4R0j60r1M64n33K55
7081G9j16j86J04J53l3Q9k04L14k74j13L93m6m2k02J21j30N8MJ06Q5k13k37M26
7104A36j6m44K18n3K66l50K85J23j88o2K37r6J29k49m4mJJ28p3R4q2L1M1j58J14
7129a6j16k3J34o9K52J90n10J64K01j69m4j96J60P7n0j00K59j52j30j69Q8J27
$$ y = [-27, -201, -186, 151, -143, 57, 226, 144, -288, -54, 293, 129, -79, 95, -11, 230, -180, -35, 92, 173, -224, 8, -130, -250, 13, -20, 109, -266, -42, -92, 24, 94, -80, -9, 147, 423, 158, 12, 258, 214, -134, -41, -66, 15, -4, 10, -73, 24, -87, 70, 176, 133, 1, -134, 70, -254, 167, -5, -327, -95, 17, 5, -390, 15, -61, 66, 56, -221, -3, 43, -80, 161, -49, -217, 177, -327, 180, 172, -213, 38, 49, 73, 258, 25, -135, 79, 192, 7, 211, -55, 35, -22, 143, 180, 42, -134, 15, 21, 43, -58, -62, 358, -92, 91, -126, 42, 20, 118, 54, 144, -16, -107, 357, -176, 79, -37, -223, -119, 34, 1, 90, -114, 200, -74, -187, 206, 160, 118, -84, 37, -93, -35, -31, 75, 160, -53, -290, 136, 120, -324, -106, -159, 107, -243, 42, 165, -23, -85, 152, 56, 185, -64, -108, -112, -111, 17, -56, 38, -44, -13, 28, -130, -16, -132, -155, -21, -90, 162, 352, -158, 6, 207, 38, -6, -202, -42, 35, -15, -115, 144, -8, -138, -307, -219, -92]
7151i2j19M57p8k77J0OJ56j99L88j28K2p8j34J77Q8j20k69J38K0p0l2L40j63j1
7175C2q9m8j94P0L10j99L93j42r0j09K46r3J3j03K09j54j3j40m0J43k0Mo7J65
7199H4l1j31J63J30l34J39rL7Q0l22J55K79k16j50L25k45j02J4K10m12M34O0j19
7222C9pj52K39k02J92M0n9p4R2l76K49p9KM17m42J83l61K55J39o0J58m4p4P4m56
7247c07L54rk56J09K45j89K72j58R1o9j33M9L3kn2N9N3l40M33r4K2Q1k75K02k84
7272a65J48j7J8J93Jn7Q6J19l03J24k71L10j58k06J46J75j66K5j04L7J11J3J67
7295B26j48j86J93m47K13K17J29k19J35k74K69j50k31L47N2j75j67K3L8J88l7
7316dJ16l45K84J59j06j03K39k25k55K2P8Q5mp8J61J12l41K06Q3m3k6j70K65k45
$$ y = [-92, -211, 246, 168, -109, -99, -93, 63, -136, 252, 124, 146, 68, -66, 111, 199, 79, -190, -52, -32, -102, -134, 206, 43, 32, -57, -105, -299, -229, 81, -118, 275, 133, 43, -66, 180, 87, 100, -3, 206, 52, 39, -101, -141, 2, -18, -14, -81, 84, 53, -78, 85, 215, -119, 20, 11, 48, 128, -194, -39, 240, 24, -126, 199, -46, -148, -134, 76, -336, 98, 158, 39, 32, -120, 119, -83, 109, 149, 90, 16, 108, -268, -19, -98, -96, 321, -121, 62, -299, -44, 95, 35, 193, 149, 75, 149, -307, 47, 38, -218, -109, 136, -53, 219, 61, 152, 83, -50, -1, 32, 30, -22, 37, 90, -250, 183, 89, 111, 192, -83, 119, -165, -17, -34, -16, 177, 178, 121, 207, 326, 23, 147, -124, 186, 28, -178, -32, 143, -23, 2, -102, -65, 46, 59, 226, 78, -108, 85, -362, -149, 68, 197, -22, 113, -161, 108, -42, -273, 74, 126, -49, -216, -193, -155, 33, -4, 112, -233, 51, 210, 104, 1, 240, 15, -240, -218, -140, -55, -59, -137, 24, 136, -205, 1, 84, 41, 15, -155, 110, -135]
7340a35K24j33J26q0q4J90o8k81J16K07k3J13j72OM9m7k01L06j49K45j54l77J20
7363b02J05J57J05q4P3j17k03L18l53K17j5K93j78k51J45N6l29K75R7K8M8r3R6
7386A88l75L94l0j18k13K0L00n30M44nl9k31L59k26Jk9m8J64j66M15k7k57M0n8
7410b7J02l00O0j65K12Q2K97j50j35o1J45k10P8J34j75J17j79L41j02m5L5k01
7432a47J26J77Mj44o4J67J06l0j48K8j43j2j5j03nk3K23r2MK57j27k37J07k20
7456c11K25q3J65j14l2L9oK23N5j31k14M04l23L55m87J60J43k89L8K0N2J57k47
7479b01L73k35K69k78j24K28k93K41J7n2p7k8K3J28J53k82J76n7rN0k73M93n2
7502A90j46M4k8MJ4J35k72N5p6J38K6j20J40j36K07mj8p4o3j10OK04O1k21J99
$$ y = [-135, 89, -44, 82, 2, -82, 108, 40, -241, -125, 82, 59, 172, 0, 6, 55, 8, -193, 113, -36, 209, 55, -322, -202, -97, 60, 165, 81, 154, 37, -166, 152, -201, 16, 1, 294, 116, -135, 10, 66, -263, 12, 109, 137, 185, 92, 188, -187, 207, 177, 59, -154, -134, 166, -364, 80, 75, 36, -195, 164, -62, -61, -90, -138, 26, -140, 275, 248, -9, 31, -27, 75, -225, -165, -330, -118, -36, 261, 111, -24, -85, 60, -150, -72, 62, -113, 4, -175, 166, 64, 19, 54, -147, -21, 156, 160, 16, -48, 119, 225, 195, 47, 75, -68, -80, -95, -198, -203, -226, -3, -95, -91, 166, 39, -198, -91, -311, -86, -169, -4, -118, -150, -111, -117, 106, 161, 30, -184, 220, -103, 252, -235, -75, 68, -221, -183, -163, -111, 46, -201, 172, -63, 206, -72, -196, 32, -261, -20, -3, -55, -132, -160, -137, -9, 144, -138, 38, -19, -28, 22, -251, 242, 190, 44, 88, 60, 64, 78, 213, -59, -4, -80, 58, 84, -36, 104, -32, 175, 171, 153, 79, 16, -94, -88, 116, 177, -44, 155]
7527A55r6m9k9Q0k61J73j36R3L21j86J41Pl09J37J8r6m4J73r8Ol3r8K15K26l15
7552ej24J00j99J48k34M90M5k10j22J77M9j4j90J5Q1O0j6J56j43j5J11k00L6l30
7576c34M90k25O5k09N71k76J42k61J26r8RJ98k65J78k61R5J88M5k18N2j10J04
7598FM4Jp6Q6J18k53K25j4q2j99K6QJ15j12J42J36k22K02L3Lj06k92K31k3j19
7623a22K47r5M3N9Q8k74J8M2j07K78k9n20J68M34k39m9Qr0P3L5J35J8k89j08L86
7648A10l00L56j98k5J06p0K87l10q4k7J33r1K77n1r9j42K24j88K07l54P8L5p2
7671a98J54Nl2J67j15k1l16M23N0l9r0J77j44j66J4J80O7j92K09j51N8J28m5k09
7695h6l13K95M9J39j9n3m3QJ79j84j40K09Qj93K06p5L0j87J68L48m79K53k45K05
$$ y = [155, 59, 10, -19, 61, -200, -27, -163, -70, 251, 65, 206, 213, -96, 41, 59, -37, -81, 92, -6, 0, -33, -131, 84, 310, -5, -129, -29, -228, -80, -314, 176, 221, 11, -111, 66, 115, 101, -89, -74, 7, 67, 51, 207, 64, 49, 160, -40, -4, -334, 156, -69, -4, -213, 358, 82, 224, -37, 89, -9, 0, 198, -67, 111, -150, -55, 133, 178, -40, 12, -98, 6, 50, 51, -25, 61, 179, -74, 151, 137, 55, -144, -118, -110, 5, -107, 35, 171, -51, 151, 184, 187, 81, -211, 20, -3, -122, 125, 30, 73, 132, 220, -54, -36, 6, -101, 177, 148, -372, -204, 230, -9, -58, -50, -140, -67, -32, 103, 121, -168, -276, 110, -190, 166, -32, -57, 49, -21, 266, -44, -128, -155, -22, -113, 164, 113, 14, -128, 96, -92, 115, -239, -161, -126, -198, -44, -39, -71, 96, -19, -40, -356, 67, 117, 78, -12, 165, 21, -145, -131, 49, 116, -76, 133, -18, 40, 168, 123, -86, -399, -104, -55, 84, 65, 12, -31, -23, 156, -28, -168, 41, 49, -144, 62, -13, 17, -170, -2, 346, -133, 120, -125, 80]
7719H0j4j4k94K28j07R5j0l8P3K9j57K35M1l16L72j11j47k61M41k47J71K12m72
7742b11K34o2J85J2n2j40n9j54K15K36l73J2K3J79k49L46n4r2M14l23N4j47q1
7765h7J22m7n7Q7M7O2k79m1r0L80J7L0k9k41r4J52j61J45j40J62j02K54n53O26
7789A63l10K34k60K14r4R4M2k68K25p9n4J31Rj27j4J08k09J17O8J26J25j10j29
7812Bl7j9r4J65J13k56J52J31l80M40L7j90K34o83L16J14k4J69l77J80jm4j37
7835a89K87L41n95L39k66N8j63Q7J74N6r2J4j8N0J19l35K07o9Lr9J36m1P4k01
7859a23K72k09j79L94j97k7R0j69J61K93k74k44K27m8J87j76J53q5k57J38K18
7880A45L5j63LO3k01K36j38J26nm25K74J00j6J42j08p4J24n8k38J19R1J34j06
$$ y = [80, 66, 52, -242, -14, -121, -26, -36, -74, -1, 28, -129, 106, 147, -169, 203, 92, -55, -316, 125, -122, 49, 261, -211, 23, -39, 146, 158, 106, -34, -93, -247, -32, 204, -169, -157, -134, 45, -204, 142, 88, -4, 410, 87, 141, -6, -87, 35, -12, -69, 18, 65, 127, -152, -193, -283, 97, 114, 144, 115, -126, -220, -68, -229, -84, -224, -62, -164, 90, -463, 163, -147, 87, -173, 41, -53, 41, 83, -185, 40, -39, -93, 38, 47, -80, -94, 14, -195, -78, -10, 116, 241, 131, 2, -35, -54, -148, 17, 130, -126, 26, 157, -223, 217, 254, 64, 298, -385, -69, 45, 21, 190, -187, -7, -8, -52, -189, 98, 439, -156, 183, -83, -25, -188, -101, 73, 129, 37, 51, 33, 83, 202, -133, 74, 5, 8, -91, 45, 4, 78, -123, 149, -60, -239, 155, -42, -69, 21, -148, 13, 306, 32, -212, 15, -33, 154, -22, 131, 46, -211, -73, 145, 180, 17, 20, 83, -118, 118, -20, 106, 101, -324, -50, 50, 34, 176, 68, -6, 118, 60, -178, -59, 32, 166, 60]
7903F0l39K20K86k83J26J32k42J37k58j50K71J77k22J25J1k8l20K82k15L26k18
7924a22K30j9L7j80J17J13m25N64l15J71k54K2J59k08J05P8Mk1j63N84m97j22
7946a42l7J78k31J00J56k76M00k13J76j55J17N1j79J59k57J2j71K20K59l57K82
7967I2Q5k54j34J06J14j71K42j60r0K58j58J03M4L4J03k08j82L54q3J01j01n3
7989D2j12L83l1l83K24O6o5l89M30k44m2K78j27Q6L3j82J7J30j4n9r8m0R9J39
8013A41o0N2j62Q3m51M47j95J18J6l0J08k96J68j19K67nj58J9K95m10J62P8k62
8036a94K25J05l07L51l11M1J08J73j77q3n6K69j7J66k53j7j9j70L24j93K60o7
8058A58l21K1M8J75j84M51l25k02K29k88M11p1M0p5l38M37q0l39L31j44R3j1j86
$$ y = [60, -279, -59, 227, -56, 70, 202, -40, 97, -161, -311, -40, 137, -85, 40, 51, 23, -297, -15, -230, 96, -122, 108, 89, 126, -54, 63, 176, -249, 315, 0, 171, -83, -61, 98, -110, -5, 73, 77, 56, -107, 477, -20, -142, -179, -1, -232, -132, 24, -252, 148, -65, 111, -44, 73, 124, -55, 104, -153, -141, -312, -92, 167, -190, 92, 177, -77, -211, -105, 9, -162, 80, -80, -170, 88, -70, 33, 77, 111, 214, 6, -176, 178, 95, 196, 95, 42, -70, 313, 282, -101, 123, 189, 124, -265, 165, -79, -121, 157, 30, 116, 149, -33, -16, 114, 100, 41, -57, -97, 2, 141, 81, 133, -29, 54, -397, 50, -145, -27, -11, -41, 67, -229, -61, -180, 87, 82, -76, -57, 238, -172, -10, 68, -194, 31, 136, -171, 180, -131, -90, 18, 191, 14, -69, -125, 144, 127, 293, 40, 23, 4, -166, 158, -35, 225, 158, -163, -142, -94, 81, -103, 348, 23, -179, 50, -238, 173, 102, 142, 67, -271, 166, 86, -253, 78, -66, 27, 16, -170]
8081a70M3K54j87m6O4J32r2m9K5M8k9l4K67k16P4k43K23M6M7k71K45j62J52l70
8105b49K95n6K83j33j61J29k5q5J3k4K85k32j42K01k4j22lj40j9L23j88Q0k03
8128a97J77j7J24M6j99L4j28J66P4q4J47Oj59J24o4rj86j21L86qk02K14j56q2
8152a14rJ04K4jL3P7j39M5N0J8j15K05K12m58K76k26J36L12l53j4k9k1l19N20
8176B14m27J87K85k40p2R6m7l6J21j69k0J3j10R9L75
$$ y = [-170, -127, 127, -60, -106, -42, 90, -2, -51, -26, 22, -7, -41, 226, 10, 84, -159, 64, 110, 157, -114, 131, -31, 121, -249, 46, -10, 273, 140, -21, 108, 83, -2, 11, -13, 272, 40, -102, 99, 75, -47, -50, -190, -209, 114, -74, 6, -197, -20, -37, 87, 133, -66, -32, -160, 6, 80, -4, 143, 149, -10, 114, 50, 41, -145, -266, 120, 112, -90, 124, -32, -114, -123, -19, 5, 4, 37, 114, -25, 20, 70, 88, -27, 178, 390, -68, 208, -18, 118, 430, 77, 63, 34, 13, -306, 214, -213, -26, 259, 19, -53, 43, -4, -40, 81, -88, -108, -95, -205, -106, 269]
8191B69
$$ Imaginary data points
##PAGE= N=2
##DATA TABLE= (X++(I..I)), XYDATA
0@%%%%%%%%%%%%Qj6J6j6J6k4L2l9M7n5O3p2Q8j03J18j35J54j77K04k33K64k97
34a57L34l76M22m70N25n88O52p22Q00q86R80j081J191j312J447j595J756j934
52a014K132k354K604k887L209l580M012m526N148n916O890q173R949j2558J6760
67I696k4569M3560j66439j71324M85756j09665k41390K42472l328j98521J87711
78E3959L6543j73437N6418N4909n1143N5625l5465n8747Q2020l801n5705N3048
90A4224k7619l2136P1032k1050m4522N0830k2152j3050O6893l5184l9862N9196
102B6600j8075k9343L1720l5491r098N1856l5394j958N7614m8566j2424O3301
114D0742m6557j6980O1826n2021j5754Q0984n4028m2171Q7160l0096n6598P1589
$$ y = [0, 0, 0, 0, 0, 0, 0, 0, 0, 0, 0, 0, 0, 8, -8, 8, -8, 8, -16, 16, -23, 24, -31, 32, -40, 48, -55, 63, -72, 82, -95, 109, -124, 140, -157, 177, -199, 223, -247, 278, -310, 342, -380, 420, -466, 514, -567, 624, -688, 759, -836, 920, -1014, 1118, -1236, 1368, -1519, 1690, -1890, 2122, -2404, 2744, -3172, 3718, -4455, 5494, -7064, 9696, -14873, 28687, -137752, -309076, 176680, 67015, -174375, 68097, 64769, -133752, 53959, 90502, -82935, -26517, 28392, -22751, 32874, -2591, -61338, 20682, 16881, -38824, 14224, -13395, -45531, 25501, 4451, -40071, 10759, -11393, -24443, 42450, 7266, -32596, 26600, 8525, -20818, 10902, -24589, -33687, 18169, -17225, -19183, 38431, -10135, -22559, 40742, -5815, -22795, 39031, -12990, -28744, 52240, -1788, -43959, 43201, 13105, -43493, 28096]
126B8096j0361n3036N0283j027l7640L6349p677j7023M8315j9089l1522M2397
138B8065k1144m2627M3388K889k8891K9326k862k2859K7402k610j8834J5269j2883
151f371r86L4999k1408k6071K9674j484r727J5717k9181j3394M4189l758k5416
164a3217J2046j0830M9L4504j6926k0545K6332o219p588K2919k8902k7247M1054
177E430P446k6188J3099J424j0704K1512n902k6281J5878J4027q289M293m359
190A386r725J5663P363j7080p748N703O792j815r103N652P179p957N871J1676
204A3857j1152j730J1181j0714o511Q628m736j304P863o862j155J0749o421p064
218e371Q340j252n322O512K650m76K400k372l465N3n89o87l285l539L945L348
$$ y = [28096, 17735, -35301, 14982, 13955, -23685, 12664, 4987, -12036, 36279, 17190, -14332, 28065, 6921, -35706, 7682, 10571, -18320, 11006, 8144, -14715, 12687, 10077, -8757, 6512, -6371, -7357, 27642, 6234, -19837, 9837, 8353, -1374, 14343, -14838, -28232, 15957, 12199, -13217, -1171, -12001, -11952, 22552, 5626, -14919, 11413, 5194, -2394, 20525, -8377, -35624, 5430, 12876, -13312, -213, 1211, -9493, 12019, 6117, -20164, -4286, 9741, 1452, 5745, 1386, -8339, 7324, 14687, -2393, -10141, -4438, 2354, 539, -8564, -2912, 4267, -3690, 2181, 13857, 2705, 975, 12156, 1442, -5069, 3559, -1177, -2481, 5382, -1480, -2635, 8114, 1693, -5371, 2969, 1717, -3605, 2907, 5557, 5081, 7481, 5109, 1644, 1697, 1108, 421, -2864, -6403, -2458, 890]
234H90l376k745K950R031K582j0183l68R480q119o936N914o658j819J5185m586
249A242j0713Q278r98l115Q944o909q012J3288r66o836J1087m287q827J3140m159
264A157j4946Q145J773m743Q369m588n132J5800q67r235J0041l911q886J0540
278C517n451r703J2977j847p825J3528k139r310J2940m661j2601J5478N92j3774
292h279J0641M564q525Q580k34j0800Q000J999r833L018j629l664J3081J885q955
307a51M769O73k105O073o857q012R351M0m277O400m952l890J1551l868p395P286
323D636l082l894Q152p304l974J5200l452q558R920m241q741J1252o068j1115
337a1269J2315J721r519Q592K058o539Q331k363j1300P186M195p101J920J500
$$ y = [890, -2486, -5231, -2281, 6750, 9332, -851, -1219, 8261, 142, -6794, -880, -7538, -9357, 5828, 1242, -9471, -1193, -2191, -5306, 3638, -3271, -11283, 2005, 1039, -5797, 5290, 1003, -7824, 5316, 1157, -13789, -5644, -3871, -8614, -245, -4833, -9965, 5835, 4968, -4267, 5774, 1863, -7023, 3517, -1934, -11637, 1340, -507, -8332, 5196, 3057, -6253, 6687, 2026, -10575, 4903, 5495, -8279, 2362, 6926, -1599, 6981, 6747, -4053, 3947, 5946, -3887, -869, -2498, -6162, 6919, 8804, -151, 4618, 5291, 3186, 9259, 2402, -5610, 3741, 3781, -496, 5904, 952, -2938, 8613, 4745, -2650, 4636, 1554, -2340, 5812, -1492, -5466, 9734, 6282, -2276, 7644, 3403, -5338, 5914, -154, -11269, 1046, 2767, -6752, 1840, 3898, -2641, 5690, 3327, -7973, -787, 3408, -3693, -1773, -273]
351b73k137L631l071l786N113j478j585L927m607q11Q058k859m560N046R82J482
367C072O17r333P33M859p418L578P847j0143K645J2646j0358n096J1627n600l784
382d108Q668o365m12J0570r465o044J2669n613o941J0709l195p463J0378J730
396E118q787K798O397K61l242l625K637J643n763O67Q13m839O497O151o337o9
412C20J800m305M550k87r335R493P214j1485L87N292r588L640P724j1845n40J0801
428C836l732n55J757p641N229R441q864j886N711n947q8M082p308p09O000Q36
444A62K298k507m224O997j544p665Q392j260q868J3192K367j4435Q223L573j4439
459i738R988O200j4968Q558P093j4508Q095Q122j5779P266J0566j5114N062Q962
$$ y = [-273, -2410, 1221, -1850, -5636, -523, -2001, -3586, 341, -4266, -5077, 2981, 122, -4438, 608, 1590, 3072, 3689, -5644, -4911, -52, -7470, -3892, 3955, -6188, -3543, 9103, -1255, -6351, 5276, -324, -4108, 4560, -1805, -2217, 8353, -1112, -7156, 5513, -100, -7041, 3668, 473, -6990, 3388, 5118, -3669, -871, 5526, 5787, 2545, -1080, 1557, 3200, -2563, -1896, -1083, -5922, 575, 6726, 389, 320, 2120, -2185, 2365, 2078, -7257, 2236, 9450, -2035, -1648, 3644, -5944, -2304, 5420, -6425, -6965, 3836, 104, -451, 1306, -6335, -1106, 8335, -529, -2415, 3296, -2651, -2739, 1343, -5965, -6674, -674, 162, 2460, -47, -4271, 2726, 1182, -6483, 1909, 649, -8219, 4973, 7340, -7095, 1128, 4701, -9738, 250, 6450, -8518, 40, 7133, -7375, 720, 8842, -6937, 329, 10895, -4219, 843, 9805]
473I805j7583M341J2817j4190N82J3196p996J40O692j0729L38Q619o075J643L125
488D725p716O660N607j1878K062N916o494L632J646r910P257L869j0232P168K341
503D653j0059J1784M173j8155O293Q930j4091M682O376j1823Q168P641j4611N378
517f61O926j5236O077R815j5854N002J4616j3776k822R968p675J06O649r059J513
532d411O316o210L028K141r830P010Q472r886L45M768m867L803p89q181P824J674
548A207q064J0213K06j4585J1828N562j4878P905N696j3461J0065O858j6156P845
562B41O429j5779R657R320j9627O034J5014j6494R99J2803j3732K896J4158j3346
576a427k811J1441r177l89J0159j0887k931J3550l916n461M161l567N90N624m321
$$ y = [9805, -7778, -3437, 9380, -4810, -4228, 8968, 972, 1112, 7804, -2925, -2587, 6032, -43, 1600, 4725, -2991, 3669, 9276, -2602, -540, 5376, -1118, 2514, 4160, -5750, 1507, 5376, -4856, 2312, 4653, -5406, 6378, 10551, -7604, -1311, 7619, -6472, -1790, 4586, -7237, 931, 8572, -6039, -661, 6265, -8971, -2894, 6921, -8933, -3931, 10685, -3091, -5913, 4055, -3620, -3514, 3135, -5924, -4411, 1905, -4305, -1277, 864, -8966, -1956, 6516, -3370, -3025, 1743, -3124, 679, -110, -8291, -467, 1207, -6857, 3356, 3562, -11023, 805, 6367, -8511, -606, 5090, -8371, 1694, 8552, -7604, 241, 6670, -9109, 548, 9868, -9759, -3725, 11289, -5205, -4206, 8597, -5135, -2239, 11919, -1427, -4238, 7203, -1974, -2363, 7796, -3091, -6022, 7528, 3612, -1849, 2312, -1255, -665, 4959, 638]
591F38j229K438j109M212k172q988O112N327o567K740n26p142R753M040j2701
606e174L234N586p817P228M373j5029M270J0693j0397k49P335q494L064Q558j0143
621b962k231Q882m252j249M740o677J379Q731o285m488M749k000N00M785n285
636a663k604O006k81j655R41k266J19L195n05j571j758J72M575j075l944L453
652A139j80j522M691k244o421N016K592l775K992j583m024O381J494p953M226
667H29K692o584M303M066q804J765O954m287j803K010k725K432K975o092L95M556
683B682l725K51L771m224j939O033k82m931o05K678J762j293k501P58Q52K86J770
700A343j232l864J351M318r16l853j140L228J439j945m17J125o21M15J002k019
$$ y = [638, -591, 1847, 738, 4950, 2778, -6210, -98, 5229, -1338, 1402, 876, -6266, 3487, 7527, -5174, -1940, 3646, -4171, 3057, 7430, -7599, -3329, 7364, -3033, -3282, 4053, -4441, -1377, 7181, -2962, -5193, 3689, -563, -1812, 2928, -3749, -2370, 6361, 76, -4412, 337, -1663, -1163, 3622, -1663, -4267, 1739, 1458, -197, 744, -1522, -1403, 1792, 1287, -284, -2042, -1870, 2705, 1630, -2314, 1139, 959, -563, 4128, 1884, -4537, 479, 3071, -704, 2288, 705, -3319, 3062, 4556, -3397, 829, 3521, -3063, 1240, 5306, -3498, -1733, 5221, 934, -869, 1141, -1584, 848, 3823, -2269, -1874, 2682, -1043, -792, 2979, -1245, -3184, 2849, 2567, -2364, -2969, -291, 1471, 178, -2323, -1565, -713, -427, 1343, 111, -3753, -2402, 1916, 1000, -2853, -3993, -765, 674, -1271, -1688, -563, -1184, -769, 233, -1786]
716a786j398K554J111k030j263J160K357J72k113m22L61K47J470j9k476K97K201
733D23M23J62k000l47L153q41k703K332m90k012M491j46m710K977J911k758K257
750B122p20m121M901J097m684L167P52n711N517L111p508K790L620n229K674K281
766D059p054L274M691n850J344L414o095K807M215o848P98M788m353J820L112
781D122o613J570N139n199j21L315m482J334M025n150O85K847l491K402J974o106
797c749L275M524o486O03L333n168K642L456o376K576M100o083K596L962p098
812c893K113N987p227q6O363n473j21M800n731R36N434n587r8N391n172J40O344
829D120n147j835O732l529k244L373k592k81K939l516P51L707l366M22L873m680
$$ y = [-1786, -3184, -630, 481, -1549, -2812, -1652, 705, 877, -1236, -1658, -1297, -1050, 420, 401, -2075, -1778, 423, 846, 1008, -992, -1339, 1814, 973, -1730, 602, 112, -1900, 2591, 2445, -2265, 712, 2623, -135, 2122, 1402, -2719, 2182, 3279, -1405, 1762, 2514, -3197, 2320, 5431, -2077, 713, 4333, -896, 1778, 4059, -2995, 279, 4970, -880, 464, 3878, -2217, 590, 4805, -2043, -1245, 3543, -810, 1010, 4122, -2491, -921, 4218, -981, -1102, 2213, -2269, -935, 3090, -2060, -1375, 1472, -2019, 383, 2357, -3749, -474, 4050, -2436, -1833, 1500, -3668, -1026, 2430, -3946, -1370, 2730, -3353, -757, 3205, -3893, -1780, 4207, -3020, -3106, 3257, -2216, -2337, 2463, -3268, -2332, 3102, -2485, -2583, 2808, -2364, -2224, 4120, -1027, -2862, 3870, 341, -1903, 1470, -1122, -1403, 1536, -1980, -1229, 2478, -888, -466, 3407, -1273]
845a273n1M684l091r57L001l118L77J965k646J321J963m744K399M050n220M19
861i21L398l670M38L408l773P47L315m084N88K660n109J348M557m971j13M922
877B740l742q34M222l376r29L743k644r04K790k120j92K957l551k11L312j632
893c71j107Q78r16J001J400k057K09K406k243Q45J358l106O51K246k645L26K175
910A050j744Q59O29k110J106K214k647O38J815k088P02J960k453l28J581j182
926BJ43L31j016P91J429j203j38J458o26K49p0k31l2r64L08J315j135o78J947
945A880j916n68K838j490j859K757q86j438L315j410j922K798j534j800K401j614
961d48j747K867j146j853L276o94j857L213j509j797L721j669k986K923n29j785
$$ y = [-1273, -1324, 3360, 269, -688, 2313, -805, -428, 1537, -1109, 212, 2175, -2569, -170, 3880, -1340, -921, 2477, -1193, -755, 2653, -1120, -373, 2942, -1142, -554, 2106, -3003, -1655, 2902, -2069, -2182, 2740, -1002, -1836, 2386, -990, -1919, 1824, -820, -1724, 1066, -1054, -1246, 1711, -1840, -2051, 1261, -371, -1478, -600, -1516, -515, 885, -1172, -963, 1443, -800, 45, 1403, -1703, -1052, 1194, -1451, -1125, 1050, -694, 165, 794, -1316, -210, 2004, -643, -5, 1810, -278, 424, 2384, -69, -397, 1184, 2, 145, 476, -540, 251, 1680, 477, 339, 1797, 1171, 1420, 1350, 1119, 1087, 123, 431, 1746, 611, -67, 1880, -36, -604, 2234, 744, -1115, 1642, 756, -682, 2633, 1223, -699, 2099, 565, -1235, 1166, -448, -2195, 672, -474, -2327, 949, 255, -1602, 1611, 102, -1695, 2026, 357, -2629, 294, -235, -2020]
977b020K571j600k195L790j074k205K744j087j603M179j551k790L541k6k314K529
993H89k094j300L275k701j467M553k612k098N910k168l461N602o79m432M016m52
1009G81l382L891r27l166L906r95k306M199j376l889M813L28l662L021R75l108
1025h97K382K78k187K097j285j749L168j581k760M215o21k515L370m22k048K888
1041B333q48k110K760j883j889M232k558k530M405r09l332M195o83l631L686p9
1057A159l062K847J43j914L417j734l303M017o63l621K743m35k195L678R1l504
1073b336K947N70j977J916m92k696K553O20k287P18j63m81K310j124k041J904
1089e9j13n77J845j460j009L267q71j229J532j497k45K294l015j524M029j334
$$ y = [-2020, 551, -1049, -3244, 546, -528, -2733, 11, -1076, -2679, 1500, -51, -2841, 700, 674, -1640, 889, -1205, -2505, 770, -1931, -3398, 1155, -1457, -3555, 2355, 187, -3274, 2328, 1649, -2783, 1233, 781, -2601, 1290, 363, -2803, 1103, 108, -2198, 2001, 625, -3264, 1549, 1877, -1785, 1236, 2211, -897, 1485, 1763, -424, 1673, 388, -1361, 1807, 226, -2534, 1681, 1060, -1455, 1915, 1493, -555, 2333, 1485, -625, 2135, 252, -1637, 2595, 37, -2493, 1912, 1003, -2329, 1866, 1183, -2448, 1238, 1159, -1903, 944, 1087, -827, 2590, 856, -2447, 1570, 907, -2714, 29, -406, -2601, 1077, 1168, -2336, 611, 1181, -796, 1120, 628, -2068, 485, 1105, -1182, -464, -627, -1108, 1202, 78, -1963, -59, -172, -749, 1096, -364, -1373, 1894, 1023, -206, 1326, -171, -416, 1878, -1137, -2661, 1368, 34]
1105C4j988L544p94k399L631L3k582J593j74j443K425q09k662K863J03k484J458
1122C49L05k260J341J421j900L46J475J83M68j050r30O03j69n27J42o86n15Q68
1140e36L26P50q98q88J300R12j900M25R93j626J184J044k325J66J945j990m86
1157a604R66j647J844J370l372Q62K855j534q2K340l314j440L764m99k794N99
1173a686P62L05Q91n29j126R03R48k5o55q06K21J763L63r24j409J007K164k171
1191dj685J804j225J00L067j479k406L883N74k638J452r42k074M079m50m487K706
1208B75J663k589J832J109l880K017K990l345m34J726j236Q60R42k101N21J317
1224A667j199M32j073j087J126M44q19J211n02j16K023j037j684J681j380j095
$$ y = [34, -1954, 1590, 796, -1603, 2028, 2061, -521, 1072, 898, -545, 1880, 1071, -1591, 1272, 1375, -1109, 349, 654, -1606, -265, 1156, -744, -398, 1077, 1260, 1728, 678, -252, 351, 182, -345, -203, -889, -1404, -536, -210, 540, -358, -1246, 54, 966, -934, -509, 484, -1142, 42, 1086, -1239, -1073, 872, -1118, -1604, -638, -2285, -441, 929, -2443, -1581, 1274, -260, -342, 1998, -1316, -2756, 1008, 509, -2285, -1686, -924, -619, 272, -257, -1383, -480, 468, 443, -212, -1018, -797, 966, 1329, 405, -1004, 3, 2167, -4, -1689, 115, -1110, -1010, 2057, 578, -1828, 2055, 2629, -9, 1443, 501, -1573, 2506, 2056, -2431, 275, 1938, -651, 1181, 2290, -1590, 427, 3417, 72, -362, 1364, 128, 988, 1930, -171, 350, 1667, 468, 900, -173, -1260, -134, 310, -509, 702, 200, 84, 2107, 1070, -614, 1067, -313, -1408]
1240a408K671j575j655K953j319j912L862j686k665M933j534m213M270L6l070
1255b312M296l33m911M267R58m904K722N8m025M515J985n487K514K827l419J610
1271C61R61l731K421J743l215J234M76k533K991N48l854J961J936j822J483p29
1287B31k582L715k01k569L212q26l040M446j085m980L928J314l940L081O38l272
1303a930M698m24m940M348M55n251M285J756o604L724L261o132J984L434m706
1318b042J696K874m353J205K656l616J486K757l936O48K476k795n2J245k533J322
1334i62J255j839K069M39k817K329J344l908K073J172l206K329J025l415J759
1349c53J375k807J880M07k855L032P94m062K466K078l486K349J821m335J994J889
$$ y = [-1408, 1263, -312, -1967, 986, -333, -2245, 1617, -69, -2734, 2199, 665, -3548, 722, 758, -2312, 1984, 1651, -3260, 1007, 1965, -2939, -217, -159, -4184, 331, 2316, -3171, -657, 2170, -1249, 361, 1322, -2409, 12, 1755, -1460, -226, 250, -2283, 708, 1256, -2598, -637, 1299, -523, 960, 231, -2351, 1364, 1163, -1406, 1806, 980, -2060, 2386, 1301, -3679, 249, 1563, -2377, 704, 1342, -1930, 2768, 2344, -2596, 1752, 2207, -3044, 1241, 2997, -3607, 117, 3378, -2754, -770, 2664, -2042, -346, 2528, -1825, -620, 2036, -1580, -94, 2663, -1273, -625, 1851, -944, -996, 249, -2284, -962, 293, -1546, 523, 962, -1855, 474, 1818, -2090, -17, 1155, -2051, 278, 1303, -2112, -353, 1022, -1785, 95, 502, -2353, 679, 1473, -2589, -123, 1955, -1531, 818, 2639, -1696, 298, 2187]
1365B187m053J135J317k511K308K088l423J027K717l000N75J050k262J170J800
1380B125k683M98J580j992J349O37k650J473J473k502Q05J259j739J369P56j755
1396CJ373N69k433J142R1k929K610R24k994K181J180k473J660O30l578J780J964
1413A700l075J038J423k212J050J426k658L30J670j912L41R16j742J130J209j586
1429i52O92J636j674j96P00j563J66Q83j630R15J022o97J142J63j840Q05J152
1446G24j718L67P99p45N32N77j547P37P03j614P78L96j184M58J619j494m46K191
1464A133j42n83J87k77p1m05m50M26r9k79P67N95q87J47P17p1p46M4M95L11o71
1485A41M98N22j045K84P19j047m87Q56k69k60L12k15K71J100r37o40J444o75o55
$$ y = [2187, -1866, -731, 586, -1925, 383, 2471, -952, 75, 2792, -208, 367, 1417, -845, 325, 2125, -558, -60, 1520, -472, 877, 1514, -1136, 337, 1810, -692, 113, 1372, -367, 1002, 1758, 3, 1376, 1945, -488, 654, 745, -2184, 426, 1350, -1644, 537, 1717, -756, 904, 1534, -2044, -264, 1700, -1375, -337, 1086, -1126, -76, 1350, -1308, -978, 692, -1220, -879, 37, -1705, -575, 634, -952, -260, 1376, -298, -494, 206, -1357, -1191, -308, -1938, -1023, -1, -698, 444, 607, -1233, -428, 724, -994, -627, 172, -573, -41, 536, -1011, -274, 429, -1185, -407, -11, -1195, -737, 882, -612, -1058, 1133, 991, 408, 595, 318, 247, -158, -608, -182, -281, -560, 207, 802, -85, 62, 779, 708, -38, 6, 501, 812, 141, 639, 1161, 116, 400, 1119, 72, -415, 441, 172, -88, 224, 9, 280, 1380, 443, -197, 1247, 572, -83]
1504h3L92j130L45R07k02p7J0k66M35p3q39K26J215r21m03O20J29l81N58p87k66
1525e91M80q06K48L38m65M25R27p71p1J153p09L1J18j034O1J234q92l63J207q70
1545c50M64P98j209m04J180p27L15K40q08R89Q20j489L95R38j493J43R74j823
1563a047M08J341p67J51J210j296M58N54j576L49J000j210k13J563j059j55J349
1580A060j555L06R25j091k28R26j048J63J424j044k27J229j017j46M75j139K81
1597g06L65q74O98J079j244K44J438j417n90J459j198n81J342o88L36N14j004
1614h27o9R89o83m03J025o86l15J200m66p39R20J36q0P8n34J30Q2p39Q6R25l88
1635c58L52N76J3m60J65j10L07p52q14J765K27j177J129j01j389R37N62j178L97
$$ y = [-83, 309, -821, -476, 431, 229, 152, 162, -104, 331, 258, -581, -355, 860, -61, -464, 156, 285, -96, 462, -325, -591, -111, -917, -669, -331, -796, -371, 556, -215, -286, 867, 158, 189, 307, -727, -666, 568, -324, -687, 520, -350, 114, 912, -297, -701, 479, -248, 67, 307, -501, 488, 1308, -181, 214, 1152, -341, -198, 776, -1047, -639, 702, -65, 86, 1296, 0, 458, 1012, -564, -215, 785, -425, -638, 925, -134, -289, 1060, -495, -189, 736, -355, -583, 343, -705, -542, 882, -162, -389, 840, -177, -323, 152, -987, -706, -341, -1215, -517, 562, -682, -438, 1000, -417, -1007, 452, -746, -1327, 15, -673, -337, 177, -827, -896, 93, -590, -993, 32, -654, -969, 231, -235, -974, -54, 82, 2, 80, -454, -324, -242, -981, -895, 30, -358, -6, 570, 583, 123, 288, 178, 485, -267, -1081, 684, 911, -266, 863, 762, -627, 310, 872, -306, 91]
1654I1P39p40M85k57o31J309Nr75J046r7j165O5N71l71j40M33J89O6L3k82M6n87
1676a67J37O70o67J51L32n47N82J85j507Q13J152j500l17J689j618j73K064j808
1694e29m14K371j265j036J411j231q63K502j277k031K902L14j710J910j057k163
1710b166K872k37k189J490L91q78J446m25k121J735Q58j410J80j7k09J613q70
1727F3r48O91j77P13J120k132n05K176r29j027J369j285K78K737k021j518L066
1744A671j796j142L219k336j673L977q29k374K869j307j960K963r46k487L142
1759I91j83k585K946l46k863K728Q62k807J842L63k580J528M27j379J305J91j368
1776i28J959l43k158J419N26j707J774l70j159J718l86j345J237j132j56K232
$$ y = [91, 830, 90, 575, 318, -313, 996, 1001, 26, 1072, 975, -190, -125, 446, 75, -65, 368, 557, 623, 656, 374, 420, -167, -30, 640, -27, 124, 456, -91, 491, 676, -831, -18, 1134, -366, -683, 1006, -612, -785, 1279, -529, -943, 1428, 163, -873, 538, -693, -1556, 946, -331, -2362, 540, 854, -856, 1054, -3, -2166, 706, 469, -1720, -230, 161, -717, 729, 304, -1817, -82, 776, -634, -454, -471, -680, 933, 63, -885, -194, -371, 342, 1462, -670, -1175, 1001, 72, -955, 414, -871, -593, 2144, 123, -1395, 1671, -125, -1267, 1952, -384, -2057, 1920, 1091, -1283, 1586, 279, -1681, 1282, 336, -2151, 991, 808, -1777, 1169, 823, -2040, 688, 1550, -1257, 585, 948, -1632, -104, 323, -1056, 249, 440, -928, 1031, 688, -1470, -51, 475, -1232, 542, 172, -987, 731, 345, -1000, 237, -895, -1051, 1181]
1792A181j357k049L050n13j499K072r68j755L026k7k777K032m02j872L000p57
1808C85k683L344O27l203J870P07k771J923J258k823J147J667j384M28K80k093
1824a321J346J470k286O33R63j065N78N73j400O44R07n76O7l48r18J420K68j351
1842c96Q96J01m11J065p52j693J941j61j461J524k32j081J976q6k271J336L15
1859F10j729J230P52k076J310R76j913N43J229j493K92J129j618L60M38j014N78
1876c96Q21r99J4N28l23k8Q18j505K54Q20k08l88K03N9L16n2o37M59k16K29M80
1897B49n90q43J242J26m04k26J68K9R32p44r79J028M23r33Q50J98j384Q16J324
1916A282j811K10N58j99J31L75j111M95Q59m37n34P11o28J83O34o32m09L54N62
$$ y = [1181, -176, -2225, 825, 312, -1187, 885, -83, -1838, 1188, 1161, -1616, 416, 14, -1858, 1142, 385, -2298, 1046, 1673, -1530, 340, 1047, -1724, 199, 1457, -1366, -219, 1448, 64, 492, 772, -1321, 25, 1495, -791, -158, 805, -260, 318, 891, -509, 135, 1042, 466, 533, 185, -733, 687, 955, -396, 500, 601, 190, 1255, 503, -1190, 751, 590, -871, 653, 421, -660, 1316, 1230, -1041, 295, 610, -1119, 111, 863, -1213, 97, 1073, -840, -297, 932, -561, -269, 860, -758, -398, 40, -974, -396, 425, -574, -560, -32, -355, -383, 435, -1070, -816, 4, -204, -592, -389, -330, -14, -66, -703, -244, -460, -231, 249, -341, -1184, 58, 184, -220, -446, -278, -249, 683, -61, -1040, -12, 411, -522, 328, 526, -858, -42, 1282, -529, -319, 239, 40, 171, 546, -565, -70, 789, 352, -182, 529, -99, 84, 718, 86, -323, 31, 593]
1935E93o32M1K49L07m87o7J76r0K26J2Q7k53Q2l6L45l35m23J69L44m76k11M92
1957A13r4l5mJ63j17j75P8J4p0j1L37j85m5j0J44l4l95q5J48J00j04O8M47k61
1981a3k26O39l58o73R01M4n59J26K07m64M48j62p07J165l6p72N05O1l98Q68M8
2002F44j041N4Q08l69j77L46o73N02K62o73J82M27m78L28M37q12K72L73m10m5
2022d3M03l77K97k38m13M86K51n21l0M82l47M80l72l90L43J96j63K80k53n49N50
2043G2K54q04K39K48m41O30n7o75M62L28p95O90j0m72N11J91j080L65L22n36K62
2064b96m99J78P87l37m61J50N15m07L01J38n53N81j01l7j18k79K43J25l20j03
2084d93O05L35o40L01r2k02K78J69l42N64l93N0K59n66m36J388l84r27Q39K74
$$ y = [593, -39, 2, 251, 558, 71, 4, 180, 90, 316, 328, 415, 162, 244, 208, 553, 218, -205, -36, 308, -168, -379, 113, 19, -16, -20, 143, 26, -149, -71, -57, -127, -138, 199, 14, -31, -41, 103, 69, -326, -411, -263, -163, -267, -199, 248, -13, -239, 400, 42, -631, 270, 314, -245, -119, 88, -376, 72, -90, -797, 368, 332, -440, 65, 126, -272, 596, 644, -397, -343, 465, 96, -81, 265, -408, 94, 356, -317, -135, 292, -186, 142, 579, -233, 39, 412, 2, -43, 360, -17, 280, 42, -371, 115, 366, -155, -185, 297, -50, 430, 58, -332, 11, 207, 44, 324, 71, -478, 72, 326, -478, -239, 9, -432, 198, 141, -534, -72, 256, -539, 151, 141, -331, 180, 371, -709, -344, -22, -558, -296, -795, -617, 170, -167, -628, -478, 37, -370, -69, 69, -484, 97, -4, -41, -159, -438, -195, -70, -390, -493, 112, 447, -193, 108, 16, -186, 92, 261, -81, 483, 90, 140, 399, -167, -603, 785, 401, -526, 313, 587]
2104E87l69n9rl12O55O7m42N83m39l26P13n39o14Q89M34m54j46o6l18N61j44l12
2126f0Q34m32J11P9o13j92P15k50n77K13J06K14K7l91k26P13o42K05O57k85o92
2147d86J040n46p92O31K04m16O13m70l34O43j40n29Q62m07l05R02l28o42L14J38
2167d8o42P21n60N1O90k70m31Q60l01l81N31l54k40Q87o29p4L65n95K7R68q17
2188b42j89J040n65l12P88q01L4J021q17k05J011j028j20J031o79m08R79o79k60
2207d01Q96o48j68P43o93J04P13m09n08P84j50q32N41j20k28M92k59k7K08m62
2227d24O76L4q91K51Q00m18j37K13o49M24K79o05ON74m05K93N34j436N0J683j340
2248d88q4J262r91j85J287j232l29R25l52k65Q03q30k81J627q46o45J063P3o99
$$ y = [587, 218, 159, 150, -162, 493, 560, 118, 701, 262, -64, 649, 110, -504, 385, 819, 365, 219, 153, -165, 396, 252, -60, 774, 342, 453, 532, -81, -273, 442, 192, -385, -172, -66, 148, 175, -216, -442, 271, -371, -166, 491, 206, -486, 554, 8, -784, -153, 51, -365, 248, -222, -556, 87, -53, -582, 280, -127, -432, 470, 142, -500, -186, -48, -690, 31, -529, -478, 212, -58, -489, 371, 70, -311, 220, -134, -374, 513, -116, -190, 175, -420, -393, 575, -242, -431, 609, 44, -268, 520, -281, -247, 774, -43, -248, 763, -265, -385, 646, -33, -441, 538, -141, -401, 495, -153, -321, 422, -271, -167, 546, 137, -371, 413, 263, -569, -28, -148, -376, 116, -143, -170, 38, -424, 252, 286, -605, -354, 446, 28, -109, 104, -545, -121, 158, -447, -441, 133, -272, 21, 555, -881, -831, 852, -488, -572, 690, -301, -486, 801, -431, -760, 165, -187, -452, 351, -479, -760, 867, 21, -624, 439, 512, -187]
2267a87Q42m96l63M31q2m92N89o75L74R40j050k37Q11l23R0M85m94R9L41m38M88
2288F53j80j064P06N26j072J92J029j122K32R33j199J42J006q43k66J308j186
2305b05m24J622j093o53J302n96n14J040l99q77J164k32m73O15k45n58R79K2r13
2324d38J32o4L05J93q25m8N63K5N30m25p13O59L24m83M53j45r77J049L18j300
2344h67L24R27j016K27P83j365M57J428j250l50J115n74J36Q60j307n60J983q59
2362I2m83P30o67l31J121j93j144J066J84j73J18n54k23N81L82n71K33J9j27Q2
2382A42J75l40p2K27Q2P9n12L55L72m15K9M18j107N50N57q05j0M88m12K83M42
2403E26n43N5M13o73Q3P64p64n56J291r5q94M76j05k83L46k65m33N27M10n75M15
$$ y = [-187, 655, 159, -204, 227, 145, -347, 242, -433, -59, 881, -169, -406, 405, 82, 172, 657, 163, 262, 603, 165, 653, 473, -591, 115, 641, -431, -239, 790, -332, -100, 833, -366, -224, 782, -61, -327, 981, -205, -629, 993, -100, -753, 549, -47, -561, 479, 80, -797, 367, 135, -338, 277, 32, -526, 453, 475, -438, -306, -370, -65, 128, -697, -745, -182, -157, 373, -52, -765, -106, 218, -265, 188, 43, -934, 115, 433, -867, -543, 384, -632, -405, 378, -987, -530, 898, -352, -702, 413, -161, -25, 835, -472, -1032, 951, 92, -391, 339, -328, -659, 462, 269, -875, 191, 375, 202, 320, -234, -457, 124, 506, -65, 168, 187, 60, 142, 317, -23, -95, 132, 214, 293, -219, 136, 508, 93, 122, 540, -567, -17, 540, -265, -275, 213, -199, 84, 526, -17, 38, 451, -222, -139, 625, -139, -695, 596, 501, -393, 83, -22, -305, 41, -224, -657, -130, 280, -295, 120]
2424A20n3m25M72O74j055k98Q66l13l67l7N33n42K26P12q71q8P20m3k44J51l56
2445b18K74M58l59l83L25R5k74J77k52m01M53M46l78J05K12jJ96k38m57K16K40
2466B36j82m04L31p5L60k84L1K50l83L67L25j040J09J020n49K07K59o19N7M46
2486D62o26k95O02n81l6J126r51k57J029m36m71P94j77q28M94o9o17R48m57k43
2506e89P43N9p90L81j51j80N77J3p16P78j95J10R8m76k60P77k93n99O06j96K0
2527b83M33k47j52N00L7m28M81n60l78R96l76m14O32L8p11J001l72p08Q97j78
2547B08o73J005l31n05J172l37r89J282o72n02N43p4n89O81J23m15P16k43o15
2566b15P72l65o82Q66J26o26K21L84n75M99l07l01M51l22m84P52l1k58M17N6n34
$$ y = [120, 67, -358, 114, 788, -267, -565, 301, -12, -379, -416, 117, -425, -199, 513, -358, -446, 274, 231, -13, 138, -218, 56, 514, 155, -228, 97, 192, -82, 95, -157, -558, -105, 341, -37, 68, 280, 279, 475, 237, -220, -4, 236, 54, -350, -19, -94, 266, -18, 13, 263, -120, 247, 572, -468, -359, 661, 112, 319, 578, -41, 16, 462, -164, -459, 143, -438, -474, 652, -299, -556, 473, 37, -434, 360, 183, -645, -151, -220, -837, 111, -346, -589, 154, 213, -577, -196, -347, -527, 50, 63, -653, 125, -70, 40, 138, -338, -598, 179, -114, -713, -107, -303, -283, 150, -97, -249, 251, 288, -140, 341, -219, -597, 399, 23, -391, 241, 279, -432, 569, 197, -511, 386, 208, -465, 540, 209, -296, 876, 539, -450, 832, 160, -342, 201, 127, -462, 219, 342, -73, 643, 400, -215, 557, 192, -490, 376, 502, -124, 97, 481, -94, 405, 98, -203, 248, -74, -558, 194, 163, -95, 322, 378, -156]
2587a56O14j15m81J71j79p8L98n48j15P00p1m31M76j37o17O11J30n27J13M40l07
2608a09K59l76rN67k59p65R48k56o65O49J75m92L57J11l87K96k12k47N18k62k92
2629d51O63j75p5K63j87l00O27l28l17M60j64j65N26n67q8N48N1o62P75m28k43
2650b37L22j65k45P36j88j24K47n40n6M06j36l61L86l77J16L42j95R2N53l49j14
2671A13Q4r5j19J81j54q3R5M0N8j24l26PM36m72J85M17l16k81O96n70k0N45o75
2694c78L30k46j53J42O40m91r8K91k10m8M32l05k39K43j27K17J73k84K29J20m76
2715b38J69L73l12k92L24k14J52Q1M3J85l9l14L84K7o48M20J46k93J01J28J97
2736C80k44L34m06N8L02q92L65P10p61J87M07m91m2O17l82l37K64l74L23L39m58
$$ y = [-156, 458, 343, -138, 33, -146, -224, 174, -374, -489, 211, 140, -291, 185, 48, -569, 42, 172, -355, -242, 198, -109, 150, -226, -235, 332, 73, -692, 256, 0, -665, -16, 159, -333, 24, 135, -252, 44, -168, -415, 103, -159, -451, 212, 37, -38, 225, 38, -262, 365, 37, -280, 180, 16, -149, 377, -190, -278, 270, 321, -341, 434, 6, -237, 85, -80, -325, 411, 223, 99, 346, -194, -250, 156, 20, -341, 45, -332, -216, 126, -69, 23, 576, 227, 113, 197, 102, -17, 164, 10, -73, 22, 62, 120, -4, -330, -323, 113, -359, -174, 243, -73, -354, 342, -228, -248, 297, -378, -48, -294, -447, -305, 335, -156, -254, 37, -173, -221, 211, -94, -333, -90, -217, 0, 173, -111, 118, 238, -238, -69, 304, -8, -300, 24, -190, -38, 43, 86, 271, 232, -82, 302, 329, -319, 101, 247, -46, 55, 183, 380, 136, 470, 64, 122, 424, -468, -103, 607, -154, 33, 440, -51, -93, 524, 142, -195, 69, -305, 18, 357, -101]
2757a01P6O29o74L2L85j70j84K36l55q2K18l38K19M2k57N18Kk28j37K12k38K05
2779A0J03o60L68L24n15M58j41q52P79J67n76K99L15l32L98J5n41J58N17p33L12
2800a27L64p79M18M48o10k60Q35m14L7K51m64j73Q30k27m61O03l7k29J96r2m65
2821c56N37j28J22l37J45j61j2M71J8j45n0o5L86n74K77j90J16K46l34l31J000
2842F35l03l04K35J13o47L97P23j125K22O18m54L0K70p41J34L11j47m52Q56m52
2862h1p2M74j07o59N34L05n07j62M9L22o7J69p5k85K18K9j44o9J88l24K87M39
2884D62q50K30P02l86n90R62o28k81O66j30o87N90k2j75M64j82k78L07K8l89K27
2905D0J17k92J99K43m61j93N44j16K1m8k53L73j34L01k81q8L54K2k09l44J27j63
$$ y = [-101, -25, 604, -70, -38, 347, 177, -7, 229, -126, -208, 10, -328, -109, -67, -324, 194, 196, -32, -169, 43, -195, 10, 113, -547, -179, 145, -370, 88, -53, -905, -126, 41, -535, -236, 79, -253, 145, 160, -381, -223, 294, -439, -127, 237, -542, -124, 324, -286, -546, 289, -125, -88, 163, -301, -474, 356, 129, -332, 271, 234, 5, 201, 109, -356, 181, 53, 175, -162, -17, -178, -190, 281, 299, 154, 104, 39, 425, -149, 128, -62, 54, 300, -34, -365, 635, 332, 28, 263, 376, -271, 126, 849, -276, -54, 564, 110, 140, 410, -331, -197, 114, -33, -485, 371, -81, -153, 321, 214, -445, 89, 394, -113, -275, -226, 96, 29, 198, 123, -162, 56, 85, -59, -128, 60, -264, 23, 462, -388, -158, 544, 158, -432, 530, -98, -379, 287, 157, -530, 60, 38, -137, 327, 145, -133, 174, 202, -187, 40, 157, -135, 64, 307, -154, -347, 197, 81, 102, 54, -199, 174, 40, 341, 60, -28, 326, 348, 139, -205, -78, -241]
2927b41M06K40p86O56K58p23L25K38p13r9R61r69j36R34l48o8L17m64j96P41m45
2948a12j75N99m82J6K79j08o37N43M10l77J23n6m26K48M8Q9J6j12J25P0o9j77
2970a65J81j68j06pm23M67L09l08J32K18p26M27N19o66J23L19n99L20O66p87J09
2991a65Q97p38k15M07j51k43P85p15k71Q29k74n5N40p19j93M04J49k50K95j19
3011A98j97M22k10p1r2K6J44K70l17n09P43k28n17N52n8J2L59n84L73R7o01J77
3033a1M08q65J95R89n14l06J58L7m51N45m21L3N09l38p8L86o18j40P17l35n21
3054f21P09j44k69O35k77j49L20l21j86J44q6nM86l08l01N12k01J8JK4j97K38
3076B2m21L43J75j99MK56m05pM17n14J09N89l61k09N34m55J86M52n35j50M74k18
$$ y = [-241, 165, 405, -381, 275, 533, -190, 135, 373, -340, -439, 522, -447, -583, 351, 3, -65, 252, -212, -408, 333, -112, -287, 312, -170, -154, 125, 17, -620, -77, 333, -44, 79, 23, -403, -155, -107, -18, -2, -114, 11, 81, 12, -165, 16, -152, -258, -265, -688, -221, 88, -220, -88, 130, -596, -169, 350, -316, -193, 126, -473, -153, 513, -274, -165, 732, -6, -221, 186, 35, -208, 577, -138, -409, 420, 146, 91, 631, -88, -281, 123, 272, 22, 317, 198, 1, 423, 213, 142, 50, 76, 220, 490, 173, -336, 407, 179, -338, 214, 156, 168, 527, -57, 316, 413, -188, -11, 397, -468, -273, 716, 202, -104, 54, 91, -360, 185, -236, -203, 306, -32, -110, 276, -342, -482, 235, -100, -621, 88, -56, -325, 310, 33, -116, 204, -117, -303, -159, -245, -250, 236, -72, -373, 139, -62, -44, -43, -19, -216, 22, -399, -56, 119, -80, -76, 180, -225, -232, 185, -329, -220, 369, 8, -201, 333, -122, 64, 516, -19, -169, 305, 87]
$$ [...]
8191g7
##END NTUPLES=NMR FID
##END=
