##TITLE=1H_SL69-SePh-f4
 CDCl3+DMSO, 8 sc, 
 1.4.2019
##JCAMPDX= 6.0         $$ Bruker NMR JCAMP-DX V2.0
##DATA TYPE= NMR FID
##DATA CLASS= NTUPLES
##ORIGIN= UXNMR, Bruker Analytische Messtechnik GmbH
##OWNER= root
$$ XWIN-NMR		Version 3.5
$$ Mon Apr  1 16:30:51 2019 Russian Standard Time (UT+4h)  she@DPX200
##.OBSERVE FREQUENCY= 200.1316
##.OBSERVE NUCLEUS= ^1H
##.DELAY= (6, 6)
##.ACQUISITION MODE= SIMULTANEOUS
##.ACQUISITION SCHEME= undefined
##.AVERAGES= 8
##.DIGITISER RES= 18
##SPECTROMETER/DATA SYSTEM= spect
##.PULSE SEQUENCE= zg30
##.SOLVENT NAME= CDCl3
##.SHIFT REFERENCE= (INTERNAL, CDCl3, 0, 15.7039)
##AUDIT TRAIL= $$ (NUMBER, WHEN, WHO, WHERE, WHAT)
$$ ##TITLE= Audit trail, XWIN-NMR		Version 3.5
$$ ##JCAMPDX= 5.01
$$ ##ORIGIN= Bruker BioSpin GmbH
$$ ##OWNER= she
$$ F:/spectra/data/she/nmr/H-F/1/audita.txt
$$ ##AUDIT TRAIL=  $$ (NUMBER, WHEN, WHO, WHERE, WHAT)
(   1,<2019-04-01 16:29:23.39 +0400>,<she>,<DPX200>,
      <created by zg, POWCHK disabled, PULCHK disabled
       configuration hash MD5:
       00 E9 B6 7A A2 85 ED C7 34 08 36 98 17 FE 4E 26
       data hash MD5: 16K
       60 C0 F5 6C 72 54 6A 52 68 BD 73 2D FC CC 86 68>)
$$ ##END=
$$ 
$$ hash MD5
$$ 3D B9 5D 66 A4 B4 92 C7 9C C2 B3 ED CB A5 E5 3D
##$RELAX= 
##$RELAX= 
##$RELAX= 
##$RELAX= 
##$RELAX= 
##$RELAX= 
$$ Bruker specific parameters
$$ --------------------------
##$DU= <F:/spectra>
##$EXPNO= 1
##$NAME= <H-F>
##$PROCNO= 1
##$TYPE= <nmr>
##$USER= <she>
##$AMP= (0..31)
100 100 100 100 100 100 100 100 100 100 100 100 100 100 100 100 100 100 
100 100 100 100 100 100 100 100 100 100 100 100 100 100 
##$AQSEQ= 0
##$AQ_mod= 1
##$AUNM= <au_zg>
##$AUTOPOS= <>
##$BF1= 200.13
##$BF2= 200.13
##$BF3= 200.13
##$BF4= 200.13
##$BF5= 200.13
##$BF6= 200.13
##$BF7= 200.13
##$BF8= 200.13
##$BYTORDA= 1
##$CFDGTYP= 0
##$CFRGTYP= 5
##$CHEMSTR= <none>
##$CNST= (0..31)
1 1 145 1 1 1 1 1 1 1 1 1 1 1 1 1 1 1 1 1 1 1 1 1 1 1 1 1 1 1 1 1 
##$CPDPRG= <>
##$CPDPRG1= <>
##$CPDPRG2= <>
##$CPDPRG3= <>
##$CPDPRG4= <mlev>
##$CPDPRG5= <mlev>
##$CPDPRG6= <mlev>
##$CPDPRG7= <mlev>
##$CPDPRG8= <mlev>
##$CPDPRGB= <>
##$CPDPRGT= <>
##$D= (0..31)
0 1.2 0 0 0 0 0 0 0 0 0 0.03 0 0 0 0 0 0 0 0 0 0 0 0 0 0 0 0 0 0 0 0 
##$DATE= 1554121762
##$DBL= (0..7)
120 120 120 120 120 120 120 120 
##$DBP= (0..7)
150 150 150 150 150 150 150 150 
##$DBP07= 0
##$DBPNAM0= <>
##$DBPNAM1= <>
##$DBPNAM2= <>
##$DBPNAM3= <>
##$DBPNAM4= <>
##$DBPNAM5= <>
##$DBPNAM6= <>
##$DBPNAM7= <>
##$DBPOAL= (0..7)
0.5 0.5 0.5 0.5 0.5 0.5 0.5 0.5 
##$DBPOFFS= (0..7)
0 0 0 0 0 0 0 0 
##$DE= 6
##$DECBNUC= <off>
##$DECIM= 24
##$DECNUC= <off>
##$DECSTAT= 4
##$DIGMOD= 1
##$DIGTYP= 9
##$DL= (0..7)
0 120 120 120 120 120 120 120 
##$DP= (0..7)
150 150 150 150 150 150 150 150 
##$DP07= 0
##$DPNAME0= <>
##$DPNAME1= <>
##$DPNAME2= <>
##$DPNAME3= <>
##$DPNAME4= <>
##$DPNAME5= <>
##$DPNAME6= <>
##$DPNAME7= <>
##$DPOAL= (0..7)
0.5 0.5 0.5 0.5 0.5 0.5 0.5 0.5 
##$DPOFFS= (0..7)
0 0 0 0 0 0 0 0 
##$DQDMODE= 0
##$DR= 18
##$DS= 0
##$DSLIST= <SSSSSSSSSSSSSSS>
$$ [...]
##$SUBNAM2= <"">
##$SUBNAM3= <"">
##$SUBNAM4= <"">
##$SUBNAM5= <"">
##$SUBNAM6= <"">
##$SUBNAM7= <"">
##$SUBNAM8= <"">
##$SUBNAM9= <"">
##$SW= 24.9336934301222
##$SWIBOX= (0..15)
0 0 2 0 0 0 0 0 0 0 0 0 0 0 0 0 
##$SW_h= 4990.01996007984
##$TD= 16384
##$TD0= 1
##$TE= 0
##$TE2= 300
##$TE3= 300
##$TEG= 300
##$TL= (0..7)
0 120 120 120 120 120 120 120 
##$TP= (0..7)
150 150 150 150 150 150 150 150 
##$TP07= 0
##$TPNAME0= <>
##$TPNAME1= <>
##$TPNAME2= <>
##$TPNAME3= <>
##$TPNAME4= <>
##$TPNAME5= <>
##$TPNAME6= <>
##$TPNAME7= <>
##$TPOAL= (0..7)
0.5 0.5 0.5 0.5 0.5 0.5 0.5 0.5 
##$TPOFFS= (0..7)
0 0 0 0 0 0 0 0 
##$TUNHIN= 0
##$TUNHOUT= 0
##$TUNXOUT= 0
##$USERA1= <user>
##$USERA2= <user>
##$USERA3= <user>
##$USERA4= <user>
##$USERA5= <user>
##$V9= 5
##$VALIST= <valist>
##$VCLIST= <CCCCCCCCCCCCCCC>
##$VD= 0
##$VDLIST= <DDDDDDDDDDDDDDD>
##$VPLIST= <PPPPPPPPPPPPPPP>
##$VTLIST= <TTTTTTTTTTTTTTT>
##$WBST= 1024
##$WBSW= 4
##$XGAIN= (0..3)
0 0 0 0 
##$XL= 0
##$YL= 0
##$YMAX_a= 218274
##$YMIN_a= -396274
##$ZGOPTNS= <>
##$ZL1= 120
##$ZL2= 120
##$ZL3= 120
##$ZL4= 120
##$ABSF1= 10
##$ABSF2= 0
##$ABSG= 5
##$ABSL= 3
##$ALPHA= 0
##$AQORDER= 0
##$ASSFAC= 0
##$ASSFACI= 0
##$ASSFACX= 0
##$ASSWID= 0
##$AUNMP= <proc_1d>
##$AZFE= 0.1
##$AZFW= 0.1
##$BCFW= 1
##$BC_mod= 2
##$BYTORDP= 1
##$COROFFS= 0
##$CY= 11.3945322036743
##$DATMOD= 1
##$DC= 2
##$DFILT= <>
##$DTYPP= 0
##$F1P= 18.9103706918063
##$F2P= -1.10871071338519
##$FCOR= 0.5
##$FTSIZE= 0
##$FT_mod= 4
##$GAMMA= 1
##$GB= 0.15
##$INTBC= 1
##$INTSCL= 1
##$ISEN= 128
##$LB= 0.24
##$LEV0= 0
##$LPBIN= 0
##$MAXI= 10000
##$MC2= 0
##$MEAN= 0
##$ME_mod= 0
##$MI= 1.114404
##$NCOEF= 0
##$NC_proc= 0
##$NLEV= 6
##$NOISF1= 3.799351
##$NOISF2= 2.8
##$NSP= 1
##$NTH_PI= 0
##$NZP= 0
##$OFFSET= 15.70392
##$PC= 1
##$PHC0= -9214.807
##$PHC1= 18.40025
##$PH_mod= 1
##$PKNL= yes
##$PPARMOD= 0
##$PSCAL= 0
##$PSIGN= 0
##$REVERSE= no
##$SF= 200.130013532006
##$SI= 16384
##$SIGF1= 3
##$SIGF2= 2
##$SINO= 400
##$SIOLD= 16384
##$SREGLST= <1H.CDCl3>
##$SSB= 0
##$STSI= 0
##$STSR= 0
##$SW_p= 3612.71676300578
##$SYMM= 0
##$S_DEV= 0
##$TDeff= 0
##$TDoff= 0
##$TI= <>
##$TILT= no
##$TM1= 0
##$TM2= 0
##$TOPLEV= 0
##$USERP1= <user>
##$USERP2= <user>
##$USERP3= <user>
##$USERP4= <user>
##$USERP5= <user>
##$WDW= 1
##$XDIM= 8192
##$YMAX_p= 0
##$YMIN_p= 0
$$ End of Bruker specific parameters
$$ ---------------------------------
##NTUPLES= NMR FID
##VAR_NAME=  TIME,          FID/REAL,        FID/IMAG
##SYMBOL=    X,             R,               I
##VAR_TYPE=  INDEPENDENT,   DEPENDENT,       DEPENDENT
##VAR_FORM=  AFFN,          ASDF,            ASDF
##VAR_DIM=   8192,          8192,            8192
##UNITS=     SECONDS,       ARBITRARY UNITS, ARBITRARY UNITS
##FACTOR=    0.0002004,     1,               1
##FIRST=     0,             0,               0
##LAST=      1.6414764,     0,               0
##MIN=       0,             -396274,         0
##MAX=       1.6414764,     218274,          0
$$ Real data points
##PAGE= N=1
##DATA TABLE= (X++(R..R)), XYDATA
$$ plain form
0 0 0 0 0 0 8 -8 8 -8 16 -16 23 -24 32 -40 48 -56 69 -80 96 -116 136 -156 181 -211 241 -276 316 -358
28 -358 406 -461 518 -582 654 -730 814 -909 1012 -1124 1248 -1381 1532 -1697 1875 -2077
44 -2077 2300 -2553 2835 -3157 3525 -3955 4458 -5063 5800 -6726 7933 -9569 11930 -15666
58 -15666 22466 -38872 160054 34685 -328414 -31353 155743 52005 -36286 45208 -27326
69 -27326 -75600 10069 31819 -79164 -30143 42880 -61614 -101874 93688 100062 -145202 -157147
81 -157147 95878 106738 -63265 -22365 81019 -31648 -86081 64970 92828 -52459 -32513
92 -32513 79580 7426 -76256 29441 68410 -54474 -50768 67749 15544 -80537 15169 83601
104 83601 -40221 -75501 50713 43695 -57095 17673 105627 -21546 -106105 32654 95208
$$ packed form
0@%%%%Qj6J6j6K4l2L9m7N6p2Q8j04J25j49J76k12K52k92L37l92M52n17N92o74
28c58P64q67R79j100J236j384J544j723J921k136K372k629K913l229L572l952
44b077M377m853N388n992O682p480Q413r521J0863j2526J4659j7502K1499k7596
58a5666L8132o1338J98926j25369l63099K97061J87096j03738q8291Q1494p2534
69b7326m8274Q5669K1750j10983M9021P3023j04494m0260J95562O374k45264j1945
81a57147K53025J0860j70003M0900J03384j12667n4433J51051K7858j45287J9946
92c2513J12093p2154q3682J05697L8969j22884L706J18517n2205r6081R5706O8432
104H3601j23822l5280J26214p018j00790P4768Q7954j27173q4559J38759O2554
$$ plain form
115 95208 -24254 -38060 53381 8055 -65476 14569 52693 -59093 -72518 44463 41151 -44204
127 -44204 -17957 2018 -77668 -46749 94865 61467 -86753 -48485 69166 11254 -63219
138 -63219 28261 84412 -6103 -37817 28614 25294 -14432 15595 18428 -33693 3581 70863
150 70863 -4933 -93315 -13418 67204 -6959 -52139 22142 27589 -52196 -32875 43883 18213
162 18213 -33547 -223 23438 -8761 -99 28925 -9110 -31663 26824 40362 -25852 -28667
174 -28667 30137 12781 -38756 -8287 26309 -13653 -27318 17922 11277 -35030 -12554 27607
186 27607 -1866 -24555 14586 23941 -13767 -8352 21876 2488 -13065 20088 24170 -13917 -6778
199 -6778 24528 -1073 -28091 9022 31246 -8075 -23188 4647 -347 -19948 4352 18215
$$ packed form
115I5208j19462j3806R1441m5326p3531Q0045L8124j11786j3425J16981l312q5355
127d4204K6247J9975p9686L0919J41614l3398j48220L8268J17651n7912p4473
138f3219R1480N6151r0515l1714O6431l320l9726L0027K833n2121L7274O7282
150G0863p5796q8382P9897Q0622p4163m5180P4281N447p9785J9321P6758k5670
162A8213n1760L3324K3661l2199Q662K9024l8035k2553N8487J3538o6214k815
174b8667N8804j7356n1537L0469L4596l9962j3665M5240o645m6307K2476M0161
186B7607k9473k2689L9141R355l7708N415L0228j9388j5553L3153M082l8087P139
199f778L1306k5601k7018L7113K2224l9321j5113K7835m994j9601K4300J3863
$$ plain form
211 18215 -15677 -22493 14688 12345 -20552 -8927 14279 -2329 -7959 17752 8749 -24354 -9311
224 -9311 21040 5079 -11291 9283 8423 -19298 -7244 22588 4147 -20796 2527 19525 -3664
237 -3664 -9229 10443 2566 -11478 9609 19796 -8051 -12493 14046 8502 -15015 -914 15955
250 15955 -7106 -17472 8060 9089 -18871 -13009 10093 -1491 -16281 61 5057 -12306 -4829
263 -4829 14258 -1473 -17061 5633 19517 -2676 -6042 15157 8102 -10787 4358 20735 451
276 451 -9617 10948 11701 -9288 -5728 8068 -2695 -8703 8171 5224 -17875 -12082 8744 -910
290 -910 -14575 1676 9786 -10061 -12666 6315 2971 -10398 1707 13038 -2377 -9318 5000
303 5000 5070 -6471 2865 13060 -800 -8403 6960 8539 -7551 -3094 12317 4814 -7644 1340
$$ packed form
211A8215l3892o816L7181k343l2897J1625K3206j6608n630K5711r003l3103J5043
224i311L0351j5961j6370K0574q60k7721J2054K9832j8441k4943K3323J6998k3189
237c664n565J9672p877j4044K1087J0187k7847m442K6539n544k3517J4101J6869
250A5955k3061j0366K5532J029k7960N862K3102j1584j4790J6342M996j7363P477
263d829J9087j5731j5588K2694J3884k2193l366K1199p055j8889J5145J6377k0284
276D51j0068K0565P53k0989L560J3796j0763o008J6874k947k3099N793K0826r654
290i10j3665J6251Q110j9847k605J8981l344j3369J2105J1331j5415o941J4318
303E000P0j1541R336J0195j3860p603J5363J579j6090M457J5411p503j2458Q984
$$ plain form
317 1340 6854 -3627 -3166 8091 2268 -8273 1 6613 -4770 -6638 5569 2054 -11167 -5688
331 -5688 5169 -1397 -7437 645 1892 -7272 -4319 4451 -578 -4206 5328 7529 -3984 -4713 5995
346 5995 5511 -486 5139 8403 -452 -3098 3454 2947 -1480 3491 5966 -3132 -6926 201 -80 -6641
362 -6641 -2566 4922 -846 -8245 -4301 -895 -3421 -834 3433 -293 -3967 194 2439 -1180 445
377 445 4839 2964 -606 2661 3986 -955 -911 4832 3866 -1971 -387 2463 -209 -1393 1391 910
393 910 -3280 -2071 921 -595 -2028 -578 -1409 -4408 -2077 1078 -1185 -2783 566 1393 -2663 -3433
409 -3433 288 1981 1541 2255 1186 -1916 -869 2284 2513 1897 3142 2937 -100 -640 1478 1742 -33
426 -33 1569 3199 114 -3148 -2854 -1215 -972 430 793 -2487 -4506 -3518 -1686 -1437 -606 305 -1014
$$ packed form
317A340N514j0481M61J1257n823j0541Q274O612j1383j868J2207l515j3221N479
331e688J0857o566o040Q082J247r164K953Q770n029l628R534K201j1513p29J0708
346E995m84n997N625L264q855k646O552n07m427M971K475r098l794P127k81o561
362f641M075P488n768p399L944L406k526K587M267l726l674M161K245l619J625
377D45M394j875l570L267J325m941M4N743r66n837J584K850k672j184K784m81
393I10m190J209K992j516j433J450q31k999K331L155k263j598L349Q27m056p70
409c433L721J693m40P14j069l102J047L153K29o16J245k05l037n40K118K64j775
426c3J602J630l085l262K94J639K43J402L63l280k019R88J832K49Q31R11j319
$$ plain form
443 -1014 -2009 -1196 -344 -428 1508 3491 2076 -330 943 2685 2048 1321 2325 2389 1198 1613 1339 211
461 211 -633 583 1640 -256 -1830 -1558 -1421 -912 -1386 -1825 -2265 -1916 -1500 -1545 -734 -65 -1248 -3375 -1852
480 -1852 1254 2115 490 -51 1149 365 -1136 580 3973 4104 1372 -389 1279 2065 1122 115 1325
497 1325 2475 1977 41 -2084 -2245 -1059 -108 465 457 -860 -3866 -5526 -2623 814 584 -1480 -1792
514 -1792 -1087 -1647 -1710 -694 -63 975 2429 1760 -97 -214 1774 2029 1060 2219 3780 2120 -164
531 -164 133 604 568 333 840 340 -668 -1135 -2664 -2640 -465 1254 -1817 -4453 -1462 1681 -313 -3667
549 -3667 -2298 354 911 1138 772 -714 -51 590 -14 105 3164 3702 -632 -1957 2687 4331 -475
566 -475 -2476 1554 3540 1490 -870 -1235 -1670 -387 575 -211 -619 703 -911 -4607 -3072 1694 735
$$ packed form
443a014r95Q13Q52q4J936J983j415k406J273J742o37p27J004O4j191M15k74j128
461B11q44J216J057j896j574K72J37N09m74m39m40L49M16m5Q11O69j183k127J523
480a852L106Q61j625n41J200p84j501J716L393J31k732j761J668P86r43j007J210
497A325J150m98j936k125j61J186R51N73qj317l006j660K903L437k30k064l12
514a792P05n60o3J016O31J038J454o69j857j17J988K55r69J159J561j660k284
531a64K97M71l6k35N07n00j008m67j529K4K175J719l071k636K991L143j994l354
549c667J369K652N57K27l66j486O63O41o04J19L059N38m334j325M644J644m806
566d75k001M030J986k050k360l65m35J283R62p86m08J322j614l696J535M766r59
$$ plain form
583 735 -3411 -1667 1885 -343 -3841 -2368 1018 1443 1744 2112 130 -1026 1201 1647 199 2200
599 2200 4798 1661 -1729 697 2845 -676 -1792 2139 3323 -890 -2544 -1980 -3280 -1280 1849
614 1849 -368 -4718 -2540 923 -1369 -3911 -361 1720 -1081 -1358 2476 1108 -1738 30 3048
629 3048 1927 1457 2834 582 -1446 3000 5062 -389 -3300 1787 3795 -687 -1266 685 -1232 -2742
645 -2742 -378 -69 -2510 -1260 1430 -1927 -4850 -826 782 -2967 -3078 3354 2102 -4118 -3277 1746
661 1746 1844 280 1822 1865 -728 300 2330 -110 -155 4257 4250 -1481 -633 3709 905 -3421 571 5488
679 5488 1280 -3113 -1733 -773 -2712 -23 1616 -1502 -4262 -1779 -1302 -3395 -1371 998 -2154 -3883
695 -3883 660 2158 -2107 -2091 2458 2682 -401 812 3262 934 153 4177 4221 254 352 2249 1411
$$ packed form
583G35m146J744L552k228l498J473L386M25L01L68j982j156K227M46j448K001
599B200K598l137l390K426K148l521j116L931J184m213j654N64j300K000L129
614A849k217m350K178L463k292k542L550K081k801k77L834j368k846J768L018
629C048j121m70J377k252k028M446K062n451k911N087K008m482n79J951j917j510
645b742K364L09k441J250K690l357k923M024J608l749j11O432j252o220Q41N023
661A746R8j564J542M3k593J028K030k440m5M412pn731Q48M342k804m326L992M917
679E488m208m393J380R60j939K689J639l118k760K483M77k093K024K369l152j729
695c883M543J498m265J6M549K24l083J213K450k328p81M024M4l967R8J897q38
$$ plain form
712 1411 715 2752 1511 -2655 -1861 1150 -1375 -3307 -731 537 -2930 -4077 -1892 -2265 -2712 388
728 388 1755 -2429 -3512 275 1695 -633 355 2751 1377 -708 935 1904 879 1599 3391 1307
744 1307 332 1581 313 -1945 569 3870 664 -3197 -1308 1356 -454 -1862 159 155 -1828 -1709
760 -1709 -794 -1372 -696 617 -868 -2463 -631 882 -1126 -1643 1907 2141 -1445 -1465 1667 2067 255
777 255 1152 2300 794 507 1310 1155 562 2336 2357 -616 -1100 817 123 -1957 128 2021 -744 -3736
795 -3736 -2392 -969 -1246 -1079 36 -1734 -2342 -847 -218 -1602 -142 2452 932 -1385 892 2517
811 2517 424 -126 2311 3313 1861 858 100 -386 1335 3297 805 -2318 -1038 1683 -490 -2774
827 -2774 -1004 175 -1612 -2047 -189 -947 -2422 -1398 -491 -394 -619 640 -472 -1364 1507 2254 -432
$$ packed form
712A411o96K037j241m166P94L011k525j932K576J268l467j147K185l73m47L100
728C88J367m184j083L787J420k328R88K396j374k085J643R69j025P20J792k084
744A307r75J249j268k258K514L301l206l861J889K664j810j408K021mj983J19
760a709R15n78O76J313j485j595J832J513k008n17L550K34l586k0L132M00j812
777B55Q97J148j506k87Q03j55n93J774K1k973m84J917o94k080K085J893k765k992
795c736J344J423k77J67J115j770o08J495O29j384J460K594j520k317K277J625
811B517k093n50K437J002j452j003p58m86J721J962k492l123J280K721k173k284
827b774J770J179j787m35J858p58j475J024R07R7k25J259j112q92K871P47k686
$$ plain form
844 -432 -1563 1394 2551 967 289 1722 425 -237 1029 1332 232 574 1587 127 -1654 -254
860 -254 740 -1151 -789 1036 16 -2563 -1725 -72 -1230 -1781 8 687 -1358 -2186 -598 -365 -777
877 -777 670 612 -421 515 1713 288 -935 1541 3175 1210 -38 1538 2027 -414 -57 2175 1352
894 1352 118 12 -300 -1004 -870 -236 -1354 -2716 -445 250 -2152 -3457 -1364 -445 -1353 -1190 -11
911 -11 -280 -307 508 230 -79 1090 2280 1216 353 1979 2124 131 171 1946 2346 660 -369 513 30
930 30 -934 -358 -427 -1411 -745 -5 -1203 -2371 -1181 -592 -1362 -962 161 -206 -1732 -1268 281 -132 152
949 152 881 670 -161 154 1064 300 91 1330 1590 1063 950 1059 125 -349 1373 2046 493 -254 -271 -201
969 -201 -588 -227 -80 -933 -1229 -539 -738 -1732 -1479 -1143 -1468 -750 149 -456 -2128 -1680 837 1283 -96
$$ packed form
844d32j131K957J157j584o78J433j297o62J266L03j100L42J013j460j781J400
860b54R94j891L62J825j020k579Q38J653j158n51J789O79k045q28J588K33m12
877g77J447n8j033R36J198j425j223K476J634j965j248J576M89k441L57K232q23
894A352j234j06l12p04J34O34j118j362K271O95k402j305K093R19r08J63J179
911a1k69k7Q15k78l09J169J190j064q63J626J45j993M0J775M00j686j029Q82m83
930C0r64N76o9r84O66P40j198j168J190N89p70M00J123l67j526M64J549m13K84
949A52P29k11q31L15R10p64k09J239K60n27j13J09r34m74J722O73j553p47j7P0
969b01l87L61J47q53k96O90j99r94K53L36l25P18Q99o05j672M48K517M46j379
$$ plain form
988 -96 -78 594 886 1427 1618 496 636 1746 1948 1141 658 1359 557 5 57 519 -76 -753 -1089 -546 -819
1009 -819 -1523 -1669 -2053 -1116 -41 -599 -2163 -1642 -310 -730 -997 208 1235 591 105 -35 737 1015
1027 1015 1483 1345 1243 1434 1328 365 -456 898 1880 1336 167 -464 -737 -978 -238 87 -480 -1002 -1101
1046 -1101 -1178 -2017 -1188 -867 -993 -879 237 154 -1325 -1714 -173 1029 1086 1000 248 -103 270 1444 1271
1065 1271 867 1398 1178 423 280 1393 1363 -230 -242 836 585 -402 -632 -909 -599 -397 -708 -1561 -1840
1084 -1840 -543 -333 -1394 -1652 -794 -906 -1245 -395 609 232 158 367 234 503 1172 1464 1053 1462 1654
1103 1654 962 -490 269 2087 1792 477 -226 -31 -56 -562 133 -310 -1139 -892 -1055 -1545 -1171 -753 -1265
1122 -1265 -1731 -793 98 -610 -1801 -1013 24 649 347 93 -132 378 1333 1582 814 484 1117 1036 733
$$ packed form
988i6J8O72K92N41J91j122J40J110K02q07m83P01q02n52N2M62n95o77l36N43k73
1009h19p04j46l84R37J075n58j564N21J332m20k67J205J027o44m86j40P72K78
1027A015M68j38j02J91j06r63q21J354R82n44j169o31k73k41P40L25n67n22r9
1046a101p7q39Q29L21j26J14J116q3j479l89J541J202N7q6p52l51L73J174j73
1065A271m04N31k20p55j43J113l0j593j2J078k51r87k30k77L10K02l11q53k79
1084a840J297K10j061k58Q58j12l39Q50J004l77p4K09j33K69O69K92m11M09J92
1103A654o92j452P59J818k95j315p03J95k5n06O95m43q29K47j63m90L74M18n12
1122a265m66R38Q91p08j191P88J037O25l02k54k25N10R55K49p68l30O33q1l03
$$ plain form
1141 733 1101 1599 630 -146 366 678 109 -199 -785 -1010 -111 22 -1497 -2170 -1045 333 -227 -1592 -1352
1160 -1352 -424 -368 -760 -319 202 860 -164 -513 173 1405 1410 414 307 1505 1330 447 -8 1257 1598
1179 1598 513 -91 372 744 -112 -773 -454 -107 218 -824 -1603 -1101 -118 -192 -1242 -1515 -624 -179 -829
1198 -829 -540 -307 42 456 241 247 124 881 1344 1134 930 503 420 761 1030 1529 662 -14 392 170 164 -102
1220 -102 -670 -765 -443 6 -262 -1294 -1692 -979 -326 -443 -696 -1068 -1677 -956 -117 205 43 -463 -194 331
1240 331 888 1197 532 559 1238 1629 804 558 730 1290 1046 437 703 146 -404 -356 -167 120 -602 -1413 -1003
1261 -1003 -503 -492 -943 -1479 -1249 -344 -752 -1146 -955 -273 235 -62 -37 -60 174 309 533 861 1386 922 823
1282 823 766 1034 1065 877 534 389 576 323 -296 -258 -553 -366 -117 -599 -611 -1148 -1308 -924 -189 -308 -1439
$$ packed form
1141G33L68M98r69p76N12L12n69l08n86k25Q99J33j519o73J125J378n60j365K40
1160a352R28N6l92M41N21O58j024l49O86J232Nr96j07J198j75q83m55J265L41
1179A598j085o04M63L72q56o61L19L47L25j042p79N02R83p4j050k73Q91M45o50
1198h29K89K33L49M14k15Oj23P57M63k10k04m27q3L41K69M99q67o76M06k22ok66
1220a02n68r5L22M49k68j032l98P13O53j17k53l72o09P21Q39L22j62n06K69N25
1240C31N57L09o65K7O79L91q25k46J72N60k44o09K66n57n50M8J89K87p22q11M10
1261a003N00J1m51n36K30R05m08l94J91O82N08k97K5k3K34J35K24L28N25m64r9
1282H23n7K68L1j88l43j45J87k53o19L8k95J87K49m82j2n37j60L84P35j19j131
$$ plain form
1303 -1439 -1133 -1080 -182 -116 -239 -286 -424 563 661 278 343 913 1062 1024 1117 1023 455 817 945 1023 767 354 -82
1326 -82 -59 107 360 -44 -1058 -781 -95 -946 -1744 -946 -446 -551 -872 -558 -1011 -666 -460 -72 209 577
1346 577 617 -137 -502 651 1288 995 825 1163 1380 539 739 1046 965 144 570 986 -339 -537 -436 -370
1366 -370 -574 -355 -672 -1404 -1182 -378 -882 -1297 -507 -310 -1046 -973 350 279 -768 -396 720 879 110 385
1386 385 869 613 1022 1397 676 -136 857 1280 589 22 314 204 -485 220 363 -206 -917 -154 -605 -1639
1406 -1639 -900 -93 -489 -1221 84 -374 -1419 -1434 -44 256 -324 -42 208 -215 227 1285 470 76 1163
1425 1163 2126 385 -73 1030 1218 561 236 1116 501 -547 -100 49 -350 -617 -111 -996 -1507 -392
1443 -392 -702 -1585 -1238 -129 -878 -1231 -276 722 -419 -590 205 287 -30 421 1151 1162 189 1054 660 400
$$ packed form
1303a439L06N3Q98O6j23m7j38R87R8l83O5N70J49l8R3r4n68L62J28P8k56m13m36
1326h2K3J66K53m04j014K77O86q51p98P98N00j05l21L14m53L45K06L88K81L68
1346E77M0p54l65J153O37k93j70L38K17q41K00L07q1q21M26M16j325j98J01O6
1366c70k04K19l17p32K22Q04n04m15P90J97p36P3J323p1j047L72J116J59p69K75
1386C85M84k56M09L75p21q12R93M23o91n67K92j10o89P05J43n69p11P63m51j034
1406a639P39Q07l96p32J305m58j045j5J390L00n80K82K50m23M42J058q15l94J087
1425A163R63j741m58J103J88o57l25Q80o15j048M47J49l99k67N06q85n11J115
1443c92l10q83L47J109p49l53R55R98j141j71P95Q2l17M51P30J1r73Q65l94k60
$$ plain form
1463 400 786 1116 493 -282 1187 1010 -1068 -652 781 577 -439 -1050 -576 -1145 -855 -215 -775 -1456 -887
1482 -887 -380 -1389 -948 -219 116 -626 105 1010 281 -452 378 929 789 1236 1259 104 -364 1337 1813
1501 1813 579 135 954 595 -471 118 387 -516 -683 396 -261 -1038 -527 -276 -1427 -1164 166 -340
1519 -340 -1555 -951 517 -190 -884 -264 -110 -101 219 755 432 -415 920 1487 434 361 1376 815 422
1538 422 916 1307 -275 -745 814 654 -36 -305 -91 -1023 -760 -192 -15 -1646 -1087 -429 -477 -1114 -219
1557 -219 -492 -1230 -30 1186 435 -1063 87 1194 466 517 1377 774 -164 549 1555 712 236 824
1575 824 915 -155 115 877 -308 -918 213 235 -974 -698 -426 -886 -1407 -139 24 -1565 -1063 279
1593 279 -188 -1165 -460 442 -243 220 880 307 -231 835 1165 604 285 1352 1214 -93 223 1465 641
$$ packed form
1463D00L86L30o23p75J469j77k078M16J433k04j016o11M74n69K90O40n60o81N69
1482h87N07j009M41P29L35p42P31R05p29p33Q30N51j40M47K3j155m68J701M76
1501A813j234m44Q19l59j066N89K69r03j67J079o57p77N11K51j151K63J330n06
1519c40j215O04J468p07o94O20J54RL20N36l23q47J335N67j053p3J015n61l93
1538D22M94L91j582m70J559j60o90k69K14r32K63N68J77j631N59O58m8o37Q95
1557b19k73p38J200J216p51j498J150J107p28N1Q60o03r38P13J006q43m76N88
1575H24R1j070K70P62j185o10J131K2j209K76K72m60n21J268J63j589N02J342
1593B79m67r77P05R02o85M63O60n73n38J066L30n61l19J067j38j307L16J242q24
$$ plain form
1612 641 -382 276 813 -252 -328 -238 -231 -796 -428 57 -1543 -1445 -296 -90 -1323 -673 -384 -763 -859 332
1632 332 657 -453 -100 734 430 587 971 935 139 250 1576 1125 226 213 1102 373 97 530 14 -760
1652 -760 -389 433 -414 -1077 -807 -735 -1444 -877 -350 -708 -1172 -443 79 -528 -603 160 95 -274 206 818 232
1673 232 250 736 836 669 885 1311 585 216 1112 975 2 -76 701 380 -335 -214 -35 -173 -691 -582 -927
1694 -927 -1301 -1001 -268 -492 -934 -552 -202 -479 -197 10 -48 -221 439 576 224 456 315 314 828 790 1014
1715 1014 525 435 1058 1085 728 219 298 68 -132 11 -62 -392 -577 -531 -378 -601 -835 -787 -583 -395 -599 -616
1737 -616 -764 -388 -142 -173 -424 -158 722 1026 534 649 514 684 805 983 790 447 492 529 629 21 158
1758 158 97 79 -223 -145 -332 -791 -814 -105 -564 -713 -613 -507 -825 -755 -344 -509 -841 -179 -26 -150 47 180
$$ packed form
1612F41j023O58N37j065p6R0Pn65L68M85j600R8J149K06j233O50K89l79r6J191
1632C32L25j110L53Q34l04J57L84l6p96J11J326m51q99j3Q89p29k76M33n16p74
1652g60L71Q22q47o63K70P2p09N67N27l58m64P29N22o07p5P63o5l69M80O12n86
1673B32J8M86J00j67K16M26p26l69Q96j37r73p8P77l21p15J21J79j38n18J09l45
1694i27l74L00P33k24m42L82L50k77K82K07n8j73O60J37l52K32j41jN14l8K24
1715A014m89r0O23K7l57n09P9k30k00J43p3l30j85M6J53k23k34M8K04J88k04j7
1737f16j48L76K46l1k51K66Q80L04m92J15j35J70J21J78j93l43M5L7J00o08J37
1758A58o1j8l02P8j87m59k3P09m59j49J00J06l18P0M11j65l32O62J53j24J97J33
$$ plain form
1780 180 470 195 264 929 921 612 674 947 758 559 802 675 -26 -6 476 108 -251 -469 -397 -789 -565 -471
1802 -471 -849 -926 -635 -537 -1060 -751 -296 -416 -459 -50 0 -32 -325 169 591 210 667 780 659 779 1137 770
1824 770 -176 441 746 547 -203 326 42 -264 -269 90 -705 -915 -519 -202 -706 -305 -599 -831 -700 -434 -214
1845 -214 -799 -870 -272 403 -23 1 262 83 257 858 753 176 549 1121 566 536 488 444 -2 180 629 166
1867 166 -343 -23 -276 -310 -205 -260 -466 -1012 -607 -278 -910 -634 -354 -615 -820 -321 322 -419 -215 479 425
1888 425 180 680 757 637 480 704 901 542 256 764 704 301 445 256 24 -519 269 -130 -808 -360 -356
1909 -356 -689 -939 -788 -599 -1223 -585 -35 -538 -469 -58 -121 -631 -109 562 474 -4 600 916 329 254 926
1930 926 729 490 773 1172 415 278 874 663 -492 -339 97 -436 -653 -119 -597 -951 -667 -494 -1083 -934
$$ packed form
1780A80K90k75O9O65ql09O2K73j89j99K43j27p01K0M82l68l59k18P2l92K24R4
1802d71l78p7K91R8n23L09M55j20m3M09N0l2k93M94M22l81M57J13j21J20L58l67
1824G70r46O17L05j99p50N29k84l06nL59p95k10L96L17n04M01k94k32J31K66K20
1845b14n85p1N98O75m26K4K61j79J74O01j05n77L73N72n55l0m8m4m46J82M49m63
1867A66n09L20k53l4J05n5k06n46M05L29o32K76K80k61k05M99O43p41K04O94n4
1888D25k45N00P7j20j57K24J97l59k86N08o0m03J44j89k32n43P88l99o78M48M
1909c56l33k50J51J89o24O38N50n03O9M11o3n10N22O71q8m78O04L16n87p5O72
1930I26j97k39K83L99p57j37N96k11j155J53M36n33k17N34m78l54K84J73n89J49
$$ plain form
1950 -934 -364 26 -581 -474 -1 -289 -204 112 283 14 406 856 780 256 322 886 783 419 794 515 103
1971 103 -103 418 164 -290 5 181 -557 -623 -50 -704 -883 -470 -498 -1195 -1154 -616 -343 -508 -437 -70 -496
1992 -496 -205 366 320 -97 409 1167 512 386 805 637 656 603 874 581 49 230 435 -242 44 90 394
2013 394 -199 -588 -185 -679 -491 -369 -450 -996 -902 -594 -488 -603 -321 -221 -602 -268 341 172 -145 279 529
2034 529 522 455 423 577 339 747 801 411 194 436 297 223 122 13 -97 -339 -436 -379 -534 -779 -626 -530 -781
2057 -781 -474 -649 -1015 -484 -401 -264 -531 -11 -145 132 117 204 520 435 565 823 371 338 616 527 275 226
2079 226 417 354 156 396 -200 -112 -220 -370 -451 -438 -791 -436 -939 -451 -295 -458 -623 -444 -339 -445 -300
2100 -300 -47 74 -171 -87 375 660 627 634 285 272 388 806 363 183 248 249 137 188 4 -31 -306 -101 -90 -421
$$ packed form
1950i34N70L90o07J07M73k88Q5L16J71k69L92M50p6n24O6N64j03l64L75k79m12
1971A03k06N21k54m54K95J76p38o6N73o54j79M13k8o97M1N38K73j65P1L67m26
1992d96K91N71m6m17N06P58o55j26M19j68J9n3K71k93n32J81K05o77K86M6L04
2013C94n93l89M03m94J88J22q1n46R4L08J06j15K82J00l81L34O09j69l17M24K50
2034E29po7l2J54k38M08N4l90k17K42j39p4j01j09j10k42r7N7j55k45J53R6k51
2057g81L07j75l66N31Q3J37k67N20j34K77j5Q7L16q5J30K58m52l3K78q9k52m9
2079B26J91o3j98K40n96Q8j08j50q1J3l53L55n03M88J56j63j65J79J05j06J45
2100c00K53J21k45Q4M62K85l3Pl49j3J16M18m43j80O5Jj12N1j84l5k75K05J1l31
$$ plain form
2124 -421 -328 -566 -516 -330 -595 -961 -639 -650 -326 -212 -194 -326 205 -169 100 355 378 230 506 420 637 720
2146 720 550 609 740 475 289 676 231 90 -86 121 -205 -195 -505 -502 -558 -362 -387 -739 -685 -438 -565 -339
2168 -339 -371 -69 6 25 58 177 38 126 126 72 673 450 640 602 400 477 593 271 251 167 498 -99 -134 -80 -268
2193 -268 -449 -13 -326 -826 -656 -483 -155 -536 -537 -488 -688 -205 -306 -95 -513 -316 66 99 410 188 16
2214 16 246 854 880 665 345 901 396 621 598 316 217 117 421 -44 -406 -468 -311 -250 -669 -886 -543 -973
2236 -973 -658 -696 -485 -620 -237 -123 -168 -161 -296 -212 -307 377 651 447 247 642 771 399 313 751 224 331
2258 331 360 398 24 31 182 -260 -134 -93 -110 -405 -437 -540 -316 -412 -842 -492 -411 -449 -154 -228 -389 -463 282 38
2282 38 29 536 378 64 730 769 463 236 592 589 532 602 276 254 81 179 560 110 -311 -223 120 -408 -305 -411
$$ packed form
2124d21R3k38N0J86k65l66L22j1L24J14J8j32N31l74K69K55K3j48K76q6K17Q3
2146G20j70N9J31k65j86L87m45j41j76K07l26J0l10Ln6J96k5l52N4K47j27K26
2168c39l2L02P5J9L3J19j39Q8%n4O01k23J90l8k02P7J16l22k0q4L31n97l5N4j88
2193b68j81M36l13n00J70J73L28l81jM9k00M83j01K11m18J97L82L3L11k22j72
2214A6K30O08K6k15l20N56n05K25k3k82r9j00L04m65l62o2J57O1m19k17L43m30
2236i73L15l8K11j35L83J14m5Pj35Q4r5O84K74k04k00L95J29l72q6M38n27J07
2258C31K9L8l74PJ51m42J26M1j7k95l2j03K24r6m30L50Q1l8K95p4j61p4P45k44
2282C8rN07j58l14O66L9l06k27L56ln7P0l26k2j73R8L81m50m21Q8L43n28J03j06
$$ plain form
2306 -411 -605 -595 -111 -197 -768 -743 -518 -371 -371 -100 -538 -101 79 570 442 204 389 765 457 602 620 167
2328 167 150 415 607 309 263 39 -46 -168 -52 231 -468 -379 -162 -196 -522 -570 -345 -526 -696 -374 -383 -557 -306
2351 -306 117 -101 -275 177 128 205 204 746 313 348 789 576 338 369 752 466 270 78 377 -7 -155 -309
2373 -309 -279 -638 -432 -195 -716 -782 -462 -218 -687 -622 -702 -442 -649 -87 -16 -389 -102 62 457 74 193 283
2395 283 95 780 835 420 250 587 313 534 362 681 294 -52 -247 60 -306 -483 -195 -186 -441 -565 -420
2416 -420 -690 -659 -650 -462 -397 -439 26 -521 -111 264 407 167 62 201 -11 248 732 742 512 784 884 553
2438 553 199 389 371 249 -142 418 -8 -629 -360 -5 -359 -488 -365 -715 -824 -278 -137 -398 -566 -43
2458 -43 121 -156 -357 93 163 -71 130 599 7 159 484 570 112 343 485 102 261 644 355 -186 327
$$ packed form
2306d11j94J0M84q6n71K5K25J47%K71m38M37J80M91j28k38J85L76l08J45J8m53
2328A67j7K65J92k98m6k24q5j22J16K83o99Q9K17l4l26m8K25j81j70L22rj74K51
2351c06M23k18j74M52m9P7jN42m33L5M41k13k38L1L83k86j96j92K99l84j48j54
2373c09L0l59K06K37n21o6L20K44m69O5q0K60k07N62P1l73K87J64L95l83J19R0
2395B83j88O85N5m15j70L37k74K21j72L19l87l46j95L07l66j77K88Rk55j24J45
2416d20k70L1RJ88O5m2M65n47M10L75J43k40j05J39k12K59M84J0k30K72J00l31
2438E53l54J90j8j22l91N60m26o21K69L55l54j29J23l50j09N46J41k61j68N23
2458d3J64k77k01M50P0k34K01M69n92J52L25Q6m58K31J42l83J59L83k89n41N13
$$ plain form
2479 327 36 -157 -365 -141 121 -603 -473 -320 -593 -645 -414 -6 -563 -400 136 -152 -697 -294 64 91 17
2500 17 77 315 -9 304 543 640 304 452 604 320 96 554 240 -146 85 263 -185 -523 18 0 -544
2521 -544 -148 -577 -510 -816 -20 -174 -843 -684 -107 -102 -526 11 544 -331 -137 611 423 337 232 548 681
2542 681 201 540 480 29 166 816 73 7 398 91 -725 -106 -138 -381 -230 -199 8 -520 -593 38 -262 -514
2564 -514 -538 -109 -483 -560 141 -49 350 -242 524 290 382 434 740 267 233 554 623 614 247 7 353 -347 366
2587 366 -120 -220 -386 84 -456 -378 -284 -505 -835 -499 -286 -247 -623 -429 93 -417 -242 -11 37 -48 137 669
2609 669 455 14 638 479 609 640 537 323 230 284 488 316 149 85 190 -260 -158 -135 -364 -471 -580 -119
2631 -119 -630 -555 -382 -611 -506 -429 -370 -290 -463 -7 -418 16 224 130 14 371 460 785 400 406 386 509 358
$$ packed form
2479C27k91j93k08K24K62p24J30J53k73n2K31M08n57J63N36k88n45M03L58K7p4
2500A7O0K38l24L13K39R7l36J48J52k84k24M58l14l86K31J78m48l38N41j8n44
2521e44L96m29O7l06P96j54o69J59N77Nm24N37N33q75J94P48j88q6j05L16J33
2542F81m80L39o0m51J37O50p43o6L91l07q16O19l2k43J51L1K07n28p3O31l00k52
2564e14k4M29l74p7P01j90L99n92P66k34R2N2L06m73l4L21O9rl67k40L46p00P13
2587C66m86j00j66M70n40P8R4k21l30L36K13L9l76J94N22n10J75K31M8q5J85N32
2609F69k14m41O24j59J30L1j03k14r3N4K04j72j67o4J05m50J02K3k29j07j09M61
2631a19n11P5J73k29J05P7N9Q0j73M56m11M34K08r4j16L57Q9L25l85Ok0J23j51
$$ plain form
2654 358 564 317 249 -261 457 147 36 -346 -286 -264 -361 -395 -318 -415 -707 -328 -339 -300 -88 -325 -27 -337 -97
2677 -97 64 -301 -78 342 191 209 509 414 373 239 690 269 297 483 660 498 309 -123 175 -265 -226 218
2699 218 -246 -325 -262 -215 -423 -599 -516 -618 -263 -148 -495 -480 -320 -199 -84 -340 21 336 330 250 369 219 241
2722 241 504 497 367 337 275 205 351 339 -80 107 -100 -201 -180 -116 -97 -406 -161 -569 -93 -442 -114 -280 162
2745 162 -244 -403 -186 -142 -113 -113 224 267 333 -174 426 335 47 199 523 182 81 285 99 285 -167 87
2767 87 -8 -196 244 -276 -559 -214 -162 -390 -219 -483 -563 -368 -213 -325 -334 -492 45 164 -43 103 137 17
2789 17 245 258 390 110 328 746 706 331 484 284 202 130 307 -46 -237 -416 -10 -379 -441 -172 -309 -426
2811 -426 -311 -116 -652 -412 -198 -119 -100 -256 -67 278 55 751 5 170 217 273 269 473 433 223 261 333 439
$$ packed form
2654C58K06k47o8n10P18l10j11l82O0K2r7l4P7r7k92L79j1L9K12k37K98l10K40
2677i7J61l65K23M20j51J8L00r5m1j34M51m21K8J86J77j62j89m32K98m40L9M44
2699B18m64p9O3M7k08j76Q3j02L55J15l47J5J60J21J15k56L61L15oq0J19j50K2
2722B41K63pj30l0o2p0J46j2m19J87k07j01K1O4J9l09K45m08M76l49L28j66M42
2745A62m06j59K17M4K9%L37M3O6n07O00r1k88J52L24l41j01K04j86J86m52K54
2767H7r5j88M40n20k83L45N2k28J71k64q0J95J55j12rj58N37J19k07J46L4j20
2789A7K28J3J32k80K18M18m0l75J53k00q2p2J77l53j91j79M06l69o2K69j37j17
2811d26J15J95n36K40K14P9J9j56J89L45k23O96p46J65M7N6mK04m0k10L8P2J06
$$ plain form
2834 439 311 423 108 76 -11 -271 46 -124 -545 165 -194 -158 -443 -599 -487 -350 58 -188 -203 -570 -279
2855 -279 -42 35 -148 269 160 -98 615 293 220 60 464 361 226 383 326 364 473 590 83 25 -246 -78
2877 -78 -137 -8 -59 -129 -305 -208 -141 -513 -449 -586 -294 -299 -89 -92 -97 93 157 450 26 129 348 440 486 615 527 479
2903 479 217 190 345 220 262 104 -59 -80 180 -220 -416 46 191 -267 -175 -178 -289 -135 -204 -432 -255 29
2925 29 -113 -160 -126 -151 148 63 39 179 276 190 241 394 400 333 256 285 486 64 300 313 -70 -112 389 442 -254 -380
2951 -380 -80 -458 78 -38 -434 -311 -322 -466 -472 -46 -27 -173 -394 255 -142 -124 21 94 294 426 229 80
2973 80 197 312 241 359 514 157 475 538 -1 32 -54 -24 156 -470 -387 -252 -361 20 -425 -329 -367 -283 -237 -304
2997 -304 -151 -173 -83 -159 257 -13 68 495 140 102 139 327 387 90 401 232 183 336 384 -80 61 96 245
$$ packed form
2834D39j28J12l15l2q7k60L17j70m21P10l59L6k85j56J12J37M08k46j5l67K91
2855b79K37P7j83M17j09k58P13l22p3j60M04j03j35J57n7L8J09J17n07n8k71J68
2877g8n9J29n1p0j76R7O7l72O4j37K92nK10lnJ90O4K93m24J03K19R2M6J29q8m8
2903D79k62k7J55j25M2j58j63k1K60m00j96M62J45m58R2lj11J54o9k28J77K84
2925B9j42m7L4k5K99q5k4J40R7q6N1J53Oo7p7K9K01m22K36J3l83m2N01N3o96j26
2951c80L00l78N36j16l96J23j1j44oM26J9j46k21O49l97J8J45P3K00J32j97j49
2973H0J17J15p1J18J55l57L18O3n39L3q6L0J80o26Q3J35j09L81m45R6l8Q4M6o7
2997c04J53k2R0p6M16k70Q1M27l55l8L7J88O0k97L11j69m9J53M8m64J41L5J49
$$ plain form
3020 245 -220 -31 -122 -181 -202 -279 -200 53 -450 -456 -287 -288 -408 -173 -352 -31 262 31 -13 109 131 329 27 339
3044 339 227 275 408 187 260 323 572 -139 47 202 332 91 -193 150 48 -417 -390 -269 -74 -418 -246
3065 -246 -675 -118 -81 -363 -180 -486 -199 56 -37 274 4 204 491 439 311 184 244 67 199 663 316
3086 316 204 230 419 238 21 -53 -318 -257 -145 -522 -374 -174 -408 -731 -380 -497 -99 -165 -119 -159 -154 -154 -258
3109 -258 -49 63 -43 83 364 16 274 37 303 174 241 214 122 299 59 303 202 135 -92 -302 -152
3130 -152 106 -303 -405 -59 -443 -426 -418 -261 -403 -483 -259 -118 -232 -96 25 -29 -118 241 233 248 509 191 273
3153 273 272 299 490 476 389 188 192 394 25 222 41 -22 -150 204 -202 -421 -275 -177 -171 -346 -152 -392 -59 -412
3177 -412 -53 -490 -65 -150 67 156 149 117 401 -150 111 263 100 140 327 546 153 237 101 -97 129 150 103
$$ packed form
3020B45m65J89r1n9k1p7P9K53n03oJ69jj20K35j79L21K93k31m4J22K2J98l02L12
3044C39j12M8J33k21P3O3K49p11J86J55J30k41k84L43j02m65K7J21J95l44J72
3065b46m29N57L7k82J83l06K87K55r3L11k70K00K87n2j28j27O0j77J32M64l47
3086C16j12K6J89j81k17p4k65O1J12l77J48K00k34l23L51j17L98o6M6m0N%j04
3109b58K09J12j06J26K81l48K58k37K66j29O7k7r2J77k40K44j01o7k27k10J50
3130a52K58m09j02L46l84J7QJ57j42q0K24J41j14J36J21n4q9L59qJ5K61l18Q2
3153B73jK7J91j4q7k01MK02l69J97j81o3j28L54m06k19J46R8Oj75J94k40L33l53
3177d12L59m37M25q5K17Q9pl2K84n51K61J52j63M0J87K19l93Q4j36j98K26K1m7
$$ plain form
3200 103 -61 -92 -101 -103 -149 -162 3 -345 -136 -63 -356 -162 -69 -6 -291 -51 64 151 237 420 200 375 228 459
3224 459 513 124 375 156 238 296 518 303 -8 -267 266 57 79 288 -69 -86 -442 -57 -183 -206 -394 -529
3246 -529 -314 -326 145 -217 -272 162 249 -502 -93 165 212 -25 295 408 214 380 454 647 296 357 465 -177
3268 -177 259 291 278 -387 -75 -110 -113 -225 -485 -179 51 -231 -543 -433 -487 -396 -186 -76 17 -274 -190 23 383
3291 383 373 216 38 465 396 368 254 14 161 237 391 259 204 -94 227 -184 106 158 15 -165 -216 -94
3313 -94 -396 91 -284 -64 -306 -347 -125 -408 -159 -174 -104 24 -406 -24 64 172 278 94 103 147 160 129 418
3336 418 62 225 198 65 490 -138 -239 -103 -19 26 -462 16 75 -389 -327 31 44 -165 59 -121 -83 -435
3358 -435 -87 -224 -310 109 175 -99 10 490 126 145 78 652 140 -26 220 301 -83 -41 429 199 -18 -143
$$ packed form
3200A03j64l1rkm6j3J65l48K09P3k93J94R3O3k85K40J15Q7Q6J83k20J75j47K31
3224D59N4l89K51k19Q2N8K22k15l11k59N33k09K2K09l57j7l56L85j26k3j88j35
3246e29K15j2M71l62n5M34Q7p51M09K58M7k37L20J13j94J66P4J93l51O1J08o42
3268a77M36L2j3o65L12l5lj12k60L06K30k82l12J10n4R1K10J10R3k91Q4K13L60
3291C83j0j57j78M27o9k8j14k40J47P6J54j32n5k98L21m11K90N2j43j80n1J22
3313i4l02M87l75K20k42m1K22k83K49j5P0J28m30L82Q8J08J06j84RM4J3l1K89
3336D18l56J63k7j33M25o28j01J36Q4M5m88M78N9m64O2L58J3k09K24j80L8l52
3358d35L48j37q6M19O6k74J09M80l64J9o7N74n12j66K46Q1l84M2M70k30k17j25
$$ plain form
3380 -143 -83 -358 -226 -134 14 -367 -146 104 -242 -469 40 -37 -168 -195 -206 -164 58 122 275 -2 45 331 179
3403 179 153 502 389 -3 120 240 -133 125 227 419 3 -73 242 -18 -449 -116 -213 -148 -442 -45 -104 64
3425 64 -294 -54 -132 -556 -172 -210 -123 -245 510 -400 -54 105 283 79 243 514 352 286 140 243 320 110
3447 110 109 263 -175 75 136 75 -287 184 1 -326 -57 145 -255 -354 -242 128 -383 -230 89 -20 -412 203
3469 203 -94 301 -294 3 14 -117 328 516 309 479 680 541 164 32 57 167 142 148 16 -75 44 -89
3491 -89 -100 -219 -83 -50 -394 -253 19 -192 -451 -345 -31 -78 -218 -44 70 -183 432 383 444 -65 280 220
3513 220 119 299 432 200 164 214 420 -169 5 606 336 -369 -117 191 -116 -179 -154 64 -330 -343 50 -175
3535 -175 -231 -4 -16 -314 -164 26 -169 162 99 22 -82 311 596 371 594 271 441 207 61 -1 511 18
$$ packed form
3380a43O0k75J32R2J48l81K21K50l46k27N09p7j31k7j1M2K22O4J53k77M7K86j52
3403A79k6L49j13l92J23J20l73K58J02J92m16p6L15k60m31L33r7O5k94L97n9J68
3425F4l58K40p8m24L84l8Q7j22P55r10L46J59J78k04J64K71j62o6j46J03P7k10
3447A10jJ54m38K50O1o1l62M71j83l27K69K02m00r9J12L70n11J53L19j09l92O15
3469B03k97L95n95K97J1j31M45J88k07J70K01j39l77j32K5J10k5Oj32r1J19j33
3491h9j1j19J36L3l44J41K72k11k59J06L14m7j40J74J14k53O15m9O1n09L45o0
3513B20j01J80J33k32l6N0K06n89J74O01k70p05K52L08l07o3K5K18l94j3L93k25
3535a75n6K27j2k98J50J90j95L31o3p7j04L93K85k25K23l23J70k34j46o2N12m93
$$ plain form
3557 18 -157 137 -42 -411 188 20 -134 -44 -407 -340 -325 -108 -129 -439 -487 -188 -581 76 -30 116 -224 -77
3579 -77 -35 132 6 211 225 -4 95 417 181 -81 77 394 48 79 480 86 -111 108 136 -130 -24 67
3601 67 176 -330 -129 -328 -182 -313 -229 48 -174 -109 -216 28 -66 167 128 -41 14 241 186 -19 260 393
3623 393 415 1 205 384 208 -99 -11 138 -222 77 -58 71 11 -72 -30 -127 -386 -295 -292 -317 -144 -355 -380 -468
3647 -468 -69 -14 106 472 250 93 334 367 446 21 344 388 44 -24 225 282 -26 15 111 11 2 -75 34 -313
3671 -313 -338 -49 -384 -14 -251 -544 -319 -177 -245 -356 -71 -227 175 -150 -172 -105 -208 55 -77 323 199
3692 199 176 401 311 520 294 55 472 217 96 431 148 -59 237 105 -79 -221 -53 -34 -234 -208 -83
3713 -83 -228 -468 -72 -347 71 -162 245 23 -91 101 94 157 82 -44 -15 70 515 272 103 95 66 305 300 26
$$ packed form
3557A8j75K94j79l69N99j68j54R0l63O7J5K17k1l10m8K99l93O57j06J46l40J47
3579g7M2J67j26K05J4k29R9L22k36k62J58L17l46L1M01l94j97K19K8k66J06R1
3601F7J09n06K01j99J46j31Q4K77k22O5j07K44r4K33l9j69N5K27n5k05K79J33
3623C93K2m14K04J79j76l07Q8J49l60K99j35J29o0q3M2r7k59R1Lk5J73k11k5q8
3647d68L99N5J20L66k22j57K41L3P9m25L23M4l44o8K49N7l08M1R6j00rp7J09l47
3671c13k5K89l35L70k37k93K25J42o8j11K85j56M02l25k2O7j03K63j32M00j24
3692A99k3K25r0K09k26k39M17k55j21L35k83k07K96j32j84j42J68J9k00K6J25
3713h3j45k40L96k75M18k33M07k22j14J92pO3p5j26K9Q5M45k43j69qk9K39nk74
$$ plain form
3737 26 -130 192 109 113 -132 4 -66 -81 30 -35 -132 -347 -16 -212 21 87 -119 -58 -143 -333 -70 207 -17 65
3761 65 111 -95 137 50 108 -105 268 -46 176 104 0 363 142 -84 -166 4 153 -183 -149 159 -371 -93
3783 -93 55 -181 -128 -180 113 -385 -206 -114 76 47 -104 144 -168 74 -195 73 120 600 114 -78 214 399
3805 399 225 -43 124 307 167 48 170 26 97 -118 -223 49 -257 -25 -170 -342 -148 -131 -337 60 -18
3826 -18 69 -6 -32 266 19 -14 -43 105 73 -90 17 481 -45 -103 136 456 62 265 -41 -52 135 50 288
3849 288 -71 -88 -344 -489 -275 -415 -121 -212 -84 14 -13 263 -11 10 -421 -182 55 165 -36 84 363 -49
3871 -49 314 79 266 -39 -12 427 4 92 -4 297 22 -345 277 -290 -155 1 -29 -71 111 -404 63 -177
3893 -177 -376 -443 -396 -99 -318 -256 108 -188 -84 148 45 277 230 76 302 200 367 248 -231 -97 69
$$ packed form
3737B6j56L22q3Mk45J36p0j5J11o5r7k15L31j96K33O6k06O1q5j90K63K77k24Q2
3761F5M6k06K32q7N8k13L73l14K22p2j04L63k21k26q2J70J49l36L4L08n30K78
3783i3J48k36N3n2K93m98J79R2J90k9j51K48l12K42k69K68M7M80m86j92K92J85
3805C99j74k68J67J83j40j19J22j44P1k15j05K72l06K32j45j72J94J7k06L97p8
3826a8Q7p5k6K98k47l3k9J48l2j63J07M64n26n8K39L20l94K03l06j1J87q5K38
3849B88l59j7k56j45K14j40K94r1J28R8k7K76k74K1m31K39K37J10k01J20K79m12
3871d9L63k35J87l05K7M39m23Q8r6L01k75l67O22n67J35J56l0m2J82n15M67k40
3893a77j99o7M7K97k19O2L64k96J04K32j03K32m7j54K26j02J67j19m79J34J66
$$ plain form
3914 69 287 340 80 -180 -77 -78 -63 -118 -165 81 -328 -349 3 -86 -178 -154 -183 29 -168 -108 -14 -108 -57 135 -10
3939 -10 299 258 180 210 408 470 133 389 -132 65 73 303 95 146 131 208 139 182 114 19 72 75 -298 -148 -277 -153
3965 -153 75 -273 -207 -364 -50 -125 100 114 -98 -365 305 124 287 250 178 73 531 237 265 -9 -35 -76 66
3988 66 157 -124 21 -247 96 272 93 -53 -225 -13 -584 -86 -157 -172 -104 -203 -213 -316 26 -289 105 -38
4010 -38 4 341 31 40 404 193 -104 195 9 218 -152 53 99 -69 266 215 215 5 -79 167 -219 -86 -298
4033 -298 135 -273 -17 -190 -193 -183 -263 -154 -182 -26 6 158 210 -18 -125 40 -215 375 109 -117 97 -33
4055 -33 307 13 279 225 43 352 180 44 330 283 -58 -6 -79 74 166 114 -143 -188 -383 -10 38 209 -162
4078 -162 171 169 129 56 250 -197 -198 108 224 96 24 34 252 98 113 -29 -30 121 191 169 81 114 145 273 27
$$ packed form
3914F9K18N3k60k60J03jJ5n5m7K46m09k1L52q9r2K4k9K12j97O0R4r4N1J92j45
3939a0L09m1p8L0J98O2l37K56n21J97QK30k08N1j5P7o9M3o8r5N3Ll73J50j29J24
3965a53K28l48O6j57L14p5K25J4k12k67O70j81J63l7p2j05M58k94K8k74k6m1J42
3988F6R1k81J45k68L43J76j79j46j72K12n71M98p1j5O8r9j0j03L42l15L94j43
4010c8M2L37l10RL64k11k97K99j86K09l70K05M6j68L35n1%k10q4K46l86J33k12
4033b98M33m08K56j73lJ0q0J09k8J56L2J52N2k28j07J65k55N90k66k26K14j30
4055c3L40k94K66n4j82L09j72j36K86m7l41N2p3J53R2n2k57m5j95L73M8J71l71
4078a62L33km0p3J94m47jL06J16j28p2J0K18j54J5j42jJ51P0k2q8L3L1J28k46
$$ plain form
4103 27 33 -356 -88 -407 71 -326 -516 268 287 -88 -409 -357 -239 122 -192 -31 147 8 80 -21 128 2
4125 2 102 112 301 52 123 175 380 127 -109 -69 49 158 65 -31 -335 -80 -51 -5 -133 -152 -347 -205 -2 -23
4149 -23 22 10 -227 -248 -156 315 41 201 73 211 218 105 211 424 332 228 142 -133 416 468 -12 -24 177 -22
4173 -22 -195 59 123 -157 -403 -366 -222 -124 -128 60 -41 -319 109 -91 -147 217 141 20 -300 -17 26 -302 20
4196 20 180 133 236 130 94 179 -124 46 -40 116 -63 -202 -134 -14 -260 60 134 -337 -59 -254 -10 65 -153
4219 -153 -156 74 -421 -69 -1 -301 197 -41 70 83 163 -41 72 229 138 26 -1 244 -202 55 239 82
4241 82 401 11 264 202 155 -58 -62 226 -139 -63 -161 -56 -313 -22 -32 -170 -37 -521 -212 -284 341 -324 -226
4264 -226 105 56 334 -103 -15 195 233 -146 448 385 220 314 383 109 61 199 -175 -216 26 -64 -101 -182 240 9
$$ packed form
4103B7Ol89K68l19M78l97j90P84J9l75l21N2J18L61l14J61J78j39P2j01J49j26
4125BJ00J0J89k49P1N2K05k53k36M0J18J09r3r6l04K55K9M6j28j9j95J42K03k1
4149b3M5j2k37k1R2M71k74J60j28J38Pj13J06K13r2j04q6k75N49N2m80j2K01j99
4173b2j73K54O4k80k46L7J44R8mJ88j01k78M28k00n6L64p6j21l20K83M3l28L22
4196B0J60m7J03j06l6Q5l03J70q6J56j79j39O8J20k46L20P4m71K78j95K44P5k18
4219a53lK30m95L52O8l00M98k38J11J3Q0k04J13J57r1j12k7K45m46K57J84j57
4241H2L19l90K53o2m7k13mK88l65P6r8J05k57K91j0j38J33m84L09p2O25o65R8
4264b26L31m9K78m37Q8K10L8l79N94o3j65R4O9k74m8J38l74m1K42r0l7q1M22k31
$$ plain form
4288 9 -40 -238 -57 242 21 -97 -21 -15 -23 -198 229 317 155 20 -109 253 -11 -3 127 153 202 264 205 74 -96
4313 -96 -27 -10 54 -292 283 105 -111 -179 -236 -219 66 -187 -298 -64 -399 -69 29 154 -20 -3 -128 168 2
4336 2 3 -124 13 35 -70 173 2 -35 -52 168 254 233 76 44 212 502 204 -167 17 104 371 25 -62 -219
4360 -219 -44 -350 -168 -66 -131 -110 -143 58 27 64 -169 115 56 51 367 27 176 383 317 158 351 168 143
4383 143 -158 97 161 148 184 -89 -35 -288 8 117 -98 -93 -186 -230 -47 -310 123 80 138 48 -14 45 128 -129 120
4408 120 188 -44 -40 277 6 250 47 26 256 -37 6 275 -53 -49 330 141 121 8 -235 -144 -125 189 -48
4431 -48 76 161 -39 -167 -193 -120 -3 -33 -176 -31 -148 -165 106 189 -83 -198 87 180 383 192 -10 220 92
4454 92 -83 341 126 -7 18 -281 17 76 -216 48 -274 -92 -143 -240 -141 -161 -11 103 51 -225 -38 -262 22
$$ packed form
4288Im9j98J81K99k21j18P6Oqj75M27Q8j62j35j29L62k64QJ30K6M9O2n9j31j70
4313i6O9J7O4l46N75j78k16o8n7J7K85k53j11K34l35L30R8J25j74J7j25K96j66
4336BJj27J37K2j05K43j71l7j7K20Q6k1j57l2J68K90k98l71J84Q7K67l46q7j57
4360b19J75l06J82J02o5K1l3K01l1L7k33K84n9nL16l40J49K07o6j59J93j83k5
4383A43l01K55O4j3L6k73N4k53K96J09k15Nr3m4J83k63M33m3N8r0o2N9Q3k57K49
4408A20O8k32ML17k71K44k03k1K30k93M3K69l28ML79j89k0j13k43R1J9L14k37
4431d8J24Q5k00j28k6P3J17l0j43J45j17j7K71Q3k72j15K85R3K03j91k02K30j28
4454I2j75M24k15j33K5k99K98N9k92K64l22J82n1r7R9k0J50J14n2k76J87k24K84
$$ plain form
4477 22 137 34 -389 -10 -3 53 257 -182 -167 143 271 -47 -161 144 94 -85 164 339 21 -14 178 57
4499 57 -284 -75 -10 53 -120 17 -99 33 -161 -304 -118 51 142 -23 -138 328 -65 81 210 260 213 170
4521 170 181 306 -195 154 226 -50 122 263 71 30 -208 74 -183 -354 -64 -153 -418 -255 57 -351 135
4542 135 -126 -305 -80 -183 -76 -137 -49 196 -109 -13 24 151 224 15 118 -19 152 56 183 144 170 280 -231
4565 -231 200 -63 284 -189 -270 317 21 49 -399 11 -421 -146 -415 30 128 -151 46 34 79 -88 146 87
4587 87 -209 141 279 -119 117 -166 121 -100 107 160 49 -242 274 107 -73 -39 55 -283 -9 -4 269 -133
4609 -133 -117 -210 -169 -287 -103 164 -132 60 -288 -4 -269 -53 -51 107 146 -237 93 66 78 -93 253 331 111
4632 111 64 119 40 160 1 181 92 -50 51 -276 -62 -157 -233 -175 -46 -362 -24 -31 -96 -87 -255 0 25 45 -142
$$ packed form
4477B2J15j03m23L79PN6K04m39J5L10J28l18j14L05n0j79K49J75l18l5J92j21
4499E7l41K09O5O3j73J37j16J32j94j43J86J69R1j65j15M66l93J46J29N0m7m3
4521A70J1J25n01L49P2k76J72J41j92m1k38K82k57j71K90q9k65J63L12m08M86
4542A35k61j79K25j03J07o1Q8K45l05R6L7J27P3k09J03j37J71r6J27l9K6J10n11
4565b31M31k63L47m73q1N87k96K8m48M10m32K75k69M45R8k79J97j2M5j67K34n9
4587H7k96L50J38l98K36k83K87k21K07N3j11k91N16j67j80L4R4l38K74NK73m02
4609a33J6r3M1j18J84K67k96J92l48K84k65K16KJ58L9l83L30k7J2j71L46P8k20
4632A11m7N5p9J20j59J80q9j42J01l27K14r5p6N8J29l16L38po5Rj68K55K5K0j87
$$ plain form
4657 -142 71 -59 -95 25 -3 -136 208 260 207 337 367 240 49 -46 157 -32 -14 21 -95 256 6 -99 -88
4680 -88 -75 157 -74 -75 105 -111 86 -172 -192 38 24 -203 35 -55 -26 292 84 58 158 353 442 260 108
4703 108 121 -41 4 202 306 127 -158 -171 -222 -198 3 329 79 -141 -52 -142 85 -138 69 -104 -81 47 -5
4726 -5 210 -158 -23 -14 -40 -231 -197 -9 16 93 138 140 146 -288 -199 105 11 34 301 68 144 33 -25 99 27 -176
4752 -176 37 -254 20 -153 -348 155 129 -242 -120 -77 262 -50 45 -112 -45 -21 -300 -83 17 190 253 197
4774 197 174 347 74 297 -117 40 166 214 225 -67 -72 -2 -19 127 -43 -74 -110 -65 -59 -450 310 -37 -330 -162
4798 -162 -115 -504 -265 -43 91 341 187 174 83 -76 4 -84 170 205 137 -220 214 -87 146 -102 113 119 -136
4821 -136 -72 113 -34 19 8 26 -190 54 -7 -114 91 20 -112 272 -153 -81 136 34 -363 39 -63 308
$$ packed form
4657a42K13j30l6J20k8j33L44N2n3J30L0j27j91r5K03j89J8L5j16L51k50j05J1
4680h8J3K32k31jJ80k16J97k58k0K30j4k27K38r0K9L18k08k6J00J95Q9j82j52
4703A08J3j62M5J98J04j79k85j3n1K4K01L26k50k20Q9r0K27k23K07j73K3J28n2
4726eK15l68J35Rk6j91L4J88K5P7M5KOm34Q9L04r4K3K67k33P6j11n8J24p2k03
4752a76K13k91K74j73j95N03k6l71J22M3L39l12R5j57O7K4k79K17J00J73O3n6
4774A97k3J73k73K23m14J57J26M8J1k92nP0j7J46j70l1l6M5Ol91P60l47k93J68
4798a62M7l89K39K22J34K50j54j3r1j59Q0q8K54L5o8l57M34l01K33k48K15Ok55
4821a36O4J85j47N3j1J8k16K44o1j07K05p1j32L84m25P2K17j02l97M02j02L71
$$ plain form
4843 308 46 46 288 478 56 21 251 63 -54 192 -59 116 -48 14 49 -110 46 8 76 -3 -84 -54 25 -127
4867 -127 -75 -371 -308 -148 -197 -29 25 55 33 -180 293 -243 43 249 269 -245 206 159 0 288 55 121 -102
4890 -102 -190 168 -131 -73 -349 -25 9 82 -191 -239 -88 -202 -40 -150 12 -193 -67 -199 103 -83 121 -186
4912 -186 344 176 146 -52 -80 106 -196 299 -58 -112 166 29 -165 -118 -147 17 -13 -151 33 -122 -120 176 -108
4935 -108 143 -95 -111 40 -124 73 20 54 5 106 53 -177 16 -63 214 -330 73 -89 204 -53 44 135 67
4958 67 92 283 -91 220 43 -126 -211 -13 242 190 -72 -298 88 -246 -67 -3 7 -294 -100 -66 -288 -5
4980 -5 -22 320 32 -194 191 268 88 90 7 161 -42 -4 354 53 131 62 40 219 15 119 236 325 -144 -113
5004 -113 32 -115 -1 -141 84 73 -101 -164 163 23 26 18 129 -32 -94 8 -67 -24 -60 138 -125 13 -47 -42
$$ packed form
4843C08k62%K42J90m22l5K30j88j17K46k51J75j64O2L5j59J56l8O8p9q1L0P9j52
4867a27N2k96O3J60m9J68N4L0k2k13M73n36K86K06K0n14M51m7j59K88k33O6k23
4890a02q8L58k99N8k76L24L4P3k73m8J51j14J62j10J62k05J26j32L02j86K04l07
4912a86N30j68l0j98k8J86l02M95l57n4K78j37j94M7k9J64l0j38J84j55KK96k84
4935a08K51k38j6J51j64J97n3L4m9J01n3k30J93p9K77n44M03j62K93k57R7R1o8
4958F7K5J91l74L11j77j69q5J98K55n2k62k26L86l34J79O4J0l01J94L4k22K83
4980ej7L42k88k26L85P7j80Kq3J54k03L8L58l01P8o9k2J79k04J04J17Q9m69L1
5004a13J45j47J14j40K25j1j74o3L27j40LqJ11j61o2J02p5M3l6J98k63J38o0N
$$ plain form
5028 -42 -101 135 -5 134 74 55 -74 -82 97 -50 -110 192 128 -182 -124 -78 -186 178 -144 -199 -99 -37 47 -90
5052 -90 190 -75 73 24 -48 142 -120 52 139 -93 58 -343 -418 276 -134 -301 59 22 -111 -178 487 164
5074 164 -78 -72 66 37 102 34 -59 9 338 -466 103 123 78 287 -158 -79 -54 -16 -91 341 -108 149 179 -176 218
5099 218 46 75 77 -65 157 133 -149 218 -70 -374 -113 -41 12 -167 -222 108 -125 -25 -408 28 -11 -147 75
5122 75 -21 -195 66 130 -15 -7 -209 109 22 85 228 -276 50 -118 105 59 -171 96 -29 -129 -109 -131 -12
5145 -12 -140 225 -33 -78 116 61 43 108 -126 -22 28 98 -48 196 -73 -302 4 -175 106 -208 -110 -42 472
5168 472 96 -100 36 72 5 205 95 46 180 62 85 357 172 165 119 82 68 -144 -60 554 8 -265 -59
5191 -59 -199 -100 -37 -157 -77 -9 205 0 -60 -103 -223 215 -76 165 -82 65 87 -198 162 125 -49 69 68 187
$$ packed form
5028d2n9K36j40J39o0j9j29qJ79j47o0L02o4l10N8M6j08L64l22n5J00O2Q4j37
5052i0K80k65J48m9p2J90k62J72Q7k32J51m01p5O94m10j67L60l7j33o7O65l23
5074A64k42OJ38k9O5o8r3O8L29q04N69K0m5K09m45P9K5L8p5M32m49K57L0l55L94
5099B18j72K9Kj42K22k4k82L67k88l04K61P2N3j79n5L30k33J00l83M36l9j36K22
5122G5r6j74K61O4j45Qk02L18q7O3J43n04L26j68K23m6k30K67j25j00K0k2J19
5145a2j28L65k58m5J94n5j8O5k34J04N0P0j46K44k69k29L06j79K81l14R8O8N14
5168D72l76j96J36L6o7K00j10m9J34j18K3K72j85pm6l7j4k12Q4O14n46k73K06
5191e9j40R9O3j20Q0O8K14k05o0m3j20M38k91K41k47J47K2k85L60l7j74J18jJ19
$$ plain form
5215 187 -74 -63 134 -143 123 123 -27 -71 -265 -409 16 15 -64 -201 250 -57 -47 0 178 -210 107 261 -173
5238 -173 183 -24 -132 -88 249 -412 56 217 -125 10 -13 23 252 21 108 141 323 -244 -73 2 -206 -15
5260 -15 127 -442 65 1 153 -50 21 9 -76 62 -78 -297 -17 262 -17 -87 69 -14 132 79 332 -178 114
5283 114 1 -5 219 216 57 63 178 116 -124 -35 131 -215 40 -14 -52 212 114 179 214 11 -92 -101 -90 18 -167
5308 -167 -304 -1 242 144 147 -7 153 -148 -28 100 -25 -264 298 -131 177 -183 184 33 121 54 -97 80
5330 80 -10 -507 210 -49 -236 4 -37 391 -18 -30 143 244 -115 -122 44 -37 26 -103 54 119 -294 95 -170
5353 -170 -202 -30 236 157 -53 322 -239 91 -51 -87 -17 -137 57 -157 -161 -98 -5 34 -213 -173 -87 -148 140 128
5377 128 -188 41 -27 -39 -118 169 79 -31 -153 -43 44 111 -7 -87 -156 -12 -25 198 242 -59 -4 15 -38 277
$$ packed form
5215A87k61J1J97k77K66%j50m4j94j44M25jp9j37M51l07J0M7J78l88L17J54m34
5238a73L56k07j08M4L37o61M68J61l42J35k3L6K29k31Q7L3J82n67J71P5k08J91
5260a5J42n69N07o4J52k03P1j2q5J38j40k19K80K79k79p0J56q3J46n3K53n10K92
5283A14j13oK24lj59OJ15o2k40Q9J66l46K55n4l8K64r8O5L5k03j03rJ1J08j85
5308a67j37L03K43r8Lj54J60l01J20J28j25k39N62m29L08l60L67j51Q8o7j51J77
5330H0r0m97P17k59j87K40m1M28m09j2J73J01l59pJ66q1O3j29J57O5m13L89k65
5353a70l2J72K66p9k10L75n61L30j42l6P0j20J94k14mO3R3L9k47M0Q6o1K88j2
5377A28l16K29o8j2p9K87r0j10j22J10Q7O7j18q0o9J44j3K23M4l01N5J9n3L15
$$ plain form
5401 277 125 -128 -23 58 -94 -54 317 122 -139 79 37 -46 76 137 -25 -177 -64 35 95 -359 -77 -176 -125
5424 -125 145 -7 -156 -29 -2 16 46 -170 -78 -39 -52 0 86 -31 320 29 167 -188 32 -94 -312 -95 -272
5447 -272 199 -89 95 -151 31 -57 -24 103 -177 -392 2 356 49 212 -43 1 324 53 320 -137 65
5468 65 -16 64 29 102 118 124 -32 -7 44 -64 270 -68 17 173 -201 85 272 -57 217 -15 -204 360 65 339
5492 339 4 -124 -111 -6 121 42 -47 7 -278 98 66 99 -71 -277 197 280 -134 69 143 4 22 -88 118
5515 118 128 -67 -66 173 -160 152 41 150 -83 -253 169 -34 23 -96 -168 -19 1 334 -69 132 4 327
5537 327 36 102 -314 -110 35 -212 -259 158 7 13 -103 -87 -289 37 344 87 48 -147 22 -155 -115 20
5559 20 249 70 -14 58 182 28 128 -11 15 -93 -50 -19 -108 -27 -247 -187 -75 -289 -21 -197 -108 49 199
$$ packed form
5401B77j52k53J05Q1j52M0L71j95k61K18m2q3J22O1j62j52J13R9O0m54K82r9N1
5424a25K70j52j49J27K7J8L0k16R2L9j3N2Q6j17L51k91J38l55K20j26k18K17j77
5447b72M71k88J84k46J82q8L3J27k80k15L94L54l07J63k55M4L23k71K67m57K02
5468F5q1Q0l5P3J6Oj56K5N1j08L34l38Q5J56l74K86J87l29K74k32j89N64k95K74
5492C39l35j28J3J05J27p9q9N4k85L76l2L3j70k06M74Q3m14K03P4j39J8j10K06
5515A18J0j95JK39l33L12j11J09k33j70M22k03N7j19p2J49K0L33m03K01j28L23
5537C27k91O6m16K04J45k47m7M17j51Oj16J6k02L26L07k57l9j95J69j77M0J35
5559B0K29j79q4P2J24j54J00j39K6j08M3L1q9Q1k20O0J12k14K68j76Q9J57J50
$$ plain form
5582 199 24 87 -100 -99 -130 58 -131 -163 118 1 102 156 -214 -334 -52 -22 21 44 285 -97 18 -54 -161
5605 -161 -109 128 -59 178 -44 233 82 -68 129 -252 123 103 143 19 171 -77 -6 3 -80 146 210 -51 -27
5628 -27 214 -132 22 -23 5 -122 238 48 172 9 213 -104 -30 -197 95 94 -138 -33 -226 111 -54 -243
5650 -243 6 515 167 -44 -73 -387 25 -117 -18 -71 -92 218 84 -50 -226 41 -351 -156 -135 94 303 48
5672 48 247 -281 34 -101 -208 130 50 -17 73 -38 267 91 190 35 117 -232 94 -195 -154 88 -147 105
5694 105 -105 -136 -161 -180 42 -323 170 -49 -137 431 183 -52 -343 -2 -169 129 107 89 69 147 87 10 247
5717 247 57 61 122 -44 169 -242 -93 272 -146 180 162 227 84 149 290 227 -156 316 112 -12 -185 -130 -78
5740 -78 260 -125 -209 -186 -142 -116 -87 48 -155 153 -14 173 31 -245 -338 -296 144 30 -115 -159 -197 -74 18 -114
$$ packed form
5582A99j75O3j87Jl1J88j89l2K81j17J01N4l70j20K82L0M3K3K41l82J15p2j07
5605a61N2K37j87K37k22K77j51j50J97l81L75k0M0j24J52k48P1Rq3K26O4k61K4
5628b7K41l46J54m5K8j27L60j90J24j63K04l17P4j67K92jk32J05j93L37j65j89
5650b43K49N09l48k11k9l14M12j42R9n3k1L10j34j34j76K67l92J95K1K29K09k55
5672D8J99n28L15j35j07L38q0o7R0j11L05j76R9j55Q2l49L26k89M1K42k35K52
5694A05k10l1k5j9K22l65M93k19q8N68k48k35k91L41j67K98k2j8k0P8o0p7K37
5717B47j90MO1j66K13m11J49L65m18L26j8O5j43O5J41o3l83M72k04j24j73N5N2
5740g8L38l85q4K3M4K6K9J35k03L08j67J87j42k76r3M2M40j14j45m4l8J23R2j32
$$ plain form
5764 -114 88 19 399 -205 -32 95 -76 120 370 -8 -194 7 -110 -274 13 -8 60 -17 -162 -96 -40 -46 18
5787 18 205 -113 465 34 46 -63 -89 -56 99 -94 -95 289 9 -170 -30 -22 100 -1 -8 -131 -177 -113 -62 16 223
5812 223 -59 -89 193 -89 109 -45 -284 -78 213 66 62 74 138 273 241 -83 -119 -231 129 151 88 -239 -82
5835 -82 -348 -51 108 -49 268 146 185 -119 -34 -66 228 -166 -49 109 30 0 67 -74 -211 -192 -37 366 285
5858 285 82 68 -204 151 -22 -139 -315 100 221 134 71 -27 -39 -280 -132 -157 -73 -177 205 -66 -76 -15 -261
5881 -261 55 103 204 17 90 -170 -252 -201 -135 -270 185 -130 -155 0 -63 273 -67 135 -300 -173 -120 -136 21
5904 21 96 70 53 -166 -148 -149 228 38 80 -143 68 563 -44 244 251 8 19 44 42 -235 -40 59 -158 -37 215
5929 215 72 156 -7 -223 53 187 20 -50 -18 121 72 -483 15 -110 -234 -216 364 187 -90 -90 -153 43 80
$$ packed form
5764a14K02o9L80o04J73J27j71J96K50l78j86K01j17j64K87k1O8p7j45O6N6oO4
5787A8J87l18N78m31J2j09k6L3J55j93jL84k80j79J40QJ22j01pj23m6O4N1P8K07
5812B23k82l0K82k82J98j54k39K06K91j47mJ2O4J35l2l24l6j12L60K2o3l27J57
5835h2k66K97J59j57L17j22L9l04Q5l2K94l94J17J58p9l0O7j41j37J9J55M03q1
5858B85k03j4k72L55j73j17j76M15J21q7o3r8j2k41J48k5Q4j04L82k71j0O1k46
5881b61L16M8J01j87P3k60q2N1O6j35M55l15k5J55o3L36l40K02m35J27N3j6J57
5904B1P5k6j7k19J8jL77j90M2k23K11M95o07K88Pk43J1K5kk77J95R9k17J21K52
5929B15j43Q4j63k16K76J34j67p0L2J39m9n55M98j25j24J8N80j77k77%o3J96L7
$$ plain form
5952 80 146 246 51 -86 220 114 73 208 -175 -315 104 128 -137 -16 166 135 120 -83 -301 -88 438 223
5974 223 3 179 -78 -196 -100 -208 -115 17 114 41 -63 -85 -72 -148 156 -40 357 110 157 166 -67 9 -84 142
5998 142 73 54 -32 -191 -71 -191 -34 -106 -74 -13 -94 13 -242 29 66 -83 91 188 -91 192 -98 -381 -157
6021 -157 -192 218 155 -51 36 -228 -110 301 96 335 216 -75 228 -41 121 -53 129 -137 -352 169 82
6042 82 -135 -176 -207 167 208 184 125 33 -176 -238 -226 74 -80 131 -53 14 -274 -138 -111 244 -65 -95 45 116
6066 116 -121 -82 63 -239 54 187 268 1 -246 161 -174 -1 -204 106 25 -160 -116 83 -5 -39 289 137
6088 137 29 -36 15 93 356 -160 238 -19 -145 -9 -68 16 120 -3 -101 64 4 -19 75 273 -65 -62 119 -82
6112 -82 92 -9 84 -33 56 -87 15 307 -42 -153 -137 218 29 46 -119 274 187 49 -150 29 143 -143
$$ packed form
5952H0O6J00j95j37L06j06m1J35l83j40M19K4k65J21J82l1j5k03k18K13N26k15
5974B23k20J76k57j18R6j08R3J32R7p3j04k2J3p6L04j96L97k47M7Rk33P6r3K26
5998A42o9j9q6j59J20j20J57p2L2O1q1J07k55K71L7j49J74R7k79K83k90k83K24
6021a57l5M10o3k06Q7k64J18M11k05K39j19k91L03k69J62j74J82k66k15N21q7
6042H2k17m1l1L74M1k4n9r2k09o2J2L00j54K11j84O7k88J36K7L55l09l0J40P1
6066A16k37L9J45l02K93J33Q1k67k47M07l35J73k03L10q1j85M4J99q8l4L28j52
6088A37j08o5N1P8K63n16L98k57j26J36n9Q4J04j23r8J65o0k3R4J98l38LJ81k01
6112h2J74j01R3j17Q9j43J02K92l49j11J6L55j89J7j65L93q7j38j99J79J14k86
$$ plain form
6134 -143 111 83 140 58 70 190 -25 -213 157 184 8 50 -110 196 173 -69 202 -202 293 -285 16 -144
6156 -144 6 77 -63 236 4 -28 58 27 -141 139 -20 -184 -68 229 -166 -64 -121 185 -43 90 46 -180
6178 -180 177 -44 -119 145 -60 170 64 -174 116 -67 62 134 56 -51 -227 -78 -186 -38 23 -2 127 76
6200 76 194 -208 122 -122 34 -112 -2 -154 -148 64 196 -122 139 305 -35 -24 -127 310 -45 -36 -210 259
6222 259 141 -76 238 -93 230 50 236 -181 -67 237 181 35 -35 -59 67 -80 -232 -185 36 195 -44
6243 -44 8 -29 -98 64 -10 -132 -71 -227 57 150 417 168 38 71 -218 -2 239 12 282 -105 -109 15 148
6266 148 -76 -327 225 130 3 125 -303 84 58 282 -302 -133 129 -4 -63 117 -477 209 372 -292 40
6287 40 62 188 -158 -54 19 -110 169 -86 387 -36 -191 136 -227 -15 55 -65 32 147 -95 102 -46 177
$$ packed form
6134a43K54k8N7q2J2J20k15j88L70K7j76M2j60L06k3k42K71m04M95n78L01j60
6156a44J50P1j40K99k32l2Q6l1j68K80j59j64J16K97l95J02n7L06k28J33m4k26
6178a80L57k21p5K64k05K30j06k38K90j83J29P2p8j07j76J49j08J48O1k5J29n1
6200G6J18m02L30k44J56j46J10j52OK12J32l18K61J66l40J1j03M37l55Rj74M69
6222B59j18k17L14l31L23j80J86m17J14L04n6j46p0k4J26j47j52M7K21J59k39
6243d4N2l7o9J62p4j22O1j56K84R3K67k49j30L3k89K16K41k27K70l87mJ24J33
6266A48k24k51N52r5j27J22m28L87k6K24n84J69K62j33n9J80n94O86J63o64L32
6287D0K2J26l46J04P3j29K79k55M73m23j55L27l63K12P0j20R7J15k42J97j48K23
$$ plain form
6309 177 75 84 42 -43 -293 -45 -178 -84 183 98 -119 -76 -171 -64 203 347 251 172 185 -109 44 77 47 105 6
6334 6 -336 170 -96 322 31 -68 96 -89 133 -80 39 -43 360 -60 65 -41 -154 -102 -56 173 191 -147
6356 -147 105 -172 -205 -50 -35 104 -103 24 -161 -198 -187 22 -43 7 -150 223 -167 -259 172 9 140 267
6378 267 214 -69 215 137 17 -202 418 -26 -74 -100 -50 -100 1 46 166 32 -11 -247 -72 148 -157 298 100
6401 100 258 152 3 34 65 164 221 -104 141 -154 112 -121 -83 82 73 -30 -63 -105 -138 -300 -19 83 93 -82
6425 -82 64 -156 114 2 -63 -8 47 143 367 -52 -36 242 -157 129 33 31 -1 -294 -43 60 51 247 -92 -4
6449 -4 -194 75 -219 -40 228 121 19 -209 -123 -37 14 179 381 91 250 -171 -149 93 149 -8 149 -146
6471 -146 233 73 224 170 -33 -102 112 -62 -6 -25 15 30 -97 -20 -65 -75 -123 -30 43 317 270 100 32 74 12
$$ packed form
6309A77j02Rm2q5k50K48j33R4K67q5k17M3r5J07K67J44r6p9J3k94J53L3l0N8r9
6334Fl42N06k66M18k91r9J64j85K22k13J19q2M03m20J25j06j13N2M6K29J8l38
6356a47K52k77l3J55J5J39k07J27j85l7J1K09o5N0j57L73l90r2M31j63J31J27
6378B67n3k83K84p8j20k19O20m44m8k6N0n0J01M5J20j34m3k36J75K20l05M55j98
6401A00J58j06j49L1L1R9N7l25K45k95K66k33L8J65rj03l3m2l3j62K81J02J0j75
6425h2J46k20K70j12o5N5N5R6K24m19J6K78l99K86r6kl2k93K51J03rJ96l39Q8
6449dj90K69k94J79K68j07j02k28Q6Q6N1J65K02k90J59m21K2K42N6j57J57k95
6471a46L79j60J51n4k03o9K14j74N6j9M0J5j27P7m5j0m8R3P3K74m7j70o8M2o2
$$ plain form
6496 12 101 -50 41 189 -184 45 -138 -179 250 -131 -53 58 -43 132 350 49 -303 443 213 -16 -25 175
6518 175 172 49 76 135 -37 116 277 -33 88 67 -236 -66 299 147 -179 -290 -99 22 54 -212 -100 -178
6540 -178 213 -60 157 -105 -242 351 -125 -79 338 8 -479 57 -74 -125 -140 124 -97 -142 -262 -34 -27 145
6562 145 -21 256 -239 -73 -82 -247 -85 179 67 173 -88 88 -9 50 302 -17 62 94 163 -141 -134 -104 -232
6585 -232 -356 20 32 84 228 210 257 -331 63 -100 80 -175 1 145 -48 -64 -156 -225 -84 41 4 -262 -87
6608 -87 34 145 170 241 -76 154 -120 228 -111 95 -125 -40 -128 -152 20 -147 -159 -40 -70 -11 255 67 200
6631 200 122 -32 -92 -222 -73 177 6 -149 -124 130 -15 276 25 8 172 191 -38 14 125 255 -129 32
6653 32 345 -182 7 62 -113 92 313 70 237 253 177 3 -374 24 -104 155 -269 440 -94 253 27
$$ packed form
6496A2Q9j51R1J48l73K29j83m1M29l81P8J11j01J75K18l01l52P46k30k29rK00
6518A75lj23K7N9j72J53J61l10J21k1l03J70L65j52l26j11J91J21L2k66J12p8
6540a78L91k73K17k62j37N93m76M6M17l30m87N36j31n1j5K64k21m5j20K28PJ72
6562A45j66K77m95J66rj65J62K64j12J06k61J76r7N9K52l19P9L2O9l04PL0j28
6585b32j24L76J2N2J44j8M7n88L94j63J80k55J76J44j93j6r2o9J41J25l7k66J75
6608h7J21J11K5P1l17K30k74L48l39K06k20Q5q8k4J72j67j2J19l0N9K66j88J33
6631B00p8j54o0j30J49K50j71j55K5K54j45K91k51j7J64J9k29N2J11J30l84J61
6653C2L13n27J89N5j75K05K21k43J67J6p6j74l77L98j28K59m24P09n34L47k26
$$ plain form
6674 27 221 113 -256 356 50 67 -37 29 11 99 -72 307 315 116 90 -67 77 32 -47 61 -85 297 -200
6697 -200 84 15 -250 149 -129 270 -273 169 187 -2 148 -30 -60 80 -61 97 11 -128 -22 50 -74 -86
6719 -86 -107 37 -202 150 -310 -151 -218 136 348 -76 77 -82 62 88 18 -98 -106 -266 70 487 105 -34
6741 -34 -9 67 51 -193 15 -74 7 70 -102 47 -266 -18 -153 -423 88 4 -310 240 90 77 -196 70 -409
6764 -409 69 -105 144 -142 2 -44 134 -167 146 -32 -89 -10 -3 -258 164 -192 -16 89 136 -74 -334 82
6786 82 -11 -13 -226 33 -17 15 188 87 -172 121 153 -87 26 20 -163 150 -31 54 -151 194 317 -318 -86
6809 -86 11 386 -60 21 114 -36 190 104 292 269 302 -108 195 -43 -120 66 102 -358 -7 -222 -104 44 -152
6832 -152 157 -98 -39 62 -187 -441 77 64 118 -125 2 -34 -44 -98 -5 210 -97 123 -133 145 -147 175
$$ packed form
6674B7J94j08l69O12l06J7j04O6j8Q8j71L79Qj99k6j57J44m5p9J08j46L82m97
6697b00K84o9k65L99k78L99n43M42J8j89J50j78l0J40j41J58q6j39J06P2j24j2
6719h6k1J44k39L52m60J59o7L54K12m24J53j59J44K6p0j16qj60L36M17l82j39
6741c4K5P6j6k44K08q9Q1O3j72J49l13K48j35k70N11q4l14N50j50j3k73K66m79
6764d09M78j74K49k86J44m6J78l01L13j78n7P9Pk55M22l56J76J05M7k10k60M16
6786H2r3kk13K59n0L2J73j01k59K93L2k40J13oj83L13j81Q5k05L45J23o35K32
6809h6R7L75m46Q1R3j50K26q6J88k3L3m10L03k38p7J86L6m60L51k15J18J48j96
6832a52L09k55N9J01k49k54N18j3N4k43J27l6j0n4R3K15l07K20k56K78k92L22
$$ plain form
6854 175 2 -78 119 126 -195 -201 88 -158 55 297 -55 18 -11 -202 -25 256 59 -22 -151 105 -47 145 -23
6877 -23 -14 -47 -129 134 -117 13 115 -106 3 69 241 87 -178 -303 178 153 52 -81 -102 111 297 -95 -33
6900 -33 214 -193 -81 -122 61 103 -138 131 86 109 -279 -47 189 299 8 -212 338 -128 -11 -122 114 -36
6922 -36 73 630 18 395 182 -104 -87 -61 -207 117 -9 266 73 117 49 -3 66 69 -310 -240 -198 76 42 267
6946 267 -204 63 393 266 14 46 13 29 15 9 -81 -40 95 -131 277 -16 32 122 -165 62 83 -301 -94 -11
6970 -11 -123 -47 -313 -85 -112 -171 -115 -174 -71 -126 -278 -197 -8 105 15 180 242 -67 -327 -215 320 -16 154
6993 154 202 -11 154 74 -53 20 242 98 -247 -34 225 27 -95 -189 3 46 -50 -180 197 -242 61 125
7015 125 180 -261 27 167 66 -181 -1 160 163 -132 -197 200 -215 -17 -39 117 -8 103 9 -358 -291 -166
$$ packed form
6854A75j73q0J97Pl21oK89k46K13K42l52P3k9j91J77K81j97q1j29K56j52J92j68
6877b3Rl3q2K63k51J30J02k21J09O6J72j54k65j25M81k5j01j33k1K13J86l92O2
6900c3K47m07J12m1J83M2k41K69m5K3l88K32K36J10k91k20N50m66J17j11K36j50
6922c6J09N57o12L77k13k86J7K6j46L24j26K75j93M4o8n2O9Ll79P0M2K74l4K25
6946B67m71K67L30j27k52L2l3J6j4or0M1J35k26M08k93M8R0k87K27K1l84K07Q3
6970a1j12P6k66K28k7n9N6n9J03n5j52Q1J89J13r0J65O2l09k60J12N35l36J70
6993A54M8k13J65q0j27P3K22j44l45K13K59j98j22r4J92M3r6j30L77m39L03O4
7015A25N5m41K88J40j01k47J80J61Lk95o5L97m15J98k2J56j25J11r4l67O7J25
$$ plain form
7037 -166 -141 175 -196 -25 -92 -238 140 -120 -101 -257 -67 60 94 237 105 79 405 -24 94 304 -178 48
7059 48 93 186 -159 -8 102 -126 39 149 -42 -56 8 30 152 137 16 -379 -273 -142 -225 -131 -207 -36 201
7082 201 170 319 -145 -118 -136 317 -155 -13 -36 -11 -196 -79 21 96 -174 151 267 -37 -2 183 -112 138
7104 138 56 174 21 -31 -83 227 71 -44 63 38 -74 -164 -257 -106 -43 -225 120 406 65 -4 100 62 -34
7127 -34 223 -253 145 -64 208 95 330 -86 -71 401 125 218 -38 78 260 48 328 154 17 -100 -310
7148 -310 0 -140 -101 38 -38 -116 -46 -230 355 -19 -153 -93 37 353 -312 -34 -33 -231 81 -132 195 -72
7170 -72 55 -18 173 279 322 19 -114 -75 343 238 -30 105 -12 53 -226 -289 -139 87 -195 5 254 -26
7192 -26 114 -123 -246 -27 167 -5 81 114 -176 -1 42 32 -87 -127 177 116 -13 49 -37 199 5 153 -240
$$ packed form
7037a66K5L16l71J71o7j46L78k60J9j56J90J27L4J43j32k6L26m29J18K10m82K26
7059D8M5R3l45J51J10k28J65J10j91j4O4K2J22j5j21l95J06J31q3R4p6J71K37
7082B01l1J49m64K7j8M53m72J42k3K5j85J17J00P5k70L25J16l04L5J85k95K50
7104A38q2J18j53n2n2L10j56j15J07k5j12r0r3J51O3j82L45K86l41o9J04l8r6
7127c4K57m76L98k09K72j13K35m16J5M72k76R3k56J16J82k12K80j74j37j17k10
7148c10L10j40L9J39p6p8P0j84N85l74j34O0J30L16o65K78Jj98L12k13L27k67
7170g2J27p3J91J06M3l03j33L9M18j05k68J35j17O5k79o3J50K26k82K00K49k80
7192b6J40k37j23K19J94j72Q6L3k90J75M3j0j19m0L04o1j29O2q6K36j94J48l93
$$ plain form
7215 -240 122 -205 -22 16 2 -234 -247 297 105 -123 -147 -40 -133 4 -261 53 118 174 -21 22 -35 187 117
7238 117 262 17 46 -82 -8 202 102 187 215 406 -43 19 8 292 -45 -163 152 4 -62 -149 -55 -248 -110
7261 -110 49 102 -57 79 75 -144 262 -128 63 -26 75 106 -5 -20 119 227 116 86 -45 419 -60 33 132
7284 132 23 -166 -3 22 8 -44 -73 -23 -1 186 182 -88 -269 25 135 239 26 84 -62 300 146 -111 126
7307 126 -42 279 -128 -103 -43 159 8 73 -73 183 333 228 129 387 -277 -192 -253 -70 -254 -143 198 -154
7329 -154 88 137 -297 -54 -225 49 59 -181 -224 -121 107 -22 -122 232 -38 6 205 10 82 42 308 -76
7351 -76 -104 -110 -306 -317 146 168 36 -208 6 204 241 214 -132 -73 67 59 -208 -157 62 16 -37 21 83 -13 79 49
7377 49 84 -104 -73 -4 16 12 123 -187 42 47 -106 -41 -120 242 -142 15 -158 167 -151 232 -159 118 412 -109
$$ packed form
7215b40L62l27J83L8j4k36j3N44j92k28k4J07r3J37k65L14O5N6j95M3n7K22p0
7238A17J45k45K9j28P4K10j00Q5K8J91m49O2j1K84l37j18L15j48o6q7R4j93J38
7261a10J59N3j59J36mk19M06l90J91q9J01L1j11j5J39J08j11l0j31M64m79R3R9
7284A32j09j89J63K5j4n2k9N0K2J87mk70j81K94J10J04k13N8j46L62j54k57K37
7307A26j68L21m07K5O0K02j51O5j46K56J50j05r9K58o64Q5o1J83j84J11L41l52
7329a54K42M9m34K43j71K74J0k40m3J03K28j29j00L54k70M4J99j95P2m0K66l84
7351g6k8oj96j1M63K2j32k44K14J98L7k7l46N9J40qk67N1K19m6n3N8O2r6R2l0
7377D9L5j88L1O9K0mJ11l10K29Nj53O5p9L62l84J57j73L25l18L83l91K77K94n21
$$ plain form
7401 -109 -188 35 69 -122 -128 76 80 -105 -184 -132 -191 119 33 83 -249 -173 255 -65 305 -136 97 174 -136 -98 274
7426 274 162 -51 403 -172 104 -208 -7 163 -125 170 56 0 349 226 -178 -2 -24 -40 -66 -224 -273 -336
7448 -336 -138 77 -138 -50 335 -129 -253 96 78 -146 21 15 -11 199 54 176 -150 -223 130 91 225 116
7470 116 -10 -119 -291 -31 75 114 155 120 -115 258 -205 166 142 -115 -42 -127 -21 -287 35 -214 -37 210
7492 210 98 -213 -258 114 -11 -169 221 185 68 163 19 -97 -272 -62 -38 -283 -16 70 185 -50 -183 -252
7514 -252 192 -67 139 35 -23 363 -145 172 -218 29 127 -44 -118 -196 -70 45 140 -45 -280 -33 179 249
7536 249 -92 2 31 -101 83 37 157 144 -85 -164 89 121 -301 25 -164 -189 140 -17 148 -42 162 -60
7558 -60 -200 72 100 3 216 -238 132 -61 -12 -155 -9 318 -64 7 -106 215 -9 103 -23 20 84 132 -133
$$ packed form
7401a09p9K23L4j91oK04Mj85p9N2n9L10q6N0l32P6M28l20L70m41K33P7l10L8L72
7426B74j12k13M54n75K76l12K01J70k88K95j14n6L49j23m04J76k2j6k6j58m9o3
7448c36J98K15k15Q8L85m64j24L49j8k24J67ok6K10j45J22l26p3L53l9J34j09
7470A16j26j09j72K60J06L9M1l5k35L73m63L71k4k57P3q5J06k66L22k49J77K47
7492B10j12l11m5L72j25j58L90l6j17R5j44j16j75K10K4k45K67Q6J15k35j33o9
7514b52M44k59K06j04n8L86n08L17l90K47R8j71p4p8J26J15R5j85k35K47K12P0
7536B49l41R4K9j32J84m6J20j3k29p9K53L2m22L26j89k5L29j57J65j90K04k22
7558f0j40K72K8r7K13m54L70j93M9j43J46L27l82P1j13L21k24J12j26M3O4M8k65
$$ plain form
7581 -133 97 -16 -134 39 -37 -141 75 142 -121 251 -25 -16 105 23 83 -56 178 -112 21 -320 -34 -63
7603 -63 -88 46 40 193 -19 109 370 -147 -10 -158 54 71 124 184 74 -229 -339 -139 -206 359 232 -227 -223
7626 -223 192 46 47 24 -21 -62 52 -8 226 -175 -33 -176 191 -27 129 -25 -275 11 -224 -8 -148 -250
7648 -250 -16 181 -133 -257 71 161 -216 -87 206 167 -22 -79 -100 -73 22 146 14 117 -25 135 269 -9
7670 -9 72 106 197 466 153 -142 35 -66 115 58 -72 329 -264 -65 217 42 259 79 78 -15 46 -63 -366
7693 -366 -246 114 73 -152 141 -13 96 -142 -29 -9 152 170 -41 -5 -45 13 172 320 179 -178 113 -30
7715 -30 -136 264 -67 275 -57 342 -219 13 -126 340 61 -132 -60 -319 13 122 29 -38 -215 65 -305
7736 -305 -93 171 230 368 99 10 162 51 28 102 -163 45 295 -184 -19 49 63 115 -37 54 -64 215 -220
$$ packed form
7581a33K30j13j18J73p6j04K16O7k63L72k76RJ21q2O0j39K34k90J33l41K86k9
7603f3k5J34oJ53k12J28K61n17J37j48K12J7N3O0j10l03j10K00o7N65j27m59M
7626b23M15j46Jk3m5m1J14o0K34m01J42j43L67k18J56j54k50K86k35K16j40j02
7648b50K34J97l14j24L28R0l77J29K93l9j89n7k1K7R5J24j32J03j42J60J34k78
7670iQ1L4R1K69l13k95J77j01J81n7j30M01n93J99K82j75K17j80jr3O1j09l03
7693c66J20L60m1k25K93j54J09k38J13K0J61J8k11L6m0N8J59J48j41l57K91j43
7715c0j06M00l31L42l32L99n61K32j39M66k79j93P2k59L32J09r3o7j77K80l70
7736c05K12K64N9J38k69q9J52j11k3P4k65K08K50m79J65O8J4N2j52R1j18K79m35
$$ plain form
7759 -220 54 90 68 190 -88 3 -189 -64 -94 -171 -161 -83 60 26 11 215 21 203 150 66 60 521 -209 -181 28
7784 28 259 -68 -73 211 125 -40 157 260 -10 -31 -35 -56 -68 102 -223 174 -113 90 -139 152 -293 124 -38
7807 -38 -163 263 46 176 204 81 110 89 -222 340 36 -16 -77 -132 -55 254 38 101 44 -282 -132 -231 -219 108
7831 108 -217 -84 -15 101 -69 -77 -159 71 61 -131 152 -50 -126 83 111 -84 54 -144 -4 -95 -88 -228 -190 310
7855 310 324 55 92 73 83 160 -191 -141 1 -179 168 -10 -52 28 -181 228 -119 11 -85 154 -27 68 -80
7878 -80 -109 -259 59 -189 -55 225 -179 42 -171 -23 56 33 -60 349 112 159 -30 -68 252 83 -133 87
7900 87 289 -214 131 -273 57 -5 78 171 -21 340 109 142 75 48 120 -164 -184 7 -355 -131 -146 -93 -139 -121
7924 -121 80 45 56 201 197 54 58 139 463 -241 91 -134 -11 5 22 220 -160 -26 19 84 18 -13 -43 162 -165
$$ packed form
7759b20K74L6k2J22k78R1j92J25l0p7J0P8J43l4j5K04j94J82n3q4oM61p30K8K09
7784B8K31l27nK84q6j65J97J03k70k1mk1j2J70l25L97k87K03k29K91m45M17j62
7807c8j25M26k17J30K8j23K9k1l11N62l04n2o1n5P7L09k16O3n7l26J50r9J2L27
7831A08l25J33O9J16j70qq2K30j0j92K83k02p6K09K8j95J38j98J40r1Pj40L8N00
7855C10J4k69L7j9J0P7l51N0J42j80L47j78m2Q0k09M09l47J30r6K39j81R5j48
7878h0k9j50L18k48J34K80m04K21k13J48P9k3r3M09k37M7j89l8L20j69k16K20
7900H7K02n03L45m04L30o2Q3R3j92L61k31L3o7k7P2k84k0J91l62K24j5N3m6J8
7924a21K01l5J1J45mj43MQ1L24p04L32k25J23J6J7J98l80J34M5O5o6l1l0K05l27
$$ plain form
7949 -165 -157 -337 -44 155 26 348 209 -77 -54 110 12 -80 40 -135 209 14 152 -1 -304 -163 383 -27
7971 -27 201 -524 57 7 -134 56 121 -139 -55 71 30 -206 -125 64 12 -14 -41 -173 -155 342 -232 306 -189
7994 -189 155 91 58 -92 124 175 -131 129 212 -437 -126 311 62 -58 117 -112 124 49 -1 -180 -42 -60
8016 -60 -177 175 -242 -289 -134 7 375 -137 191 180 124 53 -165 281 -54 -83 124 66 -39 186 469 424 -406
8039 -406 -142 -106 212 -251 116 -45 -369 -395 -171 231 101 -88 286 -120 86 78 -155 -20 -16 52 75 -121 15
8062 15 77 -101 -162 -33 -80 342 254 181 187 29 168 180 319 369 138 111 -46 29 -77 133 171 -169 -85 18 85
8087 85 249 -205 49 219 377 -65 126 41 457 -124 -120 -197 -53 115 -70 235 186 -54 93 133 239 -73
8109 -73 -20 201 119 -15 36 149 42 -111 204 -144 -238 -368 154 122 -18 -176 70 -140 128 51 -157 44
$$ packed form
7949a65Qj80K93J99j29L22j39k86K3J64r8r2J20j75L44j95J38j53l03J41N46m10
7971b7K28p25N81n0j41J90O5k60Q4J26m1k36Q1J89n2k6k7j32J8M97n74N38m95
7994a89L44o4l3j50K16N1l06K60Q3o49L11M37k49j20J75k29K36p5n0j79J38j8
8016f0j17L52m17m7J55J41L68n12L28j1n6p1k18M46l35k9K07n8j05K25K83m5q30
8039d06K64L6L18m63L67j61l24k6K24M02j30j89L74m06K06qk33J35MO8K3j96J36
8062A5O2j78o1J29m7M22q8p3Oj58J39J2J39N0k31k7j57P5j06K10L8l40Q4J03O7
8087H5J64m54K54J70J58m42J91q5M16n81Mp7J44J68j85L05m9k40J47M0J06l12
8109g3N3K21q2j34N1J13j07j53L15l48r4j30N22l2j40j58K46k10K68p7k08K01
$$ plain form
8131 44 8 170 132 -107 -56 108 -353 169 26 -217 277 280 -13 35 -123 98 253 98 192 255 85 92 114 22
8155 22 -112 108 -183 -357 70 -191 223 -316 -313 -127 -222 -142 -10 -228 -476 -43 -86 38 145 22 -146 156
8177 156 222 -142 59 372 102 192 257 67 -104 263 -7 53 -74 -252
$$ packed form
8131D4l6J62l8k39N1J64m61N22j43k43M94Lk93M8j58K21J55j55R4O3j70PK2r2
8155B2j34K20k91j74M27k61M14n39LJ86r5Q0J32k18k48M33m3J24J07j23j68L02
8177A56O6l64K01L13k70R0O5j90j71L67k70O0j27j78
8191b52
$$ Imaginary data points
##PAGE= N=2
##DATA TABLE= (X++(I..I)), XYDATA
$$ plain form
0 0 0 0 0 0 0 0 0 8 -8 8 -8 8 -16 16 -16 24 -24 32 -37 40 -48 57 -67 76 -86 101 -113 127 -143 164 -182
31 -182 206 -230 255 -285 316 -353 391 -432 481 -530 588 -652 721 -801 889 -988 1104 -1239
49 -1239 1396 -1583 1813 -2103 2475 -2977 3690 -4781 6644 -10419 21021 -107772 -396274 -44940
63 -44940 218274 40843 -110651 -19136 -27311 -86353 -2332 42785 -59293 -40480 55748 -14214
75 -14214 -70760 83572 104198 -118211 -124169 137501 153247 -61834 -54446 78670 -1105 -77254
87 -77254 58988 99249 -55527 -62733 64782 17271 -82604 8886 70810 -45574 -62358 61417
99 61417 33773 -73729 1685 84788 -27498 -79412 49967 66586 -48227 -9467 81486
110 81486 -24759 -112622 24753 100842 -31515 -73697 29928 12366 -71263 -6723 50492
$$ packed form
0@%%%%%%%Qj6J6j6J6k4L2l2M0m8N6o9P7q8J05j24J43j62J87k14K40k70L07l46
31a82L88m36M85n40O01o69P44q23R13j011J118j240J373j522J690j877K092k343
49a239K635k979L396l916M578n452O667q471J1425j7063L1440j28793k88502L51334
63d4940K63214j77431j51494R1515q175n9042Q4021M5117j02078J8813R6228o9962
75a4214n6546J54332K0626k22409n958K61670J5746k15081P388J33116p9775p6149
87g7254J36242M0261j54776p206J27515m7511r9875R1490O1924j16384j6784J23775
99F1417k7644j07502P5414Q3103j12286n1914J29379J6619j14813L8760R0953
110H1486j06245q7863J37375P6089j32357m2182J03625j7562q3629O4540N7215
$$ plain form
121 50492 -45996 -68897 50750 56646 -48041 -34799 21343 -25990 -13542 101583 66755 -84902
133 -84902 -50895 85288 40074 -54974 20369 83119 -13715 -61955 16181 29294 -25429 -8593
145 -8593 13227 -29236 -13422 45812 -13221 -92516 -9871 79469 3310 -60492 12507 38171
157 38171 -38189 -27856 53194 30304 -35561 -5883 32071 -2062 -10314 19985 -4580 -31234
169 -31234 17282 35486 -29374 -38871 24021 16938 -38291 -13120 31815 -3460 -27118 16562
181 16562 20115 -25556 -9195 35768 9996 -21394 13099 28352 -11421 -13858 20741 7715
193 7715 -15834 10370 18883 -19162 -18848 15933 -789 -29959 2543 27403 -12361 -32080 2557
206 2557 8404 -14033 2235 19474 -10429 -20365 15949 18656 -16635 -8984 20191 6022 -9087
$$ packed form
121E0492r6488k2901J19647N896j04687J3242N6142m7333J2448J15125l4828j51657
133h4902L4007J36183m5214r5048P5343O2750r6834m8240P8136J3113n4723J6836
145h593K1820m2463J5814N9234n9033p9295Q2645Q9340p6159o3802P2999K5664
157C8171p6360J0333Q1050k2890o5865K9678L7954l4133q252L0299k4565k6654
169c1234M8516J8204o4860r497O2892p083n5229K5171M4935l5275k3658M3680
181A6562L553m5671J6361M4963k5772l1390L4493J5253l9773k437L4599j3026
193G715k3549K6204Q513l8045L14L4781j6722k9170L2502K4860l9764j9719L4637
206B557N847k2437J6268J7239k9903r936L6314K707l5291P651K9175j4169j5109
$$ plain form
219 -9087 11621 8720 -21627 -8531 24630 9355 -15689 1719 9884 -14561 -7771 22135 6519
232 6519 -21255 189 21335 -2890 -14389 7159 6418 -11093 3925 15378 -10366 -18686 8929
245 8929 8518 -17005 -7444 13015 -5787 -19948 5046 11026 -15376 -11947 14465 6215 -12525
258 -12525 2243 13113 -3435 -1435 16901 5353 -11983 7655 22201 -1342 -10386 10582
270 10582 8261 -12570 -1169 15874 -3120 -17341 2398 7543 -13683 -12562 5683 -1507 -11216
283 -11216 2547 4289 -16027 -11190 12561 5692 -11324 2268 12829 -5215 -10233 10112 10165
296 10165 -5956 1754 13821 -320 -10204 5047 8903 -4042 654 11591 -1383 -10971 4149
309 4149 8799 -7003 -5915 9839 3565 -11089 -3095 6265 -3706 -6217 4739 1271 -10186 -3150
$$ packed form
219i087K0708k901l0347J3096L3161j5275k5044J7408Q165k4445O790K9906j5616
232F519k7774K1444K1146k4225j1499K1548p41j7511J5018J1453k5744q320K7615
245H929m11k5523R561K0459j8802j4161K4994N980k6402L429K6412q250j8740
258a2525J4768J0870j6548K000J8336j1548j7336J9638J4546k3543r044K0968
270A0582k321k0831J1401J7043j8994j4221J9739N145k1226J121J8245p190r709
283a1216J3763J742k0316M837K3751o869j7016J3592J0561j8044n018K0345N3
296A0165j6121P710J2067j4141r884J5251L856j2945M696J0937j2974r588J5120
309D149M650j5802J088J5754o274j4654P994R360r971k511J0956l468j1457P036
$$ plain form
323 -3150 5973 -3794 -8136 3700 3107 -9829 -4772 8526 2254 -6000 1697 5160 -2968 -1592 7816
338 7816 4559 -2108 5135 7896 -3661 -4784 6833 6331 -1852 626 4139 -3924 -7522 576 1589
353 1589 -3787 -1464 1768 -5719 -9098 -416 1689 -4811 -2010 5149 -1 -7252 -2192 4027 1553
368 1553 1944 5293 1925 -2519 1842 5330 1077 434 4776 2849 -1873 354 2594 -1780 -2775 2680
384 2680 2082 -4106 -3440 643 -1371 -3371 -763 -354 -3953 -2784 1054 -48 -2152 -294 -325 -2084
400 -2084 -225 3267 945 -1566 1535 2695 -1060 -1543 2720 4321 2114 1588 810 -1503 -487 2863
416 2863 3013 248 415 154 -2543 -2452 226 518 -1759 -1052 229 -2562 -5286 -3020 -7 -33 -25 -149
434 -149 -1934 -3500 -1059 1977 1735 1884 2138 586 -3 1184 2329 2457 2913 3673 1893 -804 150
$$ packed form
323c150R123r767m342J1836n93j2936N057J3298o272q254P697L463q128J376R408
338G816l257o667P243K761j1557j123J1617n02q183K478L513q063l598Q098J013
353A589n376K323L232p487l379Q682K105o500K801P159n150p251N060O219k474
368A553L91L349l368m444M361L488m253o43M342j927m722K227K240m374r95N455
384B680n98o188O66M083k014k000K608M09l599J169L838j102k104J858l1j759
400b084J859L492k322k511L101J160l755m83M263J601k207n26p78k313J016L350
416B863J50k765J67k61k697R1K678K92k277P07J281k791k724K266L013k6Qj24
434a49j785j566K441L036k42J49K54j552n89J187J145J28M56P60j780k697R54
$$ plain form
451 150 2342 1224 -336 214 335 -1199 -1441 -1315 -2038 -2710 -931 -181 -1447 -2847 -2091 -978 -569 -656
469 -656 -818 -1185 34 550 896 882 1229 263 -998 1076 3576 3696 1000 -6 1661 1070 211 1090
487 1090 3186 2622 -1043 -2249 -760 822 -368 -1082 -413 -3 -659 -2863 -3881 -2738 -731 502
503 502 252 -442 -1783 -3695 -3453 459 3614 1970 -604 -389 1052 1054 996 2416 2633 2611 2658 1645 -336
522 -336 -76 1765 1891 -16 561 1349 -874 -2721 -1912 -1090 -868 -1456 -1097 -1659 -2419 -2324 -2382 -1762 20
541 20 1696 -1102 -2855 456 3403 995 -1873 5 3233 3036 1724 1036 32 433 1887 1435 716
558 716 2202 2273 -1745 -2958 1225 3105 -1993 -3609 531 2603 -1103 -3335 -2418 -1479 -147 468 -603
575 -603 -1393 -412 -1180 -3673 -1488 3447 2403 -2207 -986 3135 1159 -2366 -257 3972 3132 1629
$$ packed form
451A50K192j118j560N50J21j534k42J26p23o72J779P50j266j400P56J113M09q7
469f56j62l67J219N16L46j4L47r66j261K074K500J20k696j006J667n91q59Q79
487A090K096n64l665j206J489J582j190p14O69M10o56k204j018J143K007J233
503E02k50o94j341j912K42L912L155j644k574K15J441Kn8J420K17k2M7j013j981
522c36K60J841J26j907N77P88k223j847Q09Q22K22n88L59n62p60R5n8O20J782
541B0J676k798j753L311K947k408k868J878L228j97j312o88j004M01J454m52p19
558G16J486P1m018j213M183J880n098j616M140K072l706k232R17R39J332O15j071
575f03p90R81p68k493K185M935j044m610J221M121j976l525K109M229q40j503
$$ plain form
591 1629 1543 -82 -640 1172 1998 485 1045 2917 -852 -4246 -1415 1313 -1507 -3103 669 1209 -3194
608 -3194 -4458 -2199 -798 82 2051 -86 -3726 -1552 3290 859 -1896 1725 4288 892 -268
623 -268 2797 2162 -856 472 3795 2004 -88 991 -677 -2248 1137 3038 -2194 -5407 0 2724
639 2724 -2205 -4016 -687 -1129 -2933 -913 431 -1713 -1139 1612 -481 -3173 469 3345 -279 -954
655 -954 4408 3077 -2780 -1942 4051 4184 603 1308 1932 -1002 -152 2309 353 -767 2673 2322 -3336
672 -3336 -3314 1371 57 -4092 -1000 3403 -1131 -6084 -2985 -326 -1682 -548 1151 -1560 -3789 -523
688 -523 1423 -609 550 3172 464 -1417 2468 4428 220 -348 4156 4346 -134 276 3003 1023
704 1023 -865 2080 1888 -2409 -2403 95 -567 -2257 -696 -1386 -4738 -3204 218 -1334 -3243 -1215 1144
$$ packed form
591A629q6j625n58J812Q26j513N60J872l769l394K831K728k820j596L772N40m403
608c194j264K259J401Q80J969k137l640K174M842k431k755L621K563l396j160
623b68L065o35l018J328L323j791k092J079j668j571L385J901n232l213N407K724
639B724m929j811L329m42j804K020J344k144N74K751k093k692L642K876l624o75
655i54N362j331n857Q38N993J33l581P05O24k934Q50K461j956j120L440l51n658
672c336K2M685j314m149L092M403m534m953L099K659j356J134J699k711k229L266
688e23J946k032J159K622k708j881L885J960m208n68M504J90m480M10K727j980
704A023j888K945j92m297OK498o62j690J561o90l352J534L422j552j909K028K359
$$ plain form
721 1144 -2264 -3194 334 1310 266 2290 3119 -697 -1452 2853 4105 1172 998 3199 1483 -862
737 -862 907 1703 183 776 1304 -653 -1892 -602 -593 -2418 -810 2099 -960 -4796 -2264 1092 -331
754 -331 -1944 -245 347 -1583 -1290 567 175 234 1324 513 -1213 460 2305 708 -318 2668 2984
771 2984 -821 -1167 2804 2804 370 316 1398 -278 -1126 447 134 -859 791 185 -2575 -2976 -494 -397
789 -397 -2490 -1135 1063 -1598 -3924 -1452 831 303 325 910 -170 -809 1445 1816 421 1669 3844
806 3844 1855 -606 888 2761 821 -620 1609 1963 -9 -1586 -1547 -1180 -268 803 -1424 -4069
822 -4069 -2142 746 -969 -3531 -934 994 -641 -1625 681 685 -1064 110 1638 611 720 1541 709
839 709 -114 1702 2643 -59 -1506 1638 2682 226 -896 137 -230 -1201 -157 797 -962 -1105 164
$$ packed form
721A144l408r30L528R76j044K024Q29l816p55M305J252k933j74K201j716k345
737h62J769P96j520N93N28j957j239J290Rj825J608K909l059l836K532L356j423
754c31j613J699N92j930K93J857l92N9J090q11j726J673J845j597j026K986L16
771B984l805l46L971%k434n4J082j676q48J573l13r93J650o06k760m01K482R7
789c97k093J355K198k661k326K472K283n28K2N85j080o39K254L71j395J248K175
806C844j989k461J494J873j940j441K229L54j972j577L9L67R12J071k227k645
822d069J927K888j715k562K597J928j635r84K306Mj749J174J528j027J09Q21q32
839G09q23J816R41k702j447L144J044k456j122J033l67r71J044R54j759j43J269
$$ plain form
856 164 -842 -2659 -1185 325 -743 -1482 445 -300 -2193 -1620 692 105 -665 1120 1544 -813 -1198
873 -1198 1350 1471 1032 1264 1702 457 812 1999 725 -569 1478 2978 287 -1684 99 633 -1247
890 -1247 -1586 152 -219 -2006 -1894 -1245 -2051 -1662 -389 -1150 -1719 -67 1328 -1044 -1739 671 2178
907 2178 914 608 1846 1667 746 1619 1585 979 1575 2243 1100 -592 730 938 -1182 -1185 432 895 -1365
926 -1365 -2254 -1407 -924 -1487 -1118 -694 -1209 -1013 -466 -1134 -1776 -435 757 151 217 1258 898 -575 278
945 278 1616 1651 924 1363 795 245 381 1237 510 63 758 1016 106 -232 -104 -1006 -913 159 855 -720
965 -720 -2309 -1592 -1076 -876 -715 -522 -1142 -1077 -540 -366 -712 -652 584 522 870 1054 681 -696 147 2228
985 2228 2673 730 133 629 1566 1292 585 15 16 476 566 -1035 -1312 -910 -742 -1516 -1407 -984 -1297 -1741
$$ packed form
856A64j006j817J474J510j068p39J927p45j893N73K312n87p70J785M24k357l85
873a198K548J21m39K32M38j245L55J187j274j294K047J500k691j971J783N34j880
890a247l39J738l71j787J12O49q06L89J273p61n69J652J395k372o95K410J507
907B178j264l06J238j79r21Q73l4o06N96O68j143j692J322K08k120lJ617M63k260
926a365q89Q47M83n63L69M24n15J96N47o68o42J341J192o06O6J041l60j473Q53
945B78J338L5p27M39n68n50J36Q56p27m47O95K58r10l38J28r02R3J072O96j575
965g20j589P17N16K00J61J93o20O5N37J74l46O0J236o2L48J84l73j377Q43K081
985B228M45j943n97M96R37k74p07n70JM60R0j601k77M02J68p74J09M23l13m44
$$ plain form
1005 -1741 -1289 -449 -874 -838 -794 -898 223 1034 562 -406 87 1712 1254 822 1411 2285 1531 499 506 912
1025 912 1417 1154 431 -343 -249 -46 -1254 -1481 -299 775 -441 -1903 -2014 -1410 -1330 -455 74 -650 -1108
1044 -1108 -930 -777 -656 106 338 -22 405 1398 1021 -192 -480 1565 2232 1814 1192 342 313 942 1371
1063 1371 989 119 -101 293 -414 -918 573 -257 -1220 -1509 -451 -542 -1319 -1353 -1178 -1033 -645 -648 -1173 -1256 261
1084 261 823 -356 -513 602 1035 703 952 1698 1229 438 1007 972 920 927 1156 683 -42 617 99 -1640
1104 -1640 -342 989 -82 -1683 -1990 -1456 -898 -1247 -655 -920 -1044 -1295 -649 -657 -722 282 96 -208 569
1123 569 1748 548 -342 509 2031 1951 811 563 358 1015 1269 1134 243 -81 455 463 102 130 -33 -1194
1143 -1194 -1322 -948 -338 -592 -1225 -1395 -1163 -578 -283 -950 -1508 -174 1099 371 -845 -365 945 1009 373
$$ packed form
1005a741M52Q40m25L6M4j04J121Q11m72r68M93J625m58m32N89Q74p54j032PM06
1025I12N05k63p23p74R4K03j208k27J182J074j216j462j11O04Q0Q75N29p24m58
1044a108J78J53J21P62K32l60M27R93l77j213k88K045O67m18o22q50k9O29M29
1063A371l82q70k20L94p07n04J491q30r63k89J058r1p77l4J75J45L88ln25q3J517
1084B61N62j179j57J115M33l32K49P46m69p91N69l5n2PK29m73p25O59n18j739
1104a640J298J331j071j601l07N34N58l49N92k65j24k51O46qo5J004j86l04P77
1123E69J179j200q90Q51J522q0j140k48k05O57K54j35q91l24N36Ql61K8j63j161
1143a194j28L74O10k54o33j70K32N85K95o67n58J334J273p28j216M80J310O4o36
$$ plain form
1162 373 876 1565 1456 109 231 608 1623 1354 -12 -114 626 930 -81 -969 -32 265 -1152 -1465
1180 -1465 -447 -67 -1327 -1097 -897 -335 -688 -1151 -1192 -193 1008 243 -530 -11 523 1096 324 540 1088
1199 1088 661 745 1007 613 608 1094 1089 889 23 -258 -152 129 195 57 -687 -1316 -1174 -644 -917 -870 -1328 -1273
1221 -1273 -736 -501 -584 -1185 -801 172 748 408 -153 -133 241 788 1395 1300 488 364 313 1307 1467 1108 233
1242 233 306 838 771 68 -530 -225 -156 -340 -761 -817 -714 -1302 -1052 -807 -573 -857 -1384 -1347 -365 -104 -807 -463
1264 -463 334 443 599 63 487 1201 1179 1014 619 813 745 659 786 1019 888 140 -140 -125 62 68 -772 -622
1286 -622 -803 -610 -850 -932 -1200 -1034 -552 -637 -697 -678 -740 -818 -52 244 309 -267 73 468 942 843 685 613 643
1309 643 1276 1462 437 473 655 1158 382 -53 -173 145 -126 -99 -61 -801 -932 -1365 -1083 -594 -589 -743 -1259
$$ packed form
1162C73N03O89j09j347J22L77J015k69j366j02P40L04j011q88R37K97j417l13
1180a465J018L80j260K30K00N62l53m63m1R99J201p65p73N19N34N73p72K16N48
1199A088m27Q4K62l94nM86nk00q66k81J06K81O6j38p44o29J42N30k73M7m58N5
1221a273N37K35q3o01L84R73N76l40n61K0L74N47O07r5q12j24n1R94J60l59q75
1242B33P3N32o7p03n98L05O9j84m21n6J03n88K50K45K34k84n27L7R82K61p03L44
1264d63P97J09J56n36M24P14k2j65l95J94o8q6J27K33j31p48k80J5J87Oq40J50
1286f22j81J93k40q2k68J66M82q5o0J9o2p8P66K96O5n76L40L95M74r9j58p2L0
1309F43O33J86j025L6J82N03p76m35j20L18k71K7L8p40j31m33K82M89Nj54n16
$$ plain form
1330 -1259 -1098 -391 -675 -1219 -261 356 283 263 230 335 229 734 1115 1186 1010 909 368 435 852 1500 707
1351 707 -90 515 131 -597 -625 193 -348 -1391 -526 -584 -1097 -1384 -579 -553 -727 -763 -708 -962 -879 418 425 -474
1373 -474 217 883 503 157 1001 1356 285 362 1607 1267 808 711 1090 196 353 462 -291 -840 363 1051
1393 1051 -521 -1415 -870 -825 -1324 -483 97 -711 -1509 -631 -315 -728 -565 500 36 -592 210 631 -199
1412 -199 75 1402 1407 679 628 547 465 632 1322 557 140 568 797 -470 -835 273 609 -650 -867 -235
1432 -235 -1016 -1462 -950 -342 -1066 -1030 -382 -518 -1122 -39 -37 -458 -251 964 538 -583 901 1832 480
1451 480 195 984 1498 514 650 1278 351 57 541 213 -243 -147 506 -428 -1246 124 -176 -1628 -1527 132
1471 132 125 -1803 -1434 -634 -728 -514 455 -63 -854 -171 690 234 -361 1358 1120 -51 618 1747 947 -367
$$ packed form
1330a259J61P07k84n44R58O17p3k0l3J05j06N05L81P1j76j01n41O7M17O48p93
1351G07p97O05l84p28k8Q18n41j043Q65n8n13k87Q05K6j74l6N5k54Q3J297Pq99
1373d74O91O66l80l46Q44L55j071P7J245l40m59r7L79q94J57J09p53n49J203O88
1393A051j572q94N45M5m99Q41N80q08p98Q78L16m13J63J065m64o28Q02M21q30
1412a99K74J327Np28n1q1q2J67O90p65m17M28K29j267l65J108L36j259k17O32
1432b35p81m46N12O08p24L6O48j36o04J083Km21K07J215m26j121J484R31j352
1451D80k85P89N14r84J36O28r27k94M84l28m56R6O53r34q18J370l00j452J01J659
1471A32pj928L69Q00r4K14R69n18p91O83Q61m56n95J719k38j171O69J129q00j314
$$ plain form
1491 -367 939 1596 756 695 487 -199 -619 821 667 -658 -1165 -380 -145 -1274 -676 -487 -883 -1430 -390
1510 -390 -368 -1160 -781 -231 -819 -596 967 686 -904 61 1574 974 42 465 1346 760 673 1338 262
1529 262 -131 993 1302 89 -360 375 -57 -876 -182 312 -1094 -1595 -379 -111 -968 -1074 -631 -1294 -737
1548 -737 49 186 -853 -633 711 483 22 657 867 -110 577 1902 1139 -516 683 1631 646 269
1566 269 993 549 -750 -13 811 -304 -1010 -374 242 -1298 -957 254 -1188 -1563 -242 202 -1228 -733
1584 -733 -114 -193 -1183 67 502 -193 -437 1110 796 -292 371 1260 1052 393 1163 1123 157 478 1121 287
1604 287 -347 687 581 -690 -460 163 -483 -1807 -779 95 -738 -1075 -618 -726 -808 -110 44 -949 -761
1623 -761 509 758 -533 -326 741 509 187 679 1605 352 110 1330 1104 419 303 667 -165 -145 804
$$ packed form
1491c67J306O57q40o1k08o86m20J440j54j325n07P85K35j129N98J89l96n47J040
1510c90K2p92L79N50n88K23J563k81j590R65J513o00r32M23Q81n86q7O65j076
1529B62l93J124L09j213m49P35m32q19O94M94j406n01J216K68q57j06M43o63N57
1548g37P86J37j039K20J344k28m61O35K10r77O87J325p63j655J199R48r85l77
1566B69P24m44j299P37Q24j115p06O36O16j540L41J211j442l75J321M44j430M95
1584g33O19p9r90J250M35o95k44J547l14j088O63Q89k08o59P70m0r66L21O43q34
1604B87o34J034j06j271K30O23o46j324J028Q74q33l37M57j08q2O98J54r93J88
1623g61J270K49j291K07J067k32l22M92R26j253k42J220k26o85j16L64q32K0R49
$$ plain form
1642 804 19 -1118 -774 199 -317 -593 -438 -468 -1315 -680 -64 -400 -967 -564 -466 -566 -296 460 -162 -486
1662 -486 341 953 337 -16 756 1117 482 526 1193 449 329 552 986 250 79 509 -273 -390 -30 -241
1682 -241 -1067 -1030 24 -39 -1194 -1446 -426 -570 -854 -763 -320 -326 -32 364 36 -238 293 550 356 591 693
1703 693 603 392 769 1483 768 117 480 736 400 81 -94 -327 -401 -464 -303 -340 -722 -865 -498 -821 -627
1724 -627 -379 -537 -767 -583 -274 -598 -195 5 109 74 -18 544 517 1001 750 546 778 692 1052 876 356
1745 356 -123 436 384 328 156 158 -341 -573 -170 -164 -559 -730 -872 -885 -561 -686 -741 -867 -923 -456 -282 -297 -372 2
1769 2 362 159 610 623 67 430 849 906 548 896 856 570 393 714 493 123 277 384 -363 -602 162 -395
1791 -395 -883 -553 -402 -665 -1255 -748 -569 -357 -566 204 -406 -594 224 193 267 157 492 315 297 594 1145
$$ packed form
1642H04p85j137L44R73n16k76J55l0q47O35O16l36n67M03R8j00K70P56o22l24
1662d86Q27O12o16l53P72L61o35M4O67p44j20K23M34p36j71M30p82j17L60k11
1682b41q26L7J054o3j155k52J020j44k84R1M43oK94L96l28k74N31K57j94K35J02
1703F93r0k11L77P14p15o51L63K56l36l19j75k33p4o3J61l7l82j43L67l23J94
1724f27K48j58k30J84L09l24M03K00J04l5r2N62k7M84k51k04K32q6L60j76n20
1745C56m79N59n2n6j72Km99k32M03Ol95j71j42j3L24j25n5j26n6M67J74j5p5L74
1769BL60k03M51J3n56L63M19N7l58L48m0k86j77L21k21l70J54J07p47k39P64n57
1791c95m88L30J51k63n90N07J79K12k09P70o10j88Q18l1P4j10L35j77j8K97N51
$$ plain form
1812 1145 903 586 946 831 317 489 366 402 195 652 -290 -656 -313 279 -701 -1013 -716 -329 -573 -576 -604
1833 -604 -689 -1030 -223 -5 -374 -353 40 93 108 425 747 378 30 470 826 668 674 867 842 470 807 585
1855 585 -262 319 207 133 -411 -543 -23 -886 -693 -125 -427 -883 -808 -471 -583 -662 -399 -587 -667 -84 369
1876 369 -137 -284 240 661 -180 282 823 414 323 820 765 541 848 743 310 276 175 588 -194 -427 22
1897 22 -169 -728 -474 -292 -860 -1174 -616 -318 -721 -649 -128 -519 -644 190 -19 -507 85 818 688 65 643
1918 643 571 503 656 921 541 613 651 918 371 136 333 332 -238 -23 178 -615 -490 -781 -277 -882 -853 -276
1940 -276 -428 -743 -499 -294 -516 -513 -44 -150 -223 424 817 424 105 596 808 402 742 910 654 182 997
1961 997 698 -85 99 430 247 -275 -443 110 -701 -756 -130 -906 -998 -421 -289 -869 -944 -502 -412 -500 -377 6
$$ packed form
1812A145k42l17L60j15n14J72j23L6k07M57r42l66L43N92r80l12K97L87k44lk8
1833f04q5l41Q07K18l69K1L93N3J5L17L22l69l48M40L56j58OJ93k5l72L37k22
1855E85q47N81j12p4n44j32N20q63J93N68l02m56P5L37j12p9K63j88q0N83M53
1876C69n06j47N24M21q41M62N41m09r1M97n5k24L07j05m33l4j01M13p82k33M49
1897B2j91n59K54J82n68l14N58K98m03P2N21l91j25Q34k09m88N92P33j30o23N78
1918F43p2o8J53K65l80P2L8K67n47k35J97jn70K15K01p93J25k91N04o05K9N77
1940b76j52l15K44K05k22LM69j06p3O47L93l93l19M91K12m06L40J68k56m72Q15
1961I97k99p83J84L31j83n22j68N53q11n5O26p76r2N77J32n80p5M42R0q8J23L83
$$ plain form
1983 6 -18 -340 489 694 271 598 828 591 383 930 991 249 180 1096 750 134 158 497 -60 -347 63 -739
2005 -739 -535 -451 12 -480 -915 -488 -691 -698 -961 -438 -325 -437 -257 -147 -630 372 198 402 256 474 758
2026 758 325 344 920 1024 417 682 892 478 430 134 403 23 -93 214 -346 -667 -533 -203 -763 -847 -280
2047 -280 -759 -885 -429 -651 -428 -590 -196 -481 -369 25 154 135 285 674 566 426 796 588 509 523 616
2068 616 684 347 259 469 -151 75 25 58 -336 -318 -399 -72 -512 -390 -632 -778 -589 -359 -462 -311 -310 -126 -480
2091 -480 -137 71 192 393 718 477 307 595 500 430 506 400 521 279 277 -15 354 73 170 58 -272 140
2113 140 -148 -532 -478 -331 -482 -905 -602 -388 -288 -220 -387 -456 33 -248 37 402 200 439 372 101 122 212
2135 212 718 1070 845 429 492 547 494 403 355 149 76 113 -2 -376 -342 -420 -317 -455 -655 -644 -797 -863 -500 -352
$$ packed form
1983Fk4l22Q29K05m23L27K30k37k08N47O1p42o9R16l46o16K4L39n57k87M10q02
2005g39K04Q4M63m92m35M27k03pk63N23J13j12J80J10m83J002j74K04j46K18K84
2026G58m33J9N76J04o07K65K10m14m8k96K69l80j16L07n60l21J34L30n60q4N67
2047b80m79j26M56k22K23j62L94k85J12L94J29j9J50L89j08j40L70k08p9J4R3
2068F16O8l37q8K10o20K26n0L3l94J8q1L27m40J22k42j46J89K30j03J51JJ84l54
2091d80L43K08J21K01L25k41j70K88r5p0P6j06J21k42kk92L69k81R7j12l30M12
2113A40k88l84N4J47j51m23L03K14J00O8j67o9M89k81K85L65k02K39o7k71K1R0
2135B12N06L52k25m16O3N5n3r1m8k06p3L7j15l74L4p8J03j38k00J1j53o6L63J48
$$ plain form
2159 -352 -440 -166 -41 -96 -375 205 274 521 326 198 58 57 620 469 365 482 450 633 516 35 165 5
2181 5 -247 173 -3 -218 -430 -119 -33 -1082 -351 -715 -434 -524 -438 -471 -555 -407 114 -18 -285 -138 112 51
2203 51 425 478 519 292 535 945 555 586 529 721 310 438 232 250 -164 -265 143 -26 -248 -306 -529 -565 -450
2226 -450 -448 -953 -424 -401 -177 -587 -313 -103 -402 -324 511 293 88 388 431 196 388 615 610 646 430 753 590
2249 590 456 294 478 -90 -61 114 -375 97 -133 -226 -453 -419 -769 -740 -646 -609 -108 -328 -424 -149 -46 -112 -53
2272 -53 -54 26 -128 598 408 84 405 660 797 364 429 359 150 292 920 462 87 4 169 82 -263 -221 -390
2295 -390 -384 -106 -169 -675 -806 -568 -306 -588 -490 -185 -671 -175 -275 146 -102 17 390 414 569 152 556 339
2317 339 757 864 501 435 606 510 282 234 158 -216 -339 -172 -115 -432 -374 -327 -368 -844 -328 -496 -397 -728 -231
$$ packed form
2159c52q8K74J25n5k79N80O9K47j95j28j40jN63j51j04J17l2J83j17m81J30j60
2181Ek52M20j76k15k12L11Q6j049P31l64K81r0Q6l3q4J48N21j32k67J47K50o1
2203E1L74N3M1k27K43M10l90L1n7J92m11J28k06J8m14j01M08j69k22n8k23l6J15
2226d50Kn05N29K3K24m10K74K10k99P8Q35k18k05L00M3k35J92K27nL6k16L23j63
2249E90j34j62J84n68K9J75m89M72k30r3k27L4l50K9R4L7N01k20r6K75J03o6N9
2272e3jQ0j54P26j90l24L21K55J37m33O5p0k09J42O28m58l75q3J65q7l45M2j69
2295c90OK78o3n06j31K38K62k82R8L05m86M96j00M21k48J19L73K4J55m17M04k17
2317C39M18J07l63o6J71r6k28m8p6l74j23J67N7l17N8M7m1m76N16j68R9l31M97
$$ plain form
2340 -231 38 -402 -63 50 -19 -290 420 242 616 664 707 636 596 685 836 520 100 336 570 124 285 349
2362 349 -21 -135 233 -250 -394 -487 -260 -255 -663 -509 -659 -365 -222 -133 -131 -526 -347 133 104 -185 0 130
2384 130 211 517 250 292 465 893 534 598 464 494 496 340 802 -50 -75 -279 70 -81 -167 -211 -319 -465 -194
2407 -194 -445 -400 -528 -415 -634 -599 -335 -153 -192 -116 327 305 -92 274 732 450 252 584 749 398 170 334
2429 334 365 207 202 197 -114 -57 159 -363 -373 -626 -297 -576 -575 -297 -310 -901 -274 -114 -206 -732 -516 -60 -123 186
2453 186 576 100 35 413 518 95 -51 854 495 233 332 142 79 107 379 555 25 -128 170 -335 -154
2474 -154 208 -266 -821 -534 26 -494 -864 -273 -163 -739 -273 134 71 -195 -37 121 69 -65 432 718 -2
2495 -2 371 702 105 127 415 322 292 164 165 219 216 158 202 -646 -506 -21 -213 -760 -140 -134 -797 -777 -183 -218 -594
$$ packed form
2340b31K69m40L39J13o9k71P10j78L74M8M3p1m0Q9J51l16m20K36K34m46J61O4
2362C49l70j14L68m83j44r3K27Nm08J54j50K94J43Q9Kl95J79M80k9k89J85J30
2384A30Q1L06k67M2J73M28l59O4j34L0Kj56M62q52k5k04L49j51q6m4j08j46K71
2407a94k51M5j28J13k19L5K64J82l9P6M43k2l97L66M58k82j98L32J65l51k28J64
2429C34L1j58nnl11N7K16n22j0k53L29k79JK78j3n91O27J60r2n26K16M56o3L09
2453A86L90m76o5L78J05m23j46R05l59k62R9j90o3K8K72J76n30j53K98n05J81
2474a54L62m74n55K87N60n20l70N91J10n76M66M07o3k66J58J58n2j34M97K86p20
2495bL73L31n97K2K88r3l0j28JN4ln8M4q48J40M85j92n47O20Oo63K0N94l5l76
$$ plain form
2520 -594 -303 -90 -632 -300 340 570 -469 101 383 357 201 223 849 107 263 880 574 -161 -188 261 315
2541 315 -200 30 60 -549 -141 -3 -407 -629 -374 -181 -652 -609 -312 -371 -620 -154 -64 -135 -161 131 -22 -254
2563 -254 630 316 55 137 562 358 268 533 367 410 210 216 253 170 120 176 -227 -246 -211 -81 -638 -172 -320 -154
2587 -154 -945 -717 -463 -347 -600 -8 -186 -408 -7 349 292 26 98 316 136 582 558 686 754 705 780 263
2609 263 314 337 220 -20 -46 -38 -336 -570 -169 -248 -371 -474 -290 -93 -595 -526 -224 -491 -285 -250 -179 -272 93
2632 93 -13 47 131 449 340 417 508 441 767 490 615 602 471 149 475 163 419 -210 -7 17 -18 133 -185
2655 -185 -539 -401 -366 -206 -564 -568 -126 -118 -98 -510 -157 -289 -47 106 -60 -122 -46 34 296 479 535 517 290 456
2679 456 786 540 87 257 405 468 85 -141 -211 14 -103 -196 -235 -487 -380 -180 -382 -574 -486 -267 -337 -357
$$ packed form
2520e94K91K13n42L32O40K30j039N70K82k6j56K2O26p42J56O17l06p35k7M49N4
2541C15n15K30L0o09M08J38m04k22K55J93m71M3K97n9k49M66R0p1k6K92j53k32
2563b54Q84l14k61Q2M25k04r0K65j66M3k00OL7q3n0N6m03j9L5J30n57M66j48J66
2587a54p91K28K54J16k53N92j78k22M01L56n7k66P2K18j80M46k4J28O8m9P5n17
2609B63N1K3j17k40k6Qk98k34M01p9j23j03J84J97n02O9L02k67K06L5P1r3L65
2632I3j06O0Q4L18j09P7R1o7L26k77J25j3j31l22L26l12K56o29K03K4l5J51l18
2655a85l54J38L5J60l58mM42QK0m12L53j32K42J53j66o2P6Q0K62J83N6j8k27J66
2679D56L30k46m53J70J48O3l83k26p0K25j17r3l9k52J07K00k02j92Q8K19p0k0
$$ plain form
2701 -357 -234 -320 -88 175 129 287 375 -1 288 244 621 400 249 248 554 543 343 243 152 76 174 286 141
2724 141 -62 -415 -266 -472 -38 -8 -602 -529 -188 -255 -362 -292 -452 -136 -18 -144 -119 -185 -110 273 100 198 409
2747 409 409 325 295 462 741 117 -121 138 276 -80 215 204 -176 -410 -107 -119 -23 -30 -170 -539 -641 -353 -167
2770 -167 -584 -244 139 -379 -410 -289 97 107 210 -11 100 -49 316 455 232 244 358 511 105 637 517
2791 517 92 300 386 104 -27 -354 -231 -583 -539 -138 -847 -580 -246 -160 -488 -326 -231 -318 -379 25 268 140
2813 140 36 113 391 308 538 505 627 240 380 597 225 119 344 553 80 -174 24 -72 -408 28 -198
2834 -198 -128 -125 -423 -536 -358 -75 -294 -363 -600 11 -213 -402 154 191 -108 205 53 143 -21 385 63 400
2856 400 312 390 228 383 142 564 177 22 363 -121 248 130 -102 -244 -281 22 -497 -596 -407 -310 -463 -441
$$ packed form
2701c57J23q6K32K63m6J58Q8l76K89m4L77k21j51jL06j1k00j00r1p6R8J12j45
2724A41k03l53J49k06M34L0n94P3L41o7j07P0j60L16J18j26K5o6P5L83j73R8K11
2747D09%q4l0J67K79o24k38K59J38l56K95j1l80k34L03j2R6pj40l69j02K88J86
2770a67m17L40L83n18l1J21L86J0J03k21J11j49L65J39k23J2J14J53m06N32j20
2791E17m25K08Q6k82j31l27J23l52M4M01p09K67L34Q6l28J62R5q7o1M04K43j28
2813A40j04P7K78q3K30l3J22l87J40K17l72j06K25K09m73k54J98r6l36M36k26
2834a98P0Lk98j13J78K83k19o9k37O11k24j89N56L7k99L13j52R0j64M06l22L37
2856D00q8P8j62J55k41M22l87j55L41m84L69j18k32j42l7L03n19r9J89R7j53K2
$$ plain form
2878 -441 -467 -209 -319 210 -121 117 8 145 256 481 271 190 303 218 509 572 360 319 444 601 344 -30
2900 -30 -93 -233 16 -292 -181 -276 -294 -235 -859 -465 -447 -404 -162 -427 -112 -131 -256 -74 -116 -81 22 392 74
2923 74 143 413 181 207 425 351 225 93 232 443 285 -172 -225 132 39 -147 40 -263 -230 -86 -317 -163
2945 -163 -659 -202 -401 -213 29 -191 -81 -293 166 -42 -62 13 -86 50 16 353 15 162 425 684 415
2966 415 62 223 389 247 323 303 209 148 13 196 -348 31 -167 -442 5 -235 -529 -389 -443 -291 -200 -468
2988 -468 -174 -213 -215 -212 -83 -149 49 367 126 -51 310 462 497 243 15 425 405 353 126 116 348 -370 315
3011 315 -287 -171 -360 -257 -175 -211 -403 -359 -400 -191 -385 -339 -358 -88 -167 -185 254 -329 76 39 318 59 172
3034 172 161 187 447 323 336 232 641 105 241 101 97 209 327 -129 15 -219 -363 -422 -251 -35 -14 -404
$$ packed form
2878d41k6K58j10N29l31K38j09J37J11K25k10q1J13q5K91O3k12m1J25J57k57l74
2900c0o3j40K49l08J11r5j8N9o24L94J8M3K42k65L15j9j25J82m2L5J03L70l18
2923G4O9K70k32K6K18p4j26j32J39K11j58m57n3L57r3j86J87l03L3J44k31J54
2945a63m96M57j99J88K42k20J10k12M59k08k0P5r9J36l4L37l38J47K63K59k69
2966D15l53J61J66j42P6k0r4o1j35J83n44L79j98k75M47k40k94J40n4J52R1k68
2988d68K94l9kLJ29o6J98L18k41j77L61J52L5k54k28M10k0n2k27j0K32p18O85
3011C15o02J16j89J03Q2l6j92M4m1K09j94M6j9K70p9j8M39n83M05l7K79k59J13
3034A72j1K6K60j24J3j04M09n36J36j40mJ12J18m56J44k34j44n9J71K16K1l90
$$ plain form
3056 -404 -605 -223 -412 -265 -21 -251 -119 -81 -92 101 358 -170 120 185 154 365 404 311 418 389 127 521
3078 521 326 153 87 173 -3 42 60 -84 -139 -78 -222 -285 -45 -192 -443 -313 -333 -444 -385 174 -154 -113 95
3101 95 216 -10 95 81 153 58 355 223 358 360 434 650 108 57 136 236 -154 -19 138 -149 -175 -171 -190 -111 -421
3126 -421 -436 -98 -633 -344 -311 61 -217 -12 -68 13 191 -128 87 65 70 253 442 532 265 457 345 261 237
3149 237 300 -45 296 403 -40 -31 -63 -260 -249 -292 -338 -670 -192 -422 -320 -326 -227 -440 -327 -249 -89 -196 4 298
3173 298 178 107 122 181 254 262 185 277 276 209 304 347 403 34 357 -118 157 339 185 -128 -372 38 -53 -333 -204
3198 -204 -277 -405 -37 -175 -730 -153 -268 -43 28 9 189 19 -102 216 197 -84 220 345 184 236 80 226
3220 226 154 97 481 -78 -78 482 -42 -97 69 -134 -382 -342 -9 -164 -730 -645 -194 -364 -573 -343 -206 -207 -294
$$ packed form
3056d04k01L82j89J47K44k30J32L8j1J93K57n28K90O5l1K11L9r3J07k9k62L94
3078E21j95j73o6Q6j76M5J8j44n5O1j44o3K40j47k51J30k0j11N9N59l28M1K08
3101I5J21k26J05j4P2r5K97j32J35KP4K16n42n1P9J00l90J35J57k87k6Mj9P9l10
3126d21j5L38n35K89L3L72k78K05n6Q1J78l19K15k2NJ83J89R0k67J92j12q4k4
3149B37O3l45L41J07m43Rl2j97J1m3m6l32M78k30J02oR9k13J13P8J60j07K00K94
3173B98j20p1J5N9P3Qp7R2jo7R5M3N6l69L23m75K75J82j54l13k44M10r1k80J29
3198b04p3j28L68j38n55N77j15K25P1j9J80j70j21L18j9k81L04J25j61N2j56J46
3220B26p2n7L84n59%N60n24n5J66k03k48M0L33j55n66Q5M51j70k09K30J37jq7
$$ plain form
3243 -294 -165 58 -366 388 510 307 75 303 431 185 112 608 424 203 74 369 167 277 -70 -231
3263 -231 -17 114 218 -189 -643 -116 -287 -633 -394 -216 -348 -301 5 -284 -135 -346 -272 -262 -7 176 327
3284 327 163 28 172 358 103 190 459 311 12 318 262 118 527 244 163 139 36 -320 -211 -451 -36
3305 -36 -397 -389 58 -156 -369 -192 -84 -162 -142 -12 296 60 -88 152 15 -314 -76 308 334 -92 470 497
3327 497 299 211 319 196 107 191 0 -144 373 -58 -502 -543 -290 -328 -181 -547 -66 -418 -170 -122 -329 -266
$$ packed form
3243b94J29K23m24P54J22k03k32K28J28k46p3M96j84k21j29K95k02J10l47j61
3263b31K14J31J04m07m54N27j71l46K39J78j32M7L06k89J49k11P4J0K55J83J51
3284C27j64j35J44J86k55Q7K69j48k99L06n6j44M09k83q1k4j03l56J09k40M15
3305c6l61QM47k14k13J77J08p8K0J30L08k36j48K40j37l29K38L84K6m26N62K7
3327D97j98q8J08j23q9Q4j91j44N17m31m44m1K53l8J47l66M81l52K48M8k07O3
$$ [...]
8191C0
##END NTUPLES=NMR FID
##END=
