##TITLE=1H_SL67-SePh-f6
 CDCl3, 8 sc, 
 15.2.2019
##JCAMPDX= 6.0         $$ Bruker NMR JCAMP-DX V2.0
##DATA TYPE= NMR FID
##DATA CLASS= NTUPLES
##ORIGIN= UXNMR, Bruker Analytische Messtechnik GmbH
##OWNER= root
$$ XWIN-NMR		Version 3.5
$$ Fri Feb 15 16:01:28 2019 Russian Standard Time (UT+4h)  she@DPX200
##.OBSERVE FREQUENCY= 200.1313
##.OBSERVE NUCLEUS= ^1H
##.DELAY= (6, 6)
##.ACQUISITION MODE= SIMULTANEOUS
##.ACQUISITION SCHEME= undefined
##.AVERAGES= 8
##.DIGITISER RES= 18
##SPECTROMETER/DATA SYSTEM= spect
##.PULSE SEQUENCE= zg30
##.SOLVENT NAME= CDCl3
##.SHIFT REFERENCE= (INTERNAL, CDCl3, 0, 15.7039)
##AUDIT TRAIL= $$ (NUMBER, WHEN, WHO, WHERE, WHAT)
$$ ##TITLE= Audit trail, XWIN-NMR		Version 3.5
$$ ##JCAMPDX= 5.01
$$ ##ORIGIN= Bruker BioSpin GmbH
$$ ##OWNER= she
$$ F:/spectra/data/she/nmr/H-F/1/audita.txt
$$ ##AUDIT TRAIL=  $$ (NUMBER, WHEN, WHO, WHERE, WHAT)
(   1,<2019-02-15 16:00:16.32 +0400>,<she>,<DPX200>,
      <created by zg, POWCHK disabled, PULCHK disabled
       configuration hash MD5:
       00 E9 B6 7A A2 85 ED C7 34 08 36 98 17 FE 4E 26
       data hash MD5: 16K
       19 6D 32 E6 E9 C7 CD 2F 5A A0 32 46 A5 F0 F9 E6>)
$$ ##END=
$$ 
$$ hash MD5
$$ FE 53 7F 4C B1 71 61 54 E2 AB C9 6C 30 BD B9 BE
##$RELAX= 
##$RELAX= 
##$RELAX= 
##$RELAX= 
##$RELAX= 
##$RELAX= 
$$ Bruker specific parameters
$$ --------------------------
##$DU= <F:/spectra>
##$EXPNO= 1
##$NAME= <H-F>
##$PROCNO= 1
##$TYPE= <nmr>
##$USER= <she>
##$AMP= (0..31)
100 100 100 100 100 100 100 100 100 100 100 100 100 100 100 100 100 100 
100 100 100 100 100 100 100 100 100 100 100 100 100 100 
##$AQSEQ= 0
##$AQ_mod= 1
##$AUNM= <au_zg>
##$AUTOPOS= <>
##$BF1= 200.13
##$BF2= 200.13
##$BF3= 200.13
##$BF4= 200.13
##$BF5= 200.13
##$BF6= 200.13
##$BF7= 200.13
##$BF8= 200.13
##$BYTORDA= 1
##$CFDGTYP= 0
##$CFRGTYP= 5
##$CHEMSTR= <none>
##$CNST= (0..31)
1 1 145 1 1 1 1 1 1 1 1 1 1 1 1 1 1 1 1 1 1 1 1 1 1 1 1 1 1 1 1 1 
##$CPDPRG= <>
##$CPDPRG1= <>
##$CPDPRG2= <>
##$CPDPRG3= <>
##$CPDPRG4= <mlev>
##$CPDPRG5= <mlev>
##$CPDPRG6= <mlev>
##$CPDPRG7= <mlev>
##$CPDPRG8= <mlev>
##$CPDPRGB= <>
##$CPDPRGT= <>
##$D= (0..31)
0 1.2 0 0 0 0 0 0 0 0 0 0.03 0 0 0 0 0 0 0 0 0 0 0 0 0 0 0 0 0 0 0 0 
##$DATE= 1550232015
##$DBL= (0..7)
120 120 120 120 120 120 120 120 
##$DBP= (0..7)
150 150 150 150 150 150 150 150 
##$DBP07= 0
##$DBPNAM0= <>
##$DBPNAM1= <>
##$DBPNAM2= <>
##$DBPNAM3= <>
##$DBPNAM4= <>
##$DBPNAM5= <>
##$DBPNAM6= <>
##$DBPNAM7= <>
##$DBPOAL= (0..7)
0.5 0.5 0.5 0.5 0.5 0.5 0.5 0.5 
##$DBPOFFS= (0..7)
0 0 0 0 0 0 0 0 
##$DE= 6
##$DECBNUC= <off>
##$DECIM= 32
##$DECNUC= <off>
##$DECSTAT= 4
##$DIGMOD= 1
##$DIGTYP= 9
##$DL= (0..7)
0 120 120 120 120 120 120 120 
##$DP= (0..7)
150 150 150 150 150 150 150 150 
##$DP07= 0
##$DPNAME0= <>
##$DPNAME1= <>
##$DPNAME2= <>
##$DPNAME3= <>
##$DPNAME4= <>
##$DPNAME5= <>
##$DPNAME6= <>
##$DPNAME7= <>
##$DPOAL= (0..7)
0.5 0.5 0.5 0.5 0.5 0.5 0.5 0.5 
##$DPOFFS= (0..7)
0 0 0 0 0 0 0 0 
##$DQDMODE= 0
##$DR= 18
##$DS= 0
##$DSLIST= <SSSSSSSSSSSSSSS>
##$DSPFIRM= 0
$$ [...]
##$SUBNAM2= <"">
##$SUBNAM3= <"">
##$SUBNAM4= <"">
##$SUBNAM5= <"">
##$SUBNAM6= <"">
##$SUBNAM7= <"">
##$SUBNAM8= <"">
##$SUBNAM9= <"">
##$SW= 20.0189088683792
##$SWIBOX= (0..15)
0 0 2 0 0 0 0 0 0 0 0 0 0 0 0 0 
##$SW_h= 4006.41025641026
##$TD= 16384
##$TD0= 1
##$TE= 0
##$TE2= 300
##$TE3= 300
##$TEG= 300
##$TL= (0..7)
0 120 120 120 120 120 120 120 
##$TP= (0..7)
150 150 150 150 150 150 150 150 
##$TP07= 0
##$TPNAME0= <>
##$TPNAME1= <>
##$TPNAME2= <>
##$TPNAME3= <>
##$TPNAME4= <>
##$TPNAME5= <>
##$TPNAME6= <>
##$TPNAME7= <>
##$TPOAL= (0..7)
0.5 0.5 0.5 0.5 0.5 0.5 0.5 0.5 
##$TPOFFS= (0..7)
0 0 0 0 0 0 0 0 
##$TUNHIN= 0
##$TUNHOUT= 0
##$TUNXOUT= 0
##$USERA1= <user>
##$USERA2= <user>
##$USERA3= <user>
##$USERA4= <user>
##$USERA5= <user>
##$V9= 5
##$VALIST= <valist>
##$VCLIST= <CCCCCCCCCCCCCCC>
##$VD= 0
##$VDLIST= <DDDDDDDDDDDDDDD>
##$VPLIST= <PPPPPPPPPPPPPPP>
##$VTLIST= <TTTTTTTTTTTTTTT>
##$WBST= 1024
##$WBSW= 4
##$XGAIN= (0..3)
0 0 0 0 
##$XL= 0
##$YL= 0
##$YMAX_a= 139082
##$YMIN_a= -206388
##$ZGOPTNS= <>
##$ZL1= 120
##$ZL2= 120
##$ZL3= 120
##$ZL4= 120
##$ABSF1= 10
##$ABSF2= 0
##$ABSG= 5
##$ABSL= 3
##$ALPHA= 0
##$AQORDER= 0
##$ASSFAC= 0
##$ASSFACI= 0
##$ASSFACX= 0
##$ASSWID= 0
##$AUNMP= <proc_1d>
##$AZFE= 0.1
##$AZFW= 0.1
##$BCFW= 1
##$BC_mod= 2
##$BYTORDP= 1
##$COROFFS= 0
##$CY= 11.3945322036743
##$DATMOD= 1
##$DC= 2
##$DFILT= <>
##$DTYPP= 0
##$F1P= 18.9103706918063
##$F2P= -1.10871071338519
##$FCOR= 0.5
##$FTSIZE= 0
##$FT_mod= 4
##$GAMMA= 1
##$GB= 0.15
##$INTBC= 1
##$INTSCL= 1
##$ISEN= 128
##$LB= 0.24
##$LEV0= 0
##$LPBIN= 0
##$MAXI= 10000
##$MC2= 0
##$MEAN= 0
##$ME_mod= 0
##$MI= 1.114404
##$NCOEF= 0
##$NC_proc= 0
##$NLEV= 6
##$NOISF1= 3.799351
##$NOISF2= 2.8
##$NSP= 1
##$NTH_PI= 0
##$NZP= 0
##$OFFSET= 15.70392
##$PC= 1
##$PHC0= -9052.258
##$PHC1= 11.60014
##$PH_mod= 1
##$PKNL= yes
##$PPARMOD= 0
##$PSCAL= 0
##$PSIGN= 0
##$REVERSE= no
##$SF= 200.130013532006
##$SI= 16384
##$SIGF1= 3
##$SIGF2= 2
##$SINO= 400
##$SIOLD= 16384
##$SREGLST= <1H.CDCl3>
##$SSB= 0
##$STSI= 0
##$STSR= 0
##$SW_p= 3612.71676300578
##$SYMM= 0
##$S_DEV= 0
##$TDeff= 0
##$TDoff= 0
##$TI= <>
##$TILT= no
##$TM1= 0
##$TM2= 0
##$TOPLEV= 0
##$USERP1= <user>
##$USERP2= <user>
##$USERP3= <user>
##$USERP4= <user>
##$USERP5= <user>
##$WDW= 1
##$XDIM= 8192
##$YMAX_p= 0
##$YMIN_p= 0
$$ End of Bruker specific parameters
$$ ---------------------------------
##NTUPLES= NMR FID
##VAR_NAME=  TIME,          FID/REAL,        FID/IMAG
##SYMBOL=    X,             R,               I
##VAR_TYPE=  INDEPENDENT,   DEPENDENT,       DEPENDENT
##VAR_FORM=  AFFN,          ASDF,            ASDF
##VAR_DIM=   8192,          8192,            8192
##UNITS=     SECONDS,       ARBITRARY UNITS, ARBITRARY UNITS
##FACTOR=    0.0002496,     1,               1
##FIRST=     0,             0,               0
##LAST=      2.0444736,     0,               0
##MIN=       0,             -206388,         0
##MAX=       2.0444736,     139082,          0
$$ Real data points
##PAGE= N=1
##DATA TABLE= (X++(R..R)), XYDATA
0@%%%%%%%%%%%%%Qj6J6j6J6k4L2l3M1m9N7p2Q6r6J09j30J51j69J93k24K55k87
$$ 0 0 0 0 0 0 0 0 0 0 0 0 0 0 8 -8 8 -8 8 -16 16 -17 24 -25 32 -40 46 -50 59 -71 80 -89 104 -120 135 -152
35a52L20l60M07m56N08n65O30o98P70q54R48j046J153j272J403j544J699j873
$$ -152 168 -192 215 -241 267 -298 332 -366 404 -450 498 -548 605 -667 736 -808 891 -982
53i82K068k283K521k793L104l463L882m379M979n719O668p925R681j2335J6853
$$ -982 1086 -1197 1324 -1469 1635 -1828 2054 -2325 2654 -3065 3603 -4322 5359 -6976 9877
68I877k6580Q7553j01028r9699K12337N6622j36395p1429J02319J7212q1458k9626
$$ 9877 -16703 70850 -30178 -129877 82460 139082 2687 -68742 33577 50789 -30669 -60295
80f0295N4279J047k6841N371J7061k2789l646L1428J8666k0416l012K5067J7265
$$ -60295 -6016 -4969 -31810 -26439 -9378 -32167 -35813 -4385 14281 -6135 -9147 15920 33185
93C3185j3862j1602O893Q930j2379j6734J509J5641K456j4411j7846n685J8064
$$ 33185 19323 7721 14614 23544 11165 -5569 -4060 11581 14037 -374 -18220 -23905 -5841
106e841L0701o528m9525k0974M3235K6361l9235k3172M2038K1484m0340q518N8076
$$ -5841 24860 18332 -31193 -52167 -8932 17429 -21806 -44978 -2940 18544 -21796 -30314 27762
119B7762K3358l9628n004M3873n028n0067L331M0984k0886n6375M970L6476j7692
$$ 27762 51120 11492 6488 50361 45333 -4734 -1403 39581 18695 -37680 -32710 3766 -13926
132a3926l6606J8712L3582j6914k3689L0600L8569j3706k9914J1124L0994M005
$$ -13926 -50532 -31820 1762 -15152 -38841 -8241 30328 16622 -13292 -2168 28826 32831
144C2831j3746j403K262j0438j0419K685J043q214m244L85j1427j0733J5682K3421
$$ 32831 19085 17682 19944 9506 -913 1772 2815 -5399 -9643 -9258 -20685 -31418 -15736 7685
158G685n453j7829N761J3750l896k269J2694k322j8674O073K3814r038k2658J8114
$$ 7685 2232 -15597 -9836 3914 18 -2251 10443 8121 -10553 -4480 19334 10296 -12362 5752
172E752K8538k2525l0617K6613L1845l2466m3036J9641L4836k1792l5872J6176
$$ 5752 34290 11765 -18852 7761 39606 7140 -35896 -16255 18581 -3211 -39083 -22907
184b2907L1382j4074k8611J4789L6660L573k1048n96J5666J395o162R634O173
$$ -22907 8475 -5599 -34210 -19421 17239 20812 -236 -832 14834 16229 10067 19701 25874
197B5874j9754j6910J2976J1788j8793j6640J2363R998j5600j0010J4039J2094
$$ 25874 6120 -10790 2186 13974 -4819 -21459 -9096 902 -14698 -24708 -10669 1425
209A425m149k491K937K056P570J0174p359j5459Q276J7532j1754k2182J2212K2648
$$ 1425 -2724 -5215 -2278 -222 7348 17522 10163 -5296 2980 20512 8758 -13424 -1212 21436
223B1436j7100k8028J5563L0146j1789k7682P415J8203j1344j3729J6750J0833
$$ 21436 4336 -23692 -8129 22017 10228 -17454 -10039 8164 -3180 -16909 -159 10674
235A0674k3177j3238K5768J7123k1134j2620K6614J5921k4614j6348K6220K2080
$$ 10674 -12503 -25741 27 17150 -3984 -16604 10010 25931 1317 -15031 11189 33269
247C3269k1657k6605J1023J9003j0595j9101L753R846o584q648N368P230R31K088
$$ 33269 11612 -14993 -3970 15033 4438 -14663 -10910 -1064 -7648 -16296 -10928 -3698 -2767 -679
261f79J094m472L406J5081J515j5164l620J3286n42j3529L306J1375j0295j5021
$$ -679 415 -4057 -651 14430 15945 781 -2839 10447 9905 -3624 -318 11057 762 -14259
275a4259J0464J3338j4092j0991J8174Q799k4609j1347K9994J8454k8041k1861
$$ -14259 -3795 9543 -4549 -15540 2634 11433 -13176 -24523 5471 23925 -4116 -25977
287b5977K4520K4859j8521k1454J6654K0432j4899j9825J2776J8493r380j5744
$$ -25977 -1457 23402 4881 -16573 81 20513 5614 -14211 -1435 17058 7678 -8066
299h066O429Q491q593m620J0320p67j4544j324J3464L42j1764L633J2689k923
$$ -8066 -1637 6854 -1739 -6359 3961 3194 -11350 -12674 790 1132 -10632 -6999 5690 2767
313B767r865O717J2806k082o569r74j148j215O419O96j4744o583J5376P346j8489
$$ 2767 -7098 -381 12425 10343 3774 2800 1652 437 6856 7552 -7192 -13775 1601 8947 -9542
328i542p913K1072J1292k1449j2685K0398J5822j6031j4373J1869J1522q508n823
$$ -9542 -17455 3617 14909 -6540 -19225 1173 16995 964 -13409 -1540 9982 1474 -4349
341d349J0829K550j3519j331J5320o62j8102Q80J9166l804k4279L203K8668N49
$$ -4349 6480 9030 -4489 -5820 9500 8838 -9264 -8384 10782 6978 -17301 -14098 14570 15119
355A5119k8117k671K5656K324k2538j254J9415Q17j5701j86J0340J35j427N029
$$ 15119 -12998 -15669 9987 12311 -10227 -11481 7934 8751 -6950 -7136 3204 3339 1912 6941
369F941l794j0109O659J3874q215j8752N431J7247m769j4050M804J0512p058o840
$$ 6941 3147 -6962 -303 13571 5356 -13396 -7965 9282 4513 -9537 -4733 5779 -1279 -8119
383h119J1035N947j3066m182J4998K077j8712j802K2831M880k3246n546K2364
$$ -8119 2916 8863 -4203 -8385 6613 8690 -10022 -11824 11007 15887 -7359 -12905 9459
396I459M792k2569l200K4678K094k7827o545K5215P648k1454o248J7413N144j2177
$$ 9459 14251 -8318 -11518 13160 15254 -12573 -19118 6097 13745 -7709 -13957 3456 8600 -3577
410c577l69R333m337p635R197Q376j2911j0931J2438J1625r807r502Q845P628
$$ -3577 -3946 5387 1050 -6585 2612 10988 -1923 -12854 -416 11209 1402 -8100 745 8373
424H373o147n799K944J228j710K483O43o453j029P000N46q175K529J2909k781
$$ 8373 2226 -3573 -629 599 -1111 1372 2015 -4438 -5467 1533 2079 -6096 -3567 9342 6561
439F561j6778l59J8714M265j7732m816J7870O692j6877p902J3667N801j0930j760
$$ 6561 -10217 -10576 8138 12403 -5329 -10145 7725 14417 -2460 -10362 3305 9106 -1824 -3584
453c584R032o132j3834Q342J6610r245j7284J1090J9928r657j9055Q467J8705
$$ -3584 5448 -684 -14518 -6176 10434 1189 -16095 -5005 14923 5266 -13789 -5322 13383
466A3383l719j3585L295P464n953o614M918M134l234j132J387l989k681O681N115
$$ 13383 9664 -3921 -626 6838 885 -5729 -811 3323 89 -1043 344 -3645 -6326 355 5470
481E470p440m690R429N049j1324p055J0496R183o053o341M318P65n583L635Q677
$$ 5470 -1970 -6660 2769 7818 -3506 -10561 -65 9118 3065 -3276 1042 1807 -3776 -141 8536
496H536o193j1165R647J3936j3443k0289J1524K4414q198k4383M850K0793n701
$$ 8536 2343 -8822 825 14761 1318 -18971 -7447 16967 8769 -15614 -10764 10029 4328
509D328j8845P778J9608n742j5783O851J3127q214j0709J0070R877j0293q630
$$ 4328 -14517 -6739 12869 7127 -8656 -1805 11322 3108 -7601 2469 12346 2053 -6577
522f577P501K808j0544j117J2112J227j2889k730J0890L724p101j188O931L054
$$ -6577 924 3732 -6812 -7929 4183 5410 -7479 -10209 681 4405 -2696 -3884 3047 6101
536F101k108k194l397k900N561Q619m725j2884J311J2756j962j3613K828J5817
$$ 6101 3993 1799 -1598 -4498 1063 9682 4957 -7927 -6616 6140 4178 -9435 -6607 9210
550I210k625j6657J830J5977k951j4594N875J6326o577j6985N816J4099o549j0535
$$ 9210 6585 -10072 -8242 7735 4784 -9810 -3935 12391 5814 -11171 -5355 8744 2195 -8340
564h340J0118R812j3239q939J4258Q818j4774r409J5235J0422j4571j3948R053
$$ -8340 1778 11590 -1649 -10588 3670 12488 -2286 -11695 3540 13962 -609 -14557 -5504
577e504J2338m105q466K633M880j600j009K355o82j782N323K895p639n343O907
$$ -5504 6834 2729 -5737 -3104 1776 176 -833 1522 840 -942 4381 7276 -363 -5706 1201
592A201N049p759m615Q250K737j0155l877R773M183p297n63P117j915o506N281
$$ 1201 6250 -1509 -6124 2126 4863 -5292 -9169 604 4787 -2510 -3073 4044 2129 -4377 904
607I04O304q109o922J1399Q651j4534j2377J3466J4456j1875j3800J0760J2930
$$ 904 7208 -901 -7823 3576 12227 -2307 -14684 -1218 13238 1363 -12437 -1677 11253
620A1253r590j1893Q698R588o734o200P669K452j0447k053J2181J617j2253q72
$$ 11253 1663 -10230 -1532 8056 1322 -4878 2791 5243 -5204 -7257 4924 6541 -5712 -6584
634f584J1877j68j2046Q65J3608N58j2639j154J0508Q50r082j390O470J185l489
$$ -6584 5293 5125 -6921 -6056 7552 8110 -4529 -5683 4825 5675 -3407 -4797 1673 2858 -631
649f31j38j564j780M854N388o596p569Q141R856q566j0930Q362J0521p277r256
$$ -631 -769 -2333 -4113 741 6129 -467 -8036 105 9961 1395 -9535 -1173 9348 2071 -7185
664g185O842O396p692n234Q824L080r104n74J0799j325j2211J765J5010j140j6459
$$ -7185 -343 6053 -1639 -6873 1951 5031 -4073 -4647 6152 4827 -7384 -5619 9391 8251 -8208
679h208P4J6570M31j8107j467J7881L313j6723n315J4339O291q843m324M814L27
$$ -8208 -8134 8436 8867 -9240 -10707 7174 10487 -6236 -11551 2788 9079 236 -4088 726 1053
694A053r17L248p72p105O25R423j434j1392J089J2644j301j2014Q13J1388p62
$$ 1053 136 3384 2612 -4493 -3868 5555 4121 -7271 -6182 6462 5161 -6853 -6040 5348 4586
709D586q808K015O965m647m807P012L938r032k778J0299J563j3248j150J5245
$$ 4586 -4222 -2207 4758 111 -4696 2316 6254 -2778 -5556 4743 6306 -6942 -8092 7153
723G153K299j7271m137J7080N879j4259n688J2046M348r971k598R092N47q686
$$ 7153 9452 -7819 -11956 5124 11003 -3256 -8944 3102 7450 -2521 -5119 3973 4520 -4166
737d166K64P145j672o265L376O151m734n037N195N369n806m190N763L776o212
$$ -4166 -3902 3243 1571 -4694 -1318 4833 99 -4938 257 5626 -180 -4370 1393 5169 -1043
752a043l146N835J908m370j034J930j998l77O403M20j0376k227J2190M556j1671
$$ -1043 -4189 1646 3554 -816 -1850 80 -1918 -2295 4108 4528 -5848 -8075 4115 8671 -3000
767c000m671J0827L650r738k573R643J646r238j312Q437M05p337O57O945k467
$$ -3000 -7671 3156 6806 -2932 -5505 4138 5784 -3454 -4766 3671 4076 -3261 -2604 4341 1874
782A874p215L443P499m475q514N912Q219o740r134P511J0625o027j1429M053J0367
$$ 1874 -5341 -1898 5601 1126 -7388 -1476 6743 3 -9131 -1620 9005 2978 -8451 -4398 5969
797E969j291n630J466J449l573N58N322j572p040J838O019l631o371M688O896
$$ 5969 4678 -952 514 1963 -1610 -1052 4270 2698 -4342 -2504 3515 -116 -6487 -1799 5097
812E097n529o614N827O655n443m982O351M857n808k864O433R07o624O05O422m325
$$ 5097 -432 -7046 -1219 5436 -7 -4989 1362 6219 411 -2453 3980 4887 -1737 -1132 5290 965
828I65q356N436R687p103j3307O035J4578k936j2589K193J0613k233q319M231
$$ 965 -7391 -1955 7732 629 -12678 -6643 7935 4999 -7590 -5397 5216 2983 -5336 -1105
842a105Q482l568p284L312M920m279l216N894K496q592l429P844K932q077k482
$$ -1105 7377 3809 -3475 -163 4757 478 -2738 3156 5652 -2940 -6369 1475 4407 -3670 -6152
857f152P427K029p235j773O566K179m937r22L746J486l22J353k065m342K958P162
$$ -6152 1275 3304 -3931 -5704 862 3041 -1896 -2818 928 2414 2092 3445 1380 -2962 -4 7158
873G158j371r579n88Q480j383j0067Q59J0966j07j1216k030R051J177m860M123
$$ 7158 5787 -3792 -4380 4100 2717 -7350 -6491 4475 4368 -6848 -8878 173 1350 -3510 613
888F13O310o005p113P737Q173o628p465P509N368r790o490R066N777j0584o465
$$ 613 6923 918 -6195 1542 9715 3087 -4378 3131 8499 -1291 -7781 1285 7062 -3522 -9987
903i987Q803O462o975n816M544M730k284k65L245k89k091J170J500l358m03O159
$$ -9987 -1184 5278 -1697 -7513 -2969 1761 -523 -788 2457 2168 77 1247 2747 -611 -1014 5145
919E145K458q556o424N759O751k727m656K084L07m953o71O074J890n086o28M558
$$ 5145 7603 -953 -7377 -1618 5133 2406 -2250 -166 141 -4812 -5483 591 2481 -2605 -3233 1325
935A325p52m526M676O722n141p402O597Q381o994r107O005P720o512q056O376
$$ 1325 573 -3953 723 7445 2304 -5098 1499 9880 2886 -6221 -216 7504 992 -7064 -688
950f88O406o530p832L953N733j181j50K573k945n814M421Q692j161o548J687M023
$$ -688 5718 -812 -8644 -4691 1042 -139 -289 2284 -661 -6475 -2054 6638 5477 -1071 616 4639
966D639l771n248M687O439k751o930j066K698M23L42J205j460l015K311L924j861
$$ 4639 868 -4380 307 6746 3995 -2935 -4001 -1303 -880 -538 667 -793 -3808 -1497 2427 566
982E66m253L067N209l832n913N134Q629n601j0176L099J0304o1p312l32L443l884
$$ 566 -3687 -620 4589 757 -5156 -22 8607 3006 -7170 -4071 6233 6172 -1140 -1472 1971 -1913
998a913k465N925L174o416l117N674L82p948J416J1340J581j1991l725R110M530
$$ -1913 -4378 1547 4721 -1695 -4812 862 1244 -6704 -5288 6052 7633 -4358 -8083 1027 5557
1013E557n149j308M733j279n321J367N664j293n444L98K756j583n76L047j135
$$ 5557 408 -900 3833 2554 -2767 -1400 4264 2971 -2473 -2075 681 -902 -1478 1569 434
1028D34o167O43Q293K002p552k412O096J919n086j54N328J88m107L03J095l151
$$ 434 -5733 -5090 3203 5205 -2347 -4759 1337 3256 -1830 -1984 3344 3532 -575 -272 823 -2328
1044b328j07P550J943r912n704Q570N768o439l673N509R41p306m03Q887K115q075
$$ -2328 -2435 5115 7058 -2854 -8558 12 5780 -659 -4332 1177 2118 -5188 -5591 3296 5411 -2664
1060b664k349O488K639l713o92K401j106k625L309L141m926m117M475M058n746
$$ -2664 -5013 1475 4114 401 -291 2110 1004 -1621 1688 4829 -97 -4214 261 4319 -1427
1075a427n091N720O069m887o198K417L686N61O16J835l306m432L749N857j909
$$ -1427 -6518 -798 5271 384 -5814 -3397 289 850 1466 3301 -5 -4437 -688 5169 3260
1090C260m787K149K995m929k991O350L879p348n242O440N027n650l975M743K772
$$ 3260 -1527 622 3617 -1312 -4303 2047 5926 -1422 -6664 -224 4803 -847 -4822 -79 2693
1105B693n096j372N551N51m623J110N061k547n696M547P696m164q843J965P684
$$ 2693 -2403 -3775 1776 2327 -2296 -1186 3875 1328 -4368 179 7875 3711 -5132 -3167 4517
1120D517q14o164N06L458k391l612L383L442k555k409J889R28j632J456M125k085
$$ 4517 3703 -2461 -1955 1503 -888 -4500 -1117 2325 -230 -2639 -750 178 -1454 2 4127 2042
1136B042n408J773O450j304o319J583N429l099n379L069M796l097l467K088J291
$$ 2042 -3366 -1593 4857 3553 -2766 -1183 4246 1147 -4232 -1163 3633 536 -2931 -843 448
1151D48l020R93N341k177o658K070P280o30p077J031O922j617o685J048P690m56
$$ 448 -2572 -1579 3762 1585 -5073 -3003 4277 3647 -3430 -2399 4523 2906 -3779 -2731 4959 4503
1167D503o569j281M386Q18k677P35J622l193k125L645K763l986j836M627J335
$$ 4503 -2066 -3347 1039 1857 -820 -85 1537 -1656 -3781 -136 2627 -1359 -3195 1432 2767
1182B767n726o61P067J981o912k422N192K258l737p84K281j470k250K018J929
$$ 2767 -2959 -3620 3447 5428 -1484 -3906 1286 3544 -193 -977 1304 -166 -2416 -398 1531
1197A531k749p64L720j54n482L42O947J336p442k584O594K885m972j878M234N42
$$ 1531 -1218 -1982 1738 1584 -3898 -3556 3391 4727 -2715 -5299 1295 4180 -792 -2670 1564 2106
1213B106m074k01M089j79k697J136J535l154j513N019K517n895m300N248M453
$$ 2106 -1968 -2169 1920 1741 -956 180 1715 -1439 -2952 2067 4584 -1311 -5611 -363 4090
1228D090m232m322M004L272l647k860M144L382l388k242K755N93k205J649K562
$$ 4090 -142 -4464 -460 2812 -835 -3695 449 3831 443 -1799 956 1549 -656 993 3555
1243C555l585m028L754M605m544m439M629L617n366l904N553M782m177l214K688
$$ 3555 -30 -4058 -304 4301 -243 -4682 -53 3564 -1802 -5706 -153 4629 452 -2762 -74
1258g4J799k338J068K374k352l399L026M167l352m952L124M990l399n217L774
$$ -74 1725 -613 455 2829 477 -2922 104 4271 919 -4033 -909 4081 682 -4535 -761
1273g61N016l678n266K721N082k284l635K358K448l154j421L798J028l314J136
$$ -761 4255 577 -4689 -1968 3114 830 -2805 -447 2001 -1153 -2574 1224 2252 -1062 74
1288G4L405k631m731L273O270k805p195J533N925j611m756J143L552j260j882
$$ 74 3479 848 -3883 -610 5660 2855 -4340 -2807 3118 1507 -3249 -2106 1446 186 -1696
1303a696J556O94k574R65L860l83m440J410N125j930n850J376O083j198n911M40
$$ -1696 -140 554 -2020 -1055 2805 2422 -2018 -608 4517 2587 -3263 -1887 4196 2998 -2913 -2473
1319b473M691j581m918J904M974j295l711J083J664j747J26M315l62n425m4O716
$$ -2473 2218 637 -4281 -2377 2597 1302 -2409 -1326 338 -1409 -1283 3032 2670 -2755 -2799 3917
1335C917r8o985o20P667J266p166k282N423J023l663o2K594r06k363K401J072
$$ 3917 3819 -3166 -3786 3881 5147 -2019 -4301 1122 2145 -1518 -1580 1014 108 -2255 146 1218
1351A218l738p17N559J175m948j536M456P04m384K96N983j71o124q50M227R61
$$ 1218 -2520 -3237 2322 3497 -1451 -2987 1469 2173 -2211 -1915 4068 3897 -2227 -3077 1150 2111
1367B111l125J40K047j194j694J900N36l227k9N425J175o074k856N905L801n048
$$ 2111 -1014 -874 1173 -21 -1715 185 721 -2506 -2535 2890 4065 -2009 -4865 1040 4841 -207
1383b07l226M255L038l897k669K750Q68j623O99K573k157l335K020L124k229k283
$$ -207 -3433 822 3860 -37 -2706 44 912 -711 -12 2561 404 -2931 -911 2213 -16 -2299
1399b299L212J957m150k606M252L222m032k793L994K332l481k332K402J795n11
$$ -2299 913 2870 -1280 -3886 366 3588 -444 -3237 757 3089 -392 -2724 -322 1473 962
1414I62k60P42k522j178L339K333l754l265L738M090l395n352K982M319j411l202
$$ 962 702 1444 -1078 -2256 1083 3416 -338 -3603 135 4225 830 -4522 -1540 2779 1368 -1834
1430a834J461J183j965j041L016J040k258j60K351p69k965J744L569k060l443
$$ -1834 -373 810 -1155 -2196 820 1860 -398 -558 1793 1024 -1941 -197 3372 1312 -2131
1445b131K385L216l296m593L088M963k104m746N01L696p16j339J063J64j226J492
$$ -2131 254 3470 174 -4419 -1331 3632 1528 -3218 -2717 979 263 -1076 -13 151 -1075 417
1461D17K569j972m557K491N389r31n370J12M490q82m218Q10L745p94l571L22K153
$$ 417 2986 1014 -3543 -1052 4337 3406 -1964 -1852 2638 1756 -2462 -1652 2093 1299 -2272 -1950 203
1478B03j432j120K282J262k271l41K811p93k572J876M257j129n094P28M990l15
$$ 203 -1229 -2349 -67 1195 -1076 -1417 1394 601 -1971 -95 4162 3033 -2061 -1333 3657 3342
1494C342m703p37L271Q2k281n71K64q57M12K214J05l062K36L890M21l668p2N369
$$ 3342 -1361 -2098 1173 1255 -1026 -1597 -1333 -2190 -1778 436 541 -2521 -2285 1605 2026 -1642 -1714 3655
1512C655N14m548j362L415J113k918j007K642o70k783Q7K069p40j250J794M00
$$ 3655 4169 -379 -1741 1674 2787 -131 -1138 1504 834 -1949 -1862 207 -533 -1783 11 411
1528D11l052m02N020J106n450j055N636K189m921k149M588J955l501j200K241
$$ 411 -2641 -3043 1977 3083 -2367 -3422 2214 4403 -518 -2667 1921 3876 375 -825 1416
1543A416L07k012M37Q30k617j187L149J557l989k578L428L175l007k076L863K672
$$ 1416 1723 -289 148 978 -1639 -2826 323 1880 -2109 -4687 -1259 1916 -1091 -3167 696 3368
1559C368l360k150L669K522k401j429J496j4j922O5J317j982k220K358K124l569
$$ 3368 8 -2142 1527 4049 1648 219 1715 1701 -221 -156 1161 -821 -3041 -683 1441 -2128
1575b128k803M319L650l894l352L821M404k810l306K359K462j480j228J610m67
$$ -2128 -4931 -612 3038 -856 -4208 -387 4017 1207 -2099 260 2722 1242 14 1624 1157
1590A157k162P51K637j856k845J989K923k656l909K491L409j521m066J165L818
$$ 1157 -1005 -254 2383 527 -2318 -329 2594 -62 -3971 -1480 1929 408 -3658 -2493 1325
1605A325q23l113J119K650l83p02J295M17j105R82J931j654l889J956L456k869
$$ 1325 502 -2611 -1492 1158 775 73 1368 1785 680 1662 3593 1939 -1950 6 3462 593
1621E93m797J293M364j895m317J374L842l28k584J322K337o38J15K344n29k762
$$ 593 -4204 -2911 1453 -442 -4759 -3385 457 129 -2455 -1133 1204 566 681 3025 2496 -266
1637b66P07L349j085m620M64L947j157m230J64L824l13l451k37K969M30j818l30
$$ -266 441 3790 2705 -1915 -1451 2496 1339 -2891 -2727 1097 784 -2667 -2904 65 495 -1323 -1653
1654a653J569o3j95Q46M90j504P55K662r2l449k39M171R35m616j770L138J106
$$ -1653 -84 -147 -342 504 994 -510 245 2907 2815 -634 -873 3298 4233 -383 -2153 985 2091
1671B091l765j312J904j52j755O72J590j080m12K916Q15k427K14M744Q94m104
$$ 2091 -1674 -2986 -1082 -1234 -2989 -2317 -727 -1807 -2219 697 1512 -915 -701 4043 4937 833
1687H33j162L972O66m072k161K848N71l545j378J526L11j069P31J465j290q78
$$ 833 -329 3643 4309 237 -1924 924 1495 -2050 -3428 -1902 -1591 -2660 -1929 -464 -1754 -2632
1703b632K968K185k303j418L320J782l119j816L236J560l285k059K608J398k776
$$ -2632 336 2521 218 -1200 2120 3902 783 -1033 2203 3763 478 -1581 1027 2425 -351
1718c51j811J394J09p50R56N30k524j466L458K483l192k404L799L112k123k374
$$ -351 -2162 -768 -659 -1409 -453 77 -2447 -3913 -455 2028 -1164 -3568 231 3343 1220 -1154
1734a154K251K576j357j149J444o78j857q84J638r78k047j9J043j454j492K164
$$ -1154 1097 3673 2316 1167 2611 1933 76 -808 830 -148 -2195 -2214 -1171 -2625 -4117 -1953
1750a953K206j165j938K806L827j297l954J530M258O3k840j061P30p77p00O71
$$ -1953 253 -912 -2850 -44 3783 2486 -1468 62 4320 4383 1543 482 1212 435 -265 406
1766D06p47k276M99K799r82l820Q23M514j2k811O20K304j178j704K369K468j635
$$ 406 -341 -2617 -2118 681 -301 -4121 -3298 1216 1204 -1607 -987 1317 139 -1565 804 3272 1637
1783A637k079J328O80q53J81Q15j288j696J712J718k931l505J830L655p11m235
$$ 1637 -442 886 1566 713 894 1709 421 -1275 437 2155 -776 -4281 -2451 1204 493 -3742
1799c742J23L455P08j630j25K190Q34j26K82J06j658J70K528m24l035j272J833
$$ -3742 -3619 -164 544 -1086 -1211 979 1813 1687 1969 2075 417 587 3115 2691 -344 -1616 217
1816B17m84k435j72L222L76l862q16L716J759j936o17J917P92j246N34R8j267
$$ 217 -267 -2702 -2874 348 724 -3138 -3954 -238 1521 -415 -1032 885 1677 431 965 1063 -204
1833b04M86K562r18l429k12L628J8l982q84L603J558k747k015J228N82k51O64
$$ -204 282 2844 1926 -1503 -1715 1913 1931 -2051 -2935 668 2226 -521 -2536 -1308 -726 -977 -313
1850c13O94o06r92R46N79o01L75K441O26l358j289K635K080k296k283J611J262
$$ -313 381 -225 -1217 -271 308 -293 82 2523 3149 -209 -1498 1137 3217 921 -1362 249 1511
1867A511k739j863J500J569j029j046Q12P31k16J414N18k141j15L336J948k969
$$ 1511 -1228 -3091 -1591 -22 -1051 -2097 -1285 -554 -770 644 1162 -979 -1094 2242 4190 1221
1883A221l064K187K318j851j955J577J217k082j847R53R05J70L99R1j334j553
$$ 1221 -1843 344 2662 811 -1144 433 1650 -432 -2279 -1326 -421 -251 148 239 -1095 -2648
1899b648J868K416j100j775J446J701j998j577K768K853k537l362J495K366m38
$$ -2648 -780 1636 536 -1239 207 1908 -90 -1667 1101 3954 1417 -1945 -450 1916 1478
1914A478k257nO76m52j13Q35q21j911J112K256j471j646K058K945j378l665J345
$$ 1478 -779 -784 -108 -560 -673 162 -659 -2570 -1458 798 -673 -2319 -261 2684 1306 -2359 -1014
1931a014L910k00j960l31L77o68o54J355L19j820m31P95j035j191J626K279j557
$$ -1014 2896 2696 736 405 782 114 -540 815 1134 -686 -1117 -322 -1357 -2548 -922 1357 -200
1948b00k847J408L520m59k506P14K105O9j909N96J038l64p24n35l72n93J328J275
$$ -200 -3047 -1639 1881 1422 -1084 -370 1735 1804 -105 491 1529 1165 441 -94 -466 -1059 269 1544
1966A544j803k966J067L773J52l290o14K697K55j920K03K364K44j907l69Q93K58
$$ 1544 -259 -3225 -2158 1615 1767 -1523 -2137 560 815 -1105 -902 1462 1706 -201 -570 323 581
1983E81p0J040m26k039J41K121M7k674PK404m53k787k44L054Q24k826j358K282
$$ 581 511 1551 1125 -914 -773 1348 1395 -1279 -1272 1132 679 -2108 -2352 702 1526 -1300 -2658 -376
2001c76J542k16m86j44o11L65J978J2k430q19K357P32l214r78K873J167k949j773
$$ -376 1166 950 464 320 -291 74 2052 2064 -366 -1185 1172 1904 -1310 -2288 585 1752 -1197 -2970
2019b970K079K026j426p89J313K85j003N86J452q34q72J024M62k336m36L235Q28
$$ -2970 -891 1135 -291 -1080 233 518 -485 101 1553 719 -153 871 1333 -1003 -1439 1796 2624
2036B624l376k143K619K693j893k261J217J238m50j001M30J49l36J68M41j130
$$ 2624 -752 -2895 -276 2417 524 -1737 -520 718 268 -733 -303 -154 -490 -322 119 -1011
2052a011j21J971R60j883j621J930K193j253j870R92J691j340k181P25K125q85
$$ -1011 -1132 839 1799 -84 -1705 225 2418 1165 -705 287 1978 638 -1543 -818 1307 422
2068D22k237J13R51p7O35J126j443j358J621K725j069k295J115J877j011k522
$$ 422 -1815 -1702 -751 -828 -193 933 -510 -1868 -247 2478 1409 -886 229 2106 1095 -1427
2084a427J276K089j368k064K85J004J49j32J95l60j016J328J167j024j498J264
$$ -1427 -151 1938 570 -1494 -1209 -205 -56 -188 7 -353 -1369 -41 1126 102 -1396 -132
2100a32J868j442k410R09L254n15k962m08K778Q92j442o61N54l10J15M57k04j095
$$ -132 1736 294 -2116 -1207 2047 1532 -1430 -1838 940 1832 390 -271 283 -27 88 545 341 -754
2118g54o0Q32m48j955Q68K738n51k612J07L268O37j847m90J439M27j131k63J23
$$ -754 -814 18 -430 -2385 -1517 1221 670 -1942 -1835 1433 2070 223 -267 1172 1599 468 205 328
2136C28q9k40J7j250j331J456K291m87l089P4K866J572k215r47J956J062j340
$$ 328 239 -1 16 -1234 -2565 -1109 1182 695 -2394 -2320 546 2118 -97 -1044 912 1974 634
2153F34j045Q12M89n12o55l8l30J44J093k78j643J98K181L36k084p38J898Q09
$$ 634 -411 401 890 378 -277 -315 -645 -501 592 314 -1329 -1131 1050 1386 -698 -1436 462 1271
2171A271k097r03K132J250j325j868Q15Q53O90N18o79j027n9J814K08k168r75
$$ 1271 -826 -1729 403 1653 328 -1540 -725 128 818 1336 657 -370 -429 1385 1593 -575 -1550
2188a550J915O92k209j552J720J779r49j462J184J262j39o43J90L56J12L09K23
$$ -1550 365 1057 -1152 -2704 -984 795 -154 -1616 -432 830 691 48 238 594 706 1015 1238
2205A238j157j019J157L68j626r64J752J634k084j916J558K720n98j678L03J300
$$ 1238 81 -938 219 587 -1039 -2003 -251 1383 -701 -2617 -1059 1661 1063 -615 -312 988
2221I88j67m35k08j90J08P91K71k168j406K316J504j237j866J008K120q13j811
$$ 988 821 386 178 -12 96 887 1158 -1010 -2416 -100 1404 167 -1699 -691 1429 616 -1195
2238a195P33J566l68r00l25M20k13k05K10j4j32J428K76k058r28J917K065j182
$$ -1195 -462 1104 736 -164 -489 -69 -282 -487 -277 -291 -423 1005 1281 -777 -1705 212 2277 1095
2256A095k419L73K409p73k366J12J555P64j099p91K25M43R16O53n87q93O70J838
$$ 1095 -1324 -951 1458 685 -1681 -1569 -14 750 -349 -1140 -915 -472 444 1097 510 -383 287 2125
2274B125j017k026K47K312m25k231n15J607N9j467K85J490M61o18o11K60L38M24
$$ 2125 1108 -918 -671 1641 1216 -1015 -1530 77 136 -1331 -1046 444 905 287 -324 -64 274 698
2292F98N31p19j524P39J586q56k545P54K555q7k187p13K005J033j029l61K76N17
$$ 698 1229 510 -1014 -275 1311 455 -2090 -1336 1219 1132 -1055 -1768 237 1270 241 -120 156 673
2310F73k26J3n06p31K43J408R5j896m88J612M85j491l08K225O93j885r97J295
$$ 673 447 460 -46 -777 -534 874 969 -927 -1415 197 682 -809 -1117 1108 1801 -84 -1081 214
2328B14R36o43n63p7K44l33r6k74o05P61J365p8j913l27K410R91k228r57J446
$$ 214 1150 507 -56 -133 111 -222 -318 -592 -1197 -436 929 851 -1062 -1389 1021 2012 -216 -1173 273
2347B73J434j297j556L85R32pk10L05p24l35P94L93p73l39J658N13j667j295J575
$$ 273 1707 410 -1146 -761 171 164 -46 259 -465 -800 -6 387 -386 -725 933 1446 -221 -1516 59
2366E9J602j540j382J015J052j160j167Q69J146j59j88j59l71k88J589L48j857
$$ 59 1661 121 -1261 -246 806 -354 -1521 -652 494 335 147 -12 -383 -671 918 1266 -591
2383e91m83J350J092j395j941R80J759l47j346L82J007j2o86K28J84L99p9K06
$$ -591 -1074 276 1368 -27 -1968 -988 771 424 -922 -540 467 455 -231 -3 181 580 501 707
2401G07o08j212J087R24j204q30Q55J229j416j248R30K271j74k055J64J280K13
$$ 707 99 -1113 -26 898 -306 -1136 -281 948 -468 -1716 -786 1485 1311 -744 -580 700 913
2418I13l07m61j87p98Q58Q34j370j282J028J934j020j820Q80K133M9k167k67J779
$$ 913 606 145 -42 -840 18 852 -518 -1800 -772 1162 142 -1678 -798 1335 1384 -783 -1050 729
2436G29M85m77j105L51n6N5l16p1p0L45P77j522n60J024J810m29k175j24K259
$$ 729 1214 737 -368 -17 -73 -18 -334 -405 -475 -130 647 -875 -1435 -411 1399 970 -1205 -1329 930
2455I30O85j595r31Q73Q02p20n07M28n2L13L07n57p62L95K024o48k001m92K371
$$ 930 1615 20 -911 -38 764 44 -463 -35 -87 226 533 -24 -786 -391 1633 985 -1016 -1508 863
2474H63L19j845j144J735O79j080o60J014J225k55o54l41K24Q49N85p38j282O
$$ 863 1182 -663 -1807 -72 607 -473 -1133 -119 1106 851 197 -144 80 929 1514 776 -506 -500
2492e00R21K82j564p57J235R69j437r16J135J826n96j524M63J340N97l92o24m47
$$ -500 421 703 -861 -1618 -383 586 -851 -1767 -632 1194 598 -926 -463 877 1474 1082 458 11
2510A1J88N53m7j620j86J440N07j840q78J496J481j178j392R89J274j78o56r8
$$ 11 199 752 705 -915 -1101 339 846 -994 -1872 -376 1105 -73 -1465 -476 798 620 -36 -134
2528a34K30L2L20K13j139Q8J125N30j567p24J442J435j715j344L43J919o76j735
$$ -134 96 128 448 661 -478 -390 735 1265 -302 -1026 416 1851 136 -1208 -865 1054 378 -1357
2546a357J06J018M77o76m94N25N94N28k74o55K54J355O89j514j265N58J697o73
$$ -1357 -1251 -233 244 -432 -926 -401 193 721 447 -208 46 1401 2090 576 -689 -131 1566 893
2564H93k081L7R89J35q68n80P54N20P3K99k63m31J139Q25m73j513Q92J583j210
$$ 893 -1188 -1151 -162 -27 -895 -1475 -721 -201 -128 171 -92 -523 616 1441 968 -545 347 1930 720
2583G20j711K44J469M7j758k25J251O15r72m35J67Q66K73m84n68k97O81J268j006
$$ 720 -991 -747 722 769 -989 -1214 37 652 -320 -755 -588 278 551 67 -501 -798 -117 1151 145
2602A45q05L3J718J91j778k70J884O23j162j516Q03P52o29l04m05P5J57K69l16
$$ 145 -660 -627 1091 1282 -496 -766 1118 1741 579 -937 -134 618 -11 -315 -720 -645 -488 -219 -535
2621e35o67M92J341k48j187N40J598J95j525k82J270N73p84j267J41J83J57m28
$$ -535 -1202 -710 631 383 -804 -264 1334 1529 4 -278 992 1565 781 -486 -345 -162 -5 -433
2639d33N4n26M46P94p57q12M44J696O12j734q44R54J508j024j228R25J036l18
$$ -433 -379 -905 -459 335 -422 -1234 -790 906 1518 -216 -1060 -106 1402 378 -850 75 1111 793
2657G93j316L38O24K38k66l41n77L52R21m38j519j37J139O32j098o23O75J399
$$ 793 -523 -185 439 677 411 70 -507 -155 766 328 -1191 -1328 -189 443 -655 -1278 -603 796
2675G96o17r51Q43P81J9m55k74q2Q88L95p53j617p3J277K15j514p09J439J241
$$ 796 179 -772 71 852 871 416 142 60 948 1343 590 -1027 -1100 177 392 -1122 -1831 -392 849
2694H49j190j509Q66J514J17p11J17L47J1K65k95j22J13L37k43o21n29O83N77
$$ 849 -341 -1850 -984 530 647 -64 53 400 411 676 381 259 372 709 466 -155 -684 -1 576
2713E76p44q02N84R69l89j430k86J623Q80q80j083N40P32P50p36q94P72J357J76
$$ 576 -168 -970 -386 583 194 -1236 -1522 101 981 101 -982 -442 290 1040 304 -590 182 1539 1715
2732A715j468j048P33J324n41j545n0O59J25j145L4J023J51m74j17L99k08P77
$$ 1715 247 -801 -68 1256 715 -830 -880 -221 -96 -1241 -1207 -184 -33 -507 -624 -225 -433 344
2750C44M47l70j37L87P53p36j683Q13J827l97k110o23J612N42j221r18M43Q50
$$ 344 791 421 284 671 1424 688 -995 -182 1645 1248 -862 -1485 127 669 -552 -1470 -1027 -177
2768a77L38m65m92k54J021J016m57p13J71J176n22p62R9J149O0q74q91L34O69
$$ -177 161 -304 -796 -1050 -29 987 530 -183 -12 1164 642 -120 -21 1128 1188 314 -577 -243 426
2787D26k42p40R1K63J20m81l29j65J294Q55r28j238M09J790L54j559l81J151Q60
$$ 426 184 -556 -465 -202 -82 -563 -892 -1057 237 1092 164 -1074 -665 1125 1479 -80 -461 690 1550
2806A550j189q90M24O91l2q43l45o2M66M1m41o72M27J153K60j138k67R93R95q24
$$ 1550 361 -529 -105 586 554 -289 -634 -696 -230 -189 -630 -1302 -875 278 538 -600 -867 126 1121 297
2826B97n64Q22J200r72j204n4Q56N44m27j008k09N91M81o03n01J9J091K54j160
$$ 297 -267 555 1755 783 -421 -475 381 925 498 -510 -719 -128 353 -250 -751 -732 359 613 -547
2845e47n65J039J086p10r40L46J095M27p47o92K33L37J78R6j077j42O88L64j039
$$ -547 -1112 -73 1013 303 -637 -291 804 1231 484 -208 25 362 540 636 -441 -583 105 469 -570
2864e70o08J180P66j350j046N07J745L4j226k02J052O25n07m45J51R10j08o62
$$ -570 -1178 2 768 -582 -1628 -1121 624 658 -568 -770 282 907 400 -45 106 1016 908 246
2882B46n27q8P68L45q69r85L68J201k50j270m39J264O26q14r7N17P28k54k11j30
$$ 246 -281 -369 399 744 -125 -1110 -742 459 209 -1061 -1500 -236 390 -424 -521 -4 724 470 259 129
2902A29J75Q01j67r59o95Q81J286j245j188L60J046k53j411j26J560K73r04n81
$$ 129 304 1105 938 -21 -716 165 1451 206 -982 -622 424 171 -1240 -1366 194 467 -437 -1018
2920a018P09L81O70j94p10p4P77P98p69o57OJ170k18j580J57O59M04n89j168M51
$$ -1018 -309 72 742 548 -162 -236 541 1339 570 -87 -81 1089 871 -709 -552 107 511 -78 -1246 -795
2940g95R65j76m37o15O47M21L51m18k74N00Q54k70r27J23J186J85j804n69J155
$$ -795 170 -6 -443 -1058 -411 10 361 -57 -331 169 1023 753 -174 -51 1135 1320 -484 -1053 102
2959A02N92r95p55K03M77Q7l08k38J75O84N35l88p06J98J159J67j280m22J313
$$ 102 694 -301 -1056 -853 -376 -289 -597 -835 -660 24 559 171 -535 -337 822 989 -291 -713 600
2978F00N43p99j158O58Q86m47r17p5N79K07k68m99j27N72Q05l7j143j55R86P74
$$ 600 1143 344 -814 -156 730 283 -634 -709 -130 77 -191 -690 -817 -245 560 523 -620 -775 211 985
2998I85m19q97M78Q61j82j152O5Q71J58o50p09R2M86K85l99j062N26P55K53p02
$$ 985 566 -331 147 1008 826 -326 -261 610 768 118 -591 -499 -13 272 -127 -1189 -663 92 345 -357
3018c57o81J348N04n78p15P38Q85k20j116l36O25L81j01n65l51L2O08P4o33m1
$$ -357 -1038 310 814 236 -479 259 1144 924 -192 -528 97 478 377 -188 -539 -507 101 175 -458 -499
3038d99L40O55n41q45M91J264q6j387k01J049M80o32m88K9P33K97o64j15J36N77
$$ -499 -159 496 -45 -890 -399 865 779 -608 -809 240 720 88 -400 -371 362 659 -5 -120 16 593
3058E93o4r57n44J088O44p92j157K89J236J65j152j15P23M65M2m65k32P17R4k0
$$ 593 529 -428 -972 116 760 -32 -1189 -900 336 501 -651 -766 -43 422 464 -1 -233 484 578 558
3078E58q35k00R04L98n81q60R2N97K38q47p15J283M54p58o01N83Q99j56r18l85
$$ 558 -277 -477 427 825 244 -616 -524 73 311 -536 -1251 32 486 -272 -873 -290 609 453 -465 -850
3098h50R02O52j73m30m47K97Q97q6j071k52P73O25r85p47L08J172o34p44q2N23
$$ -850 52 704 531 101 -346 -49 848 762 -309 -561 212 837 -148 -895 -587 585 -49 -793 -875 -352
3118c52P94m19l09l91R98L29m73l64J45J108j84j204k09R64L06p13q22M73L53
$$ -352 442 23 -286 -677 321 650 177 -187 -42 1066 882 -322 -531 433 739 26 -796 -323 30
3137C0n2p55j29M92L62L56q07j3J61J255l22p63O9P37N12o51j111L67R88l7j077
$$ 30 -22 -777 -906 -414 -52 304 -503 -516 -355 900 578 -185 -116 621 1133 482 -629 -262 726 689 -388
3158c88m20P78O8k41n89J72N23L74l46o58L34P01J20p86l0R71O36o89q05K44Q22
$$ -388 -808 -30 38 -203 -792 -620 -97 277 -69 -727 -393 308 428 -358 -388 583 1219 530 -275 -31 791
3179G91p0o84m55L90J09J78r13k77M11O68k13o58o42J031J088o92m02J79J098
$$ 791 721 37 -418 -28 81 259 -654 -931 -520 148 -65 -723 -1365 -334 754 62 -340 -161 937
3198I37L9j132m40J109M51k81q21j84L57mk33qj27N17l87j00p02Q25P97k28p35
$$ 937 976 -156 -596 513 964 683 -138 -322 35 31 -202 -210 -337 180 -207 -307 -1009 -184 613 385 -350
3219c50r9R06L37q09k36M03M95R1m65o94L70N31r8o06r19J242P00p59j090N14
$$ -350 -449 457 794 -15 -251 152 647 738 273 -421 -51 480 382 -224 -1143 99 799 40 -1050 -536
3239e36P58J0o37m02J019L88l01m94M22N96k09m26k88RM19J56k80q56N18K68k16
$$ -536 222 232 -405 -807 212 600 299 -195 227 823 614 188 -100 -91 328 484 204 -652 -134 134 -82
3260h2p11lQ51M21p77p35O01J114k5p56j62O14L11j33l76n24J100M0n56p40J48
$$ -82 -793 -796 55 476 -301 -1036 -435 679 654 -102 -264 350 661 528 152 -372 728 768 212 -528 -380
3281c80P48o0j067j66O55O57l67r09K20N72L81q3m76K01M77O8m11j84L52O30p8
$$ -380 368 308 -759 -925 -270 387 20 -889 -669 -97 284 201 -275 -74 403 471 60 -124 228 858 780
3302G80p84o13J037O7n03o76M9Q58J8q94l73J023J29l10l85L14L54M73k78n49
$$ 780 -4 -617 420 487 -16 -692 -643 215 233 -661 -1034 -11 118 -192 -577 -263 91 564 286 -263
3322b63K37O41N61m33p90j25P60k02n45k64L31L30o22p11M24Q09L4n24n75K65
$$ -263 -26 615 1176 743 -47 -172 588 386 -159 -423 -92 238 -384 -1095 -671 138 172 -352 -927 -662
3342f62J182J72q97J75M80O24o45q39L37R05l5j277j27O90J75j80p38k81M39N79
$$ -662 520 692 -205 -30 450 1074 429 -410 -73 832 797 -480 -607 83 258 78 -660 -941 -502 77
3362G7j91l00rN02J53j01p39N28J008j76r32N8O03N42l48r60K88O5K99p81m10
$$ 77 -114 -414 -423 79 232 131 -608 -80 928 752 -180 -122 481 1023 675 -285 3 68 367 -414 -824
3383h24N30L87j45o05j28M50Q38n43n08q0J221M47r01n15O85M99k76j15l96K25
$$ -824 -294 93 -52 -657 -785 -335 503 -40 -548 -628 593 1040 139 -376 309 808 532 417 21 246
3403B46M39o33k62l50N86K8m08n89M20P57O9o43k53Q71M88n09m39L02Q26rq76
$$ 246 685 52 -210 -560 26 54 -354 -943 -523 234 303 -340 -593 278 766 257 -182 120 946 937 61
3424F1k91J70R37j89j019j29N29K97k95o16j02O36L77q95k16O32P76m80o58k1
$$ 61 -230 -60 877 688 -331 -460 69 366 71 -545 -647 -11 366 -529 -745 -113 663 183 -475 -496
3444d96R17L50l62l80j33N54L94n74p15M11M84l58p08j16O49L79l85p28L38O97
$$ -496 421 771 409 29 -104 450 844 270 -445 -34 450 92 -616 -732 -83 296 -89 -817 -479 218
3464B18P7n78N8O1N17K8j63k58N25L3j78o42J98N31J66q43o79O28Q40k01q90j82
$$ 218 295 -283 -225 -164 353 381 218 -40 485 518 340 -302 -104 427 593 -250 -929 -301 539 338 -552 -734
3486g34M89O74l76o92L10N31J75k60l46J08R77O0q78n05P31K61n9o39n5M65O4
$$ -734 -245 429 53 -639 -329 202 377 117 -229 -121 856 916 38 -467 264 525 466 -173 -228 237 301
3507C01n27k90J71M37n5o08J4M60N07j11p22n4J122J61n27o44K00Q30L3o28k61
$$ 301 -226 -516 -345 92 37 -571 -557 -97 410 299 -423 -477 645 806 279 -365 -165 665 698 70 -191
3528a91N53J55n85n82L01K75L36o09p03M96N17J69o6l96N06M09k46m44J81N88
$$ -191 362 517 -68 -650 -349 -74 262 -347 -1050 -554 -37 132 66 -330 176 585 339 -105 76 664
3548F64J96m91n38J15N44N1n68m31K12M16o5p29q6N99K62l71l51J31J072N2p12
$$ 664 860 369 -169 -54 490 541 -27 -458 -246 170 105 -624 -710 -111 151 -220 -571 -440 632 684 -28
3569b8l26P90O24l47p32k67L72L26l87j26l40M66k28n14J09J94Q97m80m85k9O72
$$ -28 -354 436 1060 713 -19 -286 86 412 25 -101 -441 25 -203 -717 -608 -414 483 3 -482 -511 161
3590A61K18l77l03N59L08j49m82K40J87L56m59l85k57M89K78n11o41J46O14K33
$$ 161 379 2 -301 258 566 417 -65 175 362 718 259 -126 -383 106 384 -127 -768 -622 -8 225
3610B25n08n64L71O35J39m84j14O90r9p0n25L26Q55j06q89m40K37O13j51o84j35
$$ 225 -283 -847 -476 159 298 -186 -300 390 291 221 -304 22 877 771 -118 -558 -321 292 141 -543 -678
3631f78N82L73o33m78K49Q26K03q44M9O59K69j42p22P4M40L46j76o31n6O27R9
$$ -678 -96 277 -356 -834 -585 241 444 -400 -351 308 577 435 -287 -213 227 573 397 -234 -290 337 436
3652D36p52j87M99M58k97p93R3R42N2n17m76J10M57L38p21K10J75P70k75q17K21
$$ 436 -316 -503 -4 454 157 -636 -543 399 451 -66 -542 -432 25 363 -358 -148 27 797 522 -295 -74
3673g4M75K24m97l85J93M26k99n70o5M75L83l49p89K69N17K54j88n60J87R29m
$$ -74 401 625 128 -257 -64 362 63 -507 -572 -97 286 -63 -852 -583 -66 188 0 -560 -373 556 552
3694E52n80k92M63K11K79p10k00N61L06o41n11N72L66k20k58m09N10O63n67k73
$$ 552 -28 -320 143 354 633 -77 -277 284 590 -51 -562 10 376 156 -102 -511 -1 662 95 -178
3714a78l81N99K99k30l62O8P92L1n11l50P44P9l82n28kL68L08m45p55K38M99J62
$$ -178 -559 40 339 109 -253 -185 607 638 127 -223 521 600 218 -310 -312 56 364 -81 -836 -598 -99 63
3736F3o83o8K07P18J87p25j3N12N10m87o10N48M41k11k33n40L18N69l89m89j56
$$ 63 -620 -688 -481 237 424 -301 -314 198 708 221 -389 159 600 389 156 -384 -66 503 114 -375 -531
3757e31N42J29j87n58J9P24J85l83m05N04M58j02l56j62M24L59m70l79j51O40
$$ -531 11 140 -47 -605 -586 138 323 -60 -465 39 497 395 39 -123 301 660 190 -189 -340 300
3777C00M94q72k97k6N89k85m93R2L41K54j78m05R5P82J04n05j8K25K66j48l06
$$ 300 794 -78 -375 -401 188 -97 -590 -498 -157 97 -81 -486 -391 391 495 -10 -28 197 463 315 9
3798Il39M53M14p15k01jO19M5r02J01J98M40Ol87k45N27L70l70k26J03O70J83
$$ 9 -330 123 537 -178 -379 -380 239 284 -618 -517 -319 121 127 -260 -505 22 392 22 -204 -101 569 752
3820G52o07l85L16O63o38m12R8Q4L43k77m40J54L77K75n37k23L41L54r8l79k65
$$ 752 145 -240 76 739 101 -311 -213 -129 214 -63 -503 -349 28 303 -234 -457 -116 238 140 -239 -504
3841e04P96J53o2p64K01N4O63m76n78L49M28j60o47J87N71o8k36n00J55O66N0
$$ -504 292 445 383 -381 -180 -126 537 61 -517 -168 260 100 -547 -360 211 143 -93 -593 -438 228 278
3862B78rp27M34K94K73m53j11J35L22l01k57k16N00K50l73o33K59Q05k17o33n8
$$ 278 269 -458 -24 270 543 90 -21 114 436 135 -122 -338 162 412 39 -594 -335 470 253 -380 -438
3883d38O51K50k46n67lQ01r6l54n18M49N29k34p03K14M84M18m40n41J70M45m9
$$ -438 213 463 217 -350 -353 448 352 -2 -520 -71 458 224 -479 -265 219 637 197 -344 -174 271 222
3904B22m13l19L35M95j82o70J40L57L26j40n93L35M87J68o20j25J13L80j44l26
$$ 222 -191 -510 -175 320 138 -532 -392 -35 291 151 -442 -107 380 548 -72 -197 -84 296 152 -174
3924a74J0K22L71l83n59JO78N4l11l04L6N03j28k83p5K75M19l62k61K92M15K19
$$ -174 -164 58 429 46 -513 -512 166 220 -91 -395 -359 144 16 -267 -342 -67 352 -10 -271 21 436 655
3946F55n30m14K45P82l79l46o43L67O05j60l80M1o4N29l77l54L69L17n8o39j83
$$ 655 125 -289 -44 738 359 13 -630 -263 342 182 -198 -157 -221 308 -69 -423 -54 263 205 -434 -617
3967f17Q03N97m39n15N3N76k05l67k93N49K96j80m95k32M81J90l72k13n7N18K72
$$ -617 186 783 344 -171 -118 458 253 -114 -407 142 438 258 -237 -469 12 202 -170 -383 -440 78 350
3988C50m89l01K01O41j9k53k11K87M26m56k60q3K94L46m72n13J39M10K32m73l22
$$ 350 -139 -440 -239 402 383 130 -81 206 632 176 -84 -167 127 473 1 -512 -373 37 269 -204 -526
4009e26N82J46j02j95k31M91M00k73o35L65L64o1n68J71J27L00j42o20j75N28
$$ -526 56 202 100 -95 -326 165 565 292 -343 22 386 325 -243 -72 55 355 213 -407 -582 -54
4029e4M90n55n58N39M68m5n33l08O52L22j54l55l85P85O4l28k10J18M79k16p40
$$ -54 436 -119 -677 -138 330 285 -248 -556 96 418 264 -91 -476 309 373 45 -165 -47 432 216 -524
4050e24L60J62L33k05n72Q8M91p9m90J7K89N01k79l57M5M70M14l97m32j00N31
$$ -524 -164 -2 331 126 -446 -358 133 54 -436 -419 -130 371 92 -265 -220 250 664 267 -165 -265 266
4071B66R7l22n95J69N48J36n76j65K58L78k40p8k03O00J65l55m18n2N67L09n09
$$ 266 363 41 -554 -385 163 299 -277 -442 -184 194 -46 -124 -327 273 438 83 -335 -387 180 489 -20
4092b0l33L32K85j02m02p6M88l1r8m54l9N85L78l74n63L76K25O3n57q9M21L11
$$ -20 -353 -21 264 162 -240 -316 172 141 43 -411 -450 135 513 139 -424 -48 177 240 -317 -406 15 326
4114C26l25q4q8N29J16o36l5K33M24l33n03r1O01o1lm18j04M23K8j03k05L26L08
$$ 326 1 -83 -171 358 474 -162 -197 36 460 127 -376 -467 134 73 70 -348 -452 -29 -1 -104 -309 17 325
4137C25m1o45K26K79J79M3q10M81L40n3l39k32M92M70o24n73k38P02L30j91k73
$$ 325 284 -361 -135 144 323 366 -444 37 377 324 -15 -247 245 715 91 -482 -720 -18 312 121 -152
4158a52l30P23J55n30m02K77N85l7n45J13N90J80o40K7k46N18J57m22j22l0L75
$$ -152 -482 241 396 -134 -536 -259 326 289 -256 -143 447 627 -13 14 -232 286 443 21 -101 -131 244
4179B44j11o39m7P21l69r6j78N5P71j33l55j58L92K27L8l95m4J66L52n9n29j86
$$ 244 133 -506 -553 168 -201 -297 -475 -420 351 218 -137 -295 97 324 362 -33 -77 89 441 382 -147 -333
4201c33N49Jk53l93J61O54j24n49r0L47M85j92n01k50N38K02j27k95K20K58rm30
$$ -333 216 217 -36 -429 -268 386 262 -287 -377 -30 455 263 -238 -488 50 252 125 -170 50 308 299 -131
4223a31L0J65K88l33o68M61K23M22p54j0r0L80K63q32J83O82L32n40j53R5M21
$$ -131 -101 64 352 19 -649 -188 35 457 -297 -307 -397 -17 246 -586 -403 279 611 71 -82 13 434
4244D34J64l01k95n0L86j44k63m81N60M6R6n65M5O68l56k48R1J11N58j04k56m28
$$ 434 598 297 2 -48 338 194 -69 -550 10 56 152 -413 -368 300 -56 -304 -213 -102 456 352 96 -332
4266c32M18K29l23k93K77L62m3m77k34N35J68j84k97l69N56J12k08q5k94L72M96
$$ -332 86 315 -8 -301 -24 338 295 -182 -416 119 287 103 -194 -563 -7 105 -103 -188 -482 -110 386
4287C86n05k85J74O10j7m47J03L44L34k21m49j60K62J87m27l67J84J32J36l44
$$ 386 -119 -404 -230 380 363 -84 19 363 697 476 27 -133 129 316 -111 -478 -294 -162 -26 -370
4307c70q3L01L22l06j84J36M51L44o63k38J26M80J00k01j50K57O2o0o30J24M33
$$ -370 -453 -152 170 -136 -320 -184 267 611 -52 -290 -164 316 416 215 65 322 384 324 -306 -182 251
4328B51ql84m33L83N97l47j97k04k7P95l67l01P0M67L27p43R3J21L37M8o48j88
$$ 251 243 -141 -574 -191 406 59 -138 -342 -369 426 59 -242 -172 295 622 -121 -28 93 430 478 -170 -358
4350c58K30K92j47m81J30J85P7j18m44M21L10L37n47j56O40q9J8l84K29J21J7
$$ -358 -128 164 17 -464 -334 -149 -72 -190 -634 -213 97 434 -113 -269 371 282 300 -84 145 266 283
4371B83l7k93Q0J62mk62j28K14R9m76j03J07M23M4k91k48K95O12k45k47j63L62
$$ 283 246 -47 33 195 191 -71 -199 15 114 -362 -465 -358 65 109 -182 -430 -135 477 232 -15 -178 184
4393A84M30j78p51M55L63l18l19o5j49M17p5k09k72K42K11j10j55J04M05J38k59
$$ 184 614 436 -315 140 503 185 -134 -199 -348 69 -6 -215 -487 -245 -34 -144 -299 -195 210 348 89
4414H9j64J12N14p9m62j54J19M84p6m77j03K54q2j1k73j4K61R2j94O7K01n7J6
$$ 89 -75 37 551 472 10 -144 -25 459 383 -94 -197 57 -25 -36 -309 -323 -62 30 -164 -97 104 47 63
4437F3l57J29L59M72k46n21K91K79j60l44j30q8L35j24j77k01K98J27l47l64N40
$$ 63 -294 -165 194 666 420 -101 190 469 309 -35 -165 -253 82 -42 -219 -420 -122 5 -342 -706 -166
4458a66L95j19n2m30J34N39k9l11L4K36L59n59j78N4K90M7l90J54k48L57M0m56
$$ -166 229 110 58 -372 -238 301 272 -39 -5 231 590 31 -147 -93 197 244 -146 8 -240 117 157 -299
4480b99mK79J01k57j0J57K07J37m49j5L0O58k99l70J2M30J54l92l61J80K37k33
$$ -299 -303 -24 77 -180 -190 -33 174 311 -138 -153 -123 535 236 -134 -122 308 462 70 -291 -111 126 -107
4502a07j89k84N38J78k39o54K04P48K70m05k84K46J48J6rj50K22L53l87l03j55
$$ -107 -296 -580 -42 136 -103 -757 -553 195 465 60 -224 22 170 186 177 27 249 602 215 -88 -243
4523b43M29Rj71n53J84K34J05k14j78J36K40K44l24j39L88K75l01k58M82J69K21
$$ -243 186 195 24 -529 -345 -111 -6 -220 -398 -262 -22 222 -102 -241 147 422 121 -137 345 514 735
4544G35p31m19N74M90l59n94p6M04%m43k70L60M26j90j30j52J51N88n6k35p5K76
$$ 735 4 -415 159 649 290 -304 -380 24 24 -419 -689 -329 97 -93 -223 -375 -224 364 308 73 -2 274
4566B74L86l50k68M41l75K91l20j72J44j6k7n90K34J19L95m28k58K29M16L43k95
$$ 274 660 310 42 483 108 399 79 -93 51 35 8 -582 -348 -229 166 -262 -520 -291 125 468 173
4587A73r4R5J99N2l87Q5M14k57pm96N4J87O7j61m35M42J92k17k80r3N93K67n04
$$ 173 79 174 373 425 38 123 537 280 273 -223 -169 18 85 -76 -511 -69 123 -94 -374 -467 126 393 -111
4610a11j73L23M5L56k88p2J70K79Q3l44n04L91K29l39m04q2L61ok17k11J96P42
$$ -111 -284 39 84 440 152 80 250 529 612 268 -236 155 384 45 -359 -441 -80 -86 -303 -514 -318 424
4632D24j62m28R8L96J21j57k20k2P69l64m8m84K17N8m0l66m4k18N93k75k89M12
$$ 424 262 -166 -68 328 449 292 72 50 819 455 407 -77 140 198 158 -208 -252 -470 123 -152 -441 -29
4654b9K10q9m15j2K96O38j95m21k11J88L11n4l20J33L27j72l81o8K41r6K73k06
$$ -29 181 92 -323 -335 -39 599 404 -17 -228 -40 271 217 -103 30 357 185 -196 -264 -23 -119 154 -52
4676e2k09J23K16j17m50K14K79J18j76j90M24L35j42l02k41L57j62K98p35K24
$$ -52 -261 -138 78 -39 -489 -275 4 122 -54 -244 180 515 373 71 -170 187 25 323 -412 -188
4696a88L69k81m6j25j42M51l7j92k11L44K8L2p7n9M66Kj10o19M58J96J30m73k60
$$ -188 181 -100 -146 -271 -413 38 1 -191 -402 -58 -30 2 -75 -134 332 334 224 -395 63 259 389 -84 -344
4719c44K04M39k42l29l1M87q9q7l48K06K58o8l34P4M37m9j4n7k61M55J10j20j73
$$ -344 -140 299 57 -272 -303 184 95 8 -340 -134 124 56 -278 -204 233 184 170 113 -148 307 417 297 124
4742A24j63M50j71l27k05J81J44l65k38K77K03l9J31l35K92K26j17j79J20J51
$$ 124 -39 411 240 -87 -292 -111 33 -332 -570 -293 -90 -129 2 -333 -41 185 68 -111 9 160
4762A60N05k33m59n8O1M56o40J18r6L00l41J08j23J56N5j90m15K67K96L38j77
$$ 160 665 432 -27 -85 -24 432 -208 -90 -186 114 -227 -119 -242 -86 -31 -221 -636 -369 -73 265 88
4783H8n06L11L12K89n69J23R4rJ8m92J92L73n2m42J85k47J90J35o17L82m0M11
$$ 88 -418 -107 205 494 -75 48 142 133 151 -341 -149 224 172 -270 -85 -332 -142 -7 -624 -242 -282 129
4805A29J7j79n12O79J53l90Q3L85K07m70k10P3P6K12l01m7k54M14O3l99j36K42
$$ 129 146 -33 -545 134 287 -103 -20 365 572 102 -108 -35 41 253 -48 -95 -349 65 128 -271 -407 -165
4827a65L90j08l75J70M3L69j75p6R5P8K56n57RK15j22j45nj83L15q8kl58L9N47
$$ -165 225 117 -258 -88 -45 324 149 73 168 246 502 -55 -46 169 47 -98 -103 -286 29 -59 -61 -419 -380 167
4851A67j54k35j42L51L53K0l72m4k0M40q1l75L13q3L87k85m33J77J90J09l09k65
$$ 167 13 -222 -364 -13 340 360 -12 -56 -76 364 283 -92 221 138 525 240 -193 -16 174 283 -26 -291
4873b91M63l43R9k12NL02L26l34k04Q4M36N6l05P0j74M94j91l60j72L94j77L6
$$ -291 172 -171 -72 -284 -279 23 349 15 -189 -105 331 387 82 152 -22 472 281 -79 -251 143 -34 2
4895Bj22k07L67j60m2j82L82J07k94J7J39J88N4J24o95K87M55k39l30j20N19M1
$$ 2 -120 -327 40 -120 -162 -344 38 145 -149 -132 7 195 249 373 -322 -35 420 181 -149 -269 250 291
4917B91j39l15M5K37k3o3k29k30N48j33o5J34p7J57k7l24J58J6K66k81j95J07
$$ 291 152 -163 -118 119 96 33 -196 -426 122 -11 -76 58 -19 138 111 -213 -55 -39 227 -54 -249 -142
4939a42M66j92Mk91k5K63J88o42J92L54P9n27j09K68J75j3m9k61J58O80q0k79
$$ -142 324 132 136 -155 -180 83 271 -371 -179 175 254 -273 -382 -114 61 48 -1 -262 -104 576 496 217
4961B17j62L0K21m29j9Q6K4K85n35j8Q3M10m66J47J01J67J11m87r9K40L30j23
$$ 217 55 85 306 -123 -142 -56 -32 253 -282 -300 -217 193 -273 -126 -25 142 253 -234 -333 -93 237 114
4983A14j04k01L80j0j00K7l68K09L26n16j69M68J02nr7m27J69M15j3n94J20N25
$$ 114 10 -191 189 179 79 106 -262 -53 273 -243 -412 56 158 153 56 -371 -202 213 200 -394 -274 251
5005B51j09L7m89M93n8K08k65j73J61M88k76m93J16k17K30m8j92k99O90n1k85
$$ 251 142 179 -310 183 125 333 68 -105 56 544 268 -225 -109 -326 -96 -144 -336 -635 55 4 -281
5026b81P3L39L3K32l70j31M80J17m64j86J31K19j16j25q6J87J11n8k46j97M44
$$ -281 -208 131 164 396 26 -105 375 492 28 -158 -27 192 76 -49 -135 52 163 105 -141 -338 106
5047A06k2P1l22q0L76j62L4j00J46P7K53l95K16K1M7J9n64J30M98k16j57j69r7
$$ 106 84 155 -167 -247 129 -33 1 -99 47 124 377 -18 198 219 266 285 -279 -149 349 133 -24 -193 -290
5070b90J30J73j56j40l4O55l32k21n5N57K66l06k29R0J11J38o11K66j94K17m5
$$ -290 -160 13 -143 -283 -317 338 6 -215 -270 287 553 247 18 108 219 357 -254 12 -182 35 -10
5091a0m64L46m1L61m20k71L10K00J46l6l24K69n2J02k27r3L94J33l32m02K30K90
$$ -10 -474 -128 -169 192 -228 -499 -189 11 157 121 -203 66 14 116 -111 -204 190 323 -9 -411 -181 109
5113A09J81l27Mk64O23l54j48J9J67J59j2m66N4L09p4O3l62M40m5J50l57r6P42
$$ 109 290 -37 -33 -297 326 -28 -176 -157 10 169 157 -309 -255 54 -20 43 -319 121 76 226 -131 -227 515
5136E15k28k9l07j78L87p5k71m2J3J22K67m67J86J60K54m54O9J43J30k54L1k02
$$ 515 287 258 -49 -227 160 85 -186 -228 -215 -93 174 -293 -107 53 307 -147 -78 65 195 -59 -28 -230
5158b30L88j6q2l13J36K43K91m39K3O8Q3o9q9j17J70P2J1j19j73K95J48Q3n38
$$ -230 158 142 60 -253 -117 126 417 -22 1 69 152 83 -6 -123 47 119 130 11 -162 133 281 364 -174
5181a74K08J6L05j67k03J67K06j51j12j43P0K5k98oK79K02k50j55m3K53J82j98
$$ -174 34 50 355 188 -15 152 358 207 95 -48 22 47 -251 -257 22 224 -26 -181 -224 29 211 13
5203A3r9k7J74%O2k21K09m1K41n98l7K43L34J4l47k03L20J84p9l97J71M19m64
$$ 13 -86 -113 61 61 123 -98 111 70 311 -287 -324 -81 253 267 -80 -283 37 221 142 -255 -84 335 -129
5226a29k9J12NJ90Ll29l5K66K59o2o42N28J83l69Mj11M2K21k27j17K1M84j94j81
$$ -129 -158 -46 -41 149 152 -177 -212 54 313 251 -391 137 320 -49 -45 -156 -114 107 -120 -237 -216 268 74 -107
5250a07l3K2J19K75l66j69J37M82ol61m2J53j26k52J56j17L27k4j35j60L80O6
$$ -107 -140 -118 1 276 -90 -259 -122 360 354 -7 -49 104 -22 -274 -118 -235 92 68 -67 -227 153 219
5272B19j82k8j04o5K24p0J80j14M9pP5m70N64L8m08l4J40K51rl80j70K70J07J53
$$ 219 37 9 -95 -160 64 -6 174 60 109 102 177 -293 271 309 -99 -133 7 258 249 -131 -301 -31 76 229
5296B29m78L6L06K21m31j15K38j15L19k43j84M51j46J3j95k49L85J36J09l71j12
$$ 229 -249 -213 93 314 -117 -232 6 -109 210 -33 -217 234 88 101 -94 -343 42 178 287 -84 -196
5317a96M77k06J0k46J68J38L61o40m0K39Q3j01j14m1J34m4K38k25o3K67j62p5
$$ -196 281 75 85 -161 7 145 506 -134 -174 65 148 47 -67 -108 26 -18 220 -5 -68 199 37 -38
5339c8J0K9L92l52j96J84q2J99P2o79J27L19J85k12k39N05j39k0J2j09J52n4L6
$$ -38 -28 1 393 41 -155 29 -53 146 218 -461 -334 -15 170 -42 -281 224 85 65 77 -32 120 66 102
5362A02l53J63L08r8j92J10J02n2Kl49j2L80m4k30m6j72M57rj62j04J64K43R4
$$ 102 -251 -88 220 122 -70 40 142 90 92 -257 -269 111 67 -163 -209 -381 76 67 -95 -199 -35 208 302
5385C02m24L66j44J78j45k31J16P1j47j76J34P6J42p7j65J20J06m0Mo5j51K53
$$ 302 -122 244 100 278 133 -98 18 89 -58 -234 -100 -24 118 41 -124 -4 102 62 66 1 -150 103
5407A03K72l69K32l0K50j31k24j79l0L93l75j19K20P2P5n22K4K98K21j09j73j22
$$ 103 375 6 238 208 458 327 103 -76 -106 287 -88 -207 13 85 160 -362 -338 -40 181 72 -101 -223
5429b23K73K04j72j89m1K37J28j02j24L03p2Nl76M3O9L21k91j63J16J18M6j94
$$ -223 50 254 82 -107 -148 89 217 115 -9 294 222 227 -149 -106 -37 284 -7 -170 -54 64 110 -84
5451h4l68N64J82l13K50j11n5J74j14k34K76k42J82j70m5J83j47K60l14j71K47
$$ -84 -452 112 294 -19 231 120 65 239 125 -109 167 -75 107 -63 -108 75 -72 188 -126 -297 -50
5472e0J93k51j89K92J75Rl37K18k11L45j69j00j21M10j58J66n71L16K25k01k01
$$ -50 143 -108 -297 -5 170 179 -158 60 -151 194 25 -75 -196 214 56 222 -349 -33 192 -9 -210
5493b10n5J08L13j88k69J90J26m5J6%k02M23k27j01L9J63Q6J00k40p5K08j29k28
$$ -210 -265 -157 156 -32 -301 -111 15 -30 -14 -14 -216 207 -20 -121 -82 81 167 267 27 -48 160 31 -197
5516a97L39j04q5o7J48j53P6J11K9m01L0J12K76L0k86l7J61K69k00l57K45L37
$$ -197 142 38 -47 -114 34 -119 -43 68 97 -304 -274 -162 114 144 -142 -179 -18 251 51 -306 -61 276
5538B76j67j88j91L47K51j10l36k6K17P8r1l31RL28P1m65N5K79K6J59l34K58k6
$$ 276 109 -79 -270 77 328 218 -118 -144 73 151 60 -271 -262 66 137 -328 -273 6 32 191 -143 115 89
5561H9M72l59k03P5K23Qm22k17L80J03J23n36J44J29R4j43k50L93M2N9l32J4K05
$$ 89 561 202 -1 74 297 305 -117 -334 46 149 272 -264 -120 9 103 -40 -290 103 145 204 -128 -114 91
5584I1j09N9l71K68K04L2j2n02K11K05K09m06J26j12L22k03k67J28L03kn6j46
$$ 91 -18 41 -330 -62 142 174 162 -340 -129 76 285 -121 5 -107 215 12 -255 -127 176 174 118 -28
5606b8j37K09K97m86p8L51J81m37J86Kj16J17r5J43k56J38P5j20k73J69M20l09
$$ -28 -165 44 341 -145 -223 128 309 -128 58 60 -56 61 -34 109 -147 -9 66 -54 -327 -158 262 -47
5628d7r5P1J41Q7J03k23K51K7k76k06P7J41O6K8k60k8L13q4l12k4L69j1M1k65
$$ -47 -142 -71 70 157 260 37 288 315 39 -167 -90 51 117 145 -115 -143 170 86 -226 -250 119 108 149 -116
5652a16Q5J74J03r1k15q6L39K51o07pM0K03r1r4l00N05J02p7m62K31J9J00j65
$$ -116 -31 143 246 155 -60 -146 193 444 -163 -170 -130 73 -18 -112 -412 93 195 118 -344 -113 -94 6 -159
5675a59J45j03M17Mm34J08n0M98l31k36K51J23J19j87l26R0P2J6K8m03L72Q8q3
$$ -159 -14 -117 300 304 -130 -22 -72 426 95 -141 110 233 352 165 -161 -71 1 17 45 -358 14 102 19
5698A9j09j32N6L88k12q9jL30J68n23n3M33J6p3l14J32Q1J29l72o7K85K17l22
$$ 19 -90 -222 -166 222 10 -79 -80 250 418 -105 -158 275 291 218 -96 36 117 246 -126 -193 92 309 -13
5721a3l3R4j18J7O1k09q7L02J84j21l27K36n0K42j24j35J01J0J73m42j55J18L77
$$ -13 -46 48 -70 -53 8 -201 -288 14 198 77 -250 -14 -64 178 54 -81 20 30 203 -239 -394 -276 101
5744A01p0j98J20P8k25L7j94K68J16M3j00j24K24M9q5k99K55J75Qk01p9J73J05
$$ 101 31 -167 -47 31 -194 -157 -351 -83 33 76 -24 -148 76 125 40 -259 -4 171 179 -22 -101 72 177
5767A77k03o5j24J52n9P1j98J15J66L43n91k2J09PJ72p9J03o1kJ37j42j5J03J33
$$ 177 -26 -91 -215 -63 -122 -51 -249 -134 32 375 -216 -238 -129 -122 50 -29 74 13 11 148 6 -9 94 227
5791B27k40k65K02N7j6p3JJ21K20K8k16j31L9K67j89l08M90j12L17m67o2R2M4
$$ 227 -13 -278 -76 -19 -35 -108 -107 14 234 262 46 -85 -46 221 32 -276 214 102 419 -48 -110 -18 26
5814B6j12j48L19j53L15l67J53jj7j16j42J72M83m40R3k91N7M45p8j07j60Q3K79
$$ 26 -86 -234 85 -68 247 -120 33 32 15 -101 -243 -71 412 -28 65 -226 -169 276 198 91 -69 14 293
5837B93l43n3j47K59k9k57K03o1P0J54k19K50j4k10n1K6n7M44R1k17k34K99R6
$$ 293 -50 -103 -250 9 -20 -277 -74 -135 -65 89 -130 120 106 -104 -155 -129 -186 258 349 132 -102 197 293
5860B93o08l8L11n6Q6m5k21O9P2J21J48l01J05K51o7k21J85M1j90L03j03J7n7
$$ 293 -315 -353 -42 -98 -12 -57 -278 -209 -137 -16 132 -169 -64 187 120 -101 84 125 -65 238 135 152 95
5883I5L10k90l16J69N6K70m30J5J27P0j47J6p2M9K90j11k07l3j9L09M7k85J22
$$ 95 405 115 -201 -32 24 294 -136 -121 6 76 -71 -55 -127 -78 212 101 -106 -139 -158 151 198 -87 35
5906C5J43Oj79n3M7j7k02l4j10K70L34n10P5J73J59l24J45j97K87K13j39j85O1
$$ 35 178 184 5 -48 -1 -18 -220 -254 -364 -94 240 -270 -195 -22 137 -187 -42 -239 48 261 122 -63 -2
5929bL07L7l53j66J20K88n6k67p2J10K00k21l75J65R4O2k2j40K98K02kj56j83
$$ -2 305 342 -11 -177 -57 231 175 -92 -164 -54 146 -75 -450 -285 -191 -129 -151 -291 7 209 207 51 -132
5952a32K70J1o2k76M81j52K1j24j67m3L64l41J08k9nJ61o0J50m37K59R7k22j96
$$ -132 138 149 87 -189 292 140 161 37 -130 -173 191 -150 -42 -71 -76 85 25 175 -262 -3 94 -128 -324
5975c24K03J50K42k61k44L67Pk12M8j46M14N0m41O8l7L47p0l62jL56j11m5k8j9
$$ -324 -121 29 271 10 -234 133 140 -72 -24 -170 244 294 -147 -79 -116 231 161 -201 -202 154 43 -2 -30 -49
5999d9R0NK7k22J6K89m4l72r6K82L60l25ro6K40j16N9l65J43L94l48Qq9k4L66
$$ -49 41 46 73 -149 -133 156 112 -260 -356 -74 286 -39 -48 -114 126 10 69 -296 -153 241 -107 -99 -188 -212 154
6024A54p8j04r4K45j76J48l19K81K56j96N8l77m0M8n7K33k08J38P1r2J20j43O5
$$ 154 76 -28 -122 123 -53 95 -224 57 313 117 175 -202 -242 -194 -251 -18 -226 -88 -17 -109 11 -132 -67
6047f7J98j00j04L43p8j48J66l15J84j8J36n1o2Q3K18n61r1J04j1J14O3k86K41
$$ -67 131 31 -73 270 192 44 210 -105 79 61 197 146 84 167 385 -176 -267 -163 -174 -60 3 -283 -42
6070d2L01l06jk03L71R2k92j6J03K51j8j43m46M58O2j10j86k07K93M1j30L9J92
$$ -42 259 -47 -48 -251 120 212 -80 -96 7 258 240 97 -349 109 171 61 -125 -332 -39 2 -128 -89 103
6093A03r3JJ29k57K30k15J6L81k63K35Nk36l13K39K57j9l67j07L57l8M5k24LJ10
$$ 103 10 11 140 -117 113 -102 -86 295 32 267 272 36 -277 -38 219 200 -167 -274 83 45 90 -134 -131 -21
6117b1M3p4J4q5N67o20m2Q3L66K58n04qj24M08k42j67J82j45M47l87r3o1L54j86
$$ -21 22 -52 -38 -123 444 -176 -218 -135 231 489 -15 -23 -147 261 19 -148 34 -111 336 -51 -144 -205 149 -37
6141c7j11k58K20K20J24q6J22k91K57m4j94J06Q4M8k68KK65J17q9q9l5m37K82
$$ -37 -148 -406 -186 34 158 72 194 -97 160 116 -78 28 112 160 -108 -106 159 276 187 98 63 -374 -92
6164i2k15K01r6J01J79k30kL5J25o3J4o8N3J90K92l49l5n2K50j26j41K1K63j19
$$ -92 -307 -106 -202 -101 78 -152 -154 -119 6 -57 -43 -111 -58 132 424 75 40 -12 238 112 -29 -8 255 136
6188A36j28K9j37j11J99j69KK0J21J10M8n1l6K2J36l69M22p6m17K05L0j50J48
$$ 136 8 37 -100 -211 -12 -181 -179 -159 -38 72 120 69 33 55 191 -178 244 168 -249 -44 -14 -164 -16
6211a6m5J13o3L6J90k04j68J23j9m4l6K01j01K77l13O3qP6K11j41R5j58k7M74
$$ -16 -61 52 -11 25 215 11 -157 -34 -53 -97 -133 68 -33 244 -69 -6 -14 62 273 132 227 69 42 516
6235E16q42J85J6K74q7j19J53j07j4p9R0kp1K29l36o9M85n0j53k05KK30J71l57
$$ 516 -326 -141 -125 149 62 -57 96 -11 -25 -104 -14 -16 -87 142 -194 -263 222 172 19 -186 -184 46 217 -140
6259a40k14J30L54pk37q5M8K02P6m60M60L8q1K4M5j85J44j41lN5j13J46J7k68
$$ -140 -354 -224 130 123 -114 -199 -151 51 127 -333 127 165 84 108 153 -32 112 -29 -32 23 -90 56 73 -195
6283a95J70J92k36J21j22L9J21l57J24J34j34K38j54j23P7N41l74J93l26M0Lo5
$$ -195 -25 167 -69 52 -70 -31 90 -267 -143 -9 -143 95 -59 -182 -105 436 62 255 -71 -31 -28 -93
6305i3Q8q5J6J3J7l7j99m1K49J12m25L07J22j9r8q5K59m0q8J40j89J03q8J69J95
$$ -93 -5 -90 -74 -61 -44 -81 -280 -321 -72 40 -385 -78 44 25 -73 -158 101 61 -27 113 -76 27 -61 108 303
6330C03l93Q1J04j80M3j03L3L14l84N9j68N83k68l64K40P9J08j83k61N47K8k68
$$ 303 -90 -9 95 -85 -42 -145 -112 202 -182 -123 -291 292 24 -340 -100 -21 87 -96 -357 190 218 -50
6352e0J85j73K83R7l58k30M15l36K76k83m7K61k29J67r0m6Q6K07k15J94k26K38
$$ -50 135 -38 245 342 -16 -246 169 -167 109 -174 -221 40 -189 -22 -112 -158 -72 135 -80 114 -112 126
6374A26j28j9J55o1J14l0j57j4j28P6L30m85k20N03J31k53k17J79K12j40m3k0
$$ 126 -2 -21 134 73 187 157 0 -14 -142 -66 264 -221 -441 62 193 -60 -277 -98 114 -26 -69 -89
6396h9K29M3o2k75J85K71j98j29J21R3k0r5NKk4o7R3l79K27j56p2J95j34rN60
$$ -89 140 183 121 -154 31 302 104 -25 96 189 169 74 79 81 57 -10 83 -296 -69 -225 -297 -102 -236 -245 315
6421C15l85l7j39J05Q4J23p3l69O06r1j80N8Q7p4m3j96l6N8K04J46k80o8J86l7
$$ 315 -70 -107 -246 -141 -57 66 -7 -376 230 139 -41 17 104 30 -13 -209 -245 -187 17 163 -117 -185 1 -36
6445c6R9l28L68Q7rr8K1J26m5J0k57l7L11k26j44j55L02k7M0j74K02m1R6j27k9
$$ -36 63 -265 103 190 181 83 104 230 185 195 -62 -99 212 -14 -158 -313 -11 -38 2 -172 30 -11 85 -42 -71
6470g1O6j9J55k20m8R8J45J34l14m5J67k75K45pj9J8J01l13k38L75j3l3L18m28
$$ -71 -5 -24 131 -89 -137 -39 106 240 -74 -119 48 -227 18 11 -8 10 111 -202 -440 -65 -78 -111 207 -221
6494b21L83k04K24j00n2R9J68q2m46K66lJ26l24o3K39K39j62k69L79k81J62j92
$$ -221 162 -42 182 82 30 129 297 215 -231 35 32 158 -166 -229 10 249 87 -182 197 -84 78 -114
6516a14j09L84J9p7n2j62L65Jk82j43K1J73J55j45j92r9M28k40r6Q1J42K2j38
$$ -114 -223 161 180 103 51 -111 254 255 -27 -170 -149 24 179 34 -158 -257 171 -69 -165 -84 58 80 -58
6539e8O3K9J36j88J74k84p6N27k03m5J5M4j62Q1j02R9p7J9l0J45J2P1Q2l58j68
$$ -58 5 34 170 -18 156 -128 -204 323 120 75 90 134 -28 53 -49 50 -27 -8 -38 107 119 190 272 -86 -254
6564b54N9K39J46j59J3R1M0j45J67o7j75J76k39J96j01J75k35J41j84m8J62j8
$$ -254 -195 44 190 31 44 135 175 30 197 130 -45 131 -108 88 -13 162 -73 68 -116 -164 -2 -20
6586b0J42r9O2j12m5nJ50j88J31K74l95K91j66K1K39k88N0N9k06K28k57J02K2
$$ -20 122 23 85 -27 -72 -77 73 -115 16 290 -105 186 20 41 280 -8 42 101 -105 123 -134 -32 -10
6609a0l10K54j3L54k43K1j9L5J89j91q6L14j70l85J60r2K42L6J07k21j24K10J9
$$ -10 -320 -66 -79 275 32 53 34 69 258 67 -19 295 125 -260 -100 -192 50 86 193 -28 -152 58 77
6632G7k23MJ08p1o2j23L75k24N23l77r0K7L56l23J88p7j6P1j36k89Q4Q2J02n0
$$ 77 -146 -142 -34 -105 -167 -290 85 -139 384 7 -83 -56 300 -23 165 88 72 143 7 -282 -198 -116 -14 -64
6656f4m9J21k3K04k72j16L72o4Qj93j3l9J36J14l32K7J88K69k44j95J65J23J09
$$ -64 -113 8 -15 189 -83 -199 173 109 117 -76 -89 -128 8 122 -210 -183 5 274 30 -165 0 123 232
6679B32Kk35O0J50j27k25P7q6K43k74M33k38k4N4j24r8M2Q7L15l20p8K89J32k92
$$ 232 234 -1 59 209 82 -143 -66 -152 91 -183 250 12 -12 42 -82 -180 -138 -51 264 -56 -134 155 287 -5
6703ej85J33J57J6j21o8M2M0k9k8N7J43j37N9k15J74j52J47q5k11M4M02l60N5
$$ -5 -190 -57 100 116 -5 -73 -31 9 -20 -48 9 152 15 74 -141 33 -119 28 -57 -268 -224 178 -182 -127
6727a27K76J10j48j18o7K10J80k44k46J50k18M13j65O4j98L74j6k49L6m0jJ85
$$ -127 149 259 111 -7 -74 136 316 72 -174 -24 -242 171 6 70 -128 246 230 -19 17 -23 -24 161
6749A61j01j43l8L80j51k05K37m3M1l80J90J67m4k83K27o2J70q0J26l9j15M6o1
$$ 161 60 -83 -121 259 108 -97 140 97 138 -242 -52 115 71 -212 15 -47 123 43 169 130 15 61 0
6772@q4J73l01K71k09K33k78J13J13j89k12K92k95N02o8j56p5R4KJj3J10L03m08
$$ 0 -84 89 -212 59 -150 83 -195 -82 31 -158 -370 -78 -373 129 61 -95 -170 -76 -74 -73 -86 24 327 -81
6796h1J5P0L9J37p6mj49nJ29l06J70J13j14K02m03K84K50l3Rk29mj24J70n7j41
$$ -81 -66 4 43 180 104 100 -49 -54 75 -231 -61 52 -62 140 -263 21 271 238 247 18 14 -110 60 3 -138
6821a38J32L87k64k29j14M96m12K64l28M30j76j07j75K8J99K31l18m2K03K1K69
$$ -138 -6 381 117 -112 -226 270 -142 122 -206 224 48 -59 -234 -206 -7 224 -94 -136 67 88 357
6842C57k80n3k00K42rk99L4R9J64P2k91K1J58j1K14l57j30L22Q2l13K09k56L13
$$ 357 77 24 -176 66 57 -242 -208 -109 55 127 -164 -143 15 4 218 -139 -269 53 135 -178 31 -225 88
6865H8j75K09n5k62J50l08L76rQ2J73p35K69J77K14k19L9j09j35L03m95J96J89
$$ 88 -87 122 67 -195 -45 -353 23 14 96 269 -466 -197 -20 194 -25 14 -95 -230 73 -422 -226 -37
6887c7K81k37oR3M7J14l50J22j10N3M6K3k06K34J90Qj21j76K24j22J60l82K73
$$ -37 244 7 1 94 141 255 -95 27 -83 -30 16 39 -167 67 257 265 144 -32 192 70 230 -152 121
6910A21m1J04R6m00j6K65J06k66N7M7J52k76J92n2m6O2J0k59J89K07l51L2j34
$$ 121 80 184 280 -120 -136 129 235 -31 26 73 225 -51 141 89 43 105 115 -144 45 252 -99 -67 -201
6933b01K09K1N1k62q7M88k72K13m37J09L2K12j91J62J05N9j74j36Q4P8m1N8l09
$$ -201 8 29 80 -182 -269 219 -53 160 -277 -168 -136 76 -115 47 152 211 37 -99 -15 63 22 80 -229
6956b29L24k72J08J18m3j72K67K7j71j14l5K51J29k76r2l5K76m6O6k1j63J5J09
$$ -229 95 -177 -69 49 6 -166 101 128 -43 -157 -192 59 188 -88 -180 -215 61 15 81 60 -103 -88 21
6979B1k13M63l05R1p9K09k12j3l12K08P8o8K36k82J04J85M7k45K23j11J52k83
$$ 21 -192 271 -34 57 -22 187 -25 -38 -350 -142 -64 -132 104 -178 -74 111 158 -87 136 25 177 -106
7001a06J41k13J76J78ql36o7M9M31j50K0k0k30J47j73J6j07J57m7k2J30J40j60
$$ -106 35 -178 -2 176 168 -168 -235 -186 245 95 115 95 -135 12 -161 -145 -252 -95 -142 -164 -34 106 -54
7024e4L7l1O2j29L33j52j78Q2K46k17rq6k4L15k14J74r3k5J41k4l40J27n6M52
$$ -54 -17 -48 14 -115 218 66 -112 -30 216 -1 -10 -96 -120 195 -19 155 62 37 178 154 -186 -59 -115 337
7048C37k10r5j3L47l49p6j9m9M66j90P1mj79n7k75P7J05L08Nl71j10K49j39K60
$$ 337 127 32 19 366 17 -59 -78 -127 339 149 220 216 37 -20 -295 -218 -113 195 200 -171 -281 -32 -171 89
7072H9J02k28J07j31J54j81L90l18rk84K79j8L10k51j45L20j76k08R1R5m4J12
$$ 89 191 -37 70 -61 93 -88 302 -16 -25 -309 -30 -48 262 11 -134 186 10 -198 -107 -12 -56 56
7094E6qk58P7J59n4J18j55p1L36l19O9j5J43P1k95o9K62p8N6k5n1N7RK06k24q6
$$ 56 48 -210 -133 26 -28 90 -65 -136 200 -119 -50 -65 78 149 -146 -215 47 -31 25 0 -51 6 15 221 -3 -89
7120h9J98q7J41L4J20k41J39l6l10J29J54P3l18Q8M0N3J43l84M3K73q7m4j67j3
$$ -89 109 22 163 197 317 76 215 179 -131 -2 152 225 -93 -5 35 88 231 -153 -110 163 76 32 -135 -148
7144a48L24j26j27K7k32J75OR5J07m4q3l2Q3K5l8j71J57rL0n4J07j38M7N2L2o0
$$ -148 176 50 -77 -50 -282 -107 -101 -6 101 57 -26 -58 25 50 12 -159 -2 -11 19 -35 72 -66 -19 33 65 5
7170Ej3Q6K31O4l12m8J3K80m62r3n9J92K38k36N0J66k74J22n0J29M1J7O8k94J4
$$ 5 -8 78 309 373 61 13 26 306 -156 -249 -308 -116 122 -114 -64 102 -172 -50 -100 29 70 87 155 -139 -125
7195a25P4L19l96j44N21j67k37L65m91R4K67m09K76j97lM59k96J3J62j51pP8j85
$$ -125 -51 268 -128 -272 249 82 -155 210 -281 -187 80 -329 -53 -250 -253 206 -90 -77 85 -66 -73 5 -180
7218a80K58K11r9j69Q3l4n6q4M1k31K83J4o5l4j21Q0j43J06j02L21Q9k32j35J79
$$ -180 78 289 190 21 104 70 14 -70 -29 -260 23 37 -28 -62 -183 -103 -246 -140 -242 79 168 -64 -199 -20
7242b0K59o9k85j4o6K24J13k93M4N5L46n83M90q5k02M3r0M9J10K11k56k8R5j18
$$ -20 239 170 -115 -129 -195 29 142 -151 -107 -52 294 -289 201 116 -86 -43 -133 -84 26 237 -19 -47 48 -70
7266g0L50l08J0j11J04J22K6l48J59L41j04j25k03K53j68j37K23l9k05M41j83
$$ -70 280 -28 -18 -129 -25 97 123 -225 -66 275 171 46 -157 96 -72 -209 14 -25 -230 211 28
7287B8J4j74k4l7J70j41M1J99K1q1j85K07J53j37k26K33k20kj7m1K69J83k60n1
$$ 28 42 -132 -156 -193 -23 -164 -123 76 97 16 -169 38 191 54 -172 61 -159 -161 -178 -219 50 233 -27 -78
7311g8k39K77R7m6j82J54J71J0l35K87K9qk31r2Q9K84q6j08n8Q0j8O5r4k58L43
$$ -78 -317 -40 57 11 -171 -17 154 164 -171 116 145 137 -94 -186 -97 187 101 -7 -65 15 -3 62 -32 -290 53
7336E3K22p9j15P6l12J96o7j4p5J78q8k4O8k07J14O6J7j86J52L55l63k73K5K35
$$ 53 275 196 81 157 -155 41 -26 -40 -115 63 -25 -49 19 -188 -74 -8 9 -177 -25 330 -33 -306 -281 -46
7360d6j08j4K64j03L91l61q0J04J31j14k50L4J85K1N6l07K9J87J12J8l10J24j9
$$ -46 -154 -168 96 -7 384 23 -57 47 178 64 -186 -152 33 54 110 -197 -168 19 131 149 -161 -37 -56
7383e6R1J64m25L19J69ql24QJ21J11r6L8l1M5r2k4J34o9J92j59l80J06J30J70
$$ -56 35 199 -226 93 262 254 -70 -62 59 170 74 112 81 126 34 10 144 75 267 108 -272 -166 -36 134
7407A34n5q4r0j51J86N5o6L59j53j46K0j46M7K90o4j62j42L70k04j92Q9K39j47
$$ 134 79 -5 -95 -246 -60 -5 -71 288 135 -11 9 -137 -90 200 136 -26 -168 202 -2 -194 -105 134 -13
7430a3J83j52p9K07k56K88j13N3r5J39k36J54k69K32r4k21rL47j42J60J63m81
$$ -13 170 18 -61 146 -110 178 65 118 23 162 -74 80 -189 43 -51 -272 -281 66 -76 84 247 -234
7452b34K55J47j55nk32L96j40oo2j37J62Q2Ol53N79k22k95j31M14n8K34l55k0
$$ -234 21 168 13 8 -224 172 32 26 -36 -173 -11 71 77 -276 303 81 -214 -345 69 11 245 -110 -130
7475a30M9J44k43J8J73j00K55l75J66J82k7M7j94j68L53O5k41J5K61j95k6K01
$$ -130 -81 63 -180 -162 11 -89 166 -209 -43 139 112 159 -35 -203 150 215 -26 -11 250 55 29 230
7497B30l80J06J67K7m69M38k26M16k29p7j61R1K47k52N8j45K01l43J90QJ59l12
$$ 230 -150 -44 123 150 -319 119 -107 309 80 3 -158 -67 180 -72 -14 -159 42 -301 -111 -103 56 -256
7519b56M38k04q4p7J37k33K2K27O6j61M93l10N3m40J91J57j94K32J48k44Q9J6
$$ -256 182 -22 -106 -183 -46 -279 -257 -30 36 -125 368 58 111 -329 -138 19 -175 57 205 -39 50 66
7541F6K4M4l09j77J0K75o6J51P0j29N6qJ72k85J36J11l05k9J16p6O2pr0N42k14
$$ 66 90 134 -175 -352 -342 -67 -133 18 88 -41 15 7 179 -106 30 141 -164 -193 -77 -153 -91 -98 -188 354 140
7566A40n1j00J15j60O8j2j68K69N2k15j03K55n8r4J85j63L2J32j43j48L5K94k40
$$ 140 89 -11 104 -56 12 0 -168 101 153 -62 -165 90 32 -62 123 -40 -8 124 -19 -167 -132 162 -78
7589g8K36k08O6J47N8m27J68j36J89j51J37j19K92J05m37L08k84P3Q9k4J8m6J40
$$ -78 158 -50 16 163 221 -206 -38 -174 15 -136 1 -118 174 279 -158 150 -134 -61 28 4 22 -24 116
7612A16P7m59L95j34j4K76J8l73M34k82j1k29L86k57K06J20l77J83j98J33k10
$$ 116 193 -266 129 -5 -19 257 275 -98 336 54 43 -186 200 -57 149 269 -108 75 -123 10 -200
7633b00J07J55K52r7Nm1p0k44J5K7o1J97q1l6K32N7l27J08K96m32Q0j50J89n9
$$ -200 -93 62 314 217 222 181 111 -133 -118 -91 -152 45 -36 -72 160 217 -110 -2 294 -138 -58 -208 -19 -78
7657g8P9pNj92K76K6k3j64K12P4j12p4J1k2k70K15J17o0o0J54N1m5j60k50L71
$$ -78 1 -6 -1 -193 83 109 86 -78 134 208 96 22 33 11 -259 -44 73 13 -47 107 158 113 -47 -297 74
7682G4Pl7j40P4P7n4j25R5m9K77n9j39n7K1j41K18l51L52q2r8K52j81J64j35J09
$$ 74 81 44 -96 -22 55 1 -124 -29 -78 199 140 1 -56 -35 -176 42 -309 43 -39 -137 115 -66 98 -37 72
7707G2J67Kk00K3j79L08M9j51Q4k25Q6J98jl96L54k42J07Q7k42K0L22p7k05j94
$$ 72 239 241 41 64 -115 193 242 91 175 -50 36 234 233 -163 191 -51 56 143 -99 -79 243 166 -39 -233
7731b33R4L05k16j39L24j53m3m7J57j13Q8n9J84ln3r7K52j31O1j49k1J21k19q4
$$ -233 -139 166 -50 -189 135 -18 -61 -108 49 -64 24 -35 149 146 93 -4 248 117 178 29 8 129 -90 -174
7755a74K75p3j9q0k1L97j15k19j0j64J5K06j6m4J30M8l25K20m24M83K89k96j77
$$ -174 101 28 9 -71 -92 305 190 -29 -39 -203 -188 18 2 -42 88 136 -189 31 -393 90 379 83 -94
7778i4J43L2k18J57K16j99j0K4j26n2q2K05k61J79J94j08j19N0J41Q6m79K82j85
$$ -94 49 81 -137 20 236 37 27 51 -75 -127 -209 -4 -265 -86 108 0 -119 -69 72 158 -321 -39 -224
7801b24K95o7l9R1j29P8J01k90K20J55k32J57k01K08j99J82j30J82l11L31j4k8
$$ -224 71 4 -35 56 -73 5 106 -184 36 191 -41 116 -85 123 -76 106 -24 158 -153 178 164 136
7823A36o5j83K18j16j51K68j34J18rk19J77M4j09N4N1l1j27J67J68l18j04J84
$$ 136 71 -112 106 -10 -161 107 -27 91 82 -137 40 84 -25 29 80 49 -78 89 257 -61 -165 19
7845A9j24K20j18P6o4j1j7j17R3k5J50l22K88j62M4mJ06P0J78j50k95K3J57L0
$$ 19 -105 115 -3 73 9 -2 -19 -136 -43 -68 82 -240 48 -114 -70 -74 32 102 280 130 -165 -142 15 45
7869D5P9M2k05k56L00p4K17m78L55k5j55K63l70L61j96K65k83J37J04k55K21j86
$$ 45 124 166 -39 -295 5 -69 148 -330 25 0 -155 108 -262 99 -97 168 -115 22 126 -129 92 -94
7891i4K51K3l62J16P1m9J83k11P6l2QO4q1J71j67Q8n1K11m6k5j77M30l14Pj21
$$ -94 157 180 -182 -66 5 -44 139 -72 4 -28 -20 44 -37 134 -33 55 4 215 169 144 -33 397 83 90 -31
7916c1J2K9Ml6K7o9J99k34L27k58j26j92K73M5J62l35L45R2j7k03m7j09L49j51
$$ -31 -19 10 14 -22 5 -64 135 -99 228 -30 -156 -348 -75 -30 132 -203 142 234 217 14 -33 -142 207 56
7940E6p3l0M2J66j62j3L2j60K22n6r0J02J23o1j44j52K06k8J40j39qK49k39L17
$$ 56 -17 -47 -5 161 -1 -14 18 -142 80 24 -66 36 159 98 -46 -198 8 -20 120 -19 -27 222 -17 300
7964C00k33j45J41J36j60j28L05k14Pn3K5q8J0Rk29K48R2J01p9k04J04K85j22
$$ 300 67 -78 63 199 39 -89 216 2 9 -44 -19 -107 -97 -88 -317 -69 23 124 45 -159 -55 230 108
7987A08k78n6M29o4j67J00j78J25q3J48j15p0J56k20m0K93J00j42l0j39J76Q8
$$ 108 -170 -226 203 139 -28 72 -106 19 -64 84 -31 -101 55 -165 -205 88 188 46 16 -123 53 141
8009A41J1m9J28l34K83j27p7mj3K88j50n9j09K23k01R2L9j76j4J47m2k6r0K48
$$ 141 152 103 231 -103 180 53 -24 -28 -41 247 97 38 -71 152 -49 43 82 -94 -108 39 -3 -29 -119 129
8033A29j79P4o3L71m48J84k51J89J69l1k26L0K26k98J79j02J77j30j1j47J4O3
$$ 129 -50 24 -39 332 -116 68 -183 6 175 144 -82 -52 174 -124 55 -47 130 0 -11 -158 -144 -81
8055h1J10n2PK3KOj5j76K85K4j62P2r5K08o5j1k95J95N4%J56p1j49K2J22l26J78
$$ -81 29 -23 -16 7 9 15 0 -176 109 133 -29 43 -52 156 91 80 -215 -20 34 34 190 119 -30 -8 114 -212 -34
8082c4N5q9J15Q2N5m0n2k55j50L71O0j36j36J18k51K14n1K79o5j4j14Jk8K9K4
$$ -34 21 -68 47 129 184 144 92 -163 -313 58 118 -18 -154 -36 -287 -73 -124 155 90 76 -38 -37 -65 -36 -12
8107a2Q4J40j51M5J52o27K56K41N2j58K5K61n76J65K53k92O0J1j4k16M51k66J5
$$ -12 72 212 61 106 258 -369 -113 128 180 22 47 308 -268 -103 150 -142 -82 -71 -85 -301 150 -116 -101
8130a01k9K63k23M7J72k85K16K0K9O4j35k80M2M04r5q6Q4l16O3J09K17l40O0o2
$$ -101 -130 133 -90 -43 129 -156 60 80 109 173 38 -242 -200 204 109 23 107 -209 -146 -37 180 -160 -100 -162
8154a62R9R1j89J34L08k01k37M15k73k06L32j67J88k04J47L2n2p9K93l76m8l4
$$ -162 -63 28 -161 -27 281 80 -157 258 -15 -221 111 -56 132 -72 75 107 55 -24 269 -107 -155 -189
8176a89K39p0j70K34M7J65m28J83J20l28J74K53l73L1L3
$$ -189 50 -20 -190 44 91 256 -172 11 131 -197 -23 230 -143 -112 -79
8191g9
$$ Imaginary data points
##PAGE= N=2
##DATA TABLE= (X++(I..I)), XYDATA
0@%%%%%%%%%%%%%qJ6j6J6j6K4l2L2m0M8n6O7p5Q8j04J20j37J58j81K06k32K60
$$ 0 0 0 0 0 0 0 0 0 0 0 0 0 0 -8 8 -8 8 -8 16 -16 16 -24 24 -32 35 -40 48 -56 64 -73 85 -96 110 -122 138
35A38k95L34l74M16m65N19n75O38p06P80q65R57j053J159j278J407j549J709j887
$$ 138 -157 177 -197 219 -246 273 -302 336 -370 410 -455 502 -551 608 -670 737 -812 897 -990
54i90K085k307K559k850L187l584M059m640N375o330P624r495J2453j7842L0753
$$ -990 1095 -1212 1347 -1503 1684 -1900 2159 -2481 2894 -3436 4188 -5307 7146 -10696 20057
69B0057j19834j06611K59111P5678j41614o3348J36291M2703q3855l0357O4650
$$ 20057 -99777 -206388 52723 128401 -13213 -76561 59730 102433 18578 -11779 52871
80E2871J153m9119j4558J0336k7839j4242K2508J2747k5485m899K7103J7601j5074
$$ 52871 54024 4905 -9653 683 -27156 -41398 -18890 -6143 -31628 -36527 -9424 8177 -6897
93f897q827J3167J3821q180j0113Q196J8205Q5j5033r551Q043K0923J8700j4666
$$ -6897 -15724 -2557 11264 3084 -7029 1167 19372 19457 4424 -5127 2916 23839 42539 27873
107B7873m3618j0735M4842K0354m6520l2200L3528J6080m5118j6673N0077J8258
$$ 27873 -15745 -26480 18362 38716 -7804 -40004 -6476 9604 -35514 -52187 -2110 16148
119A6148m5396q518M8629Q755l7176J4191N3539p055m6340J2476M3801j6982m5009
$$ 16148 -29248 -37766 10863 19618 -17558 -3367 50172 43117 -3223 9253 53054 36072 -8937
132h937P817K4202k8677l7083J7301K6561k4529l2932J8362L8893N862j2753M227
$$ -8937 -1120 23082 -5595 -42678 -25377 1184 -23345 -56277 -37915 978 6840 -5913 -1686
145a686J3875M97k447Q663N444p973p298r69q009q543J1299J4996j3025k3785
$$ -1686 12189 12686 10239 18902 24346 16373 9075 8106 97 -8446 2853 17849 4824 -18961
159a8961L347J5694l576q374P961j33j5530N097K2295n839k1505J5676K8046j7962
$$ -18961 -15614 80 -3496 -11870 -3909 -4042 -19572 -14475 7820 1981 -19524 -3848 24198 6236
173F236k6464K7349L3767k8140l6260K7028L9100k2225l8623J4852K8407k0825
$$ 6236 -20228 7121 40888 12748 -23512 3516 42616 20391 -18232 -3380 25027 4202
185D202l4873J0863K9467q259l0339k151K1070O436m446J0071J1339r853p763
$$ 4202 -30671 -19808 9659 1400 -28939 -31090 -10020 -3584 -8030 2041 13380 3527 -4236
198d236K0038J6024j6157j6295J1777Q853j8851j4541J0585P948j1752r224K966
$$ -4236 15802 31826 15669 -626 11151 20004 1153 -13388 -2803 5145 -6607 -15831 -12865
211a2865L513L817O117n742j0632J0173J8723q336j8206J2721K2641j4176k5155
$$ -12865 -9352 -5535 582 -5160 -15792 -5619 13104 4768 -13438 -717 21924 7748 -17407
224a7407J6806K9680j3777l0429Q669K3020r647j6228J2671J0159k2271j3647
$$ -17407 -601 29079 15302 -15127 -6458 16562 6915 -9313 3358 13517 -8754 -22401
236b2401K3082J3538k4930j5477K3304J4591k4390j3463K8876K2404k1458k1681
$$ -22401 681 14219 -10711 -26188 -2884 11707 -12683 -26146 2730 25134 3676 -18005
248a8005J8925K5406r593j9563N880J1893p895j2123K703N092n294n339j506l541
$$ -18005 920 26326 16733 -2830 3050 14943 7048 -5075 -2372 2720 -2574 -7913 -9419 -12960
262a2960J792J1353Q29j2973l17J7595M216j0816L346J3121p260j3932R712J2986
$$ -12960 -11168 185 1014 -11959 -12276 5319 9535 -1281 2065 15186 7926 -6006 3706 16692
276A6692j3789j3552J3997Q535k1967j0313K7996J4343k9444k0601K6627K3427
$$ 16692 2903 -10649 3348 11883 -10084 -20397 7599 21942 -7502 -28103 -1476 21951
288B1951k1411k3719J7285K1096j5387j9362J5186K0709r802j5805Q827J3330
$$ 21951 540 -23179 -5894 15202 -185 -19547 -4361 16348 6546 -9259 -432 12898
300A2898o332o408Q648N72j4040k416J2508l36j4503J76J0801l624j0837O456
$$ 12898 6566 158 8806 9378 -4662 -7078 5430 5094 -9409 -9233 1568 -2056 -12893 -6437
314f437J2037l107q386J855M124J831N034J783j0885l283J5020O138j7876q878
$$ -6437 5600 2493 -5893 -4038 86 1917 6951 8734 -2151 -5434 9586 15724 -2152 -11030
328a1030J8836P596k2929j3142K0882J3906j7946j5434J4674J3939q676p826J0139
$$ -11030 7806 15402 -7527 -20669 213 14119 -3827 -19261 -4587 9352 676 -7150 2989
341B989M291j1761j518J4556O66j6953P55J8468k510k1392L923K6496j537k9834
$$ 2989 7280 -4481 -5999 8557 9223 -7730 -6975 11493 8983 -12409 -8486 18010 16473 -13361
355a3361k201K6657J765k4604k534K0608J294j7564J99J3829R56n765K749o95
$$ -13361 -15562 11095 12860 -11744 -14278 6330 7624 -9940 -9741 4088 5044 -721 2028 1333
369A333p354N766J1866p525j6383O916J8560m761j6214M241J2084o156r299Q568
$$ 1333 -6021 -255 11611 4086 -12297 -5381 13179 8418 -7796 -3555 8529 2373 -6926 1642
383A642N781j2595n782J3552L312j6342j666K1903L918k3180m634K3261N641k1745
$$ 1642 7423 -5172 -10954 2598 5910 -10432 -12098 9805 13723 -9457 -14091 9170 14811 -6934
397f934l829K3053K210k6924m464K7157P021k3606p466J9027N851j5616l131J0831
$$ -6934 -10763 12290 14500 -12424 -16888 10269 17290 -6316 -13782 5245 11096 -4520 -7651 3180
411C180k239q525O985Q008j1213q794J3331J1737j0620j0361R043Q684p644o997
$$ 3180 941 -7584 -599 7409 -3804 -12598 733 12470 1850 -8511 532 9216 1572 -5425
425e425M325L555k276J111Q79m388q54O806P70p572O59R269l726j5538J346J7974
$$ -5425 -1100 2455 179 1290 2169 -2219 -3073 3733 4503 -3069 -2410 6859 3133 -12405 -11059 6915
441F915K537j8147m039J8535O662j6782o403J5772P862j1945m221Q990k807j1535
$$ 6915 9452 -8695 -12734 5801 12463 -4319 -10722 5050 12912 967 -3254 5736 2929 -8606
455h606O473J4207r330j7956R632J8308j0954j9527R537K0188n450j5695L946
$$ -8606 -2133 12074 2744 -15212 -5580 12728 1774 -17753 -8216 11972 6522 -9173 -5227
468e227J0839l820o088O494N597m319l009J557k436k793N443L202p567n024P845
$$ -5227 5612 1792 -4296 2198 7795 3476 467 2024 -412 -3205 2238 5440 -2127 -7151 694
483F94M625j0040n648J1519R089q623q133M680L536m221J682P662n292r200Q107
$$ 694 5319 -4721 -10369 1150 10239 1616 -6517 -1837 1699 -2522 -840 6822 1530 -7670 437
498D37J2219j1079j7093J3474K2985j0527k5622N334K2132n621k0438O668J8338
$$ 437 12656 1577 -15516 -2042 20943 10416 -15206 -9872 12260 6639 -13799 -7131 11207
511A1207p485j7951O405J5358o710j0498J0258J1272r541q644Q479O132q800k096
$$ 11207 3722 -14229 -7824 7534 824 -9674 584 11856 2315 -6329 2150 8282 -518 -2614
525b614J0394j10j4127k929J1085K689r155k444P355K396m201j961L01R58N665
$$ -2614 7780 7670 -6457 -9386 1699 4388 -4767 -7211 144 2540 -1661 -3622 -3321 -2363 3302
540C302O393n208j1237K909J2380k001j3384J873J4128k870j7021K142J6549j698
$$ 3302 9695 4487 -6750 -3841 8539 6538 -6846 -4973 9155 6285 -10736 -8594 7955 6257
554F257j4929M460J5414o408j7256O112J5732n925j2404Q110R741j1435r108J4268
$$ 6257 -8672 -4212 11202 4794 -12462 -6350 9382 3457 -8947 -837 8904 -2531 -11639 2629
568B629R711j4163q913J5472R875j5276j2449J1467J3355o950j1364K558N491
$$ 2629 12340 -1823 -10736 4736 14611 -665 -13114 -1647 11708 4758 -6606 -4048 1443
581A443k362k872K132L65j242L580K712n892l692P862O287o840n376P561L068
$$ 1443 -919 -3791 -1659 -1294 -2536 1044 3756 -2136 -5828 2034 8321 1481 -3895 3666 6734
596F734r855l930R506L876r014l069P213o36o379L523P207n589o142J0089P415
$$ 6734 -3121 -7051 2455 6331 -2683 -5752 1461 825 -5554 -2031 5176 -413 -6555 3534 10949
611A0949j2976j0167J4051J3080j3258j4471J0568J3343j0427j2166R358J1128
$$ 10949 -2027 -12194 1857 14937 1679 -12792 -2224 11119 692 -11474 -2116 9012
623I012p099q131P408M240r170j570J1021J680j2496j736J1400K41j1918P62J2853
$$ 9012 1913 -6218 1190 5430 -3740 -5310 5711 7391 -5105 -6841 4559 4800 -7118 -6356 6497
638F497j5j3016p47J2173J117r255p21P638R64m962j052O42r21K586L457o191
$$ 6497 6482 -6534 -7281 4892 6009 -3246 -3967 3671 4635 -327 -1379 -737 -1658 928 4385 -1806
654a806o319P697Q534p881j0315Q849J1345p573r976O707Q111p366n914P897L622
$$ -1806 -8125 -428 8106 225 -10090 -1241 10104 2531 -7445 -738 7373 7 -5907 1990 5612
669E612q910j913R434P9j1492J454J4035j410j5471O06J6893J71j7349p94J7709
$$ 5612 -3298 -5211 4223 4302 -7190 -5736 8299 6889 -8582 -7976 8917 9088 -8261 -9055 8654
684H654K072j7903m388J5594N705j1828n452O625K985k226J371P14n730J098Q724
$$ 8654 10726 -7177 -11565 4029 9734 -2094 -7546 -921 2064 -162 1209 1923 -3807 -2709 6015
699F015r19j0618J145J1639j489j2684M81J1784j067j0066J691P776l046n188
$$ 6015 5096 -5522 -4377 7262 5773 -6911 -6430 5354 4287 -5779 -4088 3688 642 -4546
713d546O094M401p536l597R706K416j2017j704J3738J850j7176k683J7269N517
$$ -4546 1548 5949 -1587 -5184 4522 6938 -5079 -6783 6955 8805 -8371 -11054 6215 11732
727A1732j6448n672J3398N175j0890l293R438J450q522j08P921j222o544K289
$$ 11732 -4716 -10388 3010 8185 -2705 -5998 3440 4890 -3632 -3740 4181 2959 -3585 -1296
741a296N833l880n903M804N064n521m667O268M076o014l067O361K910n602k010
$$ -1296 4537 657 -5246 -442 4622 -899 -5566 702 4778 -1236 -4303 2058 4968 -634 -2644
756b644L501k89j366M099K7q760j247J1378L200j2063m612J1145M538j0247k975
$$ -2644 857 568 -798 3301 3328 -5432 -6679 4699 7899 -4164 -8776 2369 6907 -3340 -6315
771f315R924K215r307j702Q798J097p756q9P054j473o930L087P329m133q060N011
$$ -6315 3609 5824 -3483 -5185 3613 4710 -3046 -3135 3919 2446 -4484 -1397 5932 1799 -6261 -1250
787a250Q423o289r097P090R816p201j1773N388J1497k311q277J493L645j931p2
$$ -1250 7173 884 -8213 -1123 8693 1492 -10281 -4893 6604 4293 -3984 -2491 1154 -777 -849
802h49N038j062o171K026O403k778o166L591N945n619p362N114O308n852n951
$$ -849 4189 3127 -3044 -1018 5385 2607 -3559 32 5977 358 -7004 -1890 4418 -1434 -7385
817g385O006N551o244l002O455K668o162P56O903k222p575M733R003p069j2185
$$ -7385 -1379 4172 -2072 -5074 1381 4049 -2113 -1357 5546 3324 -4251 482 9485 2416 -9769
832i769O465J3763n409j4224J975J1355k135q825L383Q544l914p523L927O686
$$ -9769 -3304 10459 5050 -9174 -7199 4156 2021 -6804 -3421 5123 1209 -6314 -2387 4299
846D299l171l396N247K715p436k706P916L633q398k984P269J740p728k277O653
$$ 4299 1128 -2268 2979 5694 -1742 -4448 3468 7101 -1297 -4281 2988 4728 -3000 -5277 1376
861A376J583o212j554M395J062j975J19o36j771L257O882j886q264Q64R488p42
$$ 1376 2959 -3253 -4807 -412 650 -1325 -1206 -1842 -3613 -356 6526 4640 -3624 -2760 6728 5986
877E986r134J241J0219j644j2788j695R821J239p119O12N297m995o394P464Q784
$$ 5986 -3148 -1907 8312 6668 -6120 -7815 2006 3245 -3874 -3262 2035 -2960 -9354 -1890 6894
892F894o044p461P877O879q027n405R820N962j0128o621R112N796r129o992N360
$$ 6894 850 -6611 1266 8145 118 -5287 4533 10495 367 -6254 2858 8654 -475 -7467 -2107
907b107M872l805k336K450K89k453P91K038r46j70N265J199p345m065P564P554
$$ -2107 2765 -1040 -3376 -926 -637 -3090 -2299 -261 -1207 -1377 3888 5087 -2258 -6323 1241 8795
923H795m148n998J526J902l920k59N301P35o708j823M670n19m262K933N569m873
$$ 8795 4647 -1351 175 2077 -1843 -2102 3199 3934 -2774 -4597 73 -446 -4708 -1775 3794 -1079
939a079o420N794Q792o022q445P177R320n906p829O434O833p463p594M878O757
$$ -1079 -7499 -1705 7087 1065 -7380 -203 9117 3211 -4618 1816 8649 1186 -6408 -1530 5227
954E227l372l544P55k284m305M565Q128k881p069R38N884k033l388N001O009l537
$$ 5227 1855 -1689 -934 -3218 -7523 -2958 5170 2289 -4780 -3842 2042 9 -3379 1622 7631 4094
970D094p550N32M793Q68j383j01j569k422J455L573k093m301K352N012l727n396
$$ 4094 -3456 -2924 1869 2737 1354 1253 -316 -2738 -1283 2290 197 -4104 -1752 3260 -467 -5863
986e863M710P469n416r346M865J0783j238q718l75M704j340j984N276K355o551
$$ -5863 -1153 6316 900 -8446 -3581 7202 5964 -2754 -3129 1575 235 -1749 3527 5882 -669
1001f69l534N545J434p043O21R784p37j2455k983J0823M790o595k666M938j3m569
$$ -669 -4203 1342 2776 -4267 -3646 6138 5401 -7054 -10037 786 5576 -1019 -3685 1253 1240 -3329
1017c329K186O037j696n231O43M018r54j793K061j050m834J052O861Q24q304k710
$$ -3329 -1143 4894 3198 -2033 -1390 2628 1674 -119 1942 892 -3942 -2890 3971 4795 -3509 -6219
1033f219O923K330n541m74N415L37n255j94L305j301r3N723P41r277l883R620
$$ -6219 704 3034 -2507 -2981 2434 2771 -2484 -2678 627 -674 -767 4956 5697 -3580 -7463 2157
1049B157O243p235n108N216K029o437r90Q154N23q404k520O970K845n333j373
$$ 2157 8400 1165 -3943 1273 3302 -3135 -4125 4029 4552 -3852 -6372 598 3443 -1890 -3263
1064c263L531r9j993K724L538m085l518M818M128n478m298N577M958n598o727
$$ -3263 268 169 -1824 900 4438 353 -3165 1653 5781 303 -3995 1582 6540 942 -5785
1079e785K955N068m28j860L12k554k724L749N660k410n502K312M107l371k268
$$ -5785 -2830 2238 1810 -50 262 -2292 -5016 -1267 4393 1983 -3519 -1207 2900 -471 -2739
1094b739N458L400o826m737O775N243o083m810M822L076n259j747M587R69n110
$$ -2739 2719 6119 -707 -5444 1331 6574 491 -4319 503 3579 -1680 -3427 1160 2129 -2981
1109b981J32M746j720m854L790O735m340q099L696Q876j017p150Q33M551j511
$$ -2981 -2849 1897 177 -4677 -887 5848 1508 -6591 -2895 5981 4964 -2186 -1353 3198 1687
1124A687l793K728K825k908l682J968J418k135O74K842j767m913K577O359j294
$$ 1687 -2106 622 3447 539 -3143 -1175 243 -1892 -1218 1624 -143 -5056 -2479 3880 2586
1139B586n887J495N813k142n082L047M562k511m833K326K529k751J24L256j246
$$ 2586 -3301 -1806 4007 1865 -3217 -170 4392 1881 -2952 -626 1903 -848 -724 2532 1286
1154A286o016J866O810j171p208Q47O842j026p034K012O900n21p145j26N753J457
$$ 1286 -4730 -2864 3946 2775 -4433 -3586 3256 2230 -4804 -2792 4108 3587 -3558 -3684 2069 3526
1170C526l585j30J881j970k164L431K609m214k904M006J667n186j031O284J493
$$ 3526 -59 -189 1692 -278 -2442 989 3598 -616 -3520 486 2153 -3033 -4064 2220 3713
1185C713o943j984O454K893m310j260K739l10k325J938K207k532j701K982J49
$$ 3713 -3230 -5214 1240 4133 -177 -1437 1302 992 -1333 605 2812 280 -1421 1561 1710
1200A710m866M07O476L94p834j618P124K880n781k214M141J263l953m75M071P6
$$ 1710 -3156 -2749 3727 4121 -3713 -5331 1793 4673 -1108 -3322 819 2082 -1871 -2346 1725 1801
1216A801l181O93K119k132q13M207J754n164l873N477M251m627m386L490L449
$$ 1801 -1380 -687 1432 -700 -1513 2694 4448 -716 -4589 888 5139 512 -3874 -384 3065
1231C065l899l319M095K797l557k702L129J557j906J035K310k672l082L972M417
$$ 3065 -834 -4153 -58 2739 -818 -3520 -391 1166 -740 295 2605 -67 -3149 823 5240
1246E240m402m643M482L881n502m053N591M089n129m022L324K682k205k05K265
$$ 5240 838 -3805 677 4558 -944 -4997 594 4683 -446 -4468 -1144 1538 -667 -872 1393
1261A393j424l108L221L980l440m401L337M867l304m617L450M840l917n292L443
$$ 1393 -31 -3139 82 4062 622 -3779 -442 4425 1121 -3496 -46 4794 877 -4415 -972
1276i72N142k782m287J738K701k910j424L159J232l426J6L319j417l784K982O089
$$ -972 4170 1388 -2899 -1161 1540 -1370 -2794 365 1597 -1829 -1813 1506 89 -3695 -713 5376
1292E376k622o889K283O127j202n254J062L797j282l041Q72J037k316p0L409q84
$$ 5376 2754 -4135 -1852 4275 3073 -2181 -1119 2678 1396 -1645 -773 264 -2052 -2122 1287 403
1308D03m084J772M676j432m911K056O378j333o074Q81N094j051m986J605M711
$$ 403 -3681 -1909 2767 1335 -3576 -1520 4858 3525 -2549 -1668 3426 2375 -2611 -1006 3705
1323C705j891m799Q71K578j117q35L000n34m410L84O051L07o709m8P317J026p193
$$ 3705 1814 -2985 -2114 464 -653 -1488 1512 978 -3432 -3048 3003 3310 -3399 -3447 3870 4896 -2297
1340b297k172O265K058m529m48L135q38k664J575J395l046j165M657J292n799
$$ -2297 -4469 1796 3854 -675 -1123 2012 1174 -1490 85 1480 -1566 -2731 1926 3218 -2581
1355b581j530M892J125m427P07N038m98n798q8N285J260l470l51K090o67j983
$$ -2581 -4111 781 1906 -2521 -1814 3224 2726 -3072 -3160 2125 3385 -85 -436 1654 987 -996
1371i96R95J009k378l39M093N20o445j597O420L598n483l810N028L146m149k668
$$ -996 -1 1008 -1370 -1709 2384 2904 -3541 -5138 1282 4880 -603 -4413 615 3761 -388 -3056
1387c056L062K197k230N5J854j485l151K514L041j876k689K562J755l881k201
$$ -3056 6 2203 -27 28 1882 397 -2754 -240 2801 925 -1764 798 2553 -1328 -3529
1402c529M389K822m152l014L580K805l644k545K855K551j372q82N88j725r15L265
$$ -3529 860 3682 -470 -3484 96 2901 -743 -3288 -433 2118 746 -136 452 -1273 -2188 1077
1418A077K295l804l230M291L796l935n224L860M647j668m230R78K342j830j330
$$ 1077 3372 -432 -3662 629 4425 490 -4734 -874 3773 2105 -2125 -1147 1195 -635 -1965
1433a965K497R92k532q95K234j29k565J848L172j741l077K320L187k731l939L465
$$ -1965 532 1524 -1008 -1903 331 202 -2363 -515 2657 916 -2161 159 3346 615 -3324 141
1449A41M765l107m990J042L648k31k660M93Q39q79N4K266k083l236K478N242j038
$$ 141 4906 1799 -3191 -2149 1499 1268 -1392 -899 -60 -939 -885 1381 -702 -3938 -1460 3782 2744
1466B744n481M62N108j07m188L49M328j020l905K58L053j307j515J563J125k736
$$ 2744 -2737 -2275 2833 2726 -1462 -1113 3215 2195 -1710 -1452 1601 294 -1221 342 1467 -1269
1482a269j136K059K00k361J025L918j668m353J207N867r9n066J71M457L75k846
$$ -1269 -2405 -346 -146 -2507 -1482 2436 768 -3585 -2378 3489 3390 -1676 -1505 2952 3327 481
1498D81r13J187n24m79J160l73k960n06L358J29m019M53M584N59m378j118M898
$$ 481 -432 755 231 -248 912 539 -2421 -2927 431 560 -3459 -3006 1578 2137 -2241 -3359 1539
1515A539J794l342n70K773J36l139N6K669o49j728Q51M28k889j57L607N10m858
$$ 1539 3333 -9 -579 2194 2330 -809 -753 1916 1267 -461 390 818 -2071 -2228 1379 1889 -2969
1532b969j269N685J663n248j892M662K261l283j675L150Q81j708J53J716j403
$$ -2969 -4238 1447 3110 -2138 -4030 632 2893 -390 -2065 1085 1966 258 411 2127 724
1547G24j114L003P87m305k594L519K312k938l263K770K286l313j927L398K784
$$ 724 -390 2613 3400 -905 -3499 20 2332 -606 -3869 -1099 1187 -2126 -4053 -655 2129
1562B129k378j638K471J521j493M29J675j057k041J897J629l287k732K841K841
$$ 2129 -249 -1887 584 2105 612 1041 2716 1659 -382 1515 3144 -143 -2875 -34 2807
1577B807m161l438L370L694k930l676L004K905j264j379J799J61j451Q25K142
$$ 2807 -1354 -4792 -1422 2272 -658 -4334 -1330 1575 311 -1068 731 892 -559 266 2408
1592B408j354k525K159K742k494l475K618L578k110m224J310L499j103l997P31
$$ 2408 1054 -1471 688 3430 936 -2539 79 3657 1547 -2677 -1367 2132 1029 -2968 -2237
1607b237K148n68j616P55Q82q61R80K187q36k473K537M130k021m696J958M707
$$ -2237 -89 -657 -2273 -1518 -636 -1497 -517 1670 834 -1639 898 5028 3007 -1689 269 4976
1623D976k421m853L88L966j684l995N25K678r56j257J907M40k113J346L850m20
$$ 4976 2555 -2298 -1910 2056 372 -3623 -3098 -420 -1376 -2633 -726 -286 -2399 -1053 2797 2377
1639B377l656Q50M177p74l888J89L990o39m124l18L049P3k250r09J426L04j228
$$ 2377 -1279 -429 3748 2974 -914 -725 3265 2626 -1498 -1816 1233 1306 -944 -1853 -427 -123 -1351
1656a351L36L14r99p5K337k43k662L11M455R26m209r05M599J744l552r92K525
$$ -1351 -1015 -701 -1700 -1775 562 319 -2343 -2032 2423 3349 -860 -1765 2834 4578 1026 34 2559
1673B559J4k607m97J087j557j832J575P4k834l7L917P93l677J04M985K094l681
$$ 2559 2573 -34 -531 556 -1001 -2833 -1258 -1184 -4018 -4055 -138 655 -3022 -2918 2067 4161 480
1690D80j044L829J699l554j701J848L85j680p40N21j491j730J657J605k393j480
$$ 480 -564 3265 4964 1410 -291 1557 1942 262 -478 43 -1448 -3178 -1521 84 -2309 -3789
1706c789K820K378k735j462L646K358l048j711L295J737k428j727J881R48j335
$$ -3789 -969 1409 -1326 -2788 858 3216 168 -1543 1752 3489 1061 -666 1215 2163 828
1721H28L00J81k299j101K431J470l706k803K960K704k621k637K501K882j033j240
$$ 828 1128 1309 -990 -2091 340 1810 -1896 -4699 -1739 965 -1656 -4293 -1792 1090 57 -1183
1737a183J836J475j383%K517L08j981m14J218j565k220P85J105k457k481J811
$$ -1183 653 2128 745 745 3262 3570 1589 1175 2393 828 -1392 -607 498 -1959 -4440 -2629
1753b629K898j883l290K045N005l4l018L68J963Q35o58J070l93j829R5K338j592
$$ -2629 269 -1614 -4904 -2859 2146 2112 -906 -538 1425 2260 1602 2672 2279 450 545 2883 1291
1770A291l837M96M113p53l974k15K501p18j748K121K003j588k210J694J661m21
$$ 1291 -2546 -2050 2063 1310 -2664 -2879 -378 -1096 -2844 -723 1280 -308 -2518 -824 837 416
1786D16k17J141l87j155J804K101k718k474K027L138j182m766m67L388nl053p43
$$ 416 199 1340 953 -202 1602 3703 985 -1489 538 3676 2494 -2272 -2739 649 644 -2409 -3152
1803c152J915M73o37P8K63n9Q25K664P18k450q82K595M13k109m99K685o84m404
$$ -3152 -1237 -764 -1401 -1323 -1060 -1119 -294 2370 3088 638 -244 2351 2764 655 156 2841 2157 -2247
1821b247j148L774J035l106j447K202R58j346Q8R00l16P19J949l71l222O40L599
$$ -2247 -3395 379 1414 -1692 -3139 -937 21 -1325 -1237 -337 -653 66 2015 1644 -1578 -938 2661
1838B661J41m012m93L905J509l987j953K152J250r23k90M17j114j348P42Q59o50
$$ 2661 2802 -1210 -1703 2202 3711 -276 -2229 -77 1173 250 -40 377 -737 -2085 -1343 -484 -1134
1855a134j97J733J72k483o39L358K460k186j951K291J411k262j278J963J397k311
$$ -1134 -1331 402 574 -1909 -2548 810 3270 1084 -867 1424 2835 573 -705 1258 2655 344
1871C44j958O82L61m87l3J04j413k59L359J275l161k148L141K973j636j571J629
$$ 344 -1614 -932 -571 -1058 -1091 -987 -2400 -2659 700 1975 -1186 -3334 -193 2780 1144 -427 1202
1888A202J392k071j487J389J350p27m67l51j413j124J764K241k060k050J212J706
$$ 1202 2594 523 -964 425 1775 1048 581 230 -1183 -2307 -543 1698 -362 -2412 -1200 506
1904E06j548j732K917K609k813k913K210L451q63k112o5J894m02l76L85q62j404
$$ 506 -1042 -2774 143 2752 -61 -2974 -764 2687 1824 -288 -353 1541 1139 763 1148 286 -1118
1921a118Q09J531j260k265J390K027j978l219J772L829n3k663m22J964K50K5J168
$$ -1118 -309 1222 -38 -2303 -913 1114 -864 -4083 -2311 1518 1465 -1198 -1620 344 594 619 1787
1938A787Q05j630r05J090n79j086J015J558k344k603J122K849o20l063N38K487
$$ 1787 2592 962 57 1147 568 -518 497 2055 -289 -2892 -1770 1079 459 -2604 -2066 421
1954D21p1j442K73J883L2q74r1N87O1M03R01j771k382J103L593l56l993q23K672
$$ 421 350 -1092 -819 1064 1096 222 131 718 779 1182 2083 312 -2070 -967 2626 2270 -1723 -2546 126
1973A26R13k320k00K347k15k059k21J528O40n66M26J82j695L92K463L75k457n9
$$ 126 1039 -1281 -1481 866 651 -1408 -1629 -101 539 -27 399 581 -1114 -722 1741 2116 -341 -400
1991d00K003P8k855n9K808M08l539j154K239J355j393p57O0o0P55J598K46k254
$$ -400 1603 1681 -1174 -1233 1575 1983 -1556 -2710 -471 884 -509 -1266 -1206 -1266 -511 1087 1333 -921
2009i21m85K835J208k878o53K664J592l870j513K251J417j940j414J122N07j254
$$ -921 -1406 1429 2637 -241 -894 1770 3362 -508 -2021 230 1647 -293 -1707 -585 -78 -1332
2025a332L42J362l95q01J206K78j547p5K857O69l424j314K496K246k087k132J020
$$ -1332 -990 372 -23 -824 382 660 -887 -962 1895 2564 -860 -2174 322 2568 481 -1651 -631
2042f31J998q42j356R16N23o74k32K11m97l59J367L09k044j270K103K223j756
$$ -631 1367 525 -831 85 608 -66 -298 -87 -584 -943 424 733 -1311 -2581 -478 1745 -11
2059a1j671J314K146j135j548J419J923q38k486M72Q00j17m38M21j643j323J765
$$ -11 -1682 -368 1778 643 -905 514 2437 1599 -887 -415 385 268 -170 251 -1392 -2715 -950
2076i50K130j354k172J212K607p72k119J560K152r47k328N04J802m74q38j79J50
$$ -950 1180 -174 -2346 -1134 1473 701 -1418 142 2294 1347 -981 -477 1325 851 13 -166 -16
2093a6r94Q51Q52q87j265J088J667j148j893J192K755q44l362k51L063P45j811
$$ -16 -1010 -159 693 -194 -1459 -371 1296 148 -1745 -553 2202 1358 -2004 -2255 808 1553 -258
2110b58o41P48M17Q8N37O4q18R1P98k52j682O81J473j028k718K12L253n7k502
$$ -258 -899 -151 266 354 891 955 137 228 1026 774 -908 -227 1246 218 -2500 -2288 965 908 -1594
2129a594m32K140P24o59k01J161L13n00j10o83n91R84J478j378l033j52K814R35
$$ -1594 -2026 114 838 179 -22 1139 1452 952 842 159 -432 552 2030 652 -2381 -2533 281 1216
2147A216k388j181K055J171j304o84J624O99m83q25N91j63r3M08j49j694J65K198
$$ 1216 -1172 -2353 -298 873 -431 -1115 509 1208 725 -100 491 328 235 643 494 -1200 -1035 1163
2165A163K57k569o47K531P71k166q48K166P60j570j714J135J292R5m24o76p50
$$ 1163 1420 -1149 -1796 735 1506 -660 -1508 658 1418 -152 -1866 -731 561 656 232 -444 -1194
2182a194M30J717M09j853k67K286N88k204j294J724J358j805j689R50Q43m12p96
$$ -1194 -764 953 1362 -491 -758 1528 2116 -88 -1382 342 1700 -105 -1794 -844 -1 -413 -1209
2199a209K91N45J66N48N82p95k07J006R56j508r51J491J012k318j986J443K327
$$ -1209 -918 -373 -207 341 923 128 -79 927 1883 375 -576 915 1927 -391 -2377 -934 1393
2216A393j181j991L46J277L03o25M38L4J95O79L78j619q93J938J314j569k398
$$ 1393 212 -1779 -1433 -156 147 -478 -40 -6 189 868 1246 -373 -1266 672 1986 417 -1981
2233a981J266J812j005j544M64K230n03j201J63N45J67k07j64N7k33N46J97j545
$$ -1981 -715 1097 92 -1452 -988 1242 739 -462 -299 246 413 206 42 99 -134 412 609 -936
2251i36q25K076J931j480k371J143K411o04k109k95K448L17k053q74N24N17K79
$$ -936 -1761 315 2246 766 -1605 -462 1949 1345 -764 -1059 1389 1706 -347 -1221 -697 -180 99
2268I9P7m30j157J048J193l66j797J111K075m93k089rJ796j75j566l23J444J41
$$ 99 176 -254 -1411 -363 830 464 -1333 -222 1853 1360 -729 -738 1058 883 -683 -1006 438 579
2286E79j219o49O70K00Q29M95q07j021Q44J743r50j842M56K536m90k674o41K338
$$ 579 -640 -1289 -619 -419 410 905 98 -923 -79 1664 714 -1128 -672 1864 1374 -1300 -1941 397
2304C97O43j504n50Q33Q40j07n50J78m06K46J610m45j922j51J456K14j727k65
$$ 397 1040 -464 -1014 -181 659 552 2 180 -226 20 1630 1185 -737 -888 568 782 -945 -1210
2322a210J830M72k221q31J976J266q04q26P97K85k87j95j99n26M61J215p25k289
$$ -1210 620 1092 -1129 -1960 16 1282 478 -348 449 734 447 252 53 -473 -12 1203 478 -1811
2340a811L23K294P94k245j100J796J508j128j411O75J210l82k97k05l05m10N74
$$ -1811 -1488 806 1600 -645 -1745 51 1559 431 -980 -305 905 523 226 21 -284 -694 -120
2357a20M61j016k13J260O53j660j113J987J615j371j481J140Q64r39j344R25J014
$$ -120 341 -675 -888 372 1025 -635 -1748 239 1854 483 -998 142 1006 67 -1277 -352 662
2374F62m40n22n90J65K41J363o1j169n98J525J475j803j455J058J592n39k078
$$ 662 222 -300 -890 -725 -484 879 818 -351 -949 576 2051 248 -1207 -149 1443 904 -1174
2391a174L51J095p4r24J72L09N06O8J73p99j15R76Q15r97j355J058J131j391j410
$$ -1174 -823 272 198 -726 -554 -245 261 329 502 -297 -412 564 1379 382 -973 85 1216 -175 -1585
2410a585R23J884q02j826J68J473Q18p85n71M9P3P90O99j229j249R98J710j223
$$ -1585 -662 1222 420 -1406 -1238 235 1053 268 -303 -254 -181 609 1308 79 -1170 -172 1538 315
$$ [...]
8191D5
##END NTUPLES=NMR FID
##END=
