##TITLE=1H_SL66d
 CDCl3
 8 sc, 
 20.1.2022
##JCAMPDX= 6.0         $$ Bruker NMR JCAMP-DX V2.0
##DATA TYPE= NMR FID
##DATA CLASS= NTUPLES
##ORIGIN= UXNMR, Bruker Analytische Messtechnik GmbH
##OWNER= root
$$ XWIN-NMR		Version 3.5
$$ Thu Jan 20 12:22:09 2022 Russian Standard Time (UT+4h)  she@DPX200
##.OBSERVE FREQUENCY= 200.131346
##.OBSERVE NUCLEUS= ^1H
##.DELAY= (6, 6)
##.ACQUISITION MODE= SIMULTANEOUS
##.ACQUISITION SCHEME= undefined
##.AVERAGES= 8
##.DIGITISER RES= 18
##SPECTROMETER/DATA SYSTEM= spect
##.PULSE SEQUENCE= zg30
##.SOLVENT NAME= CDCl3
##.SHIFT REFERENCE= (INTERNAL, CDCl3, 0, 15.7039)
##AUDIT TRAIL= $$ (NUMBER, WHEN, WHO, WHERE, WHAT)
$$ ##TITLE= Audit trail, XWIN-NMR		Version 3.5
$$ ##JCAMPDX= 5.01
$$ ##ORIGIN= Bruker BioSpin GmbH
$$ ##OWNER= she
$$ F:/spectra/data/she/nmr/H-F/1/audita.txt
$$ ##AUDIT TRAIL=  $$ (NUMBER, WHEN, WHO, WHERE, WHAT)
(   1,<2022-01-20 12:20:17.43 +0400>,<she>,<DPX200>,
      <created by zg, POWCHK disabled, PULCHK disabled
       configuration hash MD5:
       00 E9 B6 7A A2 85 ED C7 34 08 36 98 17 FE 4E 26
       data hash MD5: 16K
       94 8C FB DA 0B 4B 3D CE EC 23 13 F0 F2 E3 B0 D8>)
$$ ##END=
$$ 
$$ hash MD5
$$ A2 D0 B6 25 E2 40 0E C1 44 9E 06 D5 3E 81 B7 80
##$RELAX= 
##$RELAX= 
##$RELAX= 
##$RELAX= 
##$RELAX= 
##$RELAX= 
$$ Bruker specific parameters
$$ --------------------------
##$DU= <F:/spectra>
##$EXPNO= 1
##$NAME= <H-F>
##$PROCNO= 1
##$TYPE= <nmr>
##$USER= <she>
##$AMP= (0..31)
100 100 100 100 100 100 100 100 100 100 100 100 100 100 100 100 100 100 
100 100 100 100 100 100 100 100 100 100 100 100 100 100 
##$AQSEQ= 0
##$AQ_mod= 1
##$AUNM= <au_zg>
##$AUTOPOS= <>
##$BF1= 200.13
##$BF2= 200.13
##$BF3= 200.13
##$BF4= 200.13
##$BF5= 200.13
##$BF6= 200.13
##$BF7= 200.13
##$BF8= 200.13
##$BYTORDA= 1
##$CFDGTYP= 0
##$CFRGTYP= 5
##$CHEMSTR= <none>
##$CNST= (0..31)
1 1 145 1 1 1 1 1 1 1 1 1 1 1 1 1 1 1 1 1 1 1 1 1 1 1 1 1 1 1 1 1 
##$CPDPRG= <>
##$CPDPRG1= <>
##$CPDPRG2= <>
##$CPDPRG3= <>
##$CPDPRG4= <mlev>
##$CPDPRG5= <mlev>
##$CPDPRG6= <mlev>
##$CPDPRG7= <mlev>
##$CPDPRG8= <mlev>
##$CPDPRGB= <>
##$CPDPRGT= <>
##$D= (0..31)
0 1.2 0 0 0 0 0 0 0 0.06 0 0.03 0 0 0 0 0.0002 0 0 0 0 0 0 0 0 0 0 0 0 
0 0 0 
##$DATE= 1642666816
##$DBL= (0..7)
120 120 120 120 120 120 120 120 
##$DBP= (0..7)
150 150 150 150 150 150 150 150 
##$DBP07= 0
##$DBPNAM0= <>
##$DBPNAM1= <>
##$DBPNAM2= <>
##$DBPNAM3= <>
##$DBPNAM4= <>
##$DBPNAM5= <>
##$DBPNAM6= <>
##$DBPNAM7= <>
##$DBPOAL= (0..7)
0.5 0.5 0.5 0.5 0.5 0.5 0.5 0.5 
##$DBPOFFS= (0..7)
0 0 0 0 0 0 0 0 
##$DE= 6
##$DECBNUC= <off>
##$DECIM= 32
##$DECNUC= <off>
##$DECSTAT= 4
##$DIGMOD= 1
##$DIGTYP= 9
##$DL= (0..7)
0 120 120 120 120 120 120 120 
##$DP= (0..7)
150 150 150 150 150 150 150 150 
##$DP07= 0
##$DPNAME0= <>
##$DPNAME1= <>
##$DPNAME2= <>
##$DPNAME3= <>
##$DPNAME4= <>
##$DPNAME5= <>
##$DPNAME6= <>
##$DPNAME7= <>
##$DPOAL= (0..7)
0.5 0.5 0.5 0.5 0.5 0.5 0.5 0.5 
##$DPOFFS= (0..7)
0 0 0 0 0 0 0 0 
##$DQDMODE= 0
##$DR= 18
##$DS= 0
##$DSLIST= <SSSSSSSSSSSSSSS>
$$ [...]
##$SUBNAM2= <"">
##$SUBNAM3= <"">
##$SUBNAM4= <"">
##$SUBNAM5= <"">
##$SUBNAM6= <"">
##$SUBNAM7= <"">
##$SUBNAM8= <"">
##$SUBNAM9= <"">
##$SW= 18.0517287032376
##$SWIBOX= (0..15)
0 0 2 0 0 0 0 0 0 0 0 0 0 0 0 0 
##$SW_h= 3612.71676300578
##$TD= 16384
##$TD0= 1
##$TE= 0
##$TE2= 300
##$TE3= 300
##$TEG= 300
##$TL= (0..7)
0 120 120 120 120 120 120 120 
##$TP= (0..7)
150 150 150 150 150 150 150 150 
##$TP07= 0
##$TPNAME0= <>
##$TPNAME1= <>
##$TPNAME2= <>
##$TPNAME3= <>
##$TPNAME4= <>
##$TPNAME5= <>
##$TPNAME6= <>
##$TPNAME7= <>
##$TPOAL= (0..7)
0.5 0.5 0.5 0.5 0.5 0.5 0.5 0.5 
##$TPOFFS= (0..7)
0 0 0 0 0 0 0 0 
##$TUNHIN= 0
##$TUNHOUT= 0
##$TUNXOUT= 0
##$USERA1= <user>
##$USERA2= <user>
##$USERA3= <user>
##$USERA4= <user>
##$USERA5= <user>
##$V9= 5
##$VALIST= <valist>
##$VCLIST= <CCCCCCCCCCCCCCC>
##$VD= 0
##$VDLIST= <DDDDDDDDDDDDDDD>
##$VPLIST= <PPPPPPPPPPPPPPP>
##$VTLIST= <TTTTTTTTTTTTTTT>
##$WBST= 1024
##$WBSW= 4
##$XGAIN= (0..3)
0 0 0 0 
##$XL= 0
##$YL= 0
##$YMAX_a= 267439
##$YMIN_a= -436696
##$ZGOPTNS= <>
##$ZL1= 120
##$ZL2= 120
##$ZL3= 120
##$ZL4= 120
##$ABSF1= 10
##$ABSF2= 0
##$ABSG= 5
##$ABSL= 3
##$ALPHA= 0
##$AQORDER= 0
##$ASSFAC= 0
##$ASSFACI= 0
##$ASSFACX= 0
##$ASSWID= 0
##$AUNMP= <proc_1d>
##$AZFE= 0.1
##$AZFW= 0.1
##$BCFW= 1
##$BC_mod= 2
##$BYTORDP= 1
##$COROFFS= 0
##$CY= 11.3945322036743
##$DATMOD= 1
##$DC= 2
##$DFILT= <>
##$DTYPP= 0
##$F1P= 2.36226072786647
##$F2P= -0.459571619588291
##$FCOR= 0.5
##$FTSIZE= 0
##$FT_mod= 4
##$GAMMA= 1
##$GB= 0.15
##$INTBC= 1
##$INTSCL= 1
##$ISEN= 128
##$LB= 0.24
##$LEV0= 0
##$LPBIN= 0
##$MAXI= 10000
##$MC2= 0
##$MEAN= 0
##$ME_mod= 0
##$MI= 1.114404
##$NCOEF= 0
##$NC_proc= 0
##$NLEV= 6
##$NOISF1= 3.799351
##$NOISF2= 2.8
##$NSP= 1
##$NTH_PI= 0
##$NZP= 0
##$OFFSET= 15.70392
##$PC= 1
##$PHC0= -15874.34
##$PHC1= 19.00078
##$PH_mod= 1
##$PKNL= yes
##$PPARMOD= 0
##$PSCAL= 0
##$PSIGN= 0
##$REVERSE= no
##$SF= 200.130013532006
##$SI= 16384
##$SIGF1= 3
##$SIGF2= 2
##$SINO= 400
##$SIOLD= 16384
##$SREGLST= <1H.CDCl3>
##$SSB= 0
##$STSI= 0
##$STSR= 0
##$SW_p= 3612.71676300578
##$SYMM= 0
##$S_DEV= 0
##$TDeff= 0
##$TDoff= 0
##$TI= <>
##$TILT= no
##$TM1= 0
##$TM2= 0
##$TOPLEV= 0
##$USERP1= <user>
##$USERP2= <user>
##$USERP3= <user>
##$USERP4= <user>
##$USERP5= <user>
##$WDW= 1
##$XDIM= 8192
##$YMAX_p= 0
##$YMIN_p= 0
$$ End of Bruker specific parameters
$$ ---------------------------------
##NTUPLES= NMR FID
##VAR_NAME=  TIME,          FID/REAL,        FID/IMAG
##SYMBOL=    X,             R,               I
##VAR_TYPE=  INDEPENDENT,   DEPENDENT,       DEPENDENT
##VAR_FORM=  AFFN,          ASDF,            ASDF
##VAR_DIM=   8192,          8192,            8192
##UNITS=     SECONDS,       ARBITRARY UNITS, ARBITRARY UNITS
##FACTOR=    0.0002768,     1,               1
##FIRST=     0,             0,               0
##LAST=      2.2672688,     0,               0
##MIN=       0,             -436696,         0
##MAX=       2.2672688,     267439,          0
$$ Real data points
##PAGE= N=1
##DATA TABLE= (X++(R..R)), XYDATA
0@%%%%%%%%%%qJ6j6K4l2L2m0N6p2Q8j04J20j44J68j92K28k68L12l60M14m76N42
$$ 0 0 0 0 0 0 0 0 0 0 0 -8 8 -8 16 -16 16 -24 32 -40 48 -56 64 -80 88 -104 124 -144 168 -192 222 -254 288
32B88o16O99p91Q95j006J127j262J411j571J747j942K151k381K633k907L208l537
$$ 288 -328 371 -420 475 -531 596 -666 745 -826 921 -1021 1130 -1251 1382 -1525 1683 -1854
49a854L896m291M729n212N746o344P015p774Q641r641J0810j2198J3879j5961
$$ -1854 2042 -2249 2480 -2732 3014 -3330 3685 -4089 4552 -5089 5721 -6477 7402 -8559
63h559J8621k2156K7109l4597M7367p4812K36914k58809l12372N70263n336l47442
$$ -8559 10062 -12094 15015 -19582 27785 -47027 189887 -68922 -381294 188969 183633 -163809
75a63809R5061K24484j88338l5534J14923n7305n9589J28817k0387r2205L9486
$$ -163809 -68748 155736 -32602 -68136 46787 -10518 -70107 58710 38323 -53882 -14396
86a4396L5936o9049M2864N3485p3930k5662R7643m0226r9832Q3524J01755r3596
$$ -14396 21540 -47509 -4645 48840 -25090 -50752 46891 6665 -93167 -9643 92112 -1484
98a484n4359P5658J0052l9280K5767j2298k1505M8810j3420p0112N6161M7378
$$ -1484 -55843 19815 29867 -9413 16354 4056 -17449 31361 17941 -52171 3990 51368
110E1368q2250N133Q4999o3218o6924Q5368L1133o7650J4807L0664m4865O847
$$ 51368 -30882 -25749 59250 -3968 -70892 14476 45609 -22041 -7234 23430 -21435 -14588
122a4588N1020l0492l8507L8300K1507l3141j1654J9509Q635k649o223n528M774
$$ -14588 36432 5940 -32567 5733 27240 -5901 -17555 1954 10589 7940 1717 -3811 963
135I63P680q619p911J5015R856k1238j6978J0752J5506K121j4160j6460J2331
$$ 963 8643 24 -7887 7128 16984 -4254 -21232 -10480 5026 7147 -7013 -23473 -11142
148a1142K2690j2430j4698J5594J221p412K3532j158m0409R539M0178j4810k3127
$$ -11142 11548 -882 -15580 14 1235 -6177 17355 16197 -24212 -14673 25505 10695 -12432
161a2432J3585j850o328K1361k061k0502J5758Q324k5478P376K2365k2192j1746
$$ -12432 1153 -697 -7025 14336 12275 -8227 7531 15855 -9623 -2247 20118 -2074 -13820
174a3820K7564m593k6790J4920J2391k3921M863K5960j6774j9698K0398Q213r204
$$ -13820 13744 9151 -17639 -2719 9672 -14249 -9386 16574 -200 -19898 500 8713 -491
187d91J0385p750k5789K1262K6642l0620j5736L1472q95j7261J6896n915k7003
$$ -491 9894 2144 -23645 -2383 24259 -6361 -22097 9375 8480 -8781 8115 2200 -24803
200b4803K6981K4844l8265j1917L9351k698k7196J4537R987k0182L018J2140j4717
$$ -24803 2178 27022 -11243 -23160 16191 13493 -13703 834 10821 -9361 -6343 5797 -8920
213h920J020K1622j1273j9935K1465J6879k1888p999J4008j589J062J1683j6636
$$ -8920 -7900 13722 2449 -17486 3979 20858 -1030 -9029 4979 3390 4452 16135 -501
226e01j5364K5604Q816k8931j576J7485p393N99J2130j6177n583K3822o280k0580
$$ -501 -15865 9739 18555 -10376 -11952 5533 -1860 -1261 10869 -5308 -10891 12931 6651 -13929
240a3929J5079N334k2939N960J8606j2240o268J0281n134j489J5494n834j5527
$$ -13929 1150 6484 -16455 -10495 8111 -4129 -10397 -116 -5250 -6739 8755 2921 -12606
253a2606J3954J3617j3889o384J0319j817n811P675j58j1546N874R810j1333j053
$$ -12606 1348 14965 1076 -5308 5011 3194 -2617 5058 4900 -6646 -772 9038 -2295 -3348
267c348J7589j0309k0090J9535J4705k3086o950J4931l685m12R248j7147q536
$$ -3348 14241 3932 -16158 3377 18082 -5004 -11954 2977 -708 -1120 8128 -9019 -17555
280a7555K7570L564k5500N132J5543r604j111Q430r350j203J5678o467j5937J1496
$$ -17555 10015 13579 -11921 -6789 8754 -850 -1961 6469 -2881 -4084 11594 5127 -10810 686
294F86J2202j5053j1365J3446Q606j1300o838N914L437M023K093j3752n660J9786
$$ 686 12888 -2165 -13530 -84 8522 -2778 -9616 -3702 -265 3758 5851 -7901 -13561 6225
308F225N240k1944Q96J8140n342q117O200l734l966J3708J365j3229N009J0400
$$ 6225 11465 -10479 -9583 8557 3215 -4902 1298 -2436 -6402 7306 8671 -4558 451 10851
322A0851p709m675J0048J610j1113n245N337K255k776J670K33n545L884O336j0992
$$ 10851 3142 -1533 8515 10125 -988 -6233 -896 1359 -1417 253 486 -5059 -1175 5161 -5831
337e831o015J6489M182j4830Q87N350n777M274P562r895l587R940m815n658J4828
$$ -5831 -11846 4643 8825 -6005 -5118 232 -5545 -1271 6291 -3604 -7191 2749 -2066 -7724 7104
352G104M096j4365O41J0232o280n965P655J109o608K813L184r455j050J3741r82
$$ 7104 11200 -3165 -2524 7708 1428 -4537 3118 4227 -2381 432 3616 -5839 -6889 6852 5870
367E870j2688K673N573p189L661J1726o473p789O539k627n119J1383J225j3203
$$ 5870 -6818 -4145 1428 -5761 -2100 9626 3153 -4636 1903 -724 -5843 5540 6765 -6438
381f438N652J0466j2087n953J3800K882r597J061K877n295r94P416J301o168l660
$$ -6438 -786 9680 -2407 -8360 5440 8322 -1275 -214 2663 -2632 -3626 3790 5091 -1077 -4737
396d737K342n52k490K229K795J36j39l086k820O469N680o975k98Q481n142j0134
$$ -4737 -2395 -2947 -5437 -3208 -413 -277 -416 -3502 -6322 147 5827 -1148 -1446 7035 1893 -8241
412h241O834Q778m955j853M629m425q068P985J1038p286r949Q306L408j2057L92
$$ -8241 -1407 7371 2416 563 5192 767 -7301 684 11722 4436 -5513 2793 6201 -5856 -5464
427e464R254l748j176N552j1238p294J7496L357j4130P348Q056j5764k2J7436
$$ -5464 3790 42 -1134 4418 -6820 -14114 3382 6739 -7391 -43 8013 -7751 -7773 9663
441I663q170p883J7147l203k2284R743J9178j1978p372J3838m503j4639Q891P151
$$ 9663 1493 -6390 10757 7554 -14730 -4987 14191 2213 -5159 8679 4176 -10463 -1572 5579
455E579r749M845R602j5775p514J8470k179j3810J5671M904k6153M997K4689j4639
$$ 5579 -4170 675 10277 -5498 -13012 5458 3279 -10531 5140 10044 -16109 -11112 13577 -1062
469a062j1538K5113k295k4997J2452J5319j6459J323J7043j2866j0975J4038j75
$$ -1062 -12600 12513 10218 -14779 -2327 12992 -3467 -2144 14899 2033 -8942 5096 4921
482D921q867Q828K20j4605O380J1473j3147l856J7891k472j8910O187J1574r748
$$ 4921 -3946 4882 5102 -9503 -3123 8350 -4797 -8653 9238 6766 -12144 -5957 5617 -4131
496d131j866J1702o612q893J2221K654j2160Q065R299j4364j544J4201n159p207
$$ -4131 -5997 5705 -907 -9800 2421 5075 -7085 980 10279 -4085 -5629 8572 3413 -3794
510c794J0438j700j0372O813K826q981M028O113q220k49N525m802q99O534n625
$$ -3794 6644 4944 -5428 1385 4211 -4770 -742 5371 -2849 -3098 2427 -2375 -3274 3260 -2365
525b365m017R094j263q769O736P166q586m110Q466K728n353n84J239M02L680r31
$$ -2365 -6382 2712 1449 -7320 -584 6582 -2004 -6114 2352 5080 -273 -857 382 784 4464 3533
541C533o261K856N976o794k878Q671l680q927R695M872j4765N65J3261o454o124
$$ 3533 -2728 128 6104 -690 -3568 5103 1423 -7504 2191 7063 -7702 -7137 6124 -330 -6454
556f454Q635k802n986R770m75j0013R193N608j3853J869J3751p871p324J1261
$$ -6454 2181 -621 -6607 3163 2688 -7325 1868 7476 -6377 -4508 9243 1372 -5952 5309
570E309j389j0151Q763O050j2560l26J2445m957j0308P161L687q199L606N589
$$ 5309 3920 -6231 2532 8582 -3978 -4304 8141 3184 -7124 37 3724 -4475 -869 4720
584D720j0215j956J2420j592r688M980K064m314O398O68j1161O480J2296j2580
$$ 4720 -5495 -7451 4969 3377 -6311 -1331 733 -3581 2817 3485 -7676 -1196 11100 -1480
598a480o844J5683j508j3341Q424P061j1201J408Q934q137l717R772k022r134
$$ -1480 -8324 7359 5851 -7490 934 7995 -3206 -1798 7136 -1001 -4718 5054 3032 -6102
612f102M612M570m156q52J390l042L155M231o633m059P907J536n730L532L133
$$ -6102 -1490 3080 -1076 -1928 -538 -3580 -425 3806 -2827 -6886 1021 2557 -3173 359 3492
627C492p109K119O977o470k111Q516m807p034J2937K356j6709L460J4909q246
$$ 3492 -3617 -1498 5479 -991 -3102 5414 607 -6427 6510 8866 -7843 -4383 10526 2280
641B280q832P415L8k689N538m357n805R233P31j1603O464Q890j1198l431J2165
$$ 2280 -6552 863 901 -1788 3750 -607 -6412 2821 3552 -8051 -1587 7303 -3895 -7326 4839
656D839k993p406Q963J198j2167N883J2886j0383r789J1981M989r097J208J256
$$ 4839 1846 -5560 3403 4601 -7566 -1683 11203 820 -8969 3012 8001 -1096 112 1368
670A368o400Q286Q056j8589n798K3127j160k2246Q978J4450j4152m254J3248n744
$$ 1368 -5032 3254 11310 -7279 -13077 10050 8890 -13356 -4378 10072 -4080 -8334 4914 -830
684h30n925J2178l424j2014J0800Q059j2640j333J1021k748m342L678l522j974
$$ -830 -6755 5423 1999 -10015 785 8844 -3796 -5129 5892 3144 -1198 2480 -1042 -3016
698c016J0750L77j3746k74J1385k23o311J082k33l042M037J271p167K251P971
$$ -3016 7734 8111 -5635 -5909 5476 5253 -1058 24 -209 -3251 786 2057 -5110 -2859 5112
713E112o742n464Q860L21q930N744P702p502l307N841j574j551O235j126o538
$$ 5112 -1630 -7094 1766 2087 -6843 -1099 6603 -899 -4206 1635 61 -1490 4745 3619 -2919
728b919J832L615k320o30K848M7l656k421M051L540n264l272N884K045n988j560
$$ -2919 -1087 2528 208 -422 2426 2473 -1183 -3604 447 3987 -1277 -4549 1335 3380 -2608 -4168
744d168K371M90L680J533p743l520Q859M980n265l204L215Q79r05R37k398j153
$$ -4168 -1797 -1307 2373 3906 -3837 -7357 1502 6482 1217 -1987 1228 2107 1202 2139 -259 -1412
760a412O083L38r558L55R896l367o692O126J743p786J275M043m015K643N754q774
$$ -1412 4671 5009 -4549 -4194 5702 2335 -4357 1769 3512 -4274 -2999 1044 -2971 -328 5426 -3348
776c348o756J0449L515o371R18J837l668M132M888p832k968J0117J736q600P46
$$ -3348 -10104 345 3860 -2511 -1593 244 -3424 708 5596 -2236 -5204 4913 6649 -1951 -1205
791a205L150l685K688O934p444p588Q259M336q257L93O677n093k831O825k849
$$ -1205 1945 -1740 948 7882 438 -7150 1109 5445 -2812 -2419 4258 -835 -3666 3159 310
806C10n886P525K444r559K595Q105o344m760P186J470l194K202k263m727O416
$$ 310 -5576 1949 4393 -5166 -2571 5534 -810 -5570 1616 3086 -108 2094 -169 -4896 1520
821A520O892p693o616O586M067n393j750J675n53J641K318m961m670O889M613
$$ 1520 8412 719 -5897 689 4756 -637 -2387 -712 -1265 376 2694 -2267 -6937 -48 4565
836D565o069j370N086k937l849N061K074l133M12o55k042M321L301n655j724O009
$$ 4565 -1504 -2874 2212 -725 -4574 487 2561 -572 -160 -815 -2857 1464 4765 -890 -2614 3395
852C395R37m617o32K589P0K62O66l013k932K975L285l193j537K576k027l834N777
$$ 3395 4332 -285 -917 1672 1742 2004 2670 -343 -3275 -300 2985 -208 -1745 831 -1196 -5030 747
869G47L344n549k319L769j54J98J158l573j680O975J077q126l52P326J358m481
$$ 747 4091 -1458 -3777 -8 -162 36 1194 -2379 -4059 2916 3993 -4133 -4485 2841 4199 -282
885b82j646J858J479j46j151L52J597r63l378l27M572J851n574l363L828L621
$$ -282 -1928 -70 1409 1263 112 464 2061 1098 -2280 -2607 1965 3816 -1758 -5121 -1293 2328
901B328k91k575l320K185O907j639q610J787Q146p84n517j478J624L631O99m292
$$ 2328 2037 -538 -3858 -1673 5234 3595 -5015 -3228 4918 4134 -1383 -2861 -1237 2394 3093 -1199
917a199j026M329J58m137J418L508n46m129k245J924M214j023m630m68K551J544
$$ -1199 -2225 2104 2262 -1875 -457 3051 2505 -1624 -3869 -1945 2269 1246 -3384 -3852 -1301 243
933B43m16j922r71L504L018k845m405K291M814j162k674J000O75l147K151M618
$$ 243 -173 -2095 -3066 438 3456 611 -3794 -1503 3311 2149 -525 475 1150 -1997 154 4772
949D772k804m371L396J625k595R85R66l655J624L573m517l034N413k8l803J947
$$ 4772 1968 -2403 993 2618 23 1008 1974 -1681 -57 3516 -1001 -4035 1378 1350 -2453 -506
965e06J152l689J190L032j416k54J491j815j787L311K194j941k001o54J292L116
$$ -506 646 -3043 -1853 1179 -237 -491 1000 -815 -2602 709 2903 962 -1039 -1693 -401 2715
981B715o63n445j0O166Q03o365p67M745k48q63J310k480k308M286R63l423K93
$$ 2715 2052 -3393 -3403 2763 3566 -2799 -3566 1179 931 68 1378 -1102 -3410 876 1839 -1584 -1291
998a291J626j845R94J929k107j92L567j561k009L108J153l697m61K520L83j372
$$ -1291 335 -1510 -516 1413 -694 -886 2681 1120 -889 2219 3372 -325 -786 1734 2117 745
1014G45j809q12K569J020j864m77P86j641O03L542k183n585K664O238l933n080
$$ 745 -1064 -1876 693 1713 -151 -628 158 -1483 -880 2662 479 -5106 -2442 3796 -137 -5217
1030e217L406K685j794J033k57l416L189M733m717k357N466j023m253M384J810
$$ -5217 -1811 874 -920 113 -144 -3560 -371 4362 -355 -2712 2754 1731 -2522 1862 3672
1045C672n761K026L776n834J31O786m162n369N578K640n636J109L572m546O81
$$ 3672 -2089 -63 3713 -2121 -1990 4796 634 -4735 843 3483 -2153 -1044 2528 -2018 -1337
1060a337O034m726o074P079M041p115p22M731l522k76O553l397o257P094L314
$$ -1337 4697 -29 -6103 976 5017 -2098 -2820 1911 -1611 -1887 4666 1269 -4988 2106 5420
1075E420q741J849P473o429m564P450r80o267M117K326n858L335M084o883n69
$$ 5420 -3321 -1472 6001 -428 -4992 2458 1478 -4789 -672 1654 -4204 -869 3215 -3668 -4237
1090d237Q224k116o163N188J552o244K143O047m137l461M519O63k465J903J234
$$ -4237 3987 1871 -4292 896 2448 -3796 -1653 4394 257 -3204 1315 1978 -487 1416 2650
1105B650k358R22K434l007k194L260n53k151K712r31n316K284N662l666m021L923
$$ 2650 292 1214 3648 641 -1553 1707 1154 -997 1715 784 -4532 -2248 3414 -252 -4273 -350
1121c50J374k467l30J344R11J41j751j403L383O52l031J064K392j490n94P48j640
$$ -350 1024 -1443 -1773 -429 482 623 -1128 -2531 852 1504 -1527 -463 1929 439 -155 593 -1047
1138a047N03M075j486m215R46K101j73K77j094k336J846K422l367k068M239Q22
$$ -1047 -544 3531 2045 -2170 -1224 877 704 981 -113 -2449 -603 1819 -1548 -3616 623 1445
1154A445l216Q84K204k288P9M066j758k835L591M85m838K319L886m595j666M715
$$ 1445 -1771 -887 1317 -971 -892 3174 1416 -1419 2172 2657 -2181 138 4024 -571 -2237 2478
1170B478k313k973N213K7o310L169M555n421j943M822j895k993L794o84l647L012
$$ 2478 165 -2808 2405 2432 -3878 -709 3846 -1575 -3518 1304 -591 -3584 210 -474 -4121 -1109
1186a109K855l967O75M246l415j267N677r66o022L190M555m348j806L950j533
$$ -1109 1746 -2221 -1546 2700 -715 -1982 3695 2729 -3293 -103 4452 104 -1702 2248 715
1201G15k645L944J54m269K222K988m543l7M037k800k618M144r61l755L792J471
$$ 715 -1930 2014 2168 -2101 121 3109 -1434 -1471 2566 -234 -2852 1292 331 -3424 368 1839
1217A839m913J315M337l089k306M099M14k979K396R23l467O72L641k104k431K271
$$ 1839 -3074 -1759 2578 -511 -2817 1282 1696 -1283 1113 2036 -1431 -759 2882 778 -1653 618
1233F18K46k016N90R74j513L47J581j662q00K265o89j349J908K82k567R19J864
$$ 618 864 -1152 -562 412 -1101 -754 827 -835 -1635 630 -59 -1408 500 782 -1785 -866 998
1250I98j797NK055j779n71K584l76j903K126Q07k556Q44J693k288k70J528j120
$$ 998 -799 -794 1261 -518 -1089 1495 1119 -784 1342 2149 -407 437 2130 -158 -428 1100 -20
1267b0r95J000R4r84M04o3j1J156K05j996J36K319j698k167K418J966k604j392
$$ -20 -1015 -15 79 -905 -501 -564 -575 581 786 -1210 -1074 1245 -453 -2620 -202 1764 -840 -2232
1285b232K531J87j352J239Q88j552K30Q89q93L35R81r64K18K50k134J50L426j054
$$ -2232 299 486 -866 373 1261 -291 -61 828 -65 270 1251 287 505 755 -1379 -1229 2197 1143
1303A143l267J598J756k502k99K941l57j999M96P49m00r0Q34M0K23q68j124Q23
$$ 1143 -2124 -526 1230 -1272 -1571 1370 1013 -986 -490 259 -141 -231 603 643 866 -2 -1126 -303
1321c03J255j11j253M87M75q80K70J444n22j345P45o6j759N91J877j009j935O08
$$ -303 952 841 -412 75 550 -330 -60 1384 862 -483 262 196 -1563 -972 905 -104 -2039 -1431
1339a431J421K82j279O9J950K61k057n18J831L57o35L94o19j280J439R96j093
$$ -1431 -10 272 -1007 -938 1012 1273 -784 -1302 529 886 251 645 26 -1254 185 1181 88
1356H8J37Q70m97p83J142m21l70N30l68j203M09K77n89o1O52M35j294j61R13P28
$$ 88 225 1095 598 -185 957 536 166 696 328 -875 -466 -189 -778 -839 -187 248 -1046 -1207 -294 434
1376D34R1n20p78N97P96n69p39J550k90j469Q60J303j445k58J817m86j773J208
$$ 434 525 5 -773 -176 620 51 -688 862 572 -897 -37 1266 -179 -437 1380 894 -879 329
1394C29L45j260P08Q11j215o21P85K16o14J13J8k75J73O59j32k37L77K32p51P42
$$ 329 674 -586 122 933 -282 -903 -118 98 -516 -403 -385 -660 -487 172 40 -197 180 412 -339 403
1414D03J006q81j545J555J758k289j295J470O55q40oJ92j023P85O32m09j208N18
$$ 403 1409 528 -1017 538 2296 7 -1288 182 837 -3 -9 183 -840 -55 577 168 -1040 -522
1432e22O22p45j85O61k88J63J24m29l91J971M8k360J391K414k301j420K431R8
$$ -522 100 -645 -830 -169 -457 -294 -170 -599 -990 981 1029 -1331 60 2474 173 -1247 1184 1282
1450A282j750J567n32k140J935K304l313r29K424l03j901J499O17k405Q83K162
$$ 1282 -468 1099 567 -1573 362 2666 -647 -1576 848 545 -1356 143 760 -1645 -762 1400
1466A400j656j828K748n8k282K083J688l581j71L934j214k565K312O07k718J487
$$ 1400 -256 -2084 664 606 -1676 407 2095 -1486 -1657 2277 1063 -1502 810 1417 -1301 186
1482A86K018k904J35K789j852k334K747N38l097J009J935j407o15J065j431L48
$$ 186 2204 -700 -565 2224 372 -1962 785 1323 -1774 -765 1170 -237 -852 213 -1218 -870
1498h70K670j166l086J291K626j078r15N24l92K33J543j039j854K117K014k327
$$ -870 1800 634 -2452 -1161 1465 387 -528 -4 -396 -163 1380 341 -1513 604 2618 291
1514B91j322K061j22j219P48j08j288J076J61j765O66K005j200j838J015J231
$$ 291 -1031 1030 908 -311 437 329 -959 117 278 -1487 -821 1184 -16 -1854 -839 392
1530C92J29q57j187N60K213j021j429J141N83m39N49M81j448J97J612q50q14Q67
$$ 392 521 -336 -1523 -963 1250 229 -1200 -59 524 85 634 1115 -333 -136 1476 626 -188 679
1548F79n45q47J365N45j923k91J588o78r40J525l97k074J698J303j952o82K383
$$ 679 134 -713 652 1197 -726 -1017 571 -107 -1047 478 81 -1993 -295 1008 -944 -1626 757
1565G57k64j833K058K98k064J052J622j927M78J424k434m62L608k38l699J136
$$ 757 493 -1340 718 1016 -1048 4 1626 -301 177 1601 -833 -1295 2313 2075 -1624 -488
1581d88J677j378L25P61k518O20K894k112k963K690J880k659N0J961j596k70K401
$$ -488 1189 -189 136 897 -1621 -1001 1893 -219 -3182 -492 1388 -1271 -1221 740 -856 -1126 1275
1598A275n04j579J540M74k584J031K544j141k029J415o3r68J773j0k885J141K833
$$ 1275 771 -808 732 1206 -1378 -347 2197 1056 -973 442 379 -589 1184 1174 -1711 -570 2263
1615B263k493j685J659N30o69Q73r14j856J704J798j784m80J566j047n70K384
$$ 2263 -230 -1915 -256 274 -395 478 -436 -2292 -588 1210 -574 -1054 512 -535 -1105 1279
1631A279m72j496J386P50j691j95J358r66L44J467j678j264K065j53k505J335
$$ 1279 807 -689 697 1447 -244 -439 919 -47 297 1764 86 -1178 887 734 -1771 -436
1647d36K428k390j717J583M88k78Q81j259j657K666J421k815n79K335l56j64P18
$$ -436 1992 -398 -2115 -532 -44 -322 559 -700 -2357 309 1730 -1085 -1664 671 315 151 869
1664H69j261j285K840J170l011m41K529o37j284Q02k56m33J301o32k029J566J750
$$ 869 -392 -1677 1163 2333 -678 -1119 1410 773 -511 291 35 -398 903 271 -1758 -192 1558
1681A558k443r02K927j70k351N29J496j252P58Q98j780p35K685k23j577J310n3
$$ 1558 -885 -1787 1140 970 -1381 -852 644 -608 150 1048 -732 -1467 1218 995 -582 728 675
1698F75j822J737J198k848j60K804r98j870R41N56r86J035J000k052q65J701J49
$$ 675 -1147 590 1788 -1060 -1220 1584 586 -1284 -343 213 -773 262 1262 -790 -1655 46 195
1715A95j82J5o14n34J371k52j038P83J778j528j675J964R11r41n79N21L54J47
$$ 195 13 28 -586 -1120 251 -1 -1039 -256 1522 -6 -1681 283 1194 253 -326 195 549 696
1733F96l36j312P46J733j31k036K00M86LJ190r68j843R13J796j286j198R77M24
$$ 696 360 -952 -206 1527 1396 -640 -440 46 49 1239 271 -1572 -659 1137 -149 -1347 -370 54
1751E4M6l74l46j21J351o8j561J102R83j467n64K050l5j188M2M00o35N73P52j106
$$ 54 100 -274 -620 -741 610 542 -1019 83 1066 -401 -965 1085 1050 -138 -96 304 -331 242 994 -112
1771a12q95J013K53m47N25o61r48J412O42j875J07K038r41j160J845r2k166J268
$$ -112 -1007 6 259 -188 337 -324 -1272 140 782 -1093 -986 1052 111 -1049 796 704 -1462 -194
1789a94K338k101r50J403M52r46Q37j71j281Q85O48j513K91J291j462r31J588
$$ -194 2144 43 -907 496 948 2 839 668 -613 272 920 -593 -302 989 -473 -1404 184
1806A84L72j232J32P95r69k26J599j231j052J716J325j689p16R92K77q0P38q14
$$ 184 556 -676 -544 251 -718 -944 655 -576 -1628 88 1413 -276 -992 0 277 197 935 121
1824A21p94J256R33j676p1N97k34j61M37m53k61M16q0m98N28M71j117k24J310
$$ 121 -673 583 1516 -160 -231 366 132 -29 408 -45 -306 110 30 -468 60 531 -586 -810 500
1843E00k02r05R6O95l09J93O74n46q28P13Q62m20p66J01P60j92J41n63n29K27
$$ 500 298 -607 -511 184 -125 68 742 196 -632 81 943 523 -243 -142 618 426 567 4 -525 -298
1863b98O38k43n87m2L30J90k70j56m16M59L90j93k48J44L91Q8j77L01j77j33J54
$$ -298 340 97 -490 -532 -202 -12 -282 -438 -854 -395 -5 -198 -446 -302 89 177 0 301 124 -9 145
1884A45L42m96K57M82r26J4O64O50r81m96K56M76j65k15n90P9Q74k13n97k27O80
$$ 145 487 -9 248 730 -196 -182 482 1132 151 -345 -89 387 222 7 -583 -504 370 157 -440 -667 13
1905A3k69K89l51n2q1N68N6o81J00O49N5o85M77K43n41J48J97M7J06j08q4l77
$$ 13 -256 33 -318 -370 -451 117 173 -508 -408 241 296 -389 88 331 -210 -62 135 182 288 180 96 -281
1927b81K69k3l13L26j91J23M7k2L8l67M3N99k11l48j13Q37J20m85M55r1m89K66
$$ -281 -12 -35 -348 -22 -213 -90 -43 -65 -27 -394 -351 248 37 -311 -424 413 533 48 503 412 -77 189
1949A89L37l02j49L8K32l85J24j21J12J45k68k94J82J26k49r4L41J26q63j60P90
$$ 189 526 224 75 113 345 -40 84 -37 75 220 -48 -342 -160 -34 -283 -377 -36 90 -773 -933 -143
1970a43J60m75L49N1n16Q64J0p04M72M51k73l31M20k84j2R21n69r12Q17K13o32
$$ -143 17 -458 -109 -58 -574 290 300 -404 68 519 246 -85 335 51 39 960 391 -521 296 509 -123
1991a23k50R91p56o43N67L64o88N35M42n62l26K50K67l48L30j4l32M30j52n13
$$ -123 -373 618 -138 -781 -214 150 -538 -3 439 -123 -449 -199 68 -280 50 36 -296 134 -18 -531
2011e31O01R04p68o24P15k6o75P51k4m58p9N40n06l95N97j33l61N61k31n38Q76
$$ -531 70 974 206 -418 297 271 -404 347 323 -135 -214 326 -180 -575 22 -111 -472 89 -142 -680 196
2032A96K35p61j0O31m41o53J126o6m59O25o8p43L88R27q05l00Q21m05n76M48J99
$$ 196 431 -330 -340 291 -150 -803 323 257 -202 423 355 -388 0 927 122 -178 643 238 -338 110 309
2053C09r01N09N67q70k32R44n42p70J081Qj099O46J212j765K95J023K8j052Q90
$$ 309 -592 -83 484 -386 -618 326 -216 -986 95 103 -996 -350 862 -903 -608 415 443 -609 281
2072B81L3j114J058M85p98k65J020m75r76J214J72j123L76R54j226p9J424j190
$$ 281 314 -800 258 743 -55 -320 700 225 -751 463 635 -488 -112 842 -384 -463 961 -229
2090b29q64J049L63j218P01Q95o11j98O60o42p24J340l07r37R98L80j238M45P61
$$ -229 -1093 -44 319 -899 -198 697 86 -112 548 -94 -818 522 215 -722 276 656 -582 -137 624
2109F24p60Q0Q16n57m67K55M77p47k3O80r74k11Q55l24k30N97q2q10Q67J98o52
$$ 624 -136 -56 760 203 -264 -9 468 -279 -302 378 -596 -807 48 -276 -506 91 9 -801 66 264 -388
2130c88jQ35k95n11L54M56m79L12J26m83L28P59r51M8K67k47m76Q67j85p22M69
$$ -388 -389 446 151 -360 -6 450 -29 283 409 -74 254 1013 62 110 377 130 -346 521 336 -386 83
2151H3J47p15J34O70p99k17Q89k31o84P38L14r35P12M10n80j83Q47l36n20N76
$$ 83 230 -485 -351 319 -480 -697 192 -39 -723 15 329 -606 106 516 -64 -247 600 264 -256 320
2171C20q2p81N63P31j032j43R91n62n54J283l13j348Q75P34j028j43O79n5p05
$$ 320 238 -543 20 751 -281 -424 567 5 -549 734 421 -927 -52 682 -346 -489 190 135 -570
2190e70N82l34m32J024P31j338J3J502j192l77Q48J90r38N70M46j236m2J467j187
$$ -570 12 -322 -754 270 1001 -337 -324 1178 -14 -391 457 647 -291 279 725 -511 -553 914 -273
2209b73m46J076j14q78P55N5q54OQ35r45k38J302p1r51P05M30q02M05N00l44l70
$$ -273 -719 357 243 -635 120 175 -679 -673 162 -783 -1021 281 210 -741 -36 394 -408 -3 497 153 -217
2230b17N61j20l81O10n2r52P19N39n18l74O96p78l64Q92j79o12K02M78o43K35
$$ -217 344 224 -157 453 401 -551 168 707 189 -185 511 -267 -631 261 82 -530 -328 150 -493 -258
2250b58N66p29m04O81L76n04K42j22n9N39L49o47j92P33l30l93M18J8l7J79j41
$$ -258 308 -421 -825 -144 232 -272 -30 -152 -211 328 677 30 -162 571 241 -152 266 284 247 426 285
2271B85q05K82M64m41k73M77J39o43L72M9o9L78o9o12L2Q25j80o69L26M48n89
$$ 285 -520 -238 226 -215 -488 -11 128 -515 -143 -94 -163 215 146 -466 -434 391 211 -458 -132 316 -273
2292b73K95J92n24L30P59m13o19N45K7n79L12L23q25M06L87m59l62K39M13n13
$$ -273 22 214 -310 20 779 366 -253 292 319 -260 52 375 -450 -44 343 -116 -478 -239 174 -339
2312c39J56L78n91r4J062m96k97K23J91o74M56M08o17M55J65n06K5R93n72n07
$$ -339 -183 195 -396 -490 572 76 -221 2 193 -481 -25 383 -234 221 386 -120 -95 898 326 -181
2332a81N5O01l62k54KJ7J62J79n14m10O63K40l59K55N8m98M73j00J6K6L23j71
$$ -181 -126 475 113 -141 -139 -122 40 219 -295 -705 -42 198 -161 94 152 -346 127 27 43 69 392 221
2354B21m93K52J87J1m26L43q8k1K46k36NL59l13l84M7P5J48J42J28n17m70O52
$$ 221 -272 -20 167 178 -248 95 7 -14 232 -4 1 360 47 -337 -290 -215 -67 75 203 -314 -784 -132
2376a32J71l5j00K0K77N6l17j95J54M00l61Rl4jJ98M00k69m53J90K17j86J00N5
$$ -132 39 4 -96 -76 201 257 -60 -255 -101 299 -62 -53 -87 -88 110 510 241 -212 -22 195 9 109 164
2399A64J66l51M2jk71J86K60l60k14O48k36k43k01L88L09k96j09l05M14K50J0
$$ 164 330 -21 21 20 -251 -65 195 -165 -379 269 33 -210 -411 -23 286 -10 -119 -424 -10 240 250
2420B50l45K3K79K6k77l7O4K79rm18K70m6PN6k41R4L43m52k02P9L6O4K29o46K04
$$ 250 -95 -72 207 233 -44 -81 -17 262 253 -165 105 59 66 122 -119 -25 318 -134 -336 -257 -221 -157 72 -574 -370
2445c70P07Q1m14k75M13K13k14j18L03j04M0j47q8k38K19K49k17J65j57k46M0
$$ -370 337 418 4 -271 142 355 141 23 326 222 262 115 27 -211 8 257 40 205 48 -198 -158
2466a58J34j00k35O7K68n52L60L10l77j84O51O9n42K61K76m27L43K61j95m81P2
$$ -158 -24 -124 -359 -292 -24 -576 -216 94 -283 -467 184 253 -289 -28 248 -179 164 425 230 -251 -179
2487a79J52M89K13m70o88N00L81n85k70K84Qp5J20j48j67N23M14q00j37M95K16
$$ -179 -27 462 675 205 -483 17 398 -187 -457 -173 -165 -240 -120 -268 -435 88 502 -298 -435 60 276
2508B76n44L52J05k27L89j44k39J08K89j58k88M12J14k95L2ql94M50m00j25k03
$$ 276 -268 84 189 -38 351 207 -32 76 365 207 -81 331 445 150 182 174 -220 230 -170 -295 -498
2529d98N19J11m74J60n5K3L83J8n24J24K55N4k28k5J7K22J09J89l92K90L59p89
$$ -498 21 132 -342 -182 -237 -214 169 187 -337 -213 42 96 -132 -157 -140 82 191 380 -12 278 637 -152
2551a52P1M06j56n66M05om02L99J30n06m9R90o92k94M01o7L2J28o7l96K78M93
$$ -152 -81 325 169 -397 8 2 -400 -1 129 -377 -426 564 -128 -422 -21 -88 -56 72 5 -391 -113 380
2573C80l25m89M99j09J40K82p1n37K14O03p28j62N38J2l58K69j28n44M60L79n80
$$ 380 55 -434 65 -44 96 378 307 -230 -16 587 -141 -303 235 247 -111 158 30 -514 -54 325 -255
2594b55k18M10K3l69K45L10k45L18l7n96K80N60l27m98L43O66m81J44k3k80K32
$$ -255 -473 -63 -40 -409 -164 146 -99 219 182 -414 -134 426 99 -399 -56 610 129 273 250 -30 202
2615B02L03l48n76N35Q7k29l06M66n14P1P05o72l89P25p3j71J97N19q39K49L13
$$ 202 505 157 -419 116 203 -26 -332 134 -380 -309 396 -276 -665 60 -13 -184 13 532 -307 -58 255
2636B55l05m3P14n71k92O05K42o95j0r8j36N59J56o94l38R37k69l67J32J17k94
$$ 255 -50 -93 621 50 -242 363 605 -90 -100 -198 -334 225 381 -313 -651 286 17 -350 -218 -101 -395
2657c95M63J74m65l40J056m23m04J67L78l09J31M48n34K81O62o42m42O31J84p16
$$ -395 68 242 -223 -563 493 70 -334 -167 211 -98 33 481 -53 228 890 248 -194 437 621 -95
2677i5P4M08o31K31J34j39k78O02K9q44N22K44n37Q8M11q23K79N75l8m48K12M77
$$ -95 -21 387 -244 -13 121 -18 -296 306 335 -509 13 257 -280 -192 219 -604 -325 250 212 -236 -24 453
2699D53n25J49K00o35L41O50m18n24N16J52q32K88M31l56j31M96q5l02M66J97
$$ 453 -72 77 277 -358 -17 633 215 -309 207 359 -473 -185 246 -110 -241 255 170 -132 334 531
2719E31q91K46L16j94j72J40O8j32N42j51p44M21N69l49k61M30k44r4O8J09o08
$$ 531 -360 -114 202 8 -164 -24 44 -88 454 303 -441 -20 549 200 -61 369 125 31 99 208 -400
2740d00N49K05n38R4J6r6l3M16l39m14P25M8p83K99J11l6o5N37j87k14L01Jm80
$$ -400 149 354 -184 -90 -74 -170 -203 213 -126 -540 185 233 -550 -251 -140 -176 -241 296 109 -105 196 197 -283
2763b83N38L15m88o3K71l37j06L20j91j75J57N38n38n1P0k6jO4k28j76N68k39
$$ -283 255 570 82 19 290 -47 -153 167 -24 -199 -42 496 -42 -93 -23 -49 -50 14 -214 -390 178 -61
2785f1k63L73%j26J17o7j90L17J02k39j97l8O25k33j05M65m15k60N58j44l64K09
$$ -61 -324 49 49 -77 40 -27 -217 100 202 -37 -234 -272 353 120 15 480 65 -195 363 219 -145 64
2807F4J82n46p0N56l11P0KK5j62O5J38j43J37L41n31R3J95j82l9N27l29m19K06
$$ 64 246 -300 -370 186 -125 -55 -53 -28 -190 -125 13 -130 7 348 -183 -90 105 -77 -116 411 82 -337 -131
2830a31J90n2k48N81k20k80K02J9j50k8K94o10K24K81j31m17M26ok36J81N24m53
$$ -131 59 7 -241 340 120 -160 42 61 -89 -117 177 -433 -209 72 -59 -476 -50 -56 -292 -111 413 -40
2852d0k92N70m38k08O29j82M7P4j33j50K30J02j50k42J35Q9k19L56L2j35j39J00
$$ -40 -332 238 -200 -408 221 39 86 160 27 -123 107 209 59 -183 -48 41 -178 178 210 75 -64 36
2874C6k43j88K91j03J7N85m59j88J26K77j77k12J38l3N0p0K27k59O6L56Lj34j55
$$ 36 -207 -395 -104 -207 -190 395 -64 -252 -126 151 -26 -238 -100 -133 -83 -153 74 -185 -119 237 240 106 -49
2897d9J21l8k46L48l95K26j89q3J08J99k34JK77j27J00l7K31k76J09P9k19O9J36
$$ -49 72 34 -212 136 -259 -33 -222 -305 -197 2 -232 -231 46 -81 19 -18 213 -63 46 125 -94 -25 111
2920A11L3K15m55K38m6P5j02J07mk16r2k2K63J28m34K25j33QR3L5m6j28K16J0
$$ 111 144 359 -96 142 96 171 69 176 172 -44 -136 -158 105 233 -201 24 -109 -101 -8 27 -19 -147 69 79
2944G9m9L4O3o8j43P1J29Q7k74RL79j55N3%k1n0j27k7j56j9R1n1K56k02K3M0j49
$$ 79 30 64 127 59 -84 -13 116 203 -71 -62 317 162 215 215 194 144 17 -10 -166 -185 -94 -145 111 -91 -68 -28 -177
2971a77Qk34L71k5l52M25L4M3j16L9O6j61J32K03m45J36L7j68L1J80J42l00J10
$$ -177 -169 -403 -32 -57 -409 16 50 93 -23 16 82 -79 53 256 -189 -53 -16 -184 -153 27 169 -131 -21
2994b1J77k46j14J55m9O4L7j69j52K98l00n4L11k17P3L04J00m18R8J41nL6j15
$$ -21 156 -90 -204 -49 -98 -34 3 -166 -318 -20 -320 -374 -63 -280 -207 97 197 -221 -123 18 13 49 -66
3017f6K19j74l5L87l02j24L4L08k87K87k27n4n6L0j08J20J11M4n02J81N16m76
$$ -66 153 -21 -56 331 29 -95 -61 247 -40 247 20 -34 -90 -60 -168 -48 63 107 -395 -214 302 -174
3039a74PN30k86j61J81j35J41rp7l19M70M2j3N0J95n21P6q2R8k94L08q3o4J28
$$ -174 -167 363 77 -84 97 -38 103 94 17 -302 168 210 197 247 442 -79 -3 -85 13 -281 27 -56 -120 8
3063Hqn7j06K47k18J21j4J76k43K90N4l23M08k05l4k94K21J39k50J95J60k57J86
$$ 8 0 -57 -163 84 -134 -13 -27 149 -94 196 250 -73 335 130 96 -198 23 162 -88 107 267 10 196
3086A96J4j05k76L33k99o6J65j55k36N24j0k68R9K56l63J31J36n6j66k25L77Q7
$$ 196 210 105 -171 162 -137 -203 -38 -193 -429 95 85 -183 -84 172 -191 -60 76 20 -146 -371 6 93
3108I3N3R9j97L3J40j31k54J62K67n19K66j8p6k30M74p5j20O2j01j66K01J15m23
$$ 93 146 245 48 81 221 90 -164 -2 265 -254 12 -6 -82 -312 162 87 -33 29 -72 -238 -37 78 -345
3131c45K98K57l91q8L32Q3j45J50K94n37Q6K09r2j57K43j69j31j03M64l23O0l07
$$ -345 -47 210 -181 -269 63 146 1 151 445 -92 -6 203 111 -46 197 28 -103 -206 258 -65 -5 -312
3153c12J31j63K72J21l83L29r3j62J71n2O3j51K44k04j2K88p5K9L60m24J37j17
$$ -312 -181 -344 -72 49 -334 -5 -98 -260 -89 -141 -78 -229 15 -189 -201 87 12 41 401 -23 114 -3
3175cL11m1m26M07L4k06M8J01k44l1K37k44j3P6r2M0L3J32m28J9M09r6K50n18
$$ -3 308 267 -159 248 282 76 124 225 -19 -50 187 -57 -70 6 -86 -46 -13 119 -309 -290 119 23 273 -245
3199b45J20J89p0J98k58k49K69l6r5M52l67r1L5J76P3k73L7J63L6J16n4k36K20
$$ -245 -125 64 -6 192 -66 -315 -46 -82 -177 275 -92 -183 -148 28 101 -172 -135 28 64 180 126 -110 110
3222A10j25M6NO8p39Q51q8k91J47K33j55j81J42J34l04k9K5L0J80L93o62n5N60
$$ 110 -15 31 36 104 -635 216 128 -163 -16 217 62 -119 23 157 -147 -176 -151 -121 59 452 -210 -265 295
3245B95k64j26J8K95j56p2o5J37N8Mk22K43l28J29L9l97L19j6K46K10l43l97L67
$$ 295 31 -95 -77 218 62 -10 -75 62 120 124 -98 145 -183 -54 -15 -412 -93 -109 137 347 4 -393 -26
3268b6K83k36J0J80k4Kk06J16j40K08j84j06O4J78p1l29J32l9M75l41l0k36J7
$$ -26 257 21 31 211 187 189 -17 99 -41 167 -17 -123 -59 119 48 -281 -149 -188 287 -54 -84 -320 -303
3291c03L34k61J91J4R0M6K17j51m87M70j79J12j12J43j3j61K69j6j46l38K80j44
$$ -303 31 -230 -39 -25 65 111 328 177 -310 160 -19 93 -19 124 111 -50 219 203 57 -281 -1 -145
3313a45j04M75m41j53L75j02PK8K10j99k4O6P9k33j20j6K50K10Km16J30M08o51
$$ -145 -249 226 -215 -368 7 -95 -88 -60 150 -49 -73 -7 72 -161 -281 -297 -47 163 165 -251 -121 287 -364
3336c64M60k09J72n0%J48l02k54L23J11j8n1p3j81rK02K32n5r6j30LK15n1j70
$$ -364 96 -113 59 9 9 157 -145 -399 -76 35 17 -34 -107 -288 -297 -95 137 82 -14 -144 -141 74 23 -147
3360a47K62N6j06k10K01l09K88K4q1m1K16k43J34M0R7k69qK01l84L55Q1j86k16
$$ -147 115 171 65 -145 56 -253 35 59 -22 -63 153 -90 44 84 181 -88 -96 105 -279 76 157 -29 -245
3383b45K19K2J68k57qJ79J07J66k35k70M03m6j40j70L87l18L8J6P4j72K37j55
$$ -245 -26 -4 164 -93 -101 78 185 351 116 -154 249 203 63 -107 280 -38 0 16 90 -82 155 0
3405@k86L42j08r7N4j81J13M10j10j18J08o4p9j93L24j23K4K67m8l44K35M9l31
$$ 0 -286 56 -52 -149 -95 -276 -163 247 137 19 127 63 -16 -209 115 -8 16 283 235 -109 126 175 -156
3428a56P4K22p2N9k94R2J8Ro0J63j46N5l8j21pMJ11J56J5j13j02K8K97k34L6Q4
$$ -156 -82 140 68 127 -167 -75 -57 -48 -108 55 -91 -36 -74 -195 -202 -198 -87 69 84 -29 -131 -103 194 -40 -4 80
3454H0p2K42k68K7j23P4J02L5l5l61L68k4r8N0J29j86Q2J8l86L60j20Q6j78K13
$$ 80 8 250 -18 9 -114 -40 62 97 62 -299 69 45 -53 -3 126 -60 22 40 -346 14 -106 -20 -198 15
3478A5R7l45K84k80J35J94l1j88jK76n6j82J29k41J92j3Q7k1j01L64k04l0m1j15
$$ 15 112 -233 51 -229 -94 100 69 -119 -120 156 100 -82 47 -194 -2 -15 72 51 -50 314 110 80 39 -76
3502g6L70j24l55J18L0K75n20J35L42m78L26l33K06J84o8J8j27l0J60j94K69k51
$$ -76 294 170 -185 -67 -37 238 -282 -147 195 -283 43 -290 -84 100 32 50 -77 -107 53 -141 128 -123
3524a23K95o2j47J00J0j17J56j62J66p5j2J8j08qo1K6K02j94L35j02N6k14q8R6
$$ -123 172 110 -37 63 73 -44 112 -50 116 41 29 47 -61 -69 -130 -104 98 -96 239 137 193 -21 -109 -13
3548a3J08q7K28j85l3K39k62J8k07K33Qk04J13K37k14k85R7K6JK67k0J38k26n7
$$ -13 95 8 236 51 18 257 -5 13 -194 39 47 -157 -44 193 -21 -306 -209 -183 -182 85 65 203 -23 -80
3572h0J59j79k2O5R2j09r0M03R6m63J67k5K65k47Q2j13q4J60R5k80j41K95Q3j88
$$ -80 79 -100 -122 -57 35 -74 -164 239 335 -128 39 14 279 32 114 1 -83 77 172 -108 -249 46 129 -59
3596e9M2p3q6J00k64K97%n6L6PO4n2J89j13j72j9K51J42k86J56Rl25R6K69q2o9
$$ -59 -17 -90 -176 -76 -340 -43 -43 -99 -63 -56 8 -44 145 32 -140 -159 92 234 -52 104 113 -212 -116 153 71 2
3622BK38l85pJ78Rk09J56J34j08N9j21J36p2R0Lj62o2R3M5K4j64L52l46K34k3
$$ 2 240 -145 -152 26 35 -174 -18 116 8 67 -54 82 10 100 103 -59 -121 -28 17 41 -123 229 -117 117 94
3647I4l76K18K38j47j40j1O4K13n2j74n4K14j2j85l4k14K37j70L63k65L9N6k6
$$ 94 -282 -64 174 27 -113 -124 -60 153 101 -73 -127 87 75 -110 -144 -358 -121 -291 72 -193 -154 -98 -124
3670a24Q1N6J55l96K25M8j70K04J8l9k07P9l1j34J77o3M11k36JJ79k84P2R9j98
$$ -124 -43 13 168 -228 -3 45 -125 79 97 58 -149 -70 -101 -235 -58 -121 290 54 55 234 -50 22 121 -77
3694g7K01j18N2k21m5L49j23j30M9l3J03R9p9j09j4K36k16J54o2j01q1J37j56
$$ -77 124 6 58 -163 -208 141 18 -112 -63 -96 7 106 27 -82 -96 140 -76 78 16 -85 -166 -29 -185
3717a85PM25l43j02L32j18jk75L35j67m3J84j4j25J59R1l17qM2O7j14K6K48j9
$$ -185 -178 247 -96 -198 134 16 15 -260 75 -92 -135 49 35 -90 69 160 -157 -165 -123 -56 -170 -144 104 85
3741H5QJ12k22J7m5K14j00j9k88l0K69j92O3j2J16n8N2L05m66J69J5K9J26j99
$$ 85 93 205 -17 0 -45 169 69 50 -238 -268 1 -191 -128 -140 -24 -82 -30 275 -191 -22 -7 22 148 -51
3765e1P3K13M2j98M4j48j61O3m8l2L25j65M5P8j01lj46J09j21J7L50l46J47m2
$$ -51 22 235 277 79 123 -25 -186 -123 -171 -203 122 -43 2 80 -21 -24 -170 -61 -182 -165 185 -161 -14 -56
3789e6j25P1J04K5J75l43R0n0J04J16m0L5j26J26r3k1R1j25J40p7K4L5j43k01
$$ -56 -181 -110 -6 19 194 -149 -59 -109 -5 111 71 106 -20 106 13 -8 83 -42 98 21 45 80 -63 -264
3813b64K17J76k19k2k4J66j31Q9r0j37L41m9Jm0O1j5m27K82o0m2L43m8J3j73K8
$$ -264 -47 129 -90 -112 -136 30 -101 -12 -102 -239 102 53 54 14 75 60 -367 -85 -145 -187 156 108 121 -52 -24
3838b4Q7J75l13K6K70k78J54J07j98R2J20k57J38Q8j55j83J03L8L2Q5O3k32J91
$$ -24 63 238 -75 -49 221 -57 97 204 6 98 218 -39 99 187 32 -151 -48 -10 22 107 170 -62 129
3861A29k54oM8K28n4m04M57j9n4q9L46j50q5j07Q8Q6k31l08L76l9r1J80k7R0k02
$$ 129 -125 -131 -83 145 91 -313 144 125 71 -18 328 178 93 -14 74 160 -71 -379 -3 -42 -133 47 20 110 -92
3886i2J58j2j29o4L61k82rQ8l8p8M5N6r1J58m1J89j61J9J03j14k36l7L6K74r8
$$ -92 66 54 -75 -139 222 -60 -69 19 -19 -97 -52 4 -87 71 30 219 58 77 180 66 -170 -207 -171 103 5
3911EO2j9p0q9N5L6L2j78R9J94M8k71L0J90L3m19K16J72l87L55J27l09M3L4Ml8
$$ 5 67 48 -22 -111 -56 -20 12 -166 -67 127 175 -96 -66 124 157 -262 -46 126 -261 94 221 -88 -45 -11 -7 -45
3937d5J58r3M5Q0n4k30J83j77j09J31r6K73J8j33K40j08k66J45Q0j86K28q9j65
$$ -45 113 20 65 145 91 -139 44 -133 -242 -111 -207 66 84 -49 191 83 -183 -38 42 -144 84 -5 -170
3960a70J84K66l20j1N6j40k16K13J26M8o7k51K81l9j37K82p5J84l73j43L17l26
$$ -170 14 280 -40 -51 5 -135 -351 -138 -12 36 -31 -282 -1 -40 -177 105 30 214 -159 -302 15 -311
3982c11L46k76K45or4J00R4k16J41L7L1j03o6J23J15j12r2j36L61k57l5J55m1
$$ -311 35 -241 4 -2 -96 4 98 -118 23 60 91 -12 -78 45 160 48 -44 -180 181 -76 -111 44 3
4005Co7K23j71j41J06J10j04k0M9L2l1N6K65l77K13j08n9J43j9k03K20j61J90
$$ 3 -64 159 -12 -153 -47 63 -41 -61 -12 20 -11 45 310 -67 146 38 -21 122 103 -100 120 -41 149
4028A49Kn0k9J11k39J4lj6P5J20j66k81L50L3k34K68k33J52L20l99k3J20J80j80
$$ 149 151 101 72 183 -56 -42 -45 -61 14 134 -32 -313 37 70 -164 104 -129 23 343 -56 -79 41 221 41
4052D1N9k59J63k83J55J63RJ87l12J13K32k89k78L45J27k66q2L02j28j37m8n1
$$ 41 100 -159 4 -279 -124 39 48 235 -77 36 268 -21 -299 46 173 -93 -175 127 -1 -138 -186 -237
4074b37J99j78K10j8j08L04j77Lj53J38l4J33j0qj60L09k18J12j49p7O9j41K80
$$ -237 -38 -216 -6 -24 -132 172 -5 -2 -155 -17 -51 82 72 64 -96 213 -5 107 -42 -119 -50 -191 89
4097H9l49J83J72k40K88k64L5J47pP2K6j54J84J32O9o68L50J6k44K58m7R4m53
$$ 89 -260 -77 95 -145 143 -121 -86 61 54 126 152 -2 182 314 383 -285 65 81 -163 95 48 142 -311
4120c11K66M5J75j6j51J13j82K18j54p1R5m0j20j22J14P8O5k79J76P3J91m15K42
$$ -311 -45 0 175 159 8 121 -61 157 3 -68 27 -13 -133 -255 -141 -63 2 -277 -101 -28 163 -252 -10
4143a0n0J28J8n7Rj45K03M9k14O4j14q2K64j96J29J46k58K13pl17K1O4L00m08
$$ -10 -60 68 86 29 38 -107 96 145 -69 -5 -119 -201 63 -133 -4 142 -116 97 90 -227 -206 -142 158 -250
4167b50Q9L3K03k6Q6j71J34k85J71J57l37J82n7J75j05k33M07l24mJ68j30RJ30
$$ -250 -161 -128 75 49 135 -36 98 -187 -16 141 -196 -14 -71 104 -1 -234 173 -151 -155 13 -117 -108 22
4190B2j74pJ08K40l19K59j92Q0N6j8l3k09K2K75j52m3N6RL09j75O5j66L9n3j21
$$ 22 -152 -159 -51 189 -130 129 -63 17 73 55 22 -187 -165 110 -42 -85 -29 -20 289 114 179 13 52 -1 -122
4215a22J67J34n1l26K96N0k50J11KJ23j59R1q8J16k25J08l22L49J29m20N22l56
$$ -122 45 179 128 -198 98 148 -102 9 11 134 -25 66 -22 94 -131 -23 -345 4 133 -287 235 -121
4237a21q1l5M92l43j1L9K09L8r9L92m57k7N1l01L42j11PJ03l43K63k27L58Nj76
$$ -121 -202 -237 255 -88 -99 -60 149 187 88 480 23 -4 47 -254 88 -23 -16 87 -256 7 -220 138 143 -33
4261c3J5L04p4k15K4q0R1p4m7p5L05q0O0k44J06o5J43j11J56J2j28n8k35M17l31
$$ -33 -18 286 212 -3 21 -59 32 -42 -89 -164 141 61 121 -123 -17 -82 61 -50 106 118 -10 -68 -303 114 -217
4286b17K10M5K05n14J29J21O7k32J92k1l1J2K79p2r6o0o6j33J46P3j6nQ9k04J28
$$ -217 -7 38 243 -271 -142 -21 46 -186 6 -15 -46 -34 245 173 77 17 -49 -182 -36 37 21 16 105 -99 29
4311B9O1k17J12k12L32l29J04P3N7K4O8j74j6J78p5J01j67J73k0k5K1M2Rj09o1
$$ 29 90 -127 -15 -227 105 -224 -120 -47 10 34 102 -72 -88 90 15 116 -51 122 102 77 98 140 149 40 -21
4336b1O1l9j49Q2J26l5K63k78j21O2R8J55j21r1k61J85N2r9r3N7R0J92j70R7j48
$$ -21 40 1 -148 -66 60 25 288 10 -111 -49 49 204 83 -8 -269 -84 -32 -131 -224 -167 -77 115 -55 42 -106
4361a06m1L49k91K74rmj16L0j33Q4J34j45j90J76k9j10j00J14J79j78R8Q3l24
$$ -106 -147 202 -89 185 176 172 56 86 -47 37 171 26 -164 12 -17 -127 -227 -113 66 -112 -14 69 -255
4384b55L15j49o8k7O7jj7K32l70L56k70L33k43jK77k19K6L73l02j41M3l0J00m3
$$ -255 60 -89 -157 -184 -117 -118 -135 97 -273 83 -187 146 -97 -98 179 -40 -14 359 57 -84 -41 -71 29 -14
4408a4r4K93j10j5k0k16K79k18l5mJ21J87O9l84P4J48J24o1k46m0J17m0l1J43
$$ -14 -108 185 75 60 40 -176 103 -115 -150 -154 -33 154 223 -161 -87 61 185 124 -122 -162 -45 -85 -116 27
4432B7R3j96K6K42j73l6R9k53K48k47L4K20K3j96J03K2k70O7K17k69J51k1O4L39
$$ 27 120 -76 -50 192 19 -17 82 -171 77 -170 -136 84 107 -89 14 36 -234 -167 50 -219 -68 -89 -25 314
4456C14k98M4q7j41K35O7j75J82j76J89r3j60J57q0J33j02q6M0J24M9l8J8k09
$$ 314 16 60 -27 -168 67 134 -41 141 -35 154 61 -99 58 -22 111 9 -77 -37 87 136 98 116 -93
4479i3k08O9K48K5j41L33l12j84kJ60K35l5Rk07K09j34r1L19m48L34k47K31K15
$$ -93 -301 -232 16 41 -100 233 -79 -263 -265 -105 130 95 104 -103 106 -28 -119 200 -248 86 -161 70 285
4502B85k6l74O1j17K06j33R0j57L7K37j94l9K05J14k37J11j50K68l83L70j96k36
$$ 285 259 -115 -54 -171 35 -98 -8 -165 -128 109 -85 -124 81 195 -42 69 -81 187 -196 174 -22 -258
4524b58K85k36M08j39j27O1j5J93m46L75J70k32O7k32K50k6M7j22j88M9K83k77
$$ -258 27 -209 199 60 -67 -6 -21 172 -274 101 271 39 106 -126 124 98 145 23 -165 -116 167 -110
4546a10J07n6mJ23j06Q4l4Jk24J45K11j48K24o2jk96k4K00j07K79k54K63j26j9
$$ -110 -3 -59 -63 60 -46 38 4 5 -219 -74 137 -11 213 151 150 -146 -170 30 -77 202 -52 211 85 66
4570F6L3l18K72j00J49j20k32RK71j53L11j76r0M8k40K80J58k81J22R0k2L2k51
$$ 66 99 -219 53 -47 102 -18 -250 -241 30 -123 188 12 -78 -30 -270 10 168 -113 9 99 77 109 -142
4593a42O9J08k5j23p4K9m6o2M8J48L06k16j13P4RKqQ8p1J46P5j82J5n8O2j15K05
$$ -142 -73 35 10 -113 -187 -158 -204 -266 -218 -70 236 20 -93 -19 -10 -8 -16 72 1 147 222 40 55 -3 59 -56 149
4620A49k64J54j02j47K90J90o51L80K11j88j43j17L69K8j26k21J81r8J46k29L82
$$ 149 -115 39 -63 -210 80 270 -381 -1 210 22 -121 -238 131 159 33 -188 -7 -105 41 -188 194
4641A94k29m0n0L37j11k33J34j54M1j4K27k21J38N6O5K6j39O2k30J99Q8j02k9
$$ 194 -35 -75 -125 212 101 -132 2 -152 -111 -125 102 -119 19 75 140 166 27 89 -141 58 146 44 15
4664A5j22N9J25J01N3k82j1j10M46j98j34m7j79L30k4J6jj08J05q9O9j3OJ13K64
$$ 15 -107 -48 77 178 231 -51 -62 -172 274 76 -58 -105 -284 46 22 38 37 -71 34 -55 14 1 7 120 384
4689C84l94R7j37J58j07K96k94P0jm6m8J93l33J53P5j84J54j90K83r7j59O0rM4
$$ 384 -10 87 -50 108 1 297 3 73 72 26 -22 171 -162 -9 66 -118 36 -154 129 32 -127 -67 -76 -32
4713c2J6p7K30j19k73K14J81q5j65J3j98K91j62L39q8N8l83jO2L37l3J15l44K04
$$ -32 -16 -93 137 18 -255 -41 140 55 -110 -97 -295 -4 -166 173 85 143 -240 -241 -179 158 125 240 -104 100
4737A00q0k59J70n7O1N7J87m2j87J7M1l28K41L37j82l03J94J65l23K23o0QJ79
$$ 100 20 -239 -69 -126 -65 -8 179 137 -50 -33 8 -320 -79 258 76 -227 -33 132 -191 32 -28 -20 159
4760A59j47j94K36L51m58L07j50l67L5Q5Q8p5M12k00j04J23M5O6l18l7J10L3J88
$$ 159 12 -182 54 405 -53 254 104 -263 -228 -143 -55 -130 282 82 -22 101 146 212 -106 -143 -33 0 188
4783A88k68k6%K10j58k01J3J27q9L17o7m5j8M6R5K3l4j44J05O1l57J05J31K65
$$ 188 -80 -106 -106 104 -54 -255 -242 -115 -204 113 46 1 -17 29 124 147 113 -31 74 135 -222 -117 14 279
4807B79j80k08K50Ol91K39J87j62l6J08p3r4l2J07m3j02k7K14k38J66r1J59J21
$$ 279 99 -109 141 147 -244 -5 182 20 -16 92 19 -75 -107 0 -43 -145 -172 42 -196 -30 -121 38 159
4830A59k61M9M6k6RP0q8N4M0j29K74Q4l78J55k05j53K48P9pj44K46K81l93j38
$$ 159 -102 -53 -7 -33 -24 46 -42 12 52 -77 197 281 -97 58 -147 -300 -52 27 20 -124 122 403 10 -128
4854a28L90j62k23q0Q1k97L27L6J39J17N9k95J18m5k16N10j72m0k88L62j00Q6
$$ -128 262 100 -123 -203 -122 -419 -92 -56 83 200 259 -36 82 37 -179 331 159 119 -169 193 93 179
4876A79k37J34j04J30q0k66Q1L06j55M63l05j46J40k62M8N5L8k50K16J77l16J61
$$ 179 -58 76 -28 102 22 -244 -163 143 -12 451 146 0 140 -122 -74 -19 19 -231 -15 162 -154 7
4898G%O9jp7j02k07M18j55J20l3j42r2J02J23K2k48K02o7K16l52kQ4j5j26K22
$$ 7 7 76 75 -2 -104 -311 107 -48 72 39 -103 -195 -93 30 52 -196 6 -61 155 -197 -199 -115 -130 -256 -34
4923c4j22j90L47j58K50O6j18m3J29j8q6p5J66m30J3L12j21N3o8Q3N2l38K61N9
$$ -34 -156 -346 1 -157 93 159 41 -2 127 109 23 -52 114 -316 -303 9 -112 -59 -127 -44 8 -330 -69 -10
4947a0l8n8K8Q7n2j08L80j34k17J84l25K07K08J80m47K11N1l88L39m0o0j78K25
$$ -10 -48 -106 -78 9 -43 -151 229 95 -122 62 -263 -56 152 332 -115 96 147 -241 98 58 -2 -180 45
4970D5K19j75j3k20r8M51k64j00K44L1Q3k17K6n2J58k51J90M0%l3O6j97q9K41
$$ 45 264 89 76 -144 -242 209 -55 -155 89 120 203 -14 12 -40 118 -133 57 97 97 64 130 -67 -156 85
4994H5k71L82m33K92lM1j32J3J13j48K96k44LK9Q8l4nq4j97N0K54k34j27J24M67
$$ 85 -186 196 -237 55 52 93 -39 -26 87 -61 235 -9 -6 23 111 77 72 -12 -209 -159 95 -139 -266 -142 325
5019C25j97Qk2k56K58l64L74K0o2m7k00K89k43J99J33j36j91m9q3M40k95K4N8
$$ 325 128 136 114 -142 116 -248 126 146 84 37 -163 126 -117 82 215 79 -112 -161 -244 196 -99 -75 -17
5042a7N0j08J55r1P7O6j65k21K01j66J95J04J7k29j42N20k09l08J84K64j30j50
$$ -17 33 -75 80 -11 66 132 -33 -254 -53 -219 -24 80 97 -132 -274 246 37 -271 -87 177 47 -103
5064a03J25O0k61O0J41P8m2j05jk50L05k0J97j69k7J13j9M3N0l98K79j25Q0J17
$$ -103 22 82 -179 -119 22 100 58 -47 -48 -298 7 -13 184 15 -12 101 82 125 175 -223 56 -69 11 128
5088A28r9j95L48k61M0l31M14k31L6R7L4K25r0j83jL5j99J41m1M06m39Q4O9NJ86
$$ 128 29 -166 182 -79 -39 -370 44 -187 -151 -54 -20 205 115 -68 -69 -34 -233 -92 -133 273 -166 -82 -13 -8 178
5113A78mk70L72l88J68j29J62k88O11m09k25M57k85j1j2K42k01K82j57p2O2n0
$$ 178 174 -96 276 -112 56 -73 89 -199 412 3 -222 235 -50 -61 -73 169 -32 250 93 21 83 33
5135C3j03k9J47L3r3J67k27Jj16r7L36j07QJ71k69K21Mk69J9L40j10L37n79J97
$$ 33 -70 -99 48 81 -12 155 -72 -71 -187 -284 52 -55 -47 124 -145 76 80 -189 -170 170 60 397 -182 15
5159A5L54l61N7k57L97k66m3J03oj51J32J47o8m3k3K5M8k17L25j60J7j08J03Q8
$$ 15 369 8 65 -192 205 -61 -104 -1 -7 -158 -26 121 53 10 -13 12 60 -157 168 8 25 -83 20 108
5183A08j44K0q7J29r1J7n5L3O2J65m43L40l1K03k24jM9j26N9J5J34M7l51K23M6
$$ 108 -36 -16 -103 26 -65 -48 -103 -70 -8 157 -286 54 23 226 2 1 50 -76 -17 -2 132 179 -172 51 97
5208I7P2K8q5NL72m52J8j26K07j13l83M06k53L29k46J14j12j24K8J70m0k23L61
$$ 97 169 197 112 117 489 37 55 -71 136 23 -360 46 -207 122 -124 -10 -122 -246 -218 -48 -88 -311 50
5231E0L7l98L73k85J32o5L50l59J20k4J63r4L7J5O9J0J24l55n2K85j59m4n2J77
$$ 50 87 -311 62 -223 -91 -156 194 -165 -45 -69 94 0 37 52 121 131 255 -100 -152 133 -26 -70 -122 55
5255E5j71j21L45M3J1j4r4k55n6J60O5J34p9j28j08L56L1j20J04k92K21jn9m5
$$ 55 -116 -237 108 151 162 148 54 -201 -257 -97 -32 102 23 -105 -213 143 174 54 158 -134 87 86 27 -18
5279a8K5O6J85k12Q0k6j68L12Plp8p4k32J19j50N6R2K78j95j13J21J13j85J8J07
$$ -18 7 73 258 46 126 100 -68 244 251 248 170 96 -136 -17 -167 -111 -19 259 64 -49 72 185 0 18 125
5304A25J1o3k06J27J2O1j02n8K78j46K0K2j66k9K70j26r7M6r2K13o0P1q1k07L75
$$ 125 136 73 -133 -6 6 67 -35 -93 185 39 59 81 -85 -114 156 30 -67 -21 -113 100 40 111 30 -177 198
5329A98j23K49n32J71Q3k0j50K49m5k19K95N8j54J4j57K03n8r5r4J7J37r4R2m63
$$ 198 75 324 -208 -37 46 26 -124 125 80 -139 156 214 60 74 -83 120 62 -33 -127 -110 27 -67 25 -438
5353d38K54J53R6j98J83j69%K19r5J25k5j49J08k41J86Q4n9J60j71p1Q6j54M09
$$ -438 -184 -31 65 -133 50 -119 -119 100 5 130 105 -44 64 -177 9 93 34 194 23 -48 38 -116 293
5376B93l52lJ2O0n1O9k45L6J09K9q4L82l66m7O5j74K73J1o7L07n94L77J48k88
$$ 293 -59 -62 -50 10 -41 28 -217 -181 -72 -43 -127 255 -111 -158 -93 -267 6 17 -50 257 -337 40 188 -100
5400a00K0J65j63K20k21J06R5j87J46L4r5j36oK54q0P0J21j16r7j38J34m3q7J07
$$ -100 -80 85 -78 142 -79 27 122 -65 81 115 20 -116 -122 132 52 122 243 127 30 -108 26 -17 -104 3
5424CN0j7r5O7p9P4L4J95k39J25L8k05j7J27J84n26K71K12Q1l55o9J94q1L1J74
$$ 3 53 36 -59 8 -71 3 37 232 -7 118 156 -49 -66 61 245 -281 -10 202 283 -72 -141 53 -28 3 177
5449A77k28N8J14k44J44k18J51L0K9J39J30r3j45oJ51j11j02k56J87L80o8q2j02
$$ 177 -51 7 121 -123 21 -197 -46 -16 13 152 282 189 44 38 189 78 -24 -280 -93 287 219 137 35
5472C5Qj32J53O2l18J05J98o3q0J42j57QPn1j81N5J93r8K84l08K48k46K55j77
$$ 35 43 -89 64 126 -192 -87 111 48 -32 110 -47 -39 -32 -83 -264 -209 -16 -114 170 -138 110 -136 119 -58
5496e8K2K32n3Lm7j58m1J09j28rL9L07m23K33J40m82J12O5L37k26o0J12J08r4
$$ -58 -36 196 143 146 99 -59 -100 9 -119 -128 -89 218 -205 28 168 -314 -202 -137 200 -26 -86 26 134 40
5520D0k65J42K29p4j10k1K7M8L3Q3k00P5J16N7k38O6J44J3l35J16j82J81M4J08
$$ 40 -225 -83 146 72 -38 -59 -32 16 49 132 -68 7 123 180 -58 8 152 165 -170 -54 -236 -55 -11 97
5544I7kk44J28j4J55k53L6P2l0j3J53k2j11m4K43j18k0K3l53L08j1O3l68L52K1
$$ 97 95 -149 -21 -35 120 -133 -97 -25 -55 -68 85 63 -48 -92 151 33 13 36 -317 -9 -20 43 -325 27 48
5569D8j06J38k14Q1j26J56J51j62P9q8pK4q3M8k05K33K28l67L01j61O9k7JM2J0
$$ 48 -58 80 -134 -53 -179 -23 128 -34 45 -43 -50 -26 -109 -61 -266 -33 195 -172 129 -32 37 10 11 53 63
5594F3m1J58k34q7L98j87j25o3R2O0J18R6l89j45M10p1J47J14m15J37J48m7l03
$$ 63 22 180 -54 -141 257 70 -55 -118 -26 34 152 248 -141 -286 124 53 200 314 -101 36 184 137 -166
5617a66J78k16K9K97k25K68j22k8r8K06l5K3k24J42R4L8p9l38L39j05m8J6p0J66
$$ -166 12 -204 -175 122 -103 165 43 15 -83 123 88 111 -113 29 123 161 82 -256 83 -22 -70 -54 -124 42
5641D2r9Q5k45N0n6L18p9R3n6J45j92p2J31J04k02J36j01J39K1l1l81K68O5j37
$$ 42 -57 28 -217 -167 -223 95 16 109 53 198 6 -66 65 169 -33 103 2 141 162 131 -250 18 83 -54
5665e4j19J08N3K1R3p9J33l37J16O1p4l3L40m37M4K64j4j25J65p7j69j7Q7J63
$$ -54 -173 -65 -12 9 102 23 156 -181 -65 -4 -78 -111 229 -208 -164 100 86 -39 126 49 -120 -137 -50 113
5689A13k7q4%j39K43j86K13j9L6q7L8J5n3n1K4k7k1n3J81L1j81K95l00K6k02L50
$$ 113 86 2 2 -137 106 -80 133 114 150 63 101 116 63 12 36 9 -12 -65 116 147 -34 261 -39 -13 -215 135
5715A35L7k88P5L15l2J05l95J60j19K83k59p9J00K8k06K8k66O20j75K2k05l5p7
$$ 135 172 -116 -41 274 242 347 -48 112 -7 276 17 -62 38 66 -140 -112 -378 242 67 89 -116 -151 -228
5738b28K46R7k07O8j00J46Pp8o9O1P1j50J10j47m0K64P1m1m8j62K33j99J1j07
$$ -228 18 115 -92 -24 -124 22 29 -49 -118 -57 14 -136 -26 -173 -213 51 122 81 33 -129 104 -95 -84 -191
5762a91J47L16n98K11L16m21K07o6K21j26N8J8P4k82K31J7j11q8O6J2j60J02J25
$$ -191 -44 272 -326 -115 201 -220 -13 -79 142 16 74 92 166 -116 115 132 21 -67 -1 11 -149 -47 78
5785G8L6j68k3o1O9L8K00q4j45mn6J46J4R9J8k41J21J44J27r1j15n5j22j33M29
$$ 78 114 -54 -77 -138 -69 -31 169 85 -60 -64 -120 26 40 139 157 -84 37 181 308 217 102 47 -75 -208 221
5810B21j98%J61j30r7L49l67k8m8K62l16l4K49k19J91k1j72K2L98q0l47K75P0
$$ 221 23 23 184 54 -43 306 -61 -89 -137 125 -191 -225 24 -195 -4 -25 -197 -175 223 143 -204 71 141
5833A41k68j86K87J29o7J19l69J20O3J34kJ37l52k21L62o5K9P7O6j0k94M25n6
$$ 141 -127 -313 -26 103 36 155 -214 -94 -31 103 101 238 -114 -335 27 -38 -9 68 134 124 -170 255 199
5856A99l74K84j04k04L24j20J68k86P2R1J16j33j4L9j06n0K12l87K43M7M9o1Q6
$$ 199 -175 109 5 -199 125 5 173 -113 -41 50 166 33 19 58 -48 -98 114 -273 -30 17 66 5 91
5879I1j19J28J92n60L80J8j83J56k00M7K01l99L36k44K08k54L81j29j48j2K03
$$ 91 -28 100 292 -268 112 130 -53 103 -97 -50 151 -248 88 -156 52 -202 179 50 -98 -110 93
5900I3j81M5K2j84J91m0q4M26k19J4r3j01K37o4k07Q8R8j71j02J71J94j40M8j22
$$ 93 -88 -43 -21 -205 -14 -54 -138 288 69 83 -10 -111 126 62 -145 -57 41 -130 -232 -61 133 -7 41 -81
5924h1N0k41M59k38j21J73P3k5M0J5m58M14K91j97j05Op0NJ39j05rL23m91N9j5
$$ -81 -31 -272 187 -51 -172 1 74 49 89 104 -354 60 351 154 49 55 -15 -10 129 24 15 338 -153 -94 -109
5949a09J21j3k85N39j33j53k59N20k30L46m06P8m3J5J63j06j97J02J98K5n11L42
$$ -109 12 -1 -286 253 120 -33 -292 228 -2 344 -62 16 -27 -12 151 45 -152 -50 148 173 -338 4
5971DL8q0n6K48j03Q0m8k22J04R2j67jj30K41q9K42j71J15k16L56k10qo5N8k13
$$ 4 42 -38 -94 154 51 131 83 -139 -35 57 -110 -111 -241 0 -89 153 -18 97 -119 237 27 19 -46 12 -201
5996b01jJ55J8J47j92r0Q0o2K21j65j49M50k13l5j01j8J93o8J78K14k33j02m5
$$ -201 -202 -47 -29 118 -74 -164 -84 -146 75 -90 -239 211 -2 -37 -138 -156 37 -31 147 361 128 26 -19
6019a9K06k14k45M73k15k6l2J18J34k92K74j77oJ82j44n5J07j31J01O6r6J42q0
$$ -19 187 -27 -272 201 -14 -40 -72 46 180 -112 162 -15 -21 161 17 -38 69 -62 39 105 9 151 71
6042G1J24m68L19o0J24j01p2K6k5p8j84M19j03LN9J8l51J64J40m8P7J36j72k7
$$ 71 195 -273 46 -14 110 9 -63 -37 -62 -140 -324 95 -8 -5 54 72 -279 -115 25 -23 54 190 18 -9
6066iL2K14l20J18n8M9L1k25J92J1j87J13J37J9J1k44J81J8k24O2K48l61m1O2
$$ -9 23 237 -83 35 -23 26 57 -168 24 35 -152 -39 98 117 128 -116 65 83 -141 -79 169 -192 -233 -171
6090a71N1K82K0k21J25KO5O2m54J80k1J46O8j22j15M4j01l5K79o8j7j58L62j77
$$ -171 -120 162 182 -39 86 88 153 215 -239 -59 -80 66 134 12 -103 -59 -160 -195 84 16 -1 -159 203 26
6114B6l9R0r6j06J50j51M68n38L8J03j7M9R9k37K23n9L9n6j94J51o8K4M0J02l1
$$ 26 -13 77 -19 -125 25 -126 342 -196 -158 -55 -72 -23 76 -161 62 3 42 -14 -208 -57 -125 -101 -61 41 10
6139A0j11j0Q8k6JK38j60j93K09O4k49Q8K35q5L7k32q9J99o7J33J00q7j17M4k18
$$ 10 -101 -111 -23 -49 -48 190 30 -163 46 110 -139 -51 184 99 136 -96 -185 14 -53 80 180 93 -24 20 -198
6164a98K06R6j29j09j78M48j63r2o7K19k35L31j14o7L9Q3r4M3k79J87l09M64Q8
$$ -198 8 104 -25 -134 -312 136 -27 -119 -186 33 -202 129 15 -52 -13 70 -24 19 -260 -73 -382 82 170
6187A70k60J72k55R3J84j15l39M53O3l89j2J53j17R4J53r4R0k43R5m2LK94j75
$$ 170 -90 82 -173 -80 104 -11 -350 103 166 -223 -235 -82 -199 -105 48 -46 44 -199 -104 -146 -143 151 -24
6210b4J96k10j0J67j61o9K58M4l41O9J62k50K20j02J70PK05j5m23N2J67j45k43
$$ -24 172 -38 -48 119 -42 -111 147 191 -150 -81 81 -169 51 -51 119 126 331 316 -107 -55 112 -33 -276
6233b76K34J37J7j40j71K40j49rR2n0j58j04J21L07j20JK11q6p8k46J04J49k8
$$ -276 -42 95 112 -28 -199 41 -108 -117 -25 -75 -233 -337 -216 91 -29 -28 183 97 19 -227 -123 26 -2
6256bR5R4j70K02M8l04J52N5l31K72k26K0J36j60l7l9L30j69M33k40j99K54k74
$$ -2 93 187 17 219 267 -37 115 170 -161 111 -115 -95 41 -119 -156 -195 135 -34 399 159 -40 214 -60
6279f0k1q0J40P5j41l3L00j95O9m0j27J84m9J5l51K42j21J14N4L2n4J41k64J68
$$ -60 -81 -161 -21 54 -87 -120 180 -15 54 14 -113 71 22 37 -314 -72 -193 -79 -25 7 -47 94 -170 -2
6303bK06j77N4o0K8k04J9K27Q1K1n14K40J69k44K63J26l08J00m3Q8m3K03j87j68
$$ -2 204 27 81 21 49 -155 -136 91 172 193 -321 -81 88 -156 107 233 -75 25 -18 70 27 230 43 -125
6327a25O1J87k99J7K21j21J31j60J35k45J42J33n1j57J83j85M9J24k36N1L68j99
$$ -125 -64 123 -176 -159 62 -59 72 -88 47 -198 -56 77 26 -131 52 -133 -84 40 -196 -145 223 24
6349B4j7j4j18Q8q6j6O2K45l14K33j04PQ6Q1j49p8o2J58j26K02m0l29K29P7K23
$$ 24 7 -7 -125 -37 -123 -139 -77 168 -146 87 -17 -10 76 157 8 -70 -132 26 -100 102 62 -267 -38 39 262
6374B62j97J30m4R3j71p0l8RJ80r2j03N5L5m8j72J31K0K23k96K99j12p3J15k70
$$ 262 65 195 151 244 73 3 -35 -26 154 62 -41 14 49 1 -171 -40 -20 203 -93 206 94 21 136 -134
6398a34J17N36l84j57M8m3k40K97N3k91K31q1Q0P8j71N4j27J36RLO8j97q6J68
$$ -134 -17 519 135 -22 26 -17 -257 40 93 -198 33 -48 32 110 -61 -7 -134 2 11 14 82 -115 -201 -33
6422c3l14J80J58q5M36l09o8R9J53r5k94K18J81j18Q3l00J42k38J31j32L59m88
$$ -33 -347 -167 -9 -94 342 33 -35 64 217 122 -172 46 227 109 192 -108 34 -204 -73 -205 154 -334
6444c34K29L5J37kN9j59J13j93P0K3R1o2O2k04K80l4k26J06l6m9N4l8N1k9r9K61
$$ -334 -105 -70 67 65 124 -35 78 -115 -45 -22 69 7 69 -135 145 111 -115 -9 -45 -94 -40 -78 -27 -56 -155 106
6470A06o6Qk02L88k25J07j33k02K88r0j39J91O6j23k06P3K90K9J85j76j83k75
$$ 106 40 48 -154 234 9 116 -17 -219 69 -21 -160 31 97 -26 -232 -159 131 160 345 169 -14 -289
6492b89M14o7q1N2j75J14%Q6N2k74L05l25J42J60j5Nr0J56j02K39k01j73K9J07
$$ -289 125 58 -23 29 -146 -32 -32 54 106 -168 137 -188 -46 114 99 104 14 170 68 307 106 -67 -38 69
6516F9n2k41M51l71k2M40k39K16l80J42K19Q2j95k61J95q4J76l2j14j04J37L5
$$ 69 17 -224 227 -144 -166 274 35 251 -129 13 232 314 119 -142 53 -31 145 113 -1 -105 32 67
6538F7M9j14K56l92J27p9j6J91j7j33j23K52k19J84l1k51K65m1J15j00j01L6j60
$$ 67 116 2 258 -134 -7 -86 -102 89 72 -61 -184 68 -151 33 2 -249 16 -25 90 -10 -111 -75 -235
6561b35M64k45K04q3J33m11L33p7k06J08o8J11J21j98J00j63j61M85k57J24l11
$$ -235 229 -16 188 105 238 -173 160 83 -123 -15 -83 28 149 -49 51 -112 -273 212 -45 79 -232
6582b32J25K99n32J09J32J73K1K03l05j1j40J99J98q3o5j23J36M2l09J88J6l03
$$ -232 -107 192 -340 -231 -99 74 95 298 -7 -18 -158 41 239 156 91 -32 104 146 -163 25 41 -262
6604b62J64M8K19q9j45j00J86k15L02q4j63K61m9k24J47P0n6j29J27K5l9J50j92
$$ -262 -98 -50 169 80 -65 -165 21 -194 108 24 -139 122 73 -151 -4 66 10 -119 8 33 -6 144 -48
6627d8kP1k4j63J69J02o7k00O5N0R9j54lL1J74O5k3r3J32k5j26k2k05K93n0j03
$$ -48 -50 21 -3 -166 3 105 38 -162 -97 -47 52 -102 -105 -74 100 165 142 49 181 156 30 8 -197 96 46 -57
6653e7k2J9rk33N61k80l8Mq5l9J30nL7J95l57K95m20L13j3J23K9l58j32N56k28
$$ -57 -79 -60 -69 -302 259 -21 -59 -55 -140 -179 -49 -54 -17 178 -179 116 -304 9 -4 119 148 -210 -342 214 -14
6678a4K1R5j44J17J8j13J62jj37Ok4j73L44j18J95m93L19j16k37M02k00P4J12
$$ -14 7 102 -42 75 93 -20 142 141 4 10 -14 -187 157 39 234 -259 60 -56 -293 109 -91 -17 95
6701I5k45M8K24M4j7l49K23L8lj55M34l71J85L0k86K62k26O5l7O5lJ73j93q4k1
$$ 95 -150 -102 122 166 149 -200 23 61 58 -97 337 -34 151 181 -105 157 -69 -4 -41 24 21 194 1 -83 -104
6726a04op3J26j21K1R5L6J13R9J43m34L34j94M4J13J80k00J08n69O1J31R8j76
$$ -104 -110 -183 -57 -178 -157 -62 -26 87 186 329 -105 229 35 79 192 372 172 280 -289 -228 -97 1 -175
6749a75J45k1o7O1l1j20O8J74j41NM2K1k61K91Mk50L65l04J8R6O5l2K18j48J53
$$ -175 -30 -51 -118 -57 -88 -208 -140 34 -107 -102 -60 -39 -300 -9 -5 -255 110 -194 -176 -80 -15 -47 171 23 176
6774A76j04l3P7k87O8r7J60J96p6j11Q0j59J9J7J57P5rk45J57N1o2j41o7K38j30
$$ 176 72 39 116 -171 -103 -200 -40 156 80 -31 49 -110 -91 -74 83 158 149 -96 61 112 50 -91 -158 80 -50
6799e0O3k10K80k13J03nK22l77J18K30j27q5J0KP2l20J76l1J29L6q7k05O8J19
$$ -50 13 -197 83 -130 -27 -32 190 -187 -69 161 34 -51 -41 -39 33 -287 -111 -142 -13 23 -64 -269 -201 -82
6823h2L60l01J42j93j59J79K67k0k47Nq1K83j39j23J82k16P4J20j55J91j69K5
$$ -82 278 -23 119 -74 -233 -54 213 193 -54 -49 -130 153 14 -109 73 -143 -69 51 -104 87 -82 -57
6845e7j8j82K35j4rL0Lk87K43K1L97j80l09K59j62R4Q5j59j00J06J21k02O3j36
$$ -57 -75 -257 -22 -36 -45 -15 -12 -299 -56 -35 362 182 -127 132 -30 64 149 -10 -110 -4 117 -85 -22 -158
6869a58J51m3J77j30j5K94l36j44L02l0%j10MJ07J3j47L77l79J53j46R2o5q9L47
$$ -158 -7 -50 127 -3 -18 276 -60 -204 98 68 68 -42 -38 69 82 -65 312 -67 86 -60 32 -33 -122 225
6893B25k24J38j3k35K1j9j07L5J01J45j91K16P2j99MP1j13j62M19k50J2j04J9
$$ 225 1 139 126 -109 -88 -107 -214 -179 -78 67 -124 92 164 -35 -31 40 -73 -235 184 -66 -54 -158 -139
6916a39N35m89K38q1m1P7k0j12J88l01K89k71J77r2MN4rj34l74N37n7K66m07L3
$$ -139 396 -93 145 64 23 100 80 -32 156 -145 144 -127 50 -42 -38 16 7 -127 -501 36 -21 245 -162 -129
6940a29K68j27j42K07k34L07l04K59k3j03LL1J09o5j67L24n47N0M01m55J09J33
$$ -129 139 12 -130 77 -157 150 -154 105 82 -21 -18 13 122 57 -110 214 -333 -283 118 -337 -228 -95
6962i5l4o1J22o7J18K04l05K53k22n1K68r9k00J31N5Pk01K06J11j09l3j43j52
$$ -95 -129 -190 -68 -135 -17 187 -118 135 -87 -138 130 31 -169 -38 17 24 -177 29 140 31 -2 -145 -297
6985b97N15j38n5q6m4n0J70J98j73k59K86K1J28k05M6j59N2J05j46qj12J45j6
$$ -297 218 80 25 -61 -105 -155 15 213 40 -219 67 88 216 11 57 -102 -50 55 -91 -99 -211 -66 -82
7008h2O1N9m9J91j25k2O5L3k41O1k03K42oK1qm5J53j89J85j27j31K56L3j18k12
$$ -82 -21 38 -11 180 55 33 98 131 -110 -49 -252 -10 -16 5 -3 -48 105 -84 101 -26 -157 99 132 14 -198
7033a98J77N4P3L8k13K5P9n3k69M41m05J10J44k07L42L4l58J89k9r8K66J17l4
$$ -198 -21 33 106 144 -69 -44 35 -18 -287 154 -251 -141 3 -204 138 172 -186 3 -26 -124 142 259 225
7056B25j52P0k64M1R3k5r9K81l79L26j02J05o1J61Om31L46l10J99j0J1j81K0k47
$$ 225 73 143 -121 -80 13 -12 -111 170 -209 117 15 120 59 220 226 -205 141 -169 30 20 31 -150 -130 -377
7080c77M43r2j67J81K1J25j5k6r4O4%k53J66j8J9m7R9k4j92K28m0J14k72J07O6
$$ -377 66 -26 -193 -12 9 134 119 93 -1 63 63 -190 -24 -42 -23 -70 29 5 -187 41 1 115 -157 -50 16
7105A6J78l24l2K39j00j3M3k37J84j33K44l5j14J75k59K20k07m5J47k2K3m7K7
$$ 16 194 -130 -162 77 -23 -36 7 -230 -46 -179 65 30 -84 91 -168 52 -155 -200 -53 -75 -52 -99 -72
7128g2L5r5J56n9P1K2L7j01jn6K61k01l05K08m2mK39p3J90j24l7k77L42p0j37
$$ -72 -37 -132 24 -35 36 58 95 -6 -7 -63 198 -3 -308 -100 -142 -146 93 20 210 86 49 -228 114 44 -93
7153i3K09K20k08p6J34Q1m13J81n4R1m0N5j50j31M0K88q4l32M04n4K42j60j54
$$ -93 116 336 128 52 186 267 -146 35 -19 72 32 87 -63 -194 -154 134 50 -282 122 68 310 150 -4
7176dr1m1j61M22j77J17J32r4J15L7j10j22K6J55j79K28l19oj59K28p6m1J93J15
$$ -4 -95 -136 -297 125 -52 65 197 103 218 255 145 23 49 204 25 253 -66 -72 -231 -3 -79 -120 73 188
7200A88Qj99M8K4j05J5oJ29k65K20O1m6j91J02J40k50J89j23k7J48k40K25R1l3
$$ 188 196 -3 45 69 -36 -21 -27 102 -163 57 118 72 -119 -17 123 -127 62 -61 -88 60 -180 45 136 103
7224A03j84J38l8k36K34J83j57j53J32j0J36r1o8j0o9n8J46n1K3J86pq2r0j00
$$ 103 -81 57 19 -217 17 200 43 -110 22 12 148 57 -11 -21 -90 -148 -2 -53 -30 156 149 67 -23 -123
7248a23L71k18r1J03k00r1L06N0Lk28K47J1n5N8p2k31P5Pn6J24j14R3J44r7J14
$$ -123 248 30 -61 42 -158 -249 57 107 110 -118 129 140 85 143 71 -160 -85 -78 -134 -10 -124 -31 113 16 130
7273A30k76J02q6J71j44r2L05j30N1J82j54m3N0J2K2J3k02K00m03L25j30J7q1
$$ 130 -146 -44 -130 41 -103 -195 110 -20 31 213 59 16 66 78 100 113 -89 111 -292 33 -97 -80 -161
7296a61Q7L28j91n2r7N83m56r7lL32k81j26J15K5O7j71K8J18j45K60l86L89j96
$$ -161 -74 254 63 11 -86 497 41 -56 -59 273 -8 -134 -19 6 73 -98 -70 48 -97 163 -223 166 -30
7319c0O6J2J14K3l8l13J7K80q5j31M3l4o0M80o45M73k58K18M8j96K23k17J08q
$$ -30 36 48 162 185 147 -166 -149 131 46 -85 -42 -76 -136 344 -301 172 -86 132 180 -16 207 -10 98 90
7343I0k51J26K36k73R4k38J53r3J1L14k8l28Q3K15M6Nk1l24K15k68n4L91m3j04
$$ 90 -161 -35 201 -72 22 -216 -63 -156 -145 169 141 -187 -104 111 157 162 141 -183 32 -236 -290 101 58 -46
7367d6j92K83J79Lk16j17J19R4lk22L7q7K67m9j50M17k29j98n6J69PR6k37l38
$$ -46 -238 45 224 227 11 -106 13 107 104 -118 -81 -168 99 50 -100 317 88 -110 -166 3 10 106 -131 -469
7391d69N84l18L97l04J77j22J76k76J27QlkJ30J34l66j18K57j82j31L93m4Q8m00
$$ -469 115 -203 194 -110 67 -55 121 -155 -28 -20 -23 -25 105 239 -127 -245 12 -170 -301 92 48 136 -264
7414b64K46N2k5j46J72P2m7rk57j38L86o2J63l90K0J51L56k52J10J05j31N6M0
$$ -264 -18 34 9 -137 35 107 60 51 -206 -344 42 -20 143 -247 -227 -76 280 28 138 243 112 168 208
7437B08m20K47K8k6m0M1K1j29l8J43M4j55j22J90O9o2N7k0Ml72L26m9Q2k08j2
$$ 208 -212 35 63 37 -3 38 59 -70 -108 35 79 -76 -198 -8 61 -1 56 36 40 -332 -6 -55 27 -181 -193
7462a93L22j89J35l64K63M7QR8l16K56j11N6j25R5J98j90k78L51L5k64K9J30O6
$$ -193 129 -60 75 -289 -26 21 29 127 -189 67 -44 12 -113 -18 180 -10 -288 63 98 -166 -137 -7 59
7485E9j95J05J43n8k1K4N1p2j44R5K6O3j72l2J6R1N0l08L64pj55j0j76K17J92
$$ 59 -136 -31 112 54 33 57 108 36 -108 -13 13 76 -96 -128 -112 -21 29 -279 85 78 -77 -87 -263 -46 146
7510A46l94K25j24j2J34K1j58J05M1%O6o0J31j18L92l52J34j4l85NL66l41L37
$$ 146 -248 -23 -147 -159 -25 -4 -162 -57 -16 -16 50 -10 121 3 395 43 177 163 -222 -217 149 -192 145
7533A45l0J6k78K16J53l17Q9j61J92j6j37L0J31J92m11L57k22O5Q6k71K78j52
$$ 145 115 131 -147 69 222 -95 -6 -167 25 9 -128 -98 33 225 -186 171 -51 14 100 -171 107 -45
7555d5O1M3K51k90m9J50k28p5K01J7J24j19j13K47k1l4M5l3J16m18K58L9o0j44
$$ -45 16 59 310 20 -29 121 -107 -182 19 36 160 41 -72 175 154 120 165 132 248 -170 88 127 67 -77
7579g7m1J29j28j09L42j81M1K44l03J35j15q0J51M9k10K10J99k15j10K14J17k99
$$ -77 -118 11 -117 -226 116 -65 -24 220 -83 52 -63 -143 8 57 -153 57 256 41 -69 145 262 -37
7601c7J25l04K76J23j57L5j9J10k63J80o9k57M27j84j51J01J72j62k3J02k40K65
$$ -37 88 -216 60 183 26 61 42 152 -111 69 0 -257 170 -14 -165 -64 108 -54 -77 25 -215 50
7623E0j24R1j22j44M33j09j29r6J77o0N9K45m02j0O4j47O8J61k05K84k06K16L4
$$ 50 -74 17 -105 -249 184 75 -54 -150 27 -33 26 271 -131 -141 -77 -224 -156 5 -200 84 -122 94 128
7646A28k37K27L7p7m6k43R5qR9J3O1J77j93k63J93J59k39K28l6j71j53L25q2l45
$$ 128 -109 118 155 78 32 -211 -116 -124 -25 -12 49 226 33 -230 -37 122 -117 111 75 -96 -249 76 -6 -351
7670c51M90l24J55KO1q0M4j28J02j23J56R5m2O7k50J7J50N7j32J34l07M05j39
$$ -351 139 -185 -30 -28 33 -47 -3 -131 -29 -152 4 99 57 124 -126 -109 41 98 -34 100 -207 198 59
7693E9k28L51k16O7j19q2K24l30K78j48K47P6j62J01j46J35o4k22L81k57p9J07
$$ 59 -169 182 -34 33 -86 -168 56 -274 4 -144 103 179 17 118 -28 107 43 -179 202 -55 -134 -27
7715b7K17l19J40l0l9n5J1J62J29k37n8J13L6P6k13K13n7j6r9K96l29J63m0k16
$$ -27 190 -129 11 -19 -58 -113 -102 60 189 -48 -106 7 43 119 -94 119 62 46 -53 243 -86 77 37 -179
7739a79N4K18j4j7J49l08N24n25K73l04J14J58k18L2r4K26k28K54l54J65M3j14
$$ -179 -125 93 79 62 211 -97 427 -98 175 -129 -15 143 -75 -43 -137 89 -139 115 -239 -74 -31 -145
7761a45K27m54M26k71K16R3j03l9p6k3P0J28LJ6l1j7j63L27l29J12j9J5r0J8j31
$$ -145 82 -372 54 -217 -1 92 -11 -50 -126 -149 -79 49 52 68 37 20 -143 184 -145 -33 -52 -37 -127 -109 -240
7786b40M22l41K0M4K27l39Q5r4r6M33k3j25LQN6j18J72j90M7k8K23J70k82J49
$$ -240 182 -159 -139 -95 132 -207 -122 -216 -312 121 98 -27 -24 -16 40 -78 94 -96 -49 -77 146 316 34 183
7810A83n13K61k79N76j48j21M7K8k93K9M22j47Q5J2p4j99M07o31M5K06J51k4J2
$$ 183 -330 -69 -348 228 80 -41 6 34 -259 -230 192 45 130 142 68 -131 276 -355 -310 -104 47 23 35
7833C5Q4l38K77ppj30K9R0J15k83P5R8J58p1j79m4J49n8P8m2K6j87J98o0L2p8
$$ 35 119 -219 58 51 44 -86 -57 33 148 -135 -60 38 196 125 -54 -98 51 -7 71 29 55 -132 66 6 38 -40
7859d0N8k03J77P7n8j50K2K31k94J16K42j44R6K2l61L92k35O6r1j80M64k84R6
$$ -40 18 -185 -8 69 11 -139 -117 114 -180 -64 178 34 130 152 -209 183 -52 14 -77 -257 207 -77 19
7882A9J44k96L66k5j30k3j93j30K88jj38L2K22j75J79k30j01K84m0Pk86K38mM8
$$ 19 163 -133 233 208 78 55 -138 -268 20 19 -119 -87 135 -40 139 -91 -192 92 52 59 -227 11 7 55
7906E5j96M22j12l2j99j82K19J47j97J58j15k06K38R8N0j99M9J58j78q8JQ8n9
$$ 55 -141 281 169 137 -62 -244 -25 122 -75 83 -32 -238 0 98 148 -51 -2 156 -22 -110 -109 -21 -80
7929h0J09p0Q2r1l1R4j49L2O0j24l3O5O9J46K9j08R6kJ81l9l25q7LpL43j91l5
$$ -80 29 -41 41 -50 -81 13 -136 -104 -44 -168 -201 -136 -67 79 108 0 96 94 275 236 -89 -176 -173 -180 163 -28 -63
7956f3K02l29M6j77M24r9K68l57O9J94l31J53p6O0M4K1O6j91K83L6k19o5J03j38
$$ -63 139 -190 -144 -321 103 4 272 -85 -16 178 -153 0 -76 -16 28 49 115 -76 207 243 24 -41 62 -76
7980g6j9J2J63KL7j72J00j72l0K44j6Q4j08O6k56q8J59J4j64K10j29L39j9j36
$$ -76 -95 -83 80 82 119 -53 47 -125 -155 89 73 157 49 115 -141 -229 -70 -56 -220 -10 -139 200 181 45
8004D5r7J9n8L88l38k2J3J68l2l1k28L38k15j79L66j33J18j02j40p1N5K71j66
$$ 45 -52 -33 -91 297 -41 -63 -50 118 86 55 -173 165 -50 -229 137 4 122 20 -120 -191 -136 135 -31
8027c1j9K02j85J4J63o8k95q1K80O1q2P3k71K7p7K78j0K06k89r7lK54l51K79J70
$$ -31 -50 152 -33 -19 144 76 -219 -300 -20 41 -41 32 -239 -212 -289 -11 -21 185 -104 -201 -204 50 -301 -22 148
8052A48j51j04L48M9k61J98l23L27m70K86J22l87K78q2Q5j18K32j82n3J23k17
$$ 148 -3 -107 241 290 29 227 -96 231 -239 47 169 -218 60 -22 63 -55 177 -5 -58 65 -152
8073a52o3M4K12K31k27k13K14j14K03k01O7l9k13K55mJ36j94j18J99j73J70k1
$$ -152 -215 -171 41 272 45 -168 46 -68 135 -66 1 -38 -251 4 0 136 -58 -176 23 -150 20 -1
8095ak58K91j70K22mJ37l37RJ6J04K39l8j69q1K12j50Nkj67P7M3J37j64q9J15
$$ -1 -259 32 -138 84 80 217 -120 -111 -95 9 248 210 41 -40 172 22 27 25 -142 -65 -22 115 -49 -138 -23
8120b3j6K56j92N6k70J36j1J64j05k1J38N0j98P6L8m2Q1k32L77j66j86p8qJ65
$$ -23 -39 217 25 81 -189 -53 -64 100 -5 -26 112 162 -36 40 78 36 117 -115 262 96 -90 -168 -176 -11
8144a1j55j7J15l9J31j16J62j38J42O0nj16qo1P8n7J70k41J98j29Kj68J60L24
$$ -11 -166 -183 -68 -107 24 -92 70 -68 74 134 129 13 5 -56 22 -35 135 -106 92 -37 -35 -203 -43 281
8168B81l84L9o5R2K6k3J23n5k36Q9J60P9l26K62J9k61K91K85m73J18O0O0l44
$$ 281 -103 -64 -129 -37 -11 -34 89 34 -202 -113 47 126 -200 62 81 -180 111 396 -77 41 101 161 -183
8191a83
$$ Imaginary data points
##PAGE= N=2
##DATA TABLE= (X++(I..I)), XYDATA
0@%%%%%%%%%%%%Pj5J6j6J6k4L2l2M0m8N6o6P4q8J04j20J36j54J77k02K29k60K92
$$ 0 0 0 0 0 0 0 0 0 0 0 0 0 7 -8 8 -8 8 -16 16 -16 24 -24 32 -34 40 -48 56 -64 72 -82 95 -107 122 -138 154
35A54l25L64m08M54n07N64o25O93p66Q47r36J030j134J251j378J517j672J845
$$ 154 -171 193 -215 239 -268 296 -329 364 -402 445 -491 539 -595 656 -722 795 -877 968
53I68k037K252k497K778l102L484l937M487n171O044p207Q831j1252J5226k2810
$$ 968 -1069 1183 -1314 1464 -1638 1846 -2091 2396 -2775 3269 -3938 4893 -6359 8867 -13943
68a3943M1996j71668k93081N78844J25291m45031M9481K98432j61167j18858J54777
$$ -13943 28053 -143615 -436696 142148 267439 -177592 -128111 170321 9154 -109704 45073
79D5073j3110r1638J06384J2698j17432K8600O7630n9162P376O2361o1059m6126
$$ 45073 31963 -59675 46709 59407 -58025 -29425 38205 -20957 -13581 48780 -12279 -58405
91e8405Q8449p004r7465O5776J06220r3443q0058Q7253L2614o0154J2261J3464
$$ -58405 30044 23040 -74425 -8649 97571 4128 -75930 11323 43937 -16217 -3956 9508
103I508k7673L3040P774o2719L6740O3916p1439k3998Q5978l6690p8782P9187
$$ 9508 -18165 14875 22649 -40070 -3330 60586 -10853 -34851 51127 14437 -64345 14842
115A4842N0419q2017q817M9092l4056j1979M9243k1598m6920L6497K9403l6734
$$ 14842 65261 -16756 -25573 23519 -10537 -22516 26727 5129 -41791 -5294 24109 -12625
127a2625j5501K7494J0712r526o634j842N496P898n139o844J1990Q171j9003j3583
$$ -12625 -28126 -632 10080 554 -6080 -7922 -2426 5472 333 -6511 5479 13650 -5353 -18936
141a8936J7577J7818m690j4663r520J2560K1004j2279k0249J3724Q449j3029R722
$$ -18936 -1359 16459 11769 -2894 -12414 146 21150 8871 -11378 2346 10795 -2234 7488
154G488K090l4270M987M2548j2742l2742J5485J1774r575J4158L718k2738Q884
$$ 7488 9578 -24692 -19705 22843 10101 -22641 -7156 4618 -4957 9201 12919 -9819 -935
167i35J5818k1504o53K4974j4861j8573K5573L629k9030J0018K0209k0247l813
$$ -935 14883 -6621 -7274 17700 2839 -15734 9839 13468 -15562 -5544 14665 -5582 -9395
180i395K5330j2335k4186J9378J4302j6570j05J25j9662J5027K8714k6288k1739
$$ -9395 15935 3600 -20586 -1208 13094 -3476 -3581 -3456 -23118 -8091 20623 -5665 -27404
193b7404L3311Q337k4964J0207P278k2075J8204K8347l3702j8650M1152M377l5000
$$ -27404 5907 14244 -10720 -513 6765 -15310 2894 31241 -2461 -21111 20041 24418 -10582
206a0582Q629J7796j9237l497J7173r513o319J8256o906k1852J6387J7665k3164
$$ -10582 -1953 15843 -3394 -6891 10282 769 -5550 12706 5800 -16052 335 18000 -5164
219e164j3664J8828L452p569P011r185j4422K2015J3808k7439m719K5463k156
$$ -5164 -18828 0 3452 -4117 2894 -6291 -20713 1302 15110 -12329 -17048 8415 6259
232F259p362J1178q515j0052K0671k67k4573J0096J3337k0603Q03K1726j0136
$$ 6259 -1103 10075 1560 -8492 12179 11912 -12661 -2565 10772 -9831 -9028 12698 2562
245B562j3151J2026J48o701J1093k226j6378J0336J4806j4480j0230J2387L318
$$ 2562 -10589 1437 1585 -5116 5977 3751 -12627 -2291 12515 -1965 -12195 192 3510
258C510p644N625L785r506L726J2450p902n726J4103n065j9743J4758J7668k3234
$$ 3510 -4134 1491 5276 -4230 -504 11946 4044 -1682 12421 7356 -12387 2371 20039 -3195
272c195j2189J9611O42q755O332r298r844K3356O170k8144J073K1641p692q531
$$ -3195 -15384 4227 4869 -3886 2446 -6852 -16696 6660 12830 -15314 -14241 7400 -292 -8823
286h823J0616m115m670J3636k126j5977R598J4861j2772j1322J4840J0354j2667
$$ -8823 1793 -2322 -6992 6644 4518 -11459 -1861 13000 228 -11094 3746 14100 1433
299A433p494R029N636j476j889r766n225J6735N606k2237l058K0216l370j3836
$$ 1433 -6061 2968 8604 7128 5239 -4527 -9752 6983 12589 -9648 -12706 7510 4140 -9696
313i696O045K793m894J0216L213j3550K191J2687o613p256Q886K413j0654l810
$$ -9696 -3651 -858 -5752 4464 7677 -5873 -3682 9005 2392 -4864 4022 6435 -4219 -8029
327h029Q718M193l100k52J054m055Q86N693p483p024J4158M426j7117k259J0226
$$ -8029 689 4882 1782 1530 2584 -1471 -585 5108 -2375 -9399 4759 9185 -7932 -10191 35
342C5l684m73P550p610n736J1170N34o542J1100N363j5937j704J2966l366p456
$$ 35 -3649 -4122 3428 -4182 -9918 1252 1786 -4756 6344 11707 -4230 -5934 7032 3666 -3790
357c790P099L880p129N09M330o156k080J1532j68j4517J111R439m936j320R928
$$ -3790 3309 7189 60 569 4899 -1257 -3337 8195 8027 -6490 -5379 4060 -876 -2196 7732
372G732o383j1353O331K444n745P531M094j2838K379J2737q934p682J4539M585
$$ 7732 1349 -10004 -3673 -1229 -6974 557 4651 -8187 -5808 6929 -2005 -9687 4852 9437
386I437j1888o76O005k821j539O601J103p805l210L988J477j900J782K885j737
$$ 9437 -2451 -3127 2878 57 -1482 5119 6222 -1583 -4793 -805 672 -1228 554 3439 1702
401A702k014j881j559M966M967p418l786P266k608r136O723J0370n650n372M963
$$ 1702 -312 -2193 -3752 1214 6181 -1237 -5023 2243 -365 -9501 -2778 7592 1942 -3430 1533
416A533r03n713O779J0167p952j0589P241O293j0386j721J1492k319n936L824
$$ 1533 630 -5083 1696 11863 3911 -6678 563 6856 -3530 -5251 6241 3922 -2014 1810
430A810n571o976J5488N945j7086J472J1234j2504m089J7804m323j3242J2858
$$ 1810 -3761 -10737 4751 10696 -6390 -4918 6316 -6188 -10277 7527 3204 -10038 2820
443B820K612k0344P518K2712j0827j3426J3153J307j4443P347J2104r203j561
$$ 2820 5432 -14912 -7394 15318 4491 -8935 4218 5525 -8918 -1571 10533 1330 -231
456b31R997j1297r515J8248K706j7348Q531R027k2012l62K6634r640j9167K0323
$$ -231 9766 -1531 -11046 7202 9908 -7440 1091 10118 -11894 -12256 14378 4738 -14429 5894
470E894M275k6511P850K1666j4935o513J7466p838j4844J4834O070j1608N464
$$ 5894 10169 -16342 -8492 13174 -1761 -8274 9192 1354 -13490 1344 7414 -4194 1270
483A270M787j2660L877J3815r490p952J5261j60j9799M272J5659q238p683J0727
$$ 1270 6057 -6603 -2726 11089 1599 -6353 8908 8748 -11051 -6779 8880 642 -7041 3686
497C686k328j1232J0072O313j2678K833J1074j1570n343J5484j913j1030Q741
$$ 3686 1358 -9874 198 6511 -6167 -3334 7740 -3830 -9173 6311 4398 -6632 2109
510B109L015j1173M923P531q085P18Q469o682l098P395l508l621N875k887o177
$$ 2109 5124 -6049 -1126 6405 -1680 -962 7507 825 -2273 5122 1614 -2007 3868 981 -5196
525e196P393R00r389L843Q181q205n926R049L018o811j286L526P00J531k79m431
$$ -5196 2197 3097 -6292 -2449 5732 -2473 -8399 650 3668 -3143 -4429 -903 -203 1328 1049 -3382
541c382K181O425m780m473Q570j20r271O757P083j2864k017J4278l502j0933P610
$$ -3382 -1201 5224 444 -4029 4541 4421 -4850 1907 8990 -3874 -5891 8387 4885 -6048 1562
556A562Q86p498O427K366j0488M571Q571j2389k219J5170n051j1132J0162L966
$$ 1562 2448 -5050 1377 3743 -6745 -2174 6397 -5992 -8211 6959 1908 -9224 938 4904
570D904j0953N359Q797j0639l340J3579k900j1491O412P374q184r6P107p283m232
$$ 4904 -6049 -690 8107 -2532 -5872 7707 4807 -6684 -272 7102 -1082 -1178 5929 -1354 -5586
585e586J1700Pj2181L003O421n207J830K878r439K623J2362r874j0012J5007K898
$$ -5586 6114 6121 -6060 -3057 3364 -1843 -13 2865 -6574 -3951 8411 -1463 -11475 3532 6430
600F430j4651N699J0619j0438k244J0694m857o606R510O53r683M004P061n109
$$ 6430 -8221 -2522 8097 -2341 -4585 6109 1252 -5354 4156 4809 -4874 -870 6191 1082
614A082k812K930j422J85L867n130m682P158L176p536R65M478n596n63P370l972
$$ 1082 -1730 1200 -222 -37 3830 -1300 -5982 1176 4352 -3184 -2219 2259 -3337 -3900 3470 -502
630e02n281Q242q01q142R358N804j5570N57J6637n682j2522Q682M653n404K784
$$ -502 -5783 2459 1658 -6484 2874 8678 -6892 -6335 10302 4620 -7902 780 5433 29 2813
645B813k33o933O762L808j1904K776J0730r524o794J2283k23j0383O172M333j1148
$$ 2813 2580 -4353 2409 6217 -5687 -2911 7819 -1705 -8499 3784 3561 -6822 -650 3683 -7465
660g465K906J2978q162j1538J1713P926j0583j597N626l843L926P771j3788p590
$$ -7465 -4559 8419 257 -11281 432 8358 -2225 -3822 1804 -2039 1887 9658 -4130 -11720
674a1720K1892K675k3445M893J8501j2034r679J4458j582j0360R313J226j3089
$$ -11720 10172 12847 -10598 -5705 12796 762 -8917 5541 3959 -6401 2912 4138 -8951
687h951P170J0390j2463m670J2643r46p663L580P07k469P287J544j2468j97J3191
$$ -8951 -1781 8609 -3854 -8524 4119 3173 -4490 -910 -203 -2672 4615 6159 -6309 -6506 6685
702F685N02r165M49L053k350J881K649o283K48P646m982p088P577K963r319K877
$$ 6685 7187 -1978 -1529 1524 -826 1055 3704 -2579 -2331 5315 333 -6755 822 3785 -5534 -2657
718b657Q400p415n558O909J028l606M402K19o499J971N687j813j536L146r4k706
$$ -2657 5743 -1672 -7230 -321 707 -2899 1503 1722 -4777 -2806 2881 1068 -468 2678 2584 -122
734a22j375L879K881m376l781N357K477o576j922M416J058J68p8o215k488Q447
$$ -122 -1497 2382 5263 887 -2894 2463 4940 -1636 -3558 858 1916 2084 2006 -4209 -6697 1750
750A750M546p332m798M589K002k097J52k69p99M524J000p946J57J0245j243q353
$$ 1750 6296 -1036 -5834 -1245 757 -1340 -1188 -1457 -2256 2268 3268 -4678 -4521 5724 4481 -3872
766c872M426M158p088m92O686k885j338M673o085o688J0092N200q942j458M562
$$ -3872 554 4712 -2376 -2868 3818 933 -405 4268 -1817 -8505 1587 6787 -2155 -3613 949
781I49k541Q60M644o154m198R813K233r453qN815j765J31N640n452p285Q086O564
$$ 949 -1592 -732 3912 -2242 -6440 3373 5606 -3847 -3855 1960 195 326 5966 514 -6771 1315 7879
798G879q329k398P471k790m935N653n86o475N210M010r072l84Q996m822o389P115
$$ 7879 -450 -2848 4623 1833 -3102 2551 1965 -4510 700 4710 -4362 -4746 4250 -572 -6961 154
814A54K925n298M70L86l275M757O495p144p060P295N468n485k825L829R67j86
$$ 154 3079 -2219 -1749 -1363 -4638 119 6614 -530 -7590 -295 5173 -312 -3137 692 1659 1473
830A473J700l238l748O333M795o708l628N332j236m532M010K768m728q33J291
$$ 1473 3173 -65 -3813 2520 7315 607 -3021 2311 1075 -3457 553 3321 -1407 -2240 -949
845i49j312K824K941n013k858N877J846n775l52L680P56j365M11j879j401L014
$$ -949 -2261 563 3504 -1509 -4367 1510 3356 -2419 -2771 909 1665 300 711 -1168 -2569 445
861D45L609l117k863L019j65l386M094L257o290l218M942O53k241J164k355j296
$$ 445 4054 937 -1926 1093 928 -2458 1636 4893 -1397 -4615 327 980 -1261 -97 -2452 -3748
877c748N396J599p916o34Q310J159n760j456L475J836m31j260QJ653p72k545M01
$$ -3748 1648 3247 -4669 -5303 3007 4166 -1594 -3050 425 2261 1830 570 578 2231 1459 -1086 -685
894f85M294R05n608k865N130L711k831l516j633K158M887k075q324J308Q767j500
$$ -685 3609 4514 -1094 -3959 1171 4882 2051 -1465 -3098 -940 3947 1872 -6452 -5144 3623 2123
910B123p065l36M109K646k8l547j313N056Q55m125P09M206j191l596q16K981L103
$$ 2123 -4942 -5278 -1169 1477 1449 -2098 -3411 1645 2500 -1625 -916 3290 2099 -1497 -2313 668 3771
927C771j393m361j75L741J133j925j899k77K457J963l573l908K581M560j618l857
$$ 3771 2378 -1983 -2158 1583 2716 791 -1108 -1385 1072 3035 -538 -4446 -1865 2695 1077 -2780
943b780Q71K127j631J187M215k057m855L262L268k849l61J778k502J4L587l307
$$ -2780 -1909 218 -1413 -226 3989 1932 -2923 339 3607 758 397 2175 -327 -313 3274 -33
959c3l483M894J337n120J258K018k920l28L460j182j829J095n17j913K969J987
$$ -33 -3516 1378 2715 -2405 -1147 871 -2049 -2377 1083 -99 -1928 -833 -1350 -3263 -294 1693
975A693k323j812P10K024K304r86l913M80O174P25o432p90N595L21l172O93j163
$$ 1693 -630 -2442 -1732 292 2596 1610 -2303 -1823 4351 5076 -1356 -2146 3449 3770 598 1291 128
992A28k285L335J507m307k38K395j115n03K209j875j268L085m43k991K641J287
$$ 128 -2157 1178 2685 -1622 -1860 535 -580 -1083 1126 -749 -2017 1068 625 -2366 275 1562
1008A562l240o31L246L06j844p54K31K342J666k564j411J681m25j90K299j726
$$ 1562 -1678 -2309 937 1243 -601 -1355 -1124 1218 2884 320 -1091 590 165 -25 2274 548
1024E48m932K323O217l624n887L726L827k644o61J468k473J519M694l793l988
$$ 548 -4384 -2061 4156 532 -5355 -1629 2198 -446 -1107 361 -2112 -593 4101 308 -3680
1039c680N260J075n145L099K811n259M90N352l581k397O508k422o591N240M412
$$ -3680 1580 2655 -2490 609 3420 -1839 -1349 4003 422 -1975 4533 2111 -4480 760 5172
1054E172o127j307M554l166j757N653l247o293N933N476p552k540N957j152k280
$$ 5172 -955 -2262 2292 -874 -2631 3022 -225 -6518 -585 4891 -2661 -5201 756 -396 -2676
1069b676N466j681o431N699N004q256p17Q683m241o082P118J851p184L051M407
$$ -2676 2790 1109 -5322 377 5381 -2875 -3592 5091 850 -5232 1886 3737 -3447 -396 4011
1084D011n013M46M974n270k443P959j492p640L678L635n943N13O485l529m924
$$ 4011 -1002 -556 4418 -852 -3295 4664 3172 -4468 -790 2845 -3098 -2585 3900 371 -4553
1099d553M700K395l663R22K128k357j56K911k280k818L407J055k782J437Q23m187
$$ -4553 147 2542 -1121 -199 1929 -428 -584 2327 47 -2771 636 1691 -1091 346 1169 -3018
1115c018J637N828l250n218M063K790m178p63K415p0j86j579j077K654J121k807
$$ -3018 -1381 4447 1197 -4021 42 2832 -1346 -2109 306 236 50 -1529 -2606 48 1169 -1638
1131a638j8L106j111j647J771p60J18L392j229m180J272L212m29p57q41j498J281
$$ -1638 -1656 1450 339 -1308 463 -297 -179 3213 1984 -2196 -924 2288 1859 1102 261 -1237 44
1148D4K433k467k243L778Q98l693j65K792j677j369L293j011l714K464J696m221
$$ 44 2477 10 -2233 1545 2443 -1250 -1415 1377 -300 -1669 1624 613 -3101 -637 1059 -3162
1164c162J449M538l676k654N050l36l481L861J642n878J465N396m414l084N202
$$ -3162 -1713 2825 -851 -3505 1545 1209 -2272 1589 3231 -2647 -1182 4214 -200 -3284 1918
1179A918m83l884K900R93l819K017L237l797n72L781k238k460M431K7n800J850
$$ 1918 1435 -2449 451 1444 -2375 -358 2879 -918 -1490 2291 53 -2407 2024 2051 -3749 -1899
1195a899N404l875k914M932k02l317L124J839m325J225L439l404j997M753j539
$$ -1899 3505 -370 -3284 1648 1446 -1871 1253 3092 -1233 -8 3431 27 -1970 2783 1244
1210A244l705L052R20m061K208K790m577q9M396k023l727L818J340l486R86K039
$$ 1244 -2461 591 1511 -2550 -342 2448 -2129 -2218 2178 155 -3572 246 1586 -1900 -914 1125
1226A125k774M3L437j160l032K657J182k362N39J995j231Q4J303r78j449K055
$$ 1125 -1649 -1606 1831 671 -2361 296 1478 -884 -345 1650 419 503 1806 828 -621 1434
1242A434Kj771J336N73k863k4K632j927o22J628n72j450K117M68k611J390J489
$$ 1434 1436 -335 1001 1574 -1289 -1313 1319 -608 -1230 398 -174 -1624 493 961 -1650 -260 1229
1259A229k396J03K080j459o11J570l68j142J067R08q71Q8N50l45L32K79j413k68
$$ 1229 -1167 -1064 1016 -443 -1054 516 148 -994 73 981 110 198 748 403 735 1014 -399 -667
1277f67J460j026j977J969J901k431k086K662J031j699J62J575j255n60J244m64
$$ -667 793 -233 -2210 -241 1660 -771 -2857 -195 836 -863 -701 874 -381 -941 303 -161
1293a61o9J045l12r08J076r67k3K989o19l748J331K427j921r99K431p8k758K89
$$ -161 -230 815 503 -405 671 -296 -319 2670 2051 -1697 -366 2061 140 -859 1572 1494 -1264 -975
1311i75R24l90k50O76n22l30p11pQ25J370l98j343N28M65O2J09J293n01j347Q85
$$ -975 -51 -441 -691 -15 -537 -867 -1578 -1585 -760 610 212 -1131 -603 -138 -76 33 1326 825 -522 363
1331C63L54j239N10J919q30k210O22J674k27j070p1J315j54k194o93K169K44j366
$$ 363 717 -522 -12 1907 1077 -1133 -511 1163 936 -134 -205 1110 956 -1238 -1931 238 482 -884
1349h84M1L22q62J192J022r20k04J215o82l87O19L26m31K75n52o10O49N06o45
$$ -884 -843 -521 -1383 -191 831 -89 -293 922 240 -147 472 798 367 642 90 -520 129 635 -10
1368a0k76N85J25q99k85P82K23m56p02k57M64O63m86r05J195M01j228O50J516
$$ -10 -286 299 424 -475 -760 22 245 -211 -913 -1170 -706 -43 -529 -1434 -239 162 -1066 -416 1100
1387A100j080o91J892N7j546N37J069n91k22Q21r26j152J186K96p87k51J58l82
$$ 1100 20 -671 1221 1278 -268 269 1338 747 525 1346 420 -732 454 750 -37 -288 -130 -512
1405e12J7M41p9m76N9M21o83J63J012q77j116J443J434j675j140J900J279j282
$$ -512 -495 -54 -133 -609 -550 -129 -812 -649 363 -514 -1630 -187 1247 -428 -1568 332 1611 329
1423C29k60N84l28J60Q67q06j418N94J180r07q66P37j88l00N56m56n71J402P5
$$ 329 69 653 325 485 1352 546 -872 -278 902 -5 -871 -134 -322 -622 -66 -522 -1093 309 384
1442C84j941Q86K376j980j875K552R13j766O55O09j884J326K465k581j718K590
$$ 384 -1557 -671 1705 -275 -2150 402 1315 -451 204 813 -1071 255 2720 139 -1579 1011
1458A011P43k486R30J198k183j79K442j846j923K826L36k590J228J757k650r58
$$ 1011 1754 -732 198 1396 -787 -966 1476 -370 -2293 533 869 -1721 -493 1264 -1386 -2344
1474b344L729j70l152J490K140k797M36K536k235j016K946p62k667K578J115k961
$$ -2344 1385 1215 -1937 -447 1693 -1104 -668 1868 -367 -1383 1563 801 -1866 712 1827 -1134
1490a134N25K507j597j298J834p06o38J981o87l317J385K909j614j762J005M68
$$ -1134 -609 1898 301 -997 837 131 -507 1474 787 -2530 -1145 1764 150 -1612 -607 -139
1506a39l04J184n90j814J497K477k529j591K422K46j280N90N56j264R00N89j512
$$ -139 -443 741 151 -1663 -166 2311 -218 -1809 613 859 -421 169 725 -539 361 950 -562
1523e62K98J866r77k029J240J212p03j015o67N92J573p06j906Q40J371m24k53
$$ -562 -264 1602 625 -1404 -164 1048 345 -670 -1337 -745 828 122 -1784 -944 427 3 -250
1540b50O47j019l43J877k73j245Q63J59r78J019J106j889n86J851j93j545J463
$$ -250 397 -622 -965 912 639 -606 257 416 -562 457 1563 -326 -912 939 746 -799 664
1557F64J36j899Q08K029k118j611K454M0j959J149J015k117N50K154j603o65J745
$$ 664 800 -1099 -291 1738 -380 -1991 463 503 -1456 -307 708 -1409 -859 1295 -308 -973 772
1574G72j222j282L282M59l717P78K791r77j052R92j154l94K727j431l029K496
$$ 772 -450 -1732 1550 2009 -1708 -930 1861 884 -168 824 -330 -724 2003 572 -2457 39
1590C9K499k963r99K243n56j806K078J31j716O66J103k481M25K879p66k737J695
$$ 39 2538 -425 -1424 819 263 -1543 535 666 -1050 -384 719 -1762 -1337 1542 776 -1961 -266
1607b66J235j405J161O18k449M97L124j837k763K552J076j331K4N5j740J318J883
$$ -266 969 -436 725 1343 -1106 -609 2515 678 -2085 467 1543 212 236 291 -1449 -131 1752
1624A752k033r23J143k84q65J713J2j985J019J291j669j93J864q87o50J732p11
$$ 1752 -281 -1204 -61 -345 -1210 503 515 -1470 -451 840 -829 -1022 842 -45 -695 1037 326
1641C26j564K112O42k701P27K897j924k296J908J288j334jk04j581J684J335k440
$$ 326 -1238 874 1516 -1185 -458 2439 515 -1781 127 1415 81 80 -124 -1705 -21 1314 -1126
1658a126j146K734K97j424O05p23r37K411J267l116o29L006l59j753J083N96r09
$$ -1126 -2272 462 759 -665 -60 -783 -1720 691 1958 -1158 -1787 1219 860 -893 190 786 -123
1675a23R83J21j988J051K073j967j829K746L17k866K59K412j313l37R54j635o68
$$ -123 860 981 -1007 44 2117 150 -1679 1067 1384 -1482 -1223 1189 -124 -461 493 -1142 -1810
1692a810K301N20k124N77P72j507J261J379k219o89K886O5k683R09J430j039L47
$$ -1810 491 1011 -1113 -536 236 -1271 -10 1369 -850 -1539 1347 1412 -1271 -362 1068 29 376
1709C76R40j439r56J539N79q15j92l56j26J016p4j664Q24J617j243j830J755J183
$$ 376 1316 -123 -1079 460 1039 224 32 -324 -450 566 492 -1172 -348 1269 26 -1804 -49 1134
1727A134j379p47R71K99j30j03o66N78J768n44k177L90J286N2K32m36j749J016
$$ 1134 -245 -992 -21 278 148 45 -621 -43 1725 1181 -996 -606 680 732 964 528 -1221 -205
1745b05J754j274j211P64L53l86P5p57J71J217k21j472O77J189j272o55J562O59
$$ -205 1549 275 -936 -172 181 -205 -130 -887 -716 501 280 -1192 -515 674 -598 -1253 309 968
1763I68j791N50R41n35m8J057r03r14J323M69j000K30m0p33J006O89j834n66K072
$$ 968 -823 -273 668 133 85 1142 239 -675 648 1117 117 347 307 -426 580 1269 -565 -1131 941
1782I41m06j690J083O48j954O22K235j412j864J610Q66j206M18K94o44N40O43
$$ 941 535 -1155 -72 576 -1378 -756 1479 67 -1797 -187 679 -527 -109 185 -459 81 724
1799G24r73o0J389o37j169J018Q61j406l62J228p88l79R34l26j646J462J287j851
$$ 724 -249 -309 1080 443 -726 292 1153 -253 -615 613 -175 -554 380 54 -1592 -130 1157 -694
1817f94q59J522K12j85J85j69r39J250Q09j544k38J372j77o77M68j64o9K96J74
$$ -694 -1553 -31 181 -4 181 12 -927 323 1132 -412 -650 722 545 -132 336 172 103 399 573
1836E73o46L73N41q66o88J357k25r41l50O02j83j56M74m11m52R26O05o42o26L39
$$ 573 -73 300 841 -25 -713 644 419 -522 -872 -270 -453 -609 -135 -546 -998 -72 533 -109 -735 -396
1856c96R14n59n9R7k14M59N43l19k92l78M08N78k16n26l26M62J19j41l49K44N6
$$ -396 518 -41 -100 -3 -217 242 785 466 174 -204 204 782 566 40 -286 176 295 154 -195 49 105
1877A05m48j41K72q2M1M1K97n36N00J92l14l92O65M41m48o81K71R42k46n31l00
$$ 105 -343 -484 -212 -294 -253 -212 85 -451 49 241 -73 -465 200 641 193 -488 -217 725 479 -52 -352
1898c52O01N67l74r29J75J74M06l12J67n33Q6M68j3m75l78O52J36n36N41R3l83
$$ -352 249 816 442 -487 -312 -138 268 -44 123 -410 -324 144 131 -344 -722 -70 66 -470 71 164 -219
1919b19r0P00%J05p4l63K05J60J49l15j70M38j94k24Nl02l0L00J81J35j100l9
$$ -219 -309 391 391 496 422 59 264 424 573 258 88 526 332 108 113 -189 -219 81 262 397 -703 -742
1941g42J062J21r20P0K06m70L37O85m52m31O15L04n74l7O69j76L41m74k03J19
$$ -742 320 441 -479 -409 -203 -673 -336 349 -103 -534 81 385 -189 -226 443 267 608 134 -69 50
1961E0J19J03n8J62K0o76n3Q62q5p31o6m0j83L31P59j134K51N56k60k64L19m8
$$ 50 169 272 214 376 396 -280 -333 529 444 -287 -353 -393 -576 -245 514 -620 -369 187 -73 -337 -18 -66
1983f6J40O18l96o91K79J176o99k44P41l55j023M87N13m46j88Q21r07m42P91l96
$$ -66 74 692 296 -395 -116 1060 361 117 858 503 -520 -33 480 34 -154 667 -240 -682 109 -287
2003b87j16R5L96n83Q4J26k60N66M13m29p89P11M24o24M74M76o15N0P61n36k92
$$ -287 -403 -308 88 -495 -411 -285 -545 21 434 5 -784 -73 351 -273 201 677 62 112 873 337 45
2024D5O34j12l86J74p6o59P47l5q25P5M96j60q32R31K14p64N66J6m41M19O15m13
$$ 45 679 567 181 355 279 -380 367 332 -493 -418 78 -82 -914 17 231 -533 33 49 -392 27 642 229
2046B29r21R54L22r13O44L80r05L61O87j072l51R40j39r44Q74J46j247M89Q81
$$ 229 -692 262 584 -329 315 695 -210 151 838 -234 -585 355 216 -728 146 292 -955 -466 415
2065D15q71o10J310q1j201N90P26p65L74J005r79m11J039j8j308J278L53j545
$$ 415 -456 -1066 244 163 -1038 -448 278 -487 -113 892 -87 -498 541 523 -785 493 846 -699
2083f99O00J120j096m69J403m25j244J117N5r19L34R30p98q45J084n69n08O76
$$ -699 -99 1021 -75 -544 859 434 -810 307 362 -557 -223 707 -91 -936 148 -421 -929 -253
2101b53N19j123N00J016j396M40J110n94q07R15J52q65L51N16n57j99R54q02m90
$$ -253 266 -857 -357 659 -737 -297 813 219 -588 327 479 -386 -35 481 -76 -275 679 -123 -613
2120f13J100J70q87K10O08q22N9Q57r44l80Q22k86o28N98N07m94J12M62p82K63
$$ -613 487 657 -230 -20 588 -234 -175 682 -262 -642 180 -106 -734 -136 371 -123 -11 451 -331 -68
2140f8O22l55n06Q09k02o60N48p1o20M30L68n88R8P87l27p77O10K74q63M68K53
$$ -68 554 199 -307 502 300 -360 188 117 -503 -73 295 -293 -195 592 265 -512 98 372 -491 -23 230
2161B30o60qR89q87j27M98L10j181J168O3q13M66O38n83m73R60j76p99R25K37
$$ 230 -430 -438 551 -336 -463 35 345 -836 332 395 -418 48 686 103 -370 590 414 -385 540 777
2181G77j377K40J422j027o80Q95J9o12L21J2n93N63P64j475J21J518q53r54J240
$$ 777 -600 -360 1062 35 -645 250 269 -343 -22 -10 -603 -40 724 -751 -630 888 35 -919 321
2200C21J59j160N99M07o95J41J146r86l66R11K08r10L44K21m84LQ23q77l42Q74
$$ 321 480 -680 -81 326 -369 -228 918 -68 -434 477 685 -225 119 340 -144 -141 682 -195 -537 337
2220C37K56j330L58R68r05j13P66l42m08M73N2o79M20K25q16O06O46m02o40R98
$$ 337 593 -737 -379 589 -316 -429 337 -5 -413 60 112 -567 -147 78 -738 -132 514 112 -528 470
2240D70M0q89O99M7m73J35N20o80j12N12j44o86Q00K54j140O4M22p5J01M5j94
$$ 470 510 -379 320 367 -106 29 549 -131 -243 269 125 -561 239 493 -647 -583 -161 -236 -135 -90 -284
2261b84m26O99L12p49N29J21m01L27J76n44QP42l1q55P64J02n13j05M86l65N8
$$ -284 -710 -11 301 -448 81 202 -199 128 304 -240 -232 510 479 -376 388 490 -23 -128 358 -7 51
2282E1J20o10J16O06l13o41L90M66m65j67O68n37mQ59l20q16N27M23l37o3M46
$$ 51 171 -439 -323 283 -30 -671 -281 185 -280 -447 221 -316 -320 539 219 -597 -70 353 16 -47 399
2303C99m15q9M96j99k89N03J17p93O7K92j75j11L42j00n57N03q0m12K83P37m57
$$ 399 -16 -105 391 192 -97 406 523 -270 -203 89 -86 -197 145 45 -512 -9 -89 -501 -218 519 62
2324F2l74J98J10r1O14l03m26J85M91j12k57j22J30J55mk50j65M58J65k71m37
$$ 62 -312 -114 -4 -95 519 216 -210 -25 466 354 97 -25 105 260 256 6 -159 299 464 193 -244
2345b44j9N5j02K14L7k68K23K6l98J63L89J37m49J40J11L36j05n9M6J77k56m44
$$ -244 -263 -208 -310 -96 -59 -327 -104 -78 -476 -313 76 213 -236 -96 15 351 246 187 233 410 154 -290
2367b90M21L88k09O3j85m53j6N64J07o15O8L48k06m9J25l55j06M41j11j78J0j02
$$ -290 131 519 310 373 188 -265 -281 283 390 -225 -157 191 -15 -64 61 -294 -400 41 -70 -248 -238 -340
2389c40M52m4K46n99J29R55m61j95K04Ol15l76N29k57L27J79n41k79O80n3o20
$$ -340 112 68 314 -285 -156 799 338 143 347 353 38 -338 191 -66 261 440 -101 -380 300 247 -373
2410c73j10M80jO7n46q0L74N24n22l05J47J60O03q45K93L3L31q1o4J46K37k46
$$ -373 -483 -3 -4 63 -483 -563 -189 335 -187 -492 -345 -185 418 -427 -134 -101 230 149 85 231 468 222
2432B22j14J36M8k22N6r6Q9J30k84m19L69k46K52o3j8l55O21J57n63L53Q8J00
$$ 222 108 244 292 70 126 30 119 249 -35 -454 -85 -331 -79 -142 -160 -515 106 263 -300 53 141 241
2454B41l04K47k67k79N59K74n37L18K0j56m1L81k37j48o8j50J24j56L49k07l47
$$ 241 -63 184 -83 -362 197 471 -66 252 272 116 75 456 219 71 3 -147 -23 -179 170 -37 -384
2475c84K87J53m48K43L41m59KM51j84k80K31R1N1J5L07m25J12L12k54l22M18K41
$$ -384 -97 56 -392 -149 192 -267 -265 186 2 -278 -47 44 95 110 417 -8 104 416 162 -160 258 499
2497D99n51Q5Q3l24K92J39n67j8J49L95q28M89L64l85J39J41k21N5N75n49j7N5
$$ 499 -52 33 116 -208 84 223 -344 -362 -213 182 -646 -157 207 -178 -39 102 -119 -64 511 -38 -55 0
2519@K46j30j34J81L0k0J44m98p4L48L11p06P5M87r2j13p1j12k89K76J6m55K22
$$ 0 246 116 -18 163 193 173 317 -181 -255 93 404 -302 -227 260 168 55 -16 -128 -417 -141 -125 -580 -358
2542c58N6K60L18n2k11J9L04l40j06M41l45m07N15J83l93P9M65p36j32J120m99
$$ -358 -302 -42 276 224 13 32 336 -4 -110 331 -14 -421 94 277 -116 -37 428 -308 -440 680 181
2563A81n52K80K22j70M3q3k64j69M86j2m59N23m2oJ72m5n89M41O69m79p28Q81
$$ 181 -371 -91 131 -39 4 -79 -343 -512 -26 -38 -497 26 -16 -22 150 105 -484 -43 626 147 -581 300
2585C00J17m18K73Pm12J93M47o86j5N92j46q01N13M64p13K21K80k06l01O70n26
$$ 300 417 -1 272 279 -133 60 507 -179 -194 398 252 -549 -36 428 -285 -64 216 10 -291 379 -147
2606a47m50N35M84p74K21L43j96j24O54l26o55N40L31m02l66O19l73j99P72n11
$$ -147 -597 -62 422 -352 -131 212 16 -108 546 220 -435 105 436 34 -332 287 -86 -285 487 -24
2626b4l58R03k31o71J95K48k09M2L87n70N2L64p1m64M59Q9j7j70J06K48k20L41
$$ -24 -382 521 290 -381 -186 62 -147 -105 282 -288 -236 128 57 -407 52 141 124 -46 60 308 88 429
2648D29n84j28P42M1o08K37K17n15M26J48p09q5O44q9p98L53L34l46J22O09p57
$$ 429 -155 -283 459 500 -108 129 346 -169 257 405 -304 -389 255 166 -632 -279 55 -291 -169 440 -317
2669c17l09Q25m54JN98K8n30J11L30n29J55L71m11J55J11K73o53J77M92o33J40
$$ -317 -626 199 -255 -254 344 372 -158 -47 283 -246 -91 280 -131 24 135 408 -245 -68 424 -209 -69
2690f9K36m35k31P65K5q90N65P0j91l5L46j98k81P87l03o92N64M92n63j56L42
$$ -69 167 -268 -499 266 291 -599 -34 36 -155 -190 156 -42 -323 464 161 -531 33 525 -38 -194 148
2711A48q6j4K39r3l61L04L80p49O8M71k76k16J40J49n31N91k1p63L54O05k44n92
$$ 148 62 48 287 194 -167 137 517 -232 -164 307 31 -185 -45 104 -427 164 143 -620 -266 339 95 -497
2733d97M44K4k25M12%m41K11N93n94J45P2j40j56L30o2k39L4M88n05j50M55j96
$$ -497 -53 -29 -254 158 158 -283 -72 521 -73 72 144 4 -152 178 116 -123 -89 399 -106 -256 199 3
2755Cl08J45K42k63J70j11j4r1N43m64J52N00k63m7n3K62o72L04M97o44j40K90
$$ 3 -305 -160 82 -181 -11 -122 -136 -227 316 -148 4 504 241 194 141 403 -269 35 532 -112 -252 38
2777C8J63j69Op7k58N28j70l50J75L22k59j86N00l42l41K03P6j30n1L72m96N19
$$ 38 201 32 38 -39 -297 231 61 -289 -114 208 -51 -237 263 -79 -420 -217 -141 -271 -322 50 -446 73
2799G3n4k9k58L79J22k88J20K54m55PP53m29o26O68k97J47P8K4j57l79M44l57
$$ 73 19 -10 -268 111 233 -55 65 319 -136 -129 624 195 -431 237 -60 87 165 189 32 -347 97 -260
2821b60m9M36k32j99L14O5m85L59K58k13j76N29m57j27L87n0m38L49L18j45l42
$$ -260 -309 127 -105 -304 10 75 -410 -51 207 -6 -182 347 -110 -237 150 100 -338 11 329 184 -158
2842a58L20J81m97J28M4j57J12R0r3M7J64j65m03R5L29kk31L21r6j27L60k28l64
$$ -158 162 343 -154 -26 18 -139 -27 63 -30 17 181 16 -387 -292 37 35 -196 125 29 -98 262 34 -330
2865c30L12K43k56o5J51R4m0q4k27K1L14k60R5J15J08l26j89J66k5l6K34j85p2
$$ -330 -18 225 -31 -96 55 149 109 25 -202 -181 133 -127 -32 83 191 -135 -324 -158 -183 -219 15 -170 -242
2888b42K75K7l71L35j49J13j24M39k10q0L2L6oJ17o4P3m67L44Mp1l5l8lN8q6q7
$$ -242 33 60 -311 24 -125 -12 -136 303 93 13 45 81 75 192 128 201 -266 78 82 11 -24 -62 -65 -7 -93 -180
2914a80J43j57J80j82K00j87K67j49j0J52Q0j48Jl3M17n01J31J27j55P2j25K03
$$ -180 -37 -194 -14 -196 4 -183 84 -65 -75 77 157 9 10 -23 394 -107 24 151 -4 68 -57 146
2936A46p3o3j52mP9N1l7J12r1J96q0j63P4L6k85L30NJ38l83J50M5q3q4M24n8j87
$$ 146 73 10 -142 -146 -67 -16 -53 59 -32 164 84 -79 -5 31 -254 76 81 219 -164 -14 31 -52 -136 288 230 43
2962D3j5K60l29J67Q8K1q2k86M1J88K50l22j25j38M13k68Nl8j39N0M05p7m57K30
$$ 43 28 288 -41 126 214 235 153 -133 -92 96 346 24 -101 -239 174 -94 -89 -127 -266 -216 189 112 -345 -115
2986a15K88l17K31o7m6r8P2P4O2k7K18k10l1J14l10l4K57J94l33J6L13o06L14
$$ -115 173 -144 87 20 -26 -124 -52 22 84 57 275 65 34 148 -162 -196 61 255 -78 -62 251 -355 -41
3009d1M3m0j29L82j2l49P4K5Q7L8J49l00R8J20q0P0j42j95L66n7o0j11l1K7j5
$$ -41 2 -38 -167 215 203 -146 -72 -47 40 78 227 -73 25 145 65 135 -7 -202 164 107 47 -64 -95 -68 -83
3034h3O6o8J38j37N1L9l5o2K41k03k02K46J12j99k05L56l51L87O2j50M1J30N9
$$ -83 -17 -85 53 -84 -33 6 -29 -91 150 -53 -255 -9 103 -96 -301 55 -296 91 153 3 44 174 233
3057B33j68J03j78J68q7M4p8q0L04k97J6M9p0j52L32n0r2k64M19k73K10n4R5k64
$$ 233 65 168 -10 158 71 115 37 -43 261 -36 -20 29 -41 -193 139 89 -3 -267 152 -121 89 35 130 -134
3081a34K70pj32k0K92k54l51M06J84k40M1o4j26J68K02m26L1M59j73l10J77J51
$$ -134 136 129 -3 -23 269 15 -336 70 254 14 55 -9 -135 33 235 -191 -160 299 126 -184 -7 144
3103A44n79M16K14l40J60J04k58j3n9M13k86J67M7JK4j01M2k80L64P1l36j81K37
$$ 144 -435 -19 195 -145 15 119 -139 -152 -211 202 -84 83 130 131 155 54 96 -184 180 251 -85 -266 -29
3126b9O4j27Q1j33O0K23M7o64O09o0k87K11J71l34L6K26P1n80K42L23j89k0j29
$$ -29 35 -92 -11 -144 -84 139 186 -478 131 71 -216 -5 166 -168 -132 94 165 -415 -173 150 -39 -59 -188
3149a88J83n8M02n36J96K46r9l29M42r3k36o6K40q3l9K47j20k62l3M24k32l2J56
$$ -188 -5 -63 339 -197 -1 245 146 -183 259 166 -70 -136 104 21 -18 229 109 -153 -186 238 6 -26 130
$$ [...]
8191G1
##END NTUPLES=NMR FID
##END=
