##TITLE=1H_SL66(b+c)-Dau-A(f4-4)
 CDCl3,8 sc, 
 1.10.2021
##JCAMPDX= 6.0         $$ Bruker NMR JCAMP-DX V2.0
##DATA TYPE= NMR FID
##DATA CLASS= NTUPLES
##ORIGIN= UXNMR, Bruker Analytische Messtechnik GmbH
##OWNER= root
$$ XWIN-NMR		Version 3.5
$$ Fri Oct  1 09:18:25 2021 Russian Standard Time (UT+4h)  she@DPX200
##.OBSERVE FREQUENCY= 200.1313468511
##.OBSERVE NUCLEUS= ^1H
##.DELAY= (6, 6)
##.ACQUISITION MODE= SIMULTANEOUS
##.ACQUISITION SCHEME= undefined
##.AVERAGES= 8
##.DIGITISER RES= 18
##SPECTROMETER/DATA SYSTEM= spect
##.PULSE SEQUENCE= zg30
##.SOLVENT NAME= CDCl3
##.SHIFT REFERENCE= (INTERNAL, CDCl3, 0, 15.7039)
##AUDIT TRAIL= $$ (NUMBER, WHEN, WHO, WHERE, WHAT)
$$ ##TITLE= Audit trail, XWIN-NMR		Version 3.5
$$ ##JCAMPDX= 5.01
$$ ##ORIGIN= Bruker BioSpin GmbH
$$ ##OWNER= she
$$ F:/spectra/data/she/nmr/H-F/1/audita.txt
$$ ##AUDIT TRAIL=  $$ (NUMBER, WHEN, WHO, WHERE, WHAT)
(   1,<2021-10-01 09:16:48.92 +0400>,<she>,<DPX200>,
      <created by zg, POWCHK disabled, PULCHK disabled
       configuration hash MD5:
       00 E9 B6 7A A2 85 ED C7 34 08 36 98 17 FE 4E 26
       data hash MD5: 16K
       71 89 3A 26 21 BE 92 E5 8D E9 0D 96 D1 30 94 44>)
$$ ##END=
$$ 
$$ hash MD5
$$ 14 C5 AA D8 A1 45 E4 03 7D 4B 35 E9 67 32 47 D8
##$RELAX= 
##$RELAX= 
##$RELAX= 
##$RELAX= 
##$RELAX= 
##$RELAX= 
$$ Bruker specific parameters
$$ --------------------------
##$DU= <F:/spectra>
##$EXPNO= 1
##$NAME= <H-F>
##$PROCNO= 1
##$TYPE= <nmr>
##$USER= <she>
##$AMP= (0..31)
100 100 100 100 100 100 100 100 100 100 100 100 100 100 100 100 100 100 
100 100 100 100 100 100 100 100 100 100 100 100 100 100 
##$AQSEQ= 0
##$AQ_mod= 1
##$AUNM= <au_zg>
##$AUTOPOS= <>
##$BF1= 200.13
##$BF2= 200.13
##$BF3= 200.13
##$BF4= 200.13
##$BF5= 200.13
##$BF6= 200.13
##$BF7= 200.13
##$BF8= 200.13
##$BYTORDA= 1
##$CFDGTYP= 0
##$CFRGTYP= 5
##$CHEMSTR= <none>
##$CNST= (0..31)
1 1 145 1 1 1 1 1 1 1 1 1 1 1 1 1 1 1 1 1 1 1 1 1 1 1 1 1 1 1 1 1 
##$CPDPRG= <>
##$CPDPRG1= <>
##$CPDPRG2= <>
##$CPDPRG3= <>
##$CPDPRG4= <mlev>
##$CPDPRG5= <mlev>
##$CPDPRG6= <mlev>
##$CPDPRG7= <mlev>
##$CPDPRG8= <mlev>
##$CPDPRGB= <>
##$CPDPRGT= <>
##$D= (0..31)
0 1.2 0 0 0 0 0 0 0 0.06 0 0.03 0 0 0 0 0.0002 0 0 0 0 0 0 0 0 0 0 0 0 
0 0 0 
##$DATE= 1633065408
##$DBL= (0..7)
120 120 120 120 120 120 120 120 
##$DBP= (0..7)
150 150 150 150 150 150 150 150 
##$DBP07= 0
##$DBPNAM0= <>
##$DBPNAM1= <>
##$DBPNAM2= <>
##$DBPNAM3= <>
##$DBPNAM4= <>
##$DBPNAM5= <>
##$DBPNAM6= <>
##$DBPNAM7= <>
##$DBPOAL= (0..7)
0.5 0.5 0.5 0.5 0.5 0.5 0.5 0.5 
##$DBPOFFS= (0..7)
0 0 0 0 0 0 0 0 
##$DE= 6
##$DECBNUC= <off>
##$DECIM= 32
##$DECNUC= <off>
##$DECSTAT= 4
##$DIGMOD= 1
##$DIGTYP= 9
##$DL= (0..7)
0 120 120 120 120 120 120 120 
##$DP= (0..7)
150 150 150 150 150 150 150 150 
##$DP07= 0
##$DPNAME0= <>
##$DPNAME1= <>
##$DPNAME2= <>
##$DPNAME3= <>
##$DPNAME4= <>
##$DPNAME5= <>
##$DPNAME6= <>
##$DPNAME7= <>
##$DPOAL= (0..7)
0.5 0.5 0.5 0.5 0.5 0.5 0.5 0.5 
##$DPOFFS= (0..7)
0 0 0 0 0 0 0 0 
##$DQDMODE= 0
##$DR= 18
##$DS= 0
$$ [...]
##$SUBNAM2= <"">
##$SUBNAM3= <"">
##$SUBNAM4= <"">
##$SUBNAM5= <"">
##$SUBNAM6= <"">
##$SUBNAM7= <"">
##$SUBNAM8= <"">
##$SUBNAM9= <"">
##$SW= 18.0517286264689
##$SWIBOX= (0..15)
0 0 2 0 0 0 0 0 0 0 0 0 0 0 0 0 
##$SW_h= 3612.71676300578
##$TD= 16384
##$TD0= 1
##$TE= 0
##$TE2= 300
##$TE3= 300
##$TEG= 300
##$TL= (0..7)
0 120 120 120 120 120 120 120 
##$TP= (0..7)
150 150 150 150 150 150 150 150 
##$TP07= 0
##$TPNAME0= <>
##$TPNAME1= <>
##$TPNAME2= <>
##$TPNAME3= <>
##$TPNAME4= <>
##$TPNAME5= <>
##$TPNAME6= <>
##$TPNAME7= <>
##$TPOAL= (0..7)
0.5 0.5 0.5 0.5 0.5 0.5 0.5 0.5 
##$TPOFFS= (0..7)
0 0 0 0 0 0 0 0 
##$TUNHIN= 0
##$TUNHOUT= 0
##$TUNXOUT= 0
##$USERA1= <user>
##$USERA2= <user>
##$USERA3= <user>
##$USERA4= <user>
##$USERA5= <user>
##$V9= 5
##$VALIST= <valist>
##$VCLIST= <CCCCCCCCCCCCCCC>
##$VD= 0
##$VDLIST= <DDDDDDDDDDDDDDD>
##$VPLIST= <PPPPPPPPPPPPPPP>
##$VTLIST= <TTTTTTTTTTTTTTT>
##$WBST= 1024
##$WBSW= 4
##$XGAIN= (0..3)
0 0 0 0 
##$XL= 0
##$YL= 0
##$YMAX_a= 77575
##$YMIN_a= -135581
##$ZGOPTNS= <>
##$ZL1= 120
##$ZL2= 120
##$ZL3= 120
##$ZL4= 120
##$ABSF1= 10
##$ABSF2= 0
##$ABSG= 5
##$ABSL= 3
##$ALPHA= 0
##$AQORDER= 0
##$ASSFAC= 0
##$ASSFACI= 0
##$ASSFACX= 0
##$ASSWID= 0
##$AUNMP= <proc_1d>
##$AZFE= 0.1
##$AZFW= 0.1
##$BCFW= 1
##$BC_mod= 2
##$BYTORDP= 1
##$COROFFS= 0
##$CY= 11.3945322036743
##$DATMOD= 1
##$DC= 2
##$DFILT= <>
##$DTYPP= 0
##$F1P= 2.36226072786647
##$F2P= -0.459571619588291
##$FCOR= 0.5
##$FTSIZE= 0
##$FT_mod= 4
##$GAMMA= 1
##$GB= 0.15
##$INTBC= 1
##$INTSCL= 1
##$ISEN= 128
##$LB= 0.24
##$LEV0= 0
##$LPBIN= 0
##$MAXI= 10000
##$MC2= 0
##$MEAN= 0
##$ME_mod= 0
##$MI= 1.114404
##$NCOEF= 0
##$NC_proc= 0
##$NLEV= 6
##$NOISF1= 3.799351
##$NOISF2= 2.8
##$NSP= 1
##$NTH_PI= 0
##$NZP= 0
##$OFFSET= 15.70392
##$PC= 1
##$PHC0= -14801.26
##$PHC1= 19.00082
##$PH_mod= 1
##$PKNL= yes
##$PPARMOD= 0
##$PSCAL= 0
##$PSIGN= 0
##$REVERSE= no
##$SF= 200.130013532006
##$SI= 16384
##$SIGF1= 3
##$SIGF2= 2
##$SINO= 400
##$SIOLD= 16384
##$SREGLST= <1H.CDCl3>
##$SSB= 0
##$STSI= 0
##$STSR= 0
##$SW_p= 3612.71676300578
##$SYMM= 0
##$S_DEV= 0
##$TDeff= 0
##$TDoff= 0
##$TI= <>
##$TILT= no
##$TM1= 0
##$TM2= 0
##$TOPLEV= 0
##$USERP1= <user>
##$USERP2= <user>
##$USERP3= <user>
##$USERP4= <user>
##$USERP5= <user>
##$WDW= 1
##$XDIM= 8192
##$YMAX_p= 0
##$YMIN_p= 0
$$ End of Bruker specific parameters
$$ ---------------------------------
##NTUPLES= NMR FID
##VAR_NAME=  TIME,          FID/REAL,        FID/IMAG
##SYMBOL=    X,             R,               I
##VAR_TYPE=  INDEPENDENT,   DEPENDENT,       DEPENDENT
##VAR_FORM=  AFFN,          ASDF,            ASDF
##VAR_DIM=   8192,          8192,            8192
##UNITS=     SECONDS,       ARBITRARY UNITS, ARBITRARY UNITS
##FACTOR=    0.0002768,     1,               1
##FIRST=     0,             0,               0
##LAST=      2.2672688,     0,               0
##MIN=       0,             -135581,         0
##MAX=       2.2672688,     77575,           0
$$ Real data points
##PAGE= N=1
##DATA TABLE= (X++(R..R)), XYDATA
0 0 0 0 0 0 0 0 0 0 0 0 0 0 0 8 -8 8 -8 8 -16 16 -16 24 -24 32 -36 40 -48 56 -64 72 -86 96 -111 126 -142
35 -142 159 -179 200 -224 250 -279 310 -343 381 -421 464 -514 567 -624 686 -758 835 -919 1013
54 1013 -1122 1240 -1377 1533 -1713 1927 -2182 2494 -2883 3392 -4079 5069 -6623 9432 -16138
69 -16138 71320 -1848 -105126 39507 47906 -17898 -22620 27444 5428 -18727 -11575 -9829 -7040
82 -7040 21781 9444 -10589 -10650 -1121 -13941 -7348 8743 -4347 -13284 -8039 -13046 -4194 8058
96 8058 17584 10766 7170 3481 -16320 -3356 24936 14556 -598 2356 4353 -9676 -7096 7413
110 7413 4342 6621 2137 -21804 -20158 8817 16885 -11041 -13405 7547 -2723 -14560 -2232
123 -2232 12072 9162 -3216 -1822 -3248 -6037 -895 4785 13317 10100 -2775 -9884 -4942 9751
137 9751 7604 -685 1989 3084 -1907 -7876 557 9682 2494 -3672 -7672 -6019 -2440 -3059 1071
152 1071 3676 2323 -5315 -13054 -2440 8705 8381 493 -3919 -1493 -3833 -3186 5 3157 10263
167 10263 6769 -4198 -4823 6650 9759 -378 2922 7216 -4496 -9670 -1996 3879 774 -1053
181 -1053 -2569 -9537 -6985 -2137 -2638 3094 5260 -3697 -13286 -4186 8868 4454 1253 4602 4826
196 4826 1651 -2915 -1865 4345 10083 4599 -6650 -913 7134 1520 -1412 4784 6900 -5016 -10914
211 -10914 -6014 -3128 -68 -1963 -7411 -6212 -2284 -4180 -5312 7129 15085 1667 -6715 -880
225 -880 3707 862 262 4409 2679 24 -603 -197 5739 8311 3057 -2811 -1069 2275 -3902 -6008
241 -6008 -163 1284 -3863 -8567 -6379 -1694 1111 2841 1212 1844 -520 -7413 -4428 5683 7568
256 7568 -1289 -3468 3516 3518 -568 584 4990 7105 2103 -3973 -3683 2863 6270 -498 -3437 -716
272 -716 -2241 -5592 -2981 2936 925 -4544 -3318 -2027 -2740 -3656 -1285 3983 5240 402 -5801 -2722
288 -2722 5340 4465 143 1379 4142 1485 -2516 1084 6570 6225 264 -4443 -1656 1739 -418 -2977
304 -2977 -979 1190 -3589 -8243 -5216 1236 3812 -623 -3438 -1311 -373 -2333 -2863 2959 5510 742
320 742 -2259 570 4070 2918 1423 4064 4349 632 -2772 -1507 3588 4298 -659 -4064 -3313 -1639
336 -1639 -2464 -1099 1531 722 -2505 -5504 -3540 -91 385 -281 888 2723 -247 -3335 -126 4063
352 4063 3922 1243 -147 465 1310 1545 1468 1632 3254 1143 -3304 -3265 1145 2698 -650 -1590 -1194 -3662
370 -3662 -5023 -1969 1997 3091 -576 -3114 -2438 756 -672 -2151 1292 3543 -58 -3811 -732
385 -732 4031 4551 2505 624 1627 2044 -32 -928 2472 3696 -918 -4921 -2980 -171 -454 -606 1051
402 1051 1506 -1940 -4455 -3491 32 1887 -869 -3443 -2033 -164 -1078 -830 2704 4684 1965 -721
418 -721 526 3908 4665 2512 1060 1331 232 -2345 -2240 1240 3106 358 -3091 -3752 -2217 -1878 -2349
435 -2349 -798 916 -985 -4902 -3613 779 1728 -17 195 1928 450 -1382 804 4288 5499 1847
451 1847 -2121 -25 3534 2782 283 1558 2593 -1045 -4009 -2429 -1062 -943 -1454 -1780 -2861 -2717
467 -2717 -2849 -2571 1629 3537 -225 -2553 165 1874 462 1061 2414 898 127 -224 -704 2432 5108
484 5108 2223 -1745 245 1659 -1358 -1354 1696 933 -2236 -3365 -3302 -2101 -49 -42 -1565 162 679 -2911
502 -2911 -2936 2349 2881 -883 -1245 586 39 -57 1666 1866 2281 1323 -1584 -1577 2872 3538 -386 -343 1668
521 1668 -615 -2750 -820 1198 1093 339 -1642 -3253 -2248 -787 -1780 -781 1225 -555 -3683 -1013
537 -1013 2765 2456 772 693 1063 457 -44 444 1719 2355 729 -1229 -498 1662 1514 929 1742 2241
555 2241 -110 -2783 -3315 -1007 493 -1028 -2634 -2504 -1763 -1917 -1192 1049 2090 69 -1547 -666 2224
572 2224 2771 891 539 1511 1100 -392 692 1865 2501 2053 377 -874 -482 -190 -1074 -700 995 -656
590 -656 -3730 -3140 -243 -585 -1245 -503 -673 -1567 -1359 -336 1233 2546 892 -1464 -115 3021 2160
607 2160 959 2304 2844 425 -785 -620 -372 617 687 -743 -1135 -291 -1281 -2631 219 1601 -1006
624 -1006 -3203 -1874 -1053 -797 115 -125 -437 -355 -439 -59 2161 3193 1178 -249 1482 1790 -352 -464
642 -464 1520 2087 747 -1076 -1581 -185 868 473 -989 -553 -289 -2093 -2493 -427 563 -1094 -1645
659 -1645 -956 -535 -242 359 857 1138 377 -620 -371 1458 2083 1342 1116 1571 966 -498 -22 1326 1590
678 1590 186 -504 -518 -1096 -1806 -1007 -175 -297 -1485 -2623 -1794 632 501 -1185 -1274 262 3 -912 63
697 63 1850 1757 865 318 414 1134 1408 631 1234 2137 462 -1740 -1211 887 625 -801 -883 -1102 -1213 -936
717 -936 -1125 -851 57 -614 -2245 -1576 674 406 -650 510 1394 386 -952 283 1422 2379 1785 93
735 93 57 1356 661 -780 679 1830 332 -1656 -1034 -149 -8 -229 -853 -1037 -874 -1564 -1390 -178 1000
754 1000 -112 -1319 -851 150 380 191 1372 1448 946 -179 218 892 1634 1353 924 717 257 -411 -336
773 -336 573 701 -288 -1358 -1266 -741 -601 -1022 -844 -64 -891 -1902 -1391 25 584 435 55 -145 383 145
793 145 -20 924 1959 1276 -122 37 932 1412 914 542 401 290 -733 -1158 -230 97 -424 -1456 -1352
812 -1352 -1172 -1435 -1041 84 487 -731 -1536 -701 385 932 626 641 1295 967 114 -166 1393 2157 721
831 721 95 558 295 -180 64 76 405 -278 -1204 -1505 -581 168 -677 -1026 -907 -1005 -1315 -569 592 499 83
852 83 -219 -296 574 632 327 1006 1896 1294 -210 -291 1105 1395 466 -352 6 354 -269 -922 -571 526 -170
873 -170 -1405 -1794 -196 -258 -783 -988 -371 -481 -1060 -516 495 1199 1182 523 4 646 510 323 718 1142
893 1142 826 -182 100 204 370 191 255 -38 -199 -834 -1030 -79 148 -809 -1725 -986 -866 -1002 -457 269
913 269 413 131 -167 -235 359 816 563 677 1081 737 275 399 1486 1117 445 -153 -80 190 155 -24 -296
934 -296 -73 -490 -1296 -1197 -323 -179 -448 -550 -723 -1146 -996 -389 43 946 619 -88 -151 1272 1306 414 1026
955 1026 1280 1123 -13 -174 97 539 32 -727 -951 -428 -546 -782 133 599 -749 -1666 -1025 -595 -432
974 -432 -230 -415 47 -50 -145 -434 587 1463 799 784 972 982 650 513 754 779 187 -343 -401 -224 442 -169
996 -169 -251 -436 -870 -1033 -610 -248 -196 -393 -952 -704 -213 -231 -150 -77 826 343 -269 320 978 779 352 646
1018 646 495 725 506 38 611 1076 -141 -774 -736 -357 -550 -298 -286 -715 -1004 -847 -708 -328 346 -344
1038 -344 -616 -111 45 -348 -295 396 481 234 609 567 530 958 802 586 849 734 -740 -815 505 627 -367
1059 -367 -560 -670 -875 -420 -546 -421 -290 -385 -983 -1065 128 219 -281 135 467 317 -54 381 691 829 785
1080 785 315 -98 706 685 277 735 925 229 -618 -126 -164 -44 -218 -775 -932 -533 -1034 -864 -431 -22 -249
1101 -249 -626 -141 77 292 116 -133 779 852 318 164 428 1294 783 285 176 37 -18 117 587 350 -89
1122 -89 -829 -943 -514 -197 -806 -742 -151 -587 -1127 -330 183 -556 -160 117 211 92 411 -91 541 1326 623
1143 623 -265 371 922 905 286 738 209 -536 -244 -209 -586 171 224 -772 -663 -67 -675 -1111 -114 -99 -485
1164 -485 -681 -95 -198 228 360 247 297 518 148 289 899 1117 282 -70 459 -5 470 357 10 -268
1184 -268 -191 -155 -660 -374 87 -803 -880 -132 -507 -807 -501 -360 -194 18 -172 -448 30 772 512 327 855
1205 855 348 89 400 598 805 396 308 97 93 -238 -166 -164 -185 -161 -954 -697 -225 -509 -600 -520 -280 -333 -272 -366
1229 -366 24 321 381 -314 224 539 278 381 667 775 394 111 84 292 585 229 36 -181 -81 -408 -645
1250 -645 -278 -156 -333 -405 -451 -522 -193 -206 -403 60 -81 -419 -117 455 585 191 139 613 419 406 291 417
1272 417 935 388 -204 -380 104 228 -608 -256 -23 -515 -742 -382 -462 -219 -469 -327 -452 -387 -165 -430 110
1293 110 419 138 -356 419 454 451 589 948 548 566 425 164 460 559 167 -249 -100 -9 -594 -432 49 -358
1315 -358 -571 -694 -347 -106 -135 -72 -258 -175 101 -40 26 438 449 337 168 431 520 343 586 454 672 110
1337 110 -29 86 22 212 -454 -404 -32 -253 -611 -615 -96 -221 -397 -501 -185 11 -188 -152 87 372 24 -55
1359 -55 95 521 412 302 323 626 333 0 269 210 648 132 -400 -231 4 -190 -456 -311 -401 -301 -455
1380 -455 -579 -87 -170 2 -226 -34 87 95 -27 25 384 279 112 315 488 500 450 655 360 211 149 7
1402 7 332 185 -138 -464 -336 -115 -9 -484 -455 -513 -402 -586 -434 -242 6 21 90 123 188 -59 303 188 443
1425 443 242 156 304 162 371 298 173 379 159 -227 -280 115 57 -140 -468 -445 -277 -677 -653 -609 -77 -223
1447 -223 -371 -170 73 167 409 157 138 101 54 422 755 731 357 211 460 291 321 133 219 89 -101 -403
1469 -403 -53 -130 -161 -608 -576 52 -353 -465 -352 -143 -141 9 -246 8 44 -22 -126 326 505 531 -15 186 360
1492 360 293 468 214 346 4 -33 -195 40 231 -500 -640 -475 -174 -568 -500 -268 -202 -344 -144 -247 -90
1513 -90 275 184 -41 196 319 5 135 367 670 181 173 145 234 240 263 -20 26 47 -277 -299 -77 -258 -492 -328
1537 -328 -378 -354 -401 -727 -180 326 198 -127 -212 448 244 159 432 363 146 262 260 268 353 280 11 -84 -76 121 -96
1562 -96 155 -68 -129 -413 -226 -161 -589 -227 -533 -228 -497 -498 -536 143 510 -233 -133 488 589 202 310 450
1584 450 429 318 295 79 209 427 -257 -262 109 -61 -367 -315 -57 -315 -381 -200 -274 -533 -280 109 -335 -154
1606 -154 111 -683 -242 210 136 262 88 277 -104 488 396 306 319 235 67 163 289 88 -45 -107 -135 -318 -278
1629 -278 -562 -492 -230 -73 -207 -274 -133 -119 -296 88 464 -23 59 458 278 290 401 349 160 388 35 6
1651 6 245 405 -63 -210 138 -186 -113 -352 -49 -155 -545 -291 -700 -215 -106 -133 -18 -176 77 -617 184
1672 184 291 263 132 97 166 496 198 95 38 383 422 -42 159 193 -222 -402 128 -309 -327 -172 -391 -266
1694 -266 -232 -346 -390 -150 -154 -156 -164 316 255 -159 131 -16 300 419 309 305 -156 288 310 88 566 160 165 -41 -102
1719 -102 226 -52 -72 -123 -197 -78 -211 -452 -125 -164 -193 68 -151 -11 -274 18 425 -83 185 37 153 430
1741 430 545 250 -44 92 357 37 92 -137 56 23 -231 -116 -37 -98 -327 -242 -36 -217 -272 -286 10 162
1763 162 49 -78 -51 194 252 274 159 196 106 146 41 537 371 104 63 293 115 -1 66 -104 -224 -22 -243
1786 -243 -175 -198 -347 -573 -362 -101 -198 -308 -215 -45 16 22 303 276 -272 207 47 238 285 224 69 245 118
1809 118 120 27 112 390 283 -367 -34 58 -356 -222 -347 -29 -337 -327 -149 -8 -178 -248 -319 -161 170 145 -207
1832 -207 9 382 122 83 -116 259 204 110 117 210 147 7 -71 -54 -103 -307 -232 -50 -42 -232 -330 -80 -95 -295 -35
1857 -35 -57 167 -12 -40 -72 126 113 138 125 315 497 242 73 -59 227 -2 -173 112 93 32 -145 -172 -330
1880 -330 -73 -247 -47 -294 -52 -131 -197 57 -168 -118 -241 43 -173 10 -29 373 483 82 158 267 319 475
1902 475 338 134 109 112 -133 -319 51 89 12 -249 -71 -138 -83 -230 -174 -191 -210 -23 -58 -129 -43 44 97 130 -52
1927 -52 41 67 319 9 200 319 43 532 522 35 -152 191 -49 -249 -259 -16 13 -117 -65 -648 -115 -330
1949 -330 -19 24 79 -33 -251 91 37 143 -20 126 367 473 182 141 116 439 180 -176 125 224 1 39
1971 39 -49 -223 61 -56 -247 89 99 94 -174 -62 177 -102 -179 425 7 216 -24 -122 -13 248 175 236 387
1994 387 138 8 -10 -73 175 116 62 135 -19 -191 1 -383 -4 -110 -298 -244 73 112 -152 15 58 -264 -170
2017 -170 285 111 265 224 -45 257 333 91 50 203 352 444 -104 90 40 -174 110 132 -212 -248 -350 -612
2039 -612 -390 -277 -126 -238 -217 -146 -87 -158 -16 70 145 175 54 51 308 41 211 202 262 19 414 14 -15 326
2063 326 323 161 -40 -22 53 -3 10 -71 -141 -240 69 232 -81 -62 -25 -145 44 64 -46 233 65 -170 -91 229
2087 229 145 133 26 160 292 381 131 223 163 -56 -81 -259 25 -50 -222 -9 28 -311 -36 -435 -23 -79 -25
2110 -25 -332 162 -42 66 -108 212 318 273 265 567 324 -101 218 161 185 -11 158 -115 -156 212 -357 -255
2132 -255 165 -329 -201 -189 151 -151 -336 -320 70 194 -31 -214 -89 68 303 170 98 24 181 196 131 26
2154 26 334 109 98 -52 309 -117 -180 -344 -97 -157 79 -36 -276 -85 30 -10 50 -13 -77 -286 -94 153 6
2177 6 232 130 -108 63 156 238 -53 -27 168 95 240 123 -34 -154 234 -24 -229 -202 -339 -151 -152 -277 -329
2200 -329 -315 27 -147 -377 64 125 21 74 177 140 -180 -105 179 238 -257 421 121 117 210 -95 204 -177 -89
2223 -89 -192 -105 -178 46 -161 -133 -60 180 -240 -378 -238 103 -130 -269 16 12 82 390 -154 33 255 129 78
2246 78 64 164 67 321 -60 -152 197 -210 97 -98 93 -167 -315 -265 -234 -166 -419 -203 -147 -75 -288 44 316
2269 316 -166 22 32 -63 285 363 152 -48 110 213 96 -67 91 -116 164 144 -206 38 -250 95 -111
2290 -111 -109 -304 -193 171 -132 -317 -110 97 217 57 -189 116 235 182 -149 41 411 224 6 169 63
2311 63 121 209 137 -7 -10 273 -185 130 17 -298 -310 -213 -302 -64 -158 -216 -18 -8 -142 41 46 -43 171 -119 88
2336 88 149 -225 -122 90 224 356 -91 -23 215 -159 -63 -56 47 -23 -245 -146 -64 -140 -274 -54 38 -220 -107 -109
2360 -109 64 -17 -191 -121 151 81 -56 -114 25 170 423 50 76 175 50 114 199 198 101 -82 -194 -197 64 -221
2384 -221 -279 -88 -182 2 -365 -181 -170 -64 56 -133 222 -26 -21 -57 -23 -11 -186 -157 145 30 68 -86 171
2407 171 325 238 279 16 275 -74 -52 -86 83 -91 -311 -127 -83 -301 -101 -115 -252 -40 87 119 180 304 -47
2430 -47 78 98 50 108 123 316 374 45 -39 110 98 -4 -81 -154 118 -307 -234 -183 -290 -137 -147 -209 -110 -130 -14
2455 -14 172 -20 -24 25 -54 -366 105 245 50 113 -24 64 -50 177 -132 267 -72 49 136 -23 65 -12 -197
2478 -197 -109 64 106 -181 -61 46 -185 -125 -252 139 -10 -191 69 110 28 -45 -10 71 -225 252 84 -78 33
2501 33 381 -44 -61 255 4 51 -155 -89 -134 0 18 74 -109 218 -94 -129 -47 302 -54 348 82 -4 79 196
2525 196 122 277 100 28 -122 191 253 89 -205 20 21 -83 228 -85 -108 -95 -98 -299 18 -111 -15 -32 -5 -30
2549 -30 -33 17 -65 -11 69 -179 53 163 44 58 103 99 47 -66 -11 369 -6 87 -120 -87 -156 94 161 -172 -301 41
2575 41 -31 148 -111 -295 46 238 46 -93 -30 -77 120 95 -39 -205 338 -30 -108 59 156 470 -56 -37 195
2598 195 156 30 -21 -403 -168 -205 -154 -268 -150 88 -147 15 72 -137 154 -77 78 68 -33 74 108 -52
2620 -52 435 10 -4 122 -92 -45 314 77 277 -33 337 -21 -140 -245 -121 -10 143 -25 -198 89 -106
2641 -106 77 18 155 -78 -39 -180 50 39 54 -53 106 -230 363 25 110 63 59 81 31 141 56 203 -11 6
2665 6 -146 -5 -138 -137 -93 -232 -126 -197 -77 -97 17 268 -11 121 -38 69 169 76 1 295 112 64 48 130
2689 130 -3 -1 -43 -32 -151 -95 109 110 -208 -133 7 -232 -39 -19 -74 -201 -256 -69 -243 -262 -299 10 -54 -1 -141
2714 -141 -328 -128 -52 -125 7 69 180 -44 132 220 349 -148 -197 -54 138 57 -40 -341 48 76 -94 -68 -75 -65
2738 -65 -222 -243 69 126 59 170 251 25 155 66 32 241 103 -10 -109 246 -71 -129 -277 -73 -185 27 67
2761 67 -17 -349 16 -45 -562 -153 -81 -145 -118 -203 -78 -187 130 -301 21 45 -32 340 219 205 -227 326 181
2784 181 210 154 232 10 29 110 143 -152 -141 35 -183 -92 177 0 -297 -51 52 111 -125 155 76 162 9 62
2808 62 165 -114 81 45 26 33 255 58 112 -92 137 25 -50 66 -367 -99 7 -14 -139 -109 127 -360 29
2831 29 115 -179 -273 -127 -12 101 82 -13 14 -138 -15 -115 85 82 179 168 112 -210 292 -6 37 -81 -258 -84
2855 -84 -114 -155 68 -119 -78 -247 -55 -59 -302 13 -71 141 -158 157 -16 91 284 -18 15 -59 -134 7 294
2878 294 22 202 -150 151 66 15 59 48 -272 235 1 86 59 -79 -219 137 -71 -176 135 57 -32 -74 75
2901 75 42 111 112 121 168 114 83 440 1 -67 209 -266 140 81 -136 -22 29 35 30 -217 -102 138 5 -41 55 108 -97
2928 -97 66 -27 -51 179 388 28 62 162 401 -234 79 36 114 -23 10 126 179 71 -1 -97 -72 14 -57 -246
2952 -246 -178 117 -147 7 126 -27 -258 26 174 31 -93 -5 93 -28 -76 274 101 81 138 -71 152 77
2974 77 94 -189 148 -218 -223 -142 76 -39 -39 -196 -130 -115 -255 -197 -118 -74 169 -95 225 269 238 147 -155 126 50
2999 50 211 188 -58 308 300 13 -154 -117 395 173 53 -109 141 -373 106 -158 -100 -121 180 -251 -160 40 -136
3022 -136 159 112 65 116 -90 -59 458 117 89 76 24 -75 133 -30 91 -65 16 -351 -222 -174 -164 -384 25 -170
3046 -170 -132 -48 6 131 -29 -196 -265 41 -5 -158 -16 -196 86 257 90 253 138 82 199 -7 155 -128
3068 -128 -82 26 179 52 -177 139 16 172 -434 49 -23 -91 2 140 145 31 -48 116 183 302 -86 24 60
3091 60 -82 276 80 205 9 284 -203 72 183 -20 19 128 -116 49 -83 9 227 -126 -156 325 -128
3112 -128 106 -50 -148 -187 125 61 -191 179 -131 42 -65 -80 -26 131 5 -45 -55 -307 36 -127 165 148 -165
3135 -165 -31 -7 -253 -78 -8 -130 -237 -202 -8 -81 -251 -70 -53 -240 152 155 134 -61 255 1 36 283 57
3158 57 -70 40 2 139 14 191 -275 -41 -36 125 -263 71 -161 -352 -164 -14 -51 142 90 -135 -250 -55
3180 -55 -17 -50 111 -51 264 281 159 61 94 160 136 -9 63 129 100 -171 114 14 -58 111 -200 -143 80 46 79
3205 79 95 -67 -82 22 95 -183 -133 -449 56 109 133 142 -24 327 -33 63 408 126 226 -240 207 101 -7
3228 -7 20 -45 298 27 208 245 172 -111 62 -302 -20 31 -99 58 253 11 -18 -154 -29 254 -198 166 71
3251 71 150 110 132 -19 -34 199 -38 -123 -31 37 -138 159 26 146 143 -179 -160 50 -185 -443 -149 -19 146 -129
3275 -129 -74 -42 -19 230 -23 -128 236 63 117 127 -21 -12 101 188 54 240 54 -129 -11 -404 -32 285 -205
3298 -205 32 -151 -69 -233 95 -90 -63 52 28 -9 -4 3 -141 117 277 -34 183 148 -60 -127 -84 -48 135 120
3322 120 -197 -45 154 73 -59 329 -32 -24 -245 -151 -27 -8 102 62 -82 25 66 -203 -312 132 426 244
3344 244 -232 -238 24 118 -214 -120 -102 118 -18 34 -24 231 45 -29 -3 133 38 -294 131 -89 142 -35 -141
3367 -141 -259 -238 -1 134 204 -17 130 -26 59 -229 -211 165 274 87 234 -4 170 -11 -147 -323 -132
3388 -132 -197 67 -150 -114 -197 -112 10 22 -5 135 217 -11 114 -22 -53 -17 199 64 -135 10 164 -8 129
3411 129 -81 -82 -126 -36 72 -157 -89 127 71 -23 -112 -106 18 -2 -281 39 -210 -103 -76 -22 -3 262 -87 57 174
3436 174 343 109 256 127 33 -88 -165 -108 -204 276 179 -6 -38 -38 250 -25 -35 44 -38 -87 -72 83 0 64 98
3461 98 -79 145 -144 127 -44 -249 85 -67 37 -110 -374 -116 88 57 -106 31 149 -175 20 51 52 -18
3483 -18 169 -143 -7 142 98 -275 -253 75 12 31 84 31 -76 95 153 59 28 -61 -48 -106 337 243 69 -49 -145
3508 -145 26 49 45 -43 -265 -178 -287 -5 -94 -67 -154 3 -56 -253 -32 -40 -195 -181 -102 71 162 -206 -9 -188 -6
3533 -6 241 120 142 238 243 35 -68 34 152 -87 153 -110 65 3 -5 5 -116 -40 -113 5 75 139 -24 313 -14
3558 -14 -105 -13 -132 120 -176 -102 72 90 -83 121 93 -86 -135 -195 296 -3 9 -78 81 220 129 118 -23 -57
3582 -57 -161 -141 32 160 -110 -31 -49 -97 -223 20 91 104 238 -65 241 -55 -35 -60 99 -8 140 -63 -74
3605 -74 234 -70 -267 57 -8 -113 157 5 -69 42 303 -112 68 -181 83 63 -18 -78 59 -159 -54 68
3627 68 -64 -48 128 286 45 -40 310 -14 -147 -65 -98 98 -192 38 -103 70 -188 -242 209 -223 171 -145
3649 -145 -39 -112 -126 -222 183 121 -14 24 -37 -45 -38 109 44 58 137 -481 89 163 89 59 -50 45 160 -77 41 -63
3675 -63 -428 -162 -153 -75 -68 -239 -43 244 -174 -76 188 -98 125 223 -20 38 377 181 -150 195 -254 -2 -214
3698 -214 98 272 39 -99 71 -443 -55 55 -121 -155 33 -113 -120 -114 20 287 -247 -21 -4 -51 306 51
3720 51 -154 156 118 119 -95 241 128 -95 32 81 -26 -50 -64 81 93 -2 -52 -61 -32 -141 -122 -44 -107 -66 -177 21
3746 21 24 -28 72 103 112 12 -40 -77 -268 206 -45 -122 -16 158 -46 -145 -128 29 -97 -16 58 -211 -2 -112 -227
3771 -227 -77 -117 -25 -205 123 -96 30 135 118 95 180 257 -148 163 210 15 -166 -203 -117 112 -9 82 85 126
3795 126 36 44 -154 -58 -59 -219 16 54 81 3 240 -66 98 -153 -35 -30 132 -3 113 -19 152 -130 -29 49
3819 49 106 347 102 28 -14 34 64 30 91 -77 33 147 47 36 42 -284 -196 40 12 108 89 154 -200 -13 144
3844 144 23 -102 325 -149 49 -277 -132 -109 3 19 217 58 -45 -175 -30 55 134 -194 -63 -212 -26
3865 -26 -202 -287 15 16 -88 -150 151 -280 -165 -90 109 17 103 -76 -199 -20 164 58 242 -7 37 -15 170
3888 170 171 0 -216 -4 -2 -87 28 -40 52 -49 159 29 21 -200 -129 -51 -111 248 24 -99 139 131 111 273 -27
3913 -27 257 237 -35 24 230 86 -181 -5 -82 -42 189 -236 56 -126 44 -236 54 -98 -273 -34 -149 12
3935 12 108 -22 31 -249 -136 193 15 -29 124 87 101 -20 -21 -63 95 29 -165 96 233 -43 -218 -179 109 109
3959 109 41 -141 55 -67 63 -247 -47 271 183 36 -132 103 50 87 46 6 74 37 -280 180 -112 165 -51
3982 -51 -23 -126 -25 65 164 -146 97 166 -154 29 -323 33 250 1 146 -167 -24 -146 -142 -118 66 68 102 6
4006 6 -245 253 74 151 -4 -76 80 95 -28 -126 -61 -101 -162 190 22 -29 191 123 259 150 -120 -19 95 106
4030 106 59 -190 -2 14 20 14 127 10 50 -19 -101 59 18 71 106 60 107 3 -64 44 128 62 -11 167 -369 -53
4056 -53 -29 -116 61 48 -87 74 108 -185 68 -155 152 -145 -91 184 158 38 -108 -156 -10 189 -150 -22 -1
4079 -1 -46 22 19 -167 -155 7 -13 -134 41 -221 107 127 -121 153 -194 140 59 145 261 -1 -230 128 -36 -27
4103 -27 -36 64 65 37 131 103 156 -18 -115 -33 140 -116 -5 -348 -64 -33 -141 -143 119 -171 118 66 -35 -77 12 103
4129 103 -25 44 -15 -19 -45 114 66 -67 104 192 -31 -338 -134 73 -54 -2 -287 -4 24 -149 5 86 -4 63
4153 63 -24 27 33 -21 -48 126 76 -14 -33 127 -8 -89 105 -182 127 -39 45 176 -41 64 56 -108 106 -57 -28
4178 -28 -164 -182 -43 68 -164 -155 234 238 78 39 48 -220 -51 -73 -79 45 -63 -179 -22 -242 373 -57 85 -202
4202 -202 262 209 -79 155 -137 27 -167 122 0 -43 166 -14 -2 -184 -28 -66 248 94 -56 -54 -276 -137
4224 -137 -267 188 -65 297 30 -214 -45 22 159 -165 -39 -200 -95 -74 -389 -85 -240 -57 23 73 359
4245 359 78 -45 77 43 -95 -250 238 46 -33 166 152 45 46 169 -188 45 -118 151 245 98 -85 296
4267 296 -18 63 -76 23 56 34 111 87 -96 -66 -91 -328 -78 108 189 75 -25 -71 -138 226 228 166 72 -173 169
4292 169 102 -61 -3 57 -83 7 244 -82 -292 69 52 -46 -124 -128 -91 -466 101 329 -106 -12 -80 -63 -24 142 111
4317 111 -55 -36 -116 -61 -179 -71 206 65 -68 39 224 121 -56 -148 133 40 -52 -73 -145 -15 149 -150 63
4340 63 43 74 128 -75 84 -86 83 38 -194 -20 142 82 -185 33 164 280 105 203 35 -78 -88 25 217
4363 217 14 133 -35 81 -144 -45 14 -143 10 172 99 -5 -82 -123 -58 94 79 -127 -82 -122 317 -30 84
4386 84 164 -12 33 -43 -45 -25 191 241 52 -64 17 -233 -15 259 193 -124 80 -38 258 92 -11 -27 54 -30
4410 -30 -14 -11 202 123 60 130 -138 204 -13 235 -6 83 -35 -84 -10 38 -77 4 -198 -88 -141 -59 -117 -146 140
4435 140 -152 137 -159 232 136 131 194 -156 34 -21 -75 -223 -28 58 15 44 -194 225 -71 -75 64 -32 99 -92
4459 -92 -350 -103 148 -15 -58 -227 -343 -300 -157 -151 -63 121 69 -191 185 102 -45 -57 102 -100 56 -123 -111
4482 -111 -78 -157 65 251 27 72 30 151 -11 -320 89 29 -272 207 -22 21 -235 -351 -83 27 34 36 -114
4505 -114 -85 134 139 -114 -53 -105 214 185 87 23 148 105 82 60 45 1 -237 -7 -150 241 -122 -28 288 105 1
4530 1 19 185 -181 -94 -115 -13 -85 -101 93 17 59 184 23 -132 -127 -24 262 34 -160 -110 258 -92 -88 -80 -52 -42
4556 -42 -196 -37 89 -91 -60 23 -12 -45 32 56 -285 118 174 -4 65 -13 10 -58 16 381 10 123 166 -121 -93
4581 -93 -176 116 -83 -132 -69 176 231 -154 4 -127 -14 -111 -58 103 -29 -103 -12 -194 63 -21 55 1 25 234
4605 234 -21 -128 -309 -130 -267 316 44 57 111 -78 -21 -60 -157 97 104 -5 -195 -321 0 20 -232 -212 215
4628 215 -13 -58 -233 -27 84 67 -51 137 85 242 -120 15 34 -42 -45 186 -45 26 -137 76 -102 -146 -119
4651 -119 -225 9 -121 -63 95 8 -143 113 -97 -197 168 -52 -153 -121 11 45 29 81 27 196 182 4 79
4674 79 236 -56 121 -36 -68 20 -256 -79 -2 48 41 -159 69 215 -56 133 82 153 -118 -44 36 119 111 118 146 -57
4700 -57 -102 -169 42 -18 -27 133 -77 -93 -193 -127 66 75 -37 181 -44 -128 232 -44 49 -256 -92 -99 390 -115 130
4725 130 25 77 -103 31 258 39 -22 -158 -157 -49 -47 154 -44 153 -102 -272 -174 173 153 98 -208 45 67
4748 67 -81 -116 -282 137 -173 -61 143 -124 -22 -22 -128 -50 292 4 136 63 -196 208 -186 178 130 137 -161
4771 -161 105 -122 -139 31 -164 37 30 18 79 -68 135 56 -117 10 -119 -101 -210 -276 -208 135 -2 -55 151
4794 151 -126 -33 125 120 112 -24 -7 137 224 -68 -445 179 123 135 -28 148 -218 234 -214 65 107 -125 -43 46
4818 46 45 240 97 19 119 -111 -31 14 -55 -95 -52 283 23 367 60 -71 -55 -168 12 -287 -15 109 -177
4841 -177 239 -172 -65 -141 -399 -106 -90 69 -9 -69 -63 31 105 61 309 315 53 -72 -56 -312 117 -80 3 -1 77
4866 77 328 85 -192 159 -303 -152 -115 -57 -146 -221 19 -57 -91 108 64 43 62 -143 137 -108 -27 39 -94 -272
4890 -272 -59 39 -24 -66 -37 -60 -64 97 -44 192 182 116 75 -222 254 -91 -133 102 -332 -2 67 -56 222 -79
4914 -79 48 -149 359 -141 281 62 -211 30 -189 217 -111 -55 133 60 -26 -105 -198 -5 -52 -98 208 -66 -72
4937 -72 205 -342 -151 -382 -103 -116 -37 66 -205 142 -43 22 22 200 -289 -252 197 92 -111 7 236 107
4959 107 -50 -141 16 -33 -23 -25 -69 -279 -67 -132 57 -192 167 -75 -185 58 -23 208 -133 244 -53 252 -70
4982 -70 148 130 -84 26 9 193 70 168 -19 145 -87 -38 -325 -66 22 63 -51 -70 -88 -51 -116 -284 -163 -86
5006 -86 -66 -27 -131 230 118 -2 -50 11 -203 185 24 40 61 83 69 -55 177 20 -26 -38 -74 92 -38 -49
5030 -49 -141 17 -142 145 74 70 -11 54 -69 -98 77 -147 298 -123 -68 114 -106 12 -188 -20 29 -161 22
5053 22 168 -271 25 -19 -291 51 -116 -61 -238 235 75 -80 -63 215 44 48 -85 -180 -91 85 -152 14 -31
5076 -31 -139 164 14 104 20 -145 -131 24 -75 99 52 160 -87 49 152 -259 -279 127 -139 -117 -199 241 -28
5099 -28 55 -168 4 -15 31 87 -71 -44 55 -143 -4 -3 -113 294 73 -106 412 -146 -35 -76 116 164 -102 -221
5123 -221 -119 -9 55 -165 165 35 -345 -249 -216 -17 -5 47 -22 158 41 91 -176 221 -247 267 111 196 -67
5146 -67 34 -21 -35 23 -35 62 -116 -15 0 265 2 -4 -29 -7 16 -68 -18 409 -273 -173 -165 -12 -44 -114 254 9
5172 9 -162 40 -129 88 17 139 26 160 -14 -12 -12 -242 -154 -39 3 40 -16 -146 -70 15 -21 60 -23 35 91 -215
5198 -215 121 -77 -80 38 -21 -90 79 67 195 -266 -99 -312 188 103 172 227 85 17 -38 -66 49 -4 -145 101
5222 101 -56 -118 -14 -132 8 -14 -205 172 79 -84 128 -42 -56 -44 204 101 -120 -95 67 -277 56 -283
5244 -283 -51 51 81 7 49 -12 -234 -37 -54 52 -113 56 -109 129 5 213 118 -40 -84 -89 -122 24 -19 -177
5268 -177 70 158 -76 49 143 87 -27 -77 -87 -211 -107 15 -34 22 62 114 388 -129 -43 -30 -88 -133 123 34 -23
5293 -23 20 -220 95 203 -205 -193 -171 -11 93 199 207 134 -88 165 -199 -29 -174 171 -435 57 11 234 -122
5316 -122 -118 -96 -28 60 76 79 -239 224 38 132 -54 -81 206 366 132 41 20 172 270 90 214 0 -110 -15 -157
5341 -157 101 -132 138 -42 -139 28 25 -120 151 106 44 37 -281 26 173 -106 -92 -114 95 235 -168 182 59
5364 59 50 -73 159 170 304 77 -1 -92 -3 -70 -122 145 -18 126 -40 89 138 -111 210 -148 54 30 -61 -122
5388 -122 7 -82 -31 144 125 -99 -43 -30 -325 89 -66 13 114 -287 -141 38 181 242 3 298 -306 -24
5410 -24 134 -119 73 147 169 104 267 -48 -102 29 -3 88 53 -163 193 -104 165 207 69 -164 24 -164 -147
5433 -147 -21 -5 11 -83 -124 -73 -63 12 -164 -74 44 -79 -59 65 -116 -168 69 -65 -229 270 -87 -115 -86 -44
5457 -44 153 97 -30 41 55 223 263 1 -109 76 115 147 -115 -11 -25 -82 97 -172 -76 -72 137 -39 168 -297
5481 -297 -91 53 -312 -138 223 41 160 101 8 33 -83 98 168 -82 -14 -195 -34 147 96 -244 54 -142
5503 -142 -198 -62 -234 -4 -28 239 -9 -27 316 -22 37 -14 25 42 29 59 101 -75 -113 76 82 -73 93 -82
5527 -82 -235 -61 76 -99 59 -103 121 71 -49 -39 -177 -38 -192 129 212 170 -7 -78 -3 175 -94 -113 -79
5550 -79 -46 -81 321 -93 117 -36 -86 185 -188 -200 23 -24 138 -349 91 33 -35 82 40 -130 49 -364 -85
5573 -85 -230 281 -11 -22 -105 89 -103 112 174 44 255 208 101 180 130 -35 94 -10 18 -36 245 3 95
5596 95 178 172 111 67 -59 189 -37 19 82 -15 -81 -101 17 -140 294 -142 226 154 31 165 9 166 -77 149
5620 149 -52 136 -1 24 -37 -174 -133 83 -42 -136 -127 87 79 191 -62 -33 120 16 74 -181 11 -137 128
5643 128 -207 18 -214 21 330 -51 243 -106 -29 112 76 49 -40 241 -51 -158 -89 -143 134 -76 -186 -62
5665 -62 -74 16 131 48 90 -2 153 -135 -60 126 -150 -33 -83 -37 8 132 30 25 112 68 -58 228 134 68 135 30
5691 30 253 -116 48 -30 -6 -229 69 -147 18 139 -55 75 154 64 -344 34 -45 -87 -212 -136 -125 -130 195 156
5715 156 -262 105 -219 -163 63 191 75 -197 -136 -178 -58 -161 71 -230 28 -163 106 -18 209 -180 -82
5736 -82 -105 -16 -89 61 183 11 39 -141 -176 133 81 -27 238 202 255 -91 64 171 61 42 -47 71 -5 -11 -31
5761 -31 -343 -119 259 -32 -129 189 271 40 66 -24 187 59 137 183 -57 -50 223 -24 -49 -264 -374 38 -127
5784 -127 17 117 151 -137 107 164 -86 59 251 49 159 -11 103 -27 156 68 -38 97 -84 49 66
5805 66 142 -172 123 95 -143 -44 -268 53 -53 -21 111 -67 -232 204 335 85 -13 -175 -2 89 181 -12 121
5828 121 167 81 99 40 -140 -75 -51 -140 8 -90 104 -408 122 296 49 36 -41 -58 139 -74 -146 181 141 -116
5852 -116 -233 -2 1 -268 158 -72 128 214 -141 -124 115 -9 22 161 33 167 -135 -133 -13 -198 -204 61 160
5875 160 -108 215 -220 -9 71 -41 126 287 -14 323 -40 -21 -56 202 284 -147 -166 -34 -130 -135 -198 -252 150
5898 150 -241 156 -110 33 84 205 29 -52 88 85 -108 107 -77 -13 67 112 187 112 -114 -29 -4 -41 -119 41
5922 41 18 38 -243 -56 103 -87 132 21 -36 -140 -37 282 -87 -47 57 101 -151 -26 46 30 55 -77 5
5945 5 -451 41 21 68 35 -90 38 187 106 86 108 -11 3 104 -13 257 56 -86 83 37 -224 53 -139
5968 -139 -48 107 55 -14 -49 184 -15 -81 -78 -172 19 -13 -40 -76 28 -10 -231 -75 64 225 292 -141 86 82 179
5993 179 48 110 59 -142 57 147 176 -172 -363 -65 -118 166 16 -51 135 -151 -50 -63 -309 -314 137 -253 -24
6016 -24 -2 -315 -3 -86 165 299 91 27 10 218 -228 -112 -28 17 91 9 -82 -96 -20 -7 192 34 213 -63
6040 -63 -71 -174 -44 -264 -44 -13 133 242 -205 -179 -71 202 -175 22 24 -57 130 160 -33 -16 -79 -1 235 53
6064 53 10 144 353 45 66 -49 -183 116 192 26 145 -50 270 -335 -108 26 -94 17 135 -224 44
6085 44 33 9 7 81 24 -160 70 3 -29 162 59 224 -21 -113 113 76 15 -213 136 -203 174 -287 -169 -283
6109 -283 102 -117 -55 -134 321 33 -21 -193 -147 7 -72 144 42 64 127 100 -128 98 52 185 127 -62 -76 -164
6133 -164 -155 26 89 11 59 -131 32 -32 221 -106 -81 158 -100 72 67 132 272 -122 128 30 128 -103 118 205
6157 205 -9 14 -221 218 -163 75 235 123 -108 180 -10 69 -215 75 -93 -101 143 31 -44 -62 81 -53
6179 -53 -29 48 95 -2 -243 -84 -367 173 50 -41 171 -259 46 -23 -8 97 35 45 -198 -252 107 -56 -82 -76 -86
6204 -86 36 9 -104 50 56 129 27 -153 111 185 -34 -198 91 -232 -121 -87 -134 -233 261 97 -33 -49 43 112
6228 112 -244 -59 -227 94 23 -160 39 29 77 32 -169 165 -85 167 -242 52 -127 -35 30 -38 -117 10 -186
6251 -186 20 -45 249 257 -111 -41 160 62 -156 266 -179 7 -167 -85 -31 111 198 19 -83 25 80 38 -55 131
6275 131 -133 82 -177 246 36 -76 -50 123 -10 -79 111 14 129 64 -244 -47 90 66 -17 -156 -160 127 -49
6298 -49 75 -39 -184 93 46 23 37 -53 47 -90 -129 -94 -25 51 -136 13 -44 -63 -18 -20 -63 -120 107 180 35 -38
6324 -38 -207 -25 -112 -155 117 -128 80 -58 25 -123 -116 0 -113 235 64 11 40 117 157 -20 -85 31 -13 170
6348 170 129 45 -31 -12 -345 86 258 75 24 -34 166 0 78 165 -66 25 -26 230 -124 -55 252 63 188 -82
6372 -82 294 15 -41 3 79 122 -194 304 22 78 13 306 13 178 -129 -189 -112 -88 235 34 -92 -415 129
6395 129 -84 17 67 -119 240 -262 -4 144 39 271 152 -80 117 -90 124 124 31 104 -64 197 136 4
6417 4 142 77 -9 -74 80 -77 150 30 -43 -267 121 -46 69 -206 23 -52 35 26 281 -31 121 38 -75 34
6441 34 -358 5 -248 -104 46 -179 -208 -327 68 60 -101 -43 132 20 -71 115 -165 -123 23 146 -157 49
6463 49 145 405 280 -113 45 42 -26 18 -48 -140 178 -172 129 101 130 168 39 118 -85 55 108 -99 -248 -71
6487 -71 -123 -142 -165 202 -41 -120 -99 1 110 -1 -138 162 -164 38 30 -117 -94 -110 -141 187 53 6 285 -47
6511 -47 44 -80 82 -83 -151 164 -5 23 162 -15 36 -348 243 -63 261 -18 -37 -119 -171 69 127 -98 8
6534 8 -125 71 27 40 -94 108 278 31 15 -21 -48 -30 19 -18 44 105 -49 -43 -69 -122 89 -138 -156 -27 111 -162
6560 -162 -140 -54 114 -29 33 -126 -138 -116 72 -56 57 181 -1 210 -213 -207 2 53 178 108 -38 -110 -64 -23
6584 -23 20 -32 24 172 -180 91 97 -136 54 131 29 -73 -32 156 28 80 -41 178 -41 165 -204 145 133
6607 133 -220 -46 -166 -41 -19 -87 5 -95 -38 -240 -47 -76 -200 -13 -138 -170 -116 -25 -177 22 -178 127 -7
6630 -7 -138 78 -124 -175 -51 213 -17 -78 103 -146 -51 76 156 120 64 87 12 -77 81 36 -7 -34 154 -6 -10
6655 -10 127 157 42 -126 56 -164 7 75 37 279 -118 -44 -71 22 -143 208 246 -145 -44 213 -19 34 -13
6678 -13 -179 166 -120 24 -161 117 123 -146 354 -86 60 74 38 -167 -121 -73 -243 144 -142 133 24 35 201
6701 201 150 16 -215 -170 117 -141 -51 -91 121 1 23 38 -29 109 -38 215 113 60 65 337 22 45 1 50
6725 50 110 121 73 -43 74 40 -198 -107 3 296 104 -68 -50 -71 115 -97 -25 104 75 217 -209 -51 -105 -5
6749 -5 -47 -41 -200 -26 -92 128 -18 64 13 20 117 -45 -7 -30 -14 -109 -13 184 103 62 14 -206 180 -85 67 -2 -38
6776 -38 17 174 141 43 32 96 222 121 -126 117 -114 -32 85 -265 67 -114 382 -34 75 -142 -24 -66 35
6799 35 -48 154 -128 -103 95 133 171 -202 296 83 137 -87 182 117 -83 -190 -107 -39 345 -68 -351 -20 85
6822 85 32 72 119 -19 -17 21 -188 148 167 86 -26 52 214 -108 65 -1 -334 -80 -199 -169 274 -20 432 -11
6846 -11 18 178 48 111 -57 -83 81 91 216 -289 -235 144 -140 18 -18 -65 76 23 56 55 -167 -203 -122 -211 -104
6871 -104 307 -216 -36 17 115 -56 197 19 57 99 162 229 2 -19 125 -41 97 46 -45 1 161 -108 -111 -143
6895 -143 117 -30 -121 -264 81 -195 -51 229 -224 91 -2 -148 277 -70 -54 -262 -11 105 191 26 16 -59
6917 -59 -109 32 38 -10 43 171 64 -7 80 -32 -10 199 -255 -30 124 -226 -14 28 0 -97 -231 155 62 -194
6941 -194 -65 -24 -10 167 -40 -237 281 35 100 -80 53 104 71 110 183 67 -57 178 -124 -61 92 5 -19
6964 -19 123 -160 -87 -87 -12 -123 -60 209 -108 -54 -7 -216 -28 138 153 66 99 -33 -26 420 24 -20 122 19 -128
6989 -128 -215 9 92 -88 30 -75 -8 179 -84 182 64 -217 11 -266 71 -117 131 -39 -101 201 -114
7010 -114 -106 297 312 126 91 28 153 -108 77 -116 -162 -15 -91 -21 -143 29 76 -25 122 232 63 79 -373
7033 -373 -45 -18 210 -65 38 -134 -140 -122 -102 -214 335 -188 -104 -45 92 239 -27 23 -280 -135 190 -9 -9
7056 -9 7 146 -89 142 32 -65 -22 -56 460 -63 -124 -127 -198 -127 86 214 17 100 30 -83 -163 114 -74 -182 9
7081 9 -10 111 -32 -358 -70 -103 32 -23 262 104 -247 127 107 -83 -81 -28 75 31 -53 -25 -48 221 -128 19
7105 19 295 198 -93 187 -120 95 158 -4 9 19 -222 -18 -76 -126 21 163 55 119 116 -25 -152 -10 -102 -46
7129 -46 71 81 -204 -77 -10 -103 106 -116 -121 52 28 47 -38 -37 91 -182 -274 -24 61 191 176 -27 108 -160 -196
7154 -196 -76 -50 -27 113 191 -76 20 92 -58 -3 86 60 70 85 174 190 -164 59 52 -309 -50 -45 181 85 324 69
7180 69 -11 137 206 -82 -103 -72 -112 -122 -197 10 -218 -67 134 71 28 32 237 197 -334 22 -38 -34 -210 44 -32 10
7206 10 1 153 -114 102 -17 -104 -200 -129 141 -101 -7 -100 -37 175 -21 221 -98 32 86 49 -98 -160 115 -167
7230 -167 186 81 -36 -9 -157 65 161 160 191 -45 -12 -89 -319 309 42 -195 118 154 94 -27 182 90 240
7253 240 -110 -151 -110 27 6 38 -45 338 -131 -1 -76 3 258 -133 -23 128 42 79 -49 126 -88 -154 44
7276 44 172 43 254 158 157 288 125 144 -321 16 92 158 70 -91 -291 180 -96 -35 328 177 150 -21 31 174
7300 174 222 -3 -99 -147 -109 27 -245 -9 272 -16 -141 -92 22 45 20 -9 330 71 -162 -117 -443 278 -6
7323 -6 -275 81 -58 -45 227 -67 -150 -40 195 29 24 -17 -49 -36 -218 71 125 65 57 -253 -92 -25 -131 41 195
7348 195 -98 -35 25 87 -14 -125 133 19 99 68 94 64 -331 -190 52 113 -112 -78 -94 173 197 146 75 243
7372 243 35 -29 -230 -222 93 -144 140 -112 54 -33 88 -80 -92 -57 38 -34 120 -64 6 238 237 53 61 -87
7396 -87 38 98 -72 91 12 36 -213 88 -144 -56 -50 -104 1 77 23 -42 -10 72 -3 117 -49 20 196 -152 -29
7421 -29 356 -43 166 -177 -94 168 -168 237 153 -136 40 173 27 45 -30 150 180 67 28 59 -217 -273 248
7444 248 304 -45 -89 -222 -48 -297 -138 69 138 78 -150 -111 127 -71 -82 -94 158 159 -22 -98 230 66 -13 -224
7468 -224 31 -21 250 -179 -166 -149 24 6 -17 85 -58 167 79 134 -221 -46 249 -319 -254 284 -80 7 -253
7491 -253 297 75 -26 28 -33 37 53 192 -209 -246 87 -13 13 -68 116 276 180 -173 -171 -81 -36 -135 -204 -152 148
7516 148 -173 100 308 -171 265 -100 147 63 100 426 133 73 77 -24 79 -143 -229 -291 160 67 85 49 290
7539 290 87 -19 -231 -109 -158 245 210 211 192 246 -111 158 103 176 -58 -66 50 -11 -37 62 -14 117 38 203 -6
7564 -6 -79 -107 67 40 66 -53 140 -121 -159 -306 37 -41 -124 -198 -205 129 -197 134 103 64 -75 151 -264 170 -5
7589 -5 -159 -193 132 258 -47 -126 -349 -102 -57 174 171 -72 187 -40 53 27 -9 -28 -58 59 196 -33 241 -148
7613 -148 190 -24 -9 186 41 110 145 97 318 96 130 -104 95 20 -13 -32 162 193 90 -39 64 -169 -291
7636 -291 -115 47 8 7 -160 -239 173 158 145 284 -50 -36 91 -78 -52 97 260 -18 93 -95 -11 -41 -83 -2
7660 -2 -40 6 -24 5 -128 163 -7 263 -38 -114 -48 -63 65 237 91 13 275 -231 127 -201 -70 -19 -135 -116
7684 -116 -235 -1 149 332 -136 56 95 77 -4 1 171 -60 68 -209 -174 99 303 -18 -52 134 1 186
7706 186 143 -61 61 138 -91 195 -47 16 27 180 29 -122 -143 -128 -68 198 108 34 -36 -123 -37 131 -84 151
7730 151 -159 -51 76 20 -94 132 132 128 -331 46 25 84 -181 -67 230 133 -262 161 -34 126 -9 216 -203
7753 -203 -28 -25 39 30 -51 -281 -210 85 -205 106 37 15 -13 96 42 -96 147 -24 -137 -53 122 -47 -171 -102
7777 -102 -48 54 -50 -40 -72 4 -10 -154 11 95 -10 -184 -40 -57 10 -275 -56 -152 -109 -70 231 29 24 -73 -359
7802 -359 120 -133 -215 106 -61 -173 52 33 -80 -241 -231 19 -100 -21 236 -7 -169 52 -160 -159 -88 70
7824 70 207 -193 -247 -116 202 7 -87 161 56 -24 208 246 159 47 12 12 -102 212 12 92 50 138 115 -227
7848 -227 -38 -160 76 -120 -62 -26 -56 38 -195 68 61 -71 51 201 -9 136 -158 115 102 -5 -146 292
7870 292 196 -240 24 -83 -90 -188 62 50 7 3 70 -256 48 200 -145 104 282 10 -144 -71 -234 -77 -43 94
7894 94 -227 48 -65 -81 -95 50 101 -134 -52 -106 -149 136 -39 -33 35 55 -5 -54 55 -17 86 -11 -298 133 -137
7919 -137 98 -79 160 12 -194 45 -23 74 -355 192 225 -13 254 -54 272 78 179 -139 1 -102 102
7940 102 148 408 67 -149 56 -119 -218 0 9 -91 -223 -6 -63 19 92 -65 -73 39 73 20 65 177 41 -178
7964 -178 405 237 197 46 173 -62 -27 -72 25 -20 -6 -166 117 20 -243 90 -108 59 98 219 286 -108 27
7987 27 -70 115 14 23 -200 157 154 137 56 144 -26 14 82 109 290 110 -96 108 -104 129 157 161 -68 -155 -89 70
8013 70 -238 192 146 -122 -24 -169 196 13 30 -52 163 74 40 -34 60 124 282 174 43 -267 26 -240 299
8036 299 4 52 -149 276 -53 -42 -163 152 -308 -95 21 -130 -98 -155 55 -144 -33 14 229 -49 102 -182
8058 -182 168 222 80 -129 101 -38 -138 -76 -328 -205 181 -232 190 25 -141 -80 -180 102 73 39 334 -226
8080 -226 102 -3 227 264 161 31 27 8 -98 -95 143 -105 -101 -15 -248 -39 73 7 112 -184 -19 -16 18 126
8104 126 -54 -177 -131 -80 208 39 -142 -17 43 25 -156 -60 180 129 -124 -166 -49 -225 9 -20 -144 141 24
8127 24 -54 -26 66 71 15 216 75 -162 -143 211 20 -231 6 -201 -174 -212 185 0 166 -13 122 -152 -146 -92
8151 -92 101 87 -20 277 -158 -71 -42 99 59 91 -118 363 326 -12 190 -149 41 335 -118 106 4 87 205
8174 205 40 35 -91 31 14 -30 -19 -88 -8 -11 31 22 -81 -116 163 -20 -23
8191b3
$$ Imaginary data points
##PAGE= N=2
##DATA TABLE= (X++(I..I)), XYDATA
0 0 0 0 0 0 0 0 0 0 0 0 0 0 0 0 0 0 8 -8 8 -8 8 -8 16 -16 16 -23 24 -29 32 -39 42 -48 55 -63 70 -79 88 -98
38 -98 110 -121 137 -152 168 -185 205 -229 249 -276 305 -336 368 -405 448 -494 548 -606 675 -754
58 -754 845 -954 1085 -1250 1459 -1737 2124 -2707 3676 -5568 10658 -53361 -135581 18075
72 18075 77575 -11507 -27531 46890 22037 -11118 2634 9738 8228 20273 9681 -19275 -13657
85 -13657 4839 -4632 1988 10576 2179 -12324 -9746 -748 -5425 4667 8111 -11776 -11688 -13737 -18709
100 -18709 -2518 20223 14982 -9985 -3888 7455 -4937 1762 14580 12746 5815 1575 -8062
113 -8062 -9378 20461 22993 -12025 -15930 1845 -581 -16431 -6331 12529 1366 -9049 -5648
126 -5648 -1698 1645 2722 9082 8624 -1661 -11637 -18165 -5570 7042 3923 -2344 -2075 7389 4505
141 4505 1325 11395 13995 6169 -5723 -8206 -3074 -3213 -687 -557 31 538 -6455 -5469 4783 14223
157 14223 9833 -5515 -8155 -6475 -6735 -5501 -4214 150 1459 -437 -6926 -6373 9478 11726 1138
172 1138 1885 5927 -297 -6481 3779 10860 3218 984 -887 -3772 -624 4145 4340 1605 1779 -6679
188 -6679 -15908 -3954 6689 1284 -6203 -3926 -540 -5406 -5381 -1637 3215 7621 227 -7616 -766
203 -766 8825 6251 -544 6953 8918 -1981 -4598 1928 6980 5102 79 -4262 -5853 -672 -1958
218 -1958 -4929 3968 6125 -6041 -15003 -5440 3470 -1138 -2315 957 -5 -1615 -1846 1727 5390
233 5390 6816 2456 -3413 1650 5839 1362 -402 3973 6076 -1587 -5645 -1117 2585 3671 1180
248 1180 -2029 -3121 -5022 -7116 -4572 4477 4763 -6233 -7681 -358 1849 -2300 -1906 4413 4178 -316
264 -316 -3441 -1141 7163 7856 1507 -2696 959 2507 -1354 1538 6148 2028 -3380 -2839 178 -529
280 -529 -2057 524 1434 482 -5257 -9825 -4416 2860 1933 -3997 -2998 1908 32 -2270 1852 6158
296 6158 4972 -1524 -3492 1242 5321 3458 -547 1871 3648 -509 -3636 -153 6136 4829 -1787
311 -1787 -4859 -3397 -1606 -4116 -4233 208 1446 -3508 -6450 -1911 2754 787 -176 1794 2363 -453
327 -453 -2564 1129 5630 5110 265 -2807 470 3100 2426 2622 3121 1515 -2761 -3979 -1769 616
343 616 781 -2048 -2342 -1187 -3575 -5502 -1728 2894 1846 -2243 -2362 -387 981 1620 827 1440 2147
360 2147 829 -1907 -463 4592 5108 1240 -765 115 -406 -1443 1432 3937 1973 -2342 -4925 -2302
376 -2302 264 -710 -2272 -210 1493 -2388 -5261 -1698 2678 1716 -1683 -2669 -450 1208 719 616
392 616 3345 4617 395 -2688 176 3706 3285 969 1670 1031 -1791 -3191 -1200 2722 2888 -728
408 -728 -3591 -2607 -190 -1663 -2776 -718 -104 -2940 -5103 -1840 2457 2951 904 -476 1001 1969
424 1969 425 1302 4661 5556 1325 -1737 -739 1640 1828 1187 943 1220 -1076 -4636 -3289 820 676
441 676 -2761 -2867 -1157 -2149 -3246 -1151 2325 2161 -1778 -4201 -1199 3594 2965 120 1744 3643
457 3643 1178 -630 2072 4756 3317 1717 24 -1614 -1934 -2249 -2295 147 615 -3033 -5168 -1440
473 -1440 1248 -451 -38 660 -940 -2041 -1456 -988 952 2720 -18 -3047 85 3127 1597 1465
489 1465 4283 3765 -306 -1001 -214 343 1481 157 -2079 -1336 -477 -2706 -3154 2065 2104 -2562 -3245 -683
507 -683 -351 -1011 335 529 -378 -1065 -1960 -1153 3140 3373 -654 -975 1853 844 -1360 1188 3437 2612
525 2612 1044 -65 -891 340 1698 189 -627 487 -1844 -4594 -2118 1512 -4 -2526 -1805 -625
541 -625 -373 -269 448 1397 1153 -765 -2318 -883 1436 1834 822 1822 2465 974 -372 605 3231
558 3231 3473 1200 -1205 -1611 -752 -1284 -1440 -480 -580 -2557 -3590 -1704 877 936 -1047 -1669 -541 -308
576 -308 -1207 27 1779 1867 978 137 -232 1056 2594 1810 1402 2643 903 -1930 -1172 1950 1246 -1019
594 -1019 -955 -919 -1948 -1721 -392 -521 -350 -2129 -3848 -2203 1259 772 -1166 240 1635 254 -472
611 -472 1172 2243 2159 2105 605 -307 1154 314 -367 1427 3012 -435 -2509 -284 879 -275 -444
628 -444 -1058 -2079 -2437 -1867 -1555 -47 727 -1245 -2275 76 1270 -95 -171 2252 2463 322 -535 -677
646 -677 1225 2388 1556 71 523 1144 14 -652 1432 1467 -895 -2042 -1338 -762 -736 -995 -747 -1016 -1518
665 -1518 -2315 -1416 585 1000 -191 -1022 -140 51 -589 102 2080 2160 867 577 857 763 761 1158 1313 731
685 731 -777 -1549 -472 753 669 -1663 -1989 -311 -742 -1743 -984 635 -294 -1623 -1558 -1028 8 341
703 341 488 814 1819 763 -1089 352 2640 2431 601 103 485 474 410 298 166 316 -370 -1995 -1216
722 -1216 411 370 -1514 -1114 -436 -1606 -2317 -835 565 1200 -91 -1081 -795 1143 1163 -116 916 2436
740 2436 1039 -568 450 1770 1594 751 28 36 76 -317 -671 168 590 -674 -2160 -1500 -542 -933 -947
759 -947 -405 -143 -1314 -1520 -715 237 910 363 -50 508 477 257 476 1740 1742 651 -93 466 1043 1011 292
780 292 -33 336 -486 -1214 -1016 53 -12 -925 -1570 -1579 -1243 -947 -576 109 720 -280 -1285 -637 849 1045
800 1045 792 931 967 1025 596 311 1424 1787 1010 -323 37 387 -381 -329 373 161 -1400 -2085 -1103 -228
820 -228 -219 -1006 -1186 -761 -613 -1326 -897 885 1085 122 -398 343 957 946 628 1195 1172 838 188 207 1074 1473
842 1473 110 -785 -448 -541 -1008 -763 174 -227 -1320 -1629 -1351 -673 -434 -392 -152 219 -29 -1075 -439 1261
862 1261 1607 426 -168 727 796 626 363 916 1410 737 -707 -318 1071 1133 -77 -268 -276 -1295 -1212 -1216 -371
883 -371 24 -650 -1317 -1246 -192 97 152 125 463 158 -289 199 853 630 540 438 484 217 430 417 1284 1318
905 1318 360 -511 -32 -80 -435 -375 -279 -535 -1157 -1465 -1217 -570 -157 -635 -652 -104 -180 -787 -218 850 783 196
927 196 292 619 909 1078 661 454 767 348 -78 -225 1017 678 56 -370 -360 -857 -985 -552 6 -305 -930
948 -930 -1621 -1193 -74 111 -506 47 348 170 194 654 1083 1365 820 -22 51 810 658 78 915 776 -369
969 -369 -1114 -82 658 360 -344 -494 -952 -821 -1320 -1418 -550 70 -465 -970 -167 221 -158 320 535 653
989 653 575 383 238 1124 1238 584 -86 292 304 158 426 776 331 -343 -801 -510 -395 -248 -561 -728 -190
1010 -190 -832 -1246 -649 237 -127 -413 -318 -112 200 317 271 833 1251 727 -259 356 1048 912 683 572 4
1031 4 -412 -330 -363 -55 190 -505 -924 -508 -32 -672 -809 -95 -327 -839 -545 -557 -162 -49 48 231 463 622
1053 622 19 306 1741 1613 154 -81 439 410 249 584 93 -41 -37 -441 -502 -90 -34 -736 -474 -293 -562
1074 -562 -953 -595 -86 -81 -100 35 -564 362 555 204 467 852 113 -142 418 1213 1081 705 210 124 394
1095 394 62 -135 -242 38 -600 -952 -726 -406 -412 -761 -434 -300 -103 -442 -585 -51 671 82 -342 -109 348
1116 348 297 927 1121 686 388 138 238 627 948 -235 -199 214 -33 -927 -322 -234 -586 -625 -531 -611 -746 -335
1138 -335 -515 -394 129 -384 -1056 -374 775 711 63 791 508 176 478 662 637 969 750 -75 12 486 -196
1159 -196 -553 -47 127 -758 -514 -319 -602 -268 -165 -848 -991 -252 -408 -517 328 719 -309 -35 430 518
1179 518 531 614 588 421 600 284 91 595 1011 123 -376 464 172 -540 -706 -234 -266 -465 -746 -953 -467
1200 -467 116 -239 -569 56 -96 -334 111 624 483 217 -29 384 533 507 522 457 1004 310 -44 366 427
1221 427 243 -321 -120 -69 -479 -595 -390 -94 -136 -402 -973 -643 -4 -337 -560 16 74 -121 -413 265 449
1242 449 797 604 357 250 603 -19 209 743 557 -53 -136 -149 129 -113 -225 -232 -674 -376 -507 -575 -30 194
1264 194 -678 -910 -214 -359 -182 85 353 261 320 -73 152 608 662 321 307 859 191 -124 416 381 129 -207
1286 -207 -59 -136 -172 -458 -650 -318 -376 -660 -745 -105 -147 -485 -310 44 62 -161 81 246 467 477 543 -65 46
1309 46 804 395 -86 531 481 -91 -283 -11 24 -64 -193 -317 -730 -434 -418 -776 -445 26 -429 -756 -406 -72
1331 -72 -35 175 322 236 -26 230 143 604 754 509 289 440 435 79 204 376 335 -260 -269 -214 18 -253 -382
1354 -382 -520 -353 -221 -881 -457 36 51 -296 -31 -18 27 231 254 240 553 349 176 251 485 598 484 23
1376 23 92 -55 -65 -153 30 12 -141 -436 -300 -189 -483 -398 -37 64 -345 -528 -449 199 64 -21 -36 13 301
1399 301 321 424 234 805 171 14 405 344 403 257 120 190 -100 -429 -414 -61 -128 -225 -570 -354 -465 -182
1421 -182 -325 -98 1 -179 -448 117 -110 30 156 200 393 192 301 266 612 318 176 31 494 483 -1
1442 -1 50 -32 -178 -320 -348 -105 -401 -259 -368 -318 -341 -127 -553 -266 205 341 -206 -144 145 288 278 279 502 321
1466 321 333 327 341 588 371 191 436 305 127 -447 -286 -54 -13 -467 -375 -387 -299 -247 -387 -102 71 -225 -473
1489 -473 140 336 122 155 303 377 395 320 350 318 484 100 -186 301 375 -62 -132 36 12 -242 -402 -511 -360
1512 -360 -197 -235 -324 -344 -133 -239 -258 176 282 29 53 -42 374 429 248 269 77 422 55 309 570 303 354
1535 354 315 320 -135 -139 -214 -22 -183 -372 -406 -602 -67 -82 -572 -282 22 -365 -300 123 45 183 249 59 112 527
1559 527 544 134 415 450 -74 -154 395 174 -270 -30 64 12 -308 -493 -525 -219 -1 -54 -587 -562 -125 -344 -51
1582 -51 -97 23 -396 -17 -23 545 588 2 -102 194 785 196 136 473 30 221 168 90 -38 -118 -215 -267 2 -128
1606 -128 -550 -452 -94 -295 -435 -197 -58 -243 -54 -21 140 129 44 181 -4 633 354 4 337 704 27
1627 27 165 202 304 226 195 -254 -215 130 -262 -428 -213 -64 -332 -427 -359 -85 -113 26 -147 -291 -18 80 2
1650 2 -92 551 281 25 561 381 84 345 201 311 357 40 -74 44 172 -258 25 -224 -45 -279 -179
1671 -179 -222 -158 -253 -304 -15 -51 82 -194 -224 486 180 76 184 446 308 -36 89 322 193 57 407 144
1693 144 285 -102 -176 -148 110 -131 -249 -169 -194 -276 -114 29 -325 -52 -150 -197 8 146 -153 129 324 73
1715 73 165 -54 205 156 350 242 221 199 76 -127 -163 53 391 -113 -443 -341 -31 -194 -4 -336 -71 -347
1737 -347 -218 -315 77 116 -164 -74 78 386 30 44 349 489 200 373 -16 103 247 294 5 92 122 -199
1759 -199 -70 -145 -246 -391 -291 -389 -426 -153 -375 -255 -117 -346 -604 35 37 215 99 -7 362 -115 288 192
1781 192 200 426 157 170 402 214 17 -64 275 -74 -24 -255 -329 -267 -259 -287 -66 -4 -387 -378 -194 -33 -97 24 105
1806 105 146 148 317 -110 66 354 201 77 120 183 158 34 65 -3 26 -268 -30 -97 -21 -278 -291 -28 -41 -301
1830 -301 -427 -149 13 -35 -210 15 167 146 -3 179 485 145 114 198 369 56 196 -61 77 -104 144
1851 144 -66 214 -147 -221 -182 34 7 -316 -311 -147 -384 -226 -268 -176 -106 -75 -283 -29 154 132 216 119 195 273 108
1876 108 115 148 418 173 170 46 -173 28 -301 136 -102 2 -482 -222 -336 -192 -27 -261 -274 88 -161 -108
1898 -108 -161 -84 241 411 -5 105 147 245 145 7 -17 98 -58 122 160 387 168 -136 -44 192 -118 -288
1920 -288 -23 -230 -190 -500 -257 -229 -58 126 -140 -116 -98 102 112 49 121 -54 10 653 410 330 78 430 241
1943 241 100 -219 198 13 -115 -273 -34 69 -178 -228 -226 -39 -216 -33 -38 -361 -330 -255 44 186 -167 264
1965 264 -112 44 103 88 643 213 275 369 65 192 172 198 114 181 1 -132 -286 -165 53 -47 -123 -345 -141
1988 -141 66 -27 -137 -283 -192 -20 20 -16 271 91 4 24 298 306 37 76 72 49 132 35 -373 170 -68 -183 -151
2013 -151 -302 -231 -184 105 -241 -228 -335 -246 -85 -37 -37 -29 46 104 81 113 259 242 231 103 320 185 205 -26 -2 25
2039 25 272 54 -35 38 -27 25 -167 -166 -223 -318 -162 -295 -293 -234 -15 -143 25 108 7 236 202 505 -82 107 -48
2064 -48 80 301 275 162 109 292 6 -226 124 131 -129 -289 -158 -166 -143 -95 -114 -110 -330 -397 -319 267 6 -222 -168
2089 -168 95 39 -97 83 113 303 86 20 5 93 293 97 -102 73 -144 7 197 182 -141 -237 75 -204
2111 -204 -160 -124 -8 -102 -11 55 -136 -73 -178 138 -13 194 132 72 42 121 137 267 329 203 -94 -22 216 -8
2135 -8 106 73 -101 -100 -123 -107 39 -196 -244 39 -152 -114 127 57 -304 -142 -150 -129 60 -32 10 60 382 196 -30
2160 -30 226 492 -145 -44 -236 148 -152 72 164 -225 -203 -249 -158 -47 -186 -427 -242 -222 -148 -274 -90 58
2182 58 -70 262 96 176 193 275 138 93 217 306 163 42 178 225 142 85 -233 -133 84 -299 -70 -28 -101 -251
2206 -251 -381 57 77 -197 -99 -123 -5 40 144 -103 -15 190 -39 -25 35 278 276 -9 276 92 33 -129 -183 -60
2230 -60 -58 114 -203 -128 -134 -106 -94 -180 36 -370 -223 41 91 -41 -208 -146 28 -59 -93 18 405 363 -31 321 -93
2255 -93 108 184 80 75 -29 -107 -30 7 128 -275 -512 -74 53 -51 -29 -3 -14 -134 -366 83 -159 43 108 2
2279 2 76 187 -145 148 242 177 30 350 245 -156 28 -165 44 -109 225 2 -53 -38 -382 179 -260 -46
2301 -46 -33 -65 -128 12 124 -15 -228 -206 34 -112 10 168 140 205 150 295 291 60 48 151 342 -182 -44 2
2325 2 68 -41 -28 -201 46 -16 -150 41 -149 -71 123 63 -281 -29 -83 -83 162 77 -63 354 -3 188 -53 120
2349 120 -27 -119 372 86 161 56 114 228 -227 -142 -128 -238 -164 -75 -177 -217 -175 -226 -235 -8 9 -203 -90 27
2373 27 39 -18 12 17 166 154 252 312 165 118 -18 100 291 -28 -93 88 -86 -83 -253 -36 -83 199 27 -283 -46
2398 -46 -222 -99 25 84 -89 133 128 72 4 -29 -107 -70 159 70 272 -278 165 24 41 14 274 -107 9 -28
2422 -28 53 -161 -276 70 -134 136 74 -183 48 -14 32 -174 -173 -19 -102 172 21 48 -14 231 -81 127 260
2445 260 408 -55 114 209 115 -237 -64 -18 -24 -87 -59 -109 10 206 -179 -106 -93 49 -155 25 44 -42 -119 96
2469 96 342 -137 208 -144 265 21 76 146 -65 -73 -66 -20 93 94 -234 -79 -126 -228 107 -319 -123 -153 -77 -251
2493 -251 -75 206 -114 -90 -5 -58 -72 -67 94 -48 148 267 249 203 11 122 231 223 25 -119 54 54 -119 -121 -160
2518 -160 -169 -140 -117 -65 -153 -174 27 -228 -291 -191 3 77 3 -50 -45 192 118 16 -15 98 239 29 -182 220 -15
2543 -15 220 -166 -195 27 -69 -202 -167 -50 -99 -428 -198 -126 23 -129 130 -2 42 104 25 35 -83 165 -26
2566 -26 148 20 -28 -5 -40 -9 -211 -15 248 153 -286 -194 -157 -4 -236 -291 -435 -235 38 13 -143 -257 -149
2589 -149 -184 -69 366 100 -143 -212 188 17 201 141 247 -96 126 153 -56 118 350 -111 -27 -11 -294 83
2611 83 -261 -96 96 -76 -40 -169 -250 28 -244 -22 -107 -125 61 -53 130 282 179 219 190 -102 78 107 -143
2634 -143 133 41 58 171 141 -90 -147 -272 165 -437 -223 -166 -408 -148 -134 -110 -135 -49 -114 -134 -98 -91 -98 39 181
2659 181 215 34 43 86 7 -44 115 -82 116 159 -109 50 54 -19 -254 -502 156 -36 -162 -76 -137 -199 -60 -208
2683 -208 -134 68 131 -80 210 274 188 50 -44 -104 161 157 228 60 -128 138 229 33 -195 249 -211 -358 269
2706 269 -246 73 -138 -253 102 -164 -108 -54 41 -15 -17 -18 161 -85 41 70 32 96 -14 31 429 -49 11 155
2730 155 139 72 -112 -136 -45 -187 -119 -49 -72 -27 -4 -125 -372 90 -125 -18 34 -242 54 50 -225 286 20 166
2754 166 153 45 7 233 82 234 -85 148 -26 14 -135 172 43 465 37 -208 140 77 99 -13 -225 -210
2776 -210 90 -188 176 -7 105 -218 158 -63 -99 -51 105 22 6 4 -27 -8 69 44 -105 166 94 41 -54 -102 -88
2801 -88 -174 -173 -147 78 -187 -134 -131 0 -103 -79 117 -75 121 25 159 368 60 57 -73 337 102 -59 -57 -64 225
2826 225 -46 -84 72 56 -2 69 -215 -136 54 2 168 170 -130 207 12 -142 -140 -112 -75 131 351 111 94 189 261
2851 261 -178 174 235 -93 -175 64 302 -208 40 101 48 -208 -187 -259 -133 -98 -153 -153 -203 173 -132 -57 361 -16
2875 -16 195 59 132 -71 191 143 -79 90 99 60 93 -153 73 65 114 -67 27 -234 -220 39 86 23 -73 10 204
2900 204 -18 -83 -314 50 -82 -66 146 166 158 116 -4 -42 49 115 53 19 158 205 8 -118 -9 57 -28 11 -97
2925 -97 75 -190 41 -204 -325 -211 18 29 50 311 -210 81 -59 172 -29 -4 47 -51 112 276 214 -57
2947 -57 128 71 192 -142 129 80 15 -213 132 -303 -138 -271 -40 -206 -320 140 -61 3 -144 -241 -191 -227 -239
2970 -239 -109 -164 127 -26 -124 176 -14 114 329 23 59 99 -28 -108 83 -99 -152 -141 -35 54 -389 -259 13
2993 13 -387 -376 -117 53 -80 -276 -63 83 61 234 -157 -227 127 -62 153 -119 103 264 -50 -117 163 312
3015 312 -136 -13 -7 64 -284 -23 -123 -91 -89 -184 -147 -68 -179 -60 -116 163 88 -85 47 -185 42 199 26 45
3039 45 -28 86 167 -135 -4 56 46 132 -268 110 -44 329 -194 -36 -208 -73 -55 -95 -113 -125 -96 -225 -58 -188
3063 -188 120 7 69 -41 474 -77 162 92 78 203 -121 -147 -66 199 -22 191 -63 -43 69 -111 179 11
3085 11 10 -321 -25 77 -318 266 -54 -11 96 -442 227 -190 36 -57 112 232 -155 178 -18 113 -57 213
3107 213 -131 86 151 -79 107 68 158 -87 -139 8 -292 -101 77 -105 -127 -228 -94 42 -11 51 -69 65
3129 65 207 56 -22 -17 442 48 -102 -110 -155 166 137 133 -14 149 -302 -181 18 -202 30 -55 -68 -269 -120 -263
3153 -263 -73 1 102 174 -364 59 -102 3 18 -55 -82 -144 22 3 76 -7 111 -130 75 89 122 47 -306 -104
3177 -104 -61 61 25 -63 109 -22 -214 -145 73 261 128 -65 -95 -33 110 37 -180 -57 -59 -17 226 -16 152
3200 152 33 324 38 38 -219 -64 -29 -101 -90 -234 -84 -214 -142 9 16 -34 -312 -178 126 56 -103 -107 113 -361
3224 -361 85 57 323 -95 -59 -210 -185 246 125 346 119 -25 18 -112 118 -136 -45 49 -100 -179 -164 -178 33
3247 33 120 -148 -132 151 -141 35 -29 -60 -98 -54 -96 -203 209 101 235 -203 324 183 321 -165 -63 187 28
3270 28 -166 -245 -151 16 83 -174 -168 -103 92 -118 -131 -67 77 -127 -8 95 -124 41 73 25 41 120 -28 -74 142
3295 142 115 -12 35 142 31 -160 -23 36 35 -194 -83 -99 -45 51 -89 -67 94 -207 -11 82 189 -153 -49
3318 -49 141 137 -75 57 125 -26 1 108 12 -40 260 155 -49 -114 -135 169 -49 -54 -11 145 37 -137 -53 -129 37
3343 37 -183 114 -8 -109 59 128 -58 175 25 -59 204 34 -117 72 -2 -128 110 291 -62 -174 35
3364 35 -74 237 -164 -234 -171 106 -49 -179 -4 139 -72 -68 35 -381 -107 22 65 268 0 44 264 -113
3386 -113 127 316 333 243 -86 109 160 -78 -163 -293 118 -220 -123 -20 -89 194 -48 -149 -79 -35 -17 -209 -405
3409 -405 -40 6 54 -159 -190 29 -87 188 -75 166 98 238 101 79 248 -69 150 34 -128 -53 153 -76
3431 -76 -239 -14 53 220 -143 -163 115 -109 95 -168 47 -6 55 124 43 -39 216 -49 -57 -122 321 42 290 -51
3455 -51 -76 57 -26 -90 53 -62 53 173 117 162 -39 92 67 -149 9 39 46 97 -239 -146 173 -194 34 78
3479 78 58 99 300 -36 -53 -74 -20 60 -19 -82 -185 47 -11 -473 -185 -213 -63 75 50 -176 -218 -135 26 -217 -30
3504 -30 -136 33 98 172 149 -27 114 11 19 -43 178 -103 -43 100 100 -55 -124 90 15 -111 -91 -105 73 45 -124
3529 -124 56 54 -189 -30 -96 38 71 27 114 171 117 128 37 288 6 -8 -92 -107 175 -70 -24 -118 56 -165 33
3554 33 -139 -70 -54 -35 90 -50 -147 -256 41 -143 -83 149 91 -4 -319 247 33 -85 259 115 62 -39 -196
3577 -196 28 1 34 293 -106 -31 201 31 -14 -31 123 -139 92 231 43 -257 -164 9 -109 114 -137 22
3599 22 -66 72 19 40 253 -313 100 300 53 -188 82 -57 76 239 189 217 -101 -116 118 15 79 94 -71
3622 -71 -96 -138 -139 -14 -109 -72 73 137 6 59 45 -79 -164 -38 67 -53 45 215 31 6 126 -109 -24 20 -195
3647 -195 27 88 -287 -46 -208 161 -373 241 3 131 -67 28 -158 -72 8 -357 202 -243 88 248 -157
3668 -157 0 -175 -155 76 90 47 -304 57 -1 50 68 248 -326 77 35 -205 -149 -40 30 -19 61 -29 -31 212 116
3693 116 -57 -185 229 -18 127 188 4 26 -67 213 -206 57 160 23 58 18 223 -117 -315 -122 -1 126
3715 126 -223 -88 75 -160 -289 114 154 41 -150 -58 219 78 35 173 -103 -10 21 280 155 307 -120 -242
3737 -242 97 -104 34 -162 -166 -215 143 -110 21 -131 -20 -132 -275 133 15 65 -142 -20 31 228 101 183
3759 183 -369 84 -2 111 276 -71 -167 58 102 121 138 99 273 -7 86 166 122 -99 -136 -18 291 -260 -110
3782 -110 11 28 -118 -91 -5 220 -33 187 -299 31 -7 95 122 161 -98 59 -4 76 229 60 39 -144 -133
3805 -133 58 -177 -99 -35 -47 -257 -1 -265 116 45 -124 -113 116 90 15 -13 -108 -69 -127 35 -105 111 89 109
3829 109 116 84 223 148 -300 47 182 61 147 57 60 -271 -175 -196 19 -219 55 -130 68 9 126 19 59 -114
3853 -114 -2 96 57 127 56 57 27 91 105 -163 168 79 84 30 63 -54 119 -41 164 45 -118 -129 -104 96 -171
3878 -171 -122 -130 -83 94 14 99 61 109 138 167 -97 202 -340 -37 179 39 373 107 -117 -153 110 114 117 95 40 -404
3904 -404 -79 205 -119 106 -39 116 -128 136 33 123 -164 187 65 -46 144 98 -55 80 -25 -75 6
3925 6 -138 107 -5 -63 -138 -39 95 -183 -33 89 -89 -108 -53 -47 74 -105 -240 -85 -5 -211 72 -54 24 152
3949 152 -118 397 72 -1 -168 0 165 -188 158 49 102 -5 106 7 -6 50 -140 -42 95 -292 -14 -47
3971 -47 144 -60 -80 -60 -15 239 132 -69 -2 143 -146 37 -17 -74 -68 185 64 -68 -69 -47 -203 -185 31 25 -142
3996 -142 37 -6 25 38 124 15 -2 244 235 -96 -170 38 -89 276 243 269 93 -136 -54 257 180 -152 137 231
4020 231 340 -35 -48 -44 -126 3 -113 108 51 -47 -309 30 -305 36 -94 -69 24 36 185 200 -33 -44 -19 271
4044 271 89 -80 -38 35 29 -99 -18 67 -71 24 119 -167 148 41 -215 -3 -33 -242 -109 -255 164 -156 -130
4067 -130 4 153 -43 130 -58 -99 -18 255 14 -62 260 -144 89 213 66 316 58 -70 -210 -186 -127 -132
4089 -132 -198 -111 -23 -34 -65 5 -46 67 1 -88 -73 -77 35 -319 163 -29 -97 159 -144 46 218 -190 -177 23 -215
4114 -215 -267 137 -50 -34 -184 -192 -26 -129 -7 -82 16 60 -46 -63 208 178 59 72 201 -43 -129 42 276 -261
4138 -261 72 -115 52 -18 213 -134 91 339 152 -29 44 -90 147 325 -389 -30 -5 47 -373 33 -50 33
4160 33 221 1 -69 -153 190 127 -52 259 -4 -107 0 24 158 60 -2 -68 221 -40 29 12 86 17 85 -4 -298
4185 -298 -100 -76 -323 -77 -142 -111 16 13 74 52 62 7 -111 -148 -353 -29 201 248 -112 111 118 153 81 0 193
4210 193 -90 8 189 -113 -20 -110 -309 -2 -18 -48 4 138 -2 -148 -188 -7 -111 -93 -77 73 -133 -149 1
4233 1 46 107 -164 -31 -120 -53 -71 -46 -219 -160 -266 -123 -30 -17 -131 11 -170 7 -23 50 -37 -165 -148 56 -294
4258 -294 -39 -4 118 91 -89 191 155 26 -49 -49 -142 -11 19 -92 57 -69 60 41 249 -3 123 -148 -68
4281 -68 196 -74 348 86 240 -90 -73 18 -49 -162 -111 153 5 98 -233 110 153 138 70 -36 -109 221 115
4304 115 -20 107 -263 -215 -73 58 -234 -3 -101 -99 -269 -34 -147 -151 -35 51 -115 171 -69 61 112 -89 -2
4327 -2 67 318 35 139 115 -25 -90 -69 -85 -199 35 -94 141 228 -179 -76 35 -124 -97 128 -226 -40 -122
4350 -122 -17 29 28 -70 18 91 -192 32 293 164 16 264 67 167 286 111 348 -95 154 67 13 -64 -89
4373 -89 160 -97 116 -277 -176 -110 222 -337 -101 -206 -24 188 -140 -169 -85 -226 -115 75 220 88 238
4394 238 122 -302 -36 -130 80 -25 186 -220 -243 85 65 74 171 -323 -117 -16 32 -117 187 207 -111 225 -13
4417 -13 334 -65 -97 -189 206 -223 39 58 79 60 -29 -163 -12 -35 -75 259 -191 82 -148 -164 -68 -64 -135 95 1
4442 1 -114 -103 21 -262 -181 -114 78 -1 -16 -130 -155 -231 188 45 -94 112 -30 17 49 119 94 -69 84 -137
4466 -137 303 -227 -99 93 83 13 296 -9 -271 91 -42 -197 58 202 18 -160 -99 107 -67 -155 131
4487 131 85 257 116 -170 -323 211 -113 -12 97 212 -9 231 -164 47 -172 -303 -148 101 -30 121
4507 121 53 -11 38 -190 -142 115 -118 -178 140 181 -45 148 122 72 19 -22 117 -1 93 395 -214 -97 214 -209
4531 -209 -167 -116 64 -117 -34 -27 -99 -59 -178 -40 -126 -319 75 168 -181 188 -104 1 -35 64 -78 57 -41 0
4555 0 -21 -58 -256 -125 322 -76 247 -265 -46 -118 -206 -183 175 234 -258 -261 -207 151 105 -56 68 28 122 -164 -31
4580 -31 71 -23 -47 -77 -274 46 -27 -72 44 141 -136 -207 40 -147 55 -252 -108 73 95 -235 -361 -107 -79
4603 -79 239 -23 -70 123 -107 -140 -1 3 -2 -231 205 -125 156 175 10 -115 -129 -73 -69 90 -54 313 -7 -38
4627 -38 -1 -66 161 27 -129 20 36 -98 147 -27 -221 -336 244 73 43 236 21 361 248 -35 115 -38
4649 -38 175 -31 106 -40 52 -135 151 -136 207 92 -83 -141 -65 165 -45 -18 -14 -15 -66 -164 28 -110 1 -161
4673 -161 -17 251 -145 37 -1 204 -35 -59 172 2 -44 -84 13 -7 273 135 -128 -115 140 -115 -80 126 -149
4696 -149 -69 9 179 -232 -47 -36 157 -149 -83 -9 90 -33 -60 75 -118 141 -115 141 48 43 -215 116 -62
4719 -62 100 -270 -167 -47 -96 -24 54 -17 -68 150 -196 -37 -180 -164 -130 115 105 70 -235 -14 -224 360 -23
4742 -23 -56 197 198 150 -108 34 96 -49 13 54 -122 -108 17 -163 22 -44 -128 -3 -20 -317 -24 -210 95 100 3
4767 3 45 221 319 262 163 -227 167 14 -14 -37 -47 -187 -245 164 137 -92 -238 98 -131 40 16 -32 -259 -258 137
4792 137 44 18 41 -51 17 51 -181 102 60 -81 -85 -183 97 -136 108 132 119 36 151 54 82 57 7 -5 -68 -184
4818 -184 116 214 -59 89 -129 -116 -109 -1 -97 -191 -5 81 -49 -34 -16 5 -168 -27 -41 16 68 -116 -9 -111
4842 -111 -100 -111 67 -234 77 -86 128 9 7 -65 47 -84 -28 -54 100 28 -127 0 -97 91 -147 -143 48 62
4866 62 -86 165 -49 136 55 93 58 -45 292 40 -137 75 -195 234 215 -36 103 -46 -62 -106 110 -113
4888 -113 -32 23 318 35 24 -117 153 112 -49 34 84 7 35 -44 51 100 85 96 86 -233 -258 -88 -148 144 -224
4913 -224 163 79 157 100 -42 26 -123 -37 -34 265 -158 60 136 -55 50 -27 -87 14 -3 -175 288 -47 155 210
4937 210 138 12 -111 -175 250 103 80 127 -140 -136 -119 -95 -4 -297 86 -83 -13 -65 90 -31 -64 42 96 187 39
4962 39 357 -227 -22 46 -54 -17 -66 73 -97 -182 -41 -115 -186 -49 176 60 -88 -36 -119 -225 105 186 19
4985 19 -45 -36 -23 -92 243 73 3 -131 -5 278 204 94 173 -74 -183 -57 1 -175 -279 -265 -186 -259 -255 175 -247
5010 -247 -226 -32 -108 215 27 -20 101 118 -344 -94 73 -64 135 248 140 -144 -79 -80 -56 45 365 99 222
5033 222 -94 -26 6 71 -44 53 166 26 -30 208 38 13 -236 -8 64 -2 248 1 106 46 405 3 -71
5056 -71 -65 11 131 -19 199 -215 -160 153 -12 -90 121 -219 -178 -204 8 56 -27 -46 -89 49 -152 16 -58 121
5080 121 172 177 -92 77 -194 -76 -88 -57 210 -254 -167 78 6 160 -16 5 -41 -146 56 40 -47 105 -126 -196
5104 -196 -187 59 -27 34 -243 -156 4 -126 -76 264 333 56 132 -249 117 14 144 10 56 1 263 -205 81
5127 81 81 -112 170 75 -54 -106 -9 6 17 90 -9 -31 -169 179 -83 54 208 121 -64 161 -62 32 303 156
5151 156 254 -76 208 237 -64 77 256 -96 -84 76 -193 -289 -171 -74 177 95 205 -54 -379 77 -397 -126
5173 -126 -147 39 -166 147 111 -118 85 -55 -142 123 -126 64 219 102 142 142 -2 -133 176 24 -210 -306
5195 -306 -111 -68 33 -37 116 -20 39 -197 -167 -131 3 -11 -82 -44 248 -187 4 -71 102 -70 24 251 -176
5218 -176 -62 48 295 -172 199 -108 6 136 -109 -30 23 39 74 -174 15 -17 30 -24 -59 -17 218 -135 198
5241 198 -127 -139 1 127 108 -94 229 0 162 -25 -14 223 107 -35 146 -138 -123 -146 -118 -35 -69 -312 -68
5264 -68 120 -68 -37 60 -13 199 -40 345 -48 -39 18 360 40 23 6 197 -97 -230 56 259 69 1 72 -178
5288 -178 -154 4 7 17 -98 -25 -21 289 242 -37 19 28 -131 -41 88 -79 -212 -58 -9 -132 238 98 -127 -172 -102
5313 -102 136 126 123 67 40 -126 118 -14 -157 -246 -156 -129 -106 73 17 114 -123 -154 -24 -95 169 22 78 7 162
5338 162 93 -164 152 18 29 149 -142 32 21 18 255 -227 -72 51 5 223 -133 -33 -89 197 -64 227
5360 227 -22 -38 226 -25 -190 9 -106 -27 302 22 -59 35 26 27 18 -15 -104 -11 101 -229 -11 73 -70 -92 64
5385 64 -60 -166 338 -71 162 39 -36 76 -8 86 57 40 96 96 -63 -225 -197 35 135 73 -25 -196 141 210
5409 210 150 -69 255 17 84 -200 -149 107 -61 286 15 -18 96 88 43 -67 -19 -19 -70 -179 -96 127 -84 138
5433 138 -63 112 104 -27 -45 -125 0 6 -117 -51 -140 -156 105 -15 -122 -197 -259 -198 -60 52 23 -41 50 92 41 113
5459 113 114 169 19 102 107 36 125 -115 172 122 56 17 -84 -137 68 -193 -164 20 -65 -6 -93 -195 35 -162 210
5484 210 77 -163 -151 -228 -251 -151 346 158 77 -68 49 -94 309 33 -60 -65 162 -246 -144 359 79 121 -285
5507 -285 -49 -178 -192 115 50 -68 -113 -365 -150 19 87 -31 141 68 156 8 93 103 -93 -18 171 66 -137
5530 -137 137 282 163 95 35 -149 -158 -191 145 -183 -61 71 -196 124 23 -236 -210 -52 -138 -55 -80 -3 28 -44
5554 -44 -143 -132 45 205 212 -102 21 29 151 99 -136 38 154 83 -53 -193 55 15 -46 -27 -81 91 42 178 -153
5579 -153 -80 137 -5 235 -3 135 -48 -120 118 186 -21 -247 250 79 42 266 -120 -30 23 -100 17 78
5601 78 69 -116 137 43 -101 295 224 -251 -106 -133 25 -243 -55 -101 21 -249 18 202 -215 135 -116 -226
5623 -226 243 -107 75 -42 -45 -67 -3 183 -182 -64 134 -96 392 304 -88 -104 -12 -12 -30 -71 95 -49 29 -19
5647 -19 -291 280 38 108 53 -9 -78 95 28 -81 12 97 -178 249 -4 45 -51 93 168 -98 -160 -43 -14 149
5671 149 18 -52 -178 -221 215 300 -65 7 -63 99 -141 201 260 117 112 -49 155 -82 -163 -189 -129 -38 123 151
5695 151 105 157 124 -218 137 -154 -32 -117 -6 -203 14 -86 -175 -91 -15 -202 61 29 133 113 113 -91 194 -9
5719 -9 184 196 42 -79 167 -3 20 295 -119 78 86 272 -63 -144 -174 61 140 -28 281 85 -115 -113 -146 -51
5743 -51 23 -91 303 7 -199 287 53 55 -35 181 -175 -179 -187 -171 137 -80 -201 -3 118 -102 21 -224 97
5766 97 -47 85 90 131 109 -13 -43 -304 -115 42 313 -11 -40 -254 190 125 78 335 170 -93 99 160 221 167
5790 167 -66 -30 -49 158 26 -202 -139 355 16 -201 198 -101 42 -269 -81 -164 48 -292 145 155 75 96
5812 96 -163 -152 -23 243 -81 151 -260 138 63 2 -256 231 -49 220 148 3 6 -45 219 16 -110 -80 20
5835 20 123 86 -97 51 121 -39 99 -104 -135 -136 -162 -61 265 -2 -179 16 104 43 -181 82 -124 -161 83
5858 83 -160 133 38 23 61 -49 145 -75 23 41 -87 -59 27 -288 63 -191 -16 171 227 285 -36 -175 -69
5881 -69 82 -46 212 95 -103 41 12 50 -39 -143 22 -108 42 -268 47 6 -301 157 -75 82 -58 -95
5903 -95 12 222 19 -40 11 -34 -236 -128 188 -65 22 -212 170 106 26 173 -169 -226 -70 -106 364 -78 55
5926 55 196 -96 126 -78 -13 -24 -57 202 41 78 140 -14 -139 135 -46 218 -88 211 97 156 35 -95
5948 -95 10 243 -68 -45 -14 -129 -180 -165 -129 141 38 224 62 -5 236 5 -245 -13 -40 -130 99 240 -36
5971 -36 150 115 27 46 -85 -72 37 -9 -1 -9 -159 69 -40 126 -91 201 67 -169 107 -136 -194 -204 186 169
5995 169 53 338 88 -163 -31 152 69 -44 112 358 206 41 157 203 -71 -245 -229 -246 -144 81 74 14
6017 14 277 293 19 -126 -73 187 170 136 -42 -152 -66 85 -23 -151 164 -1 170 -184 -92 -122 -129 -151 -5 -7
6041 -7 54 -147 -132 124 -158 -70 153 93 94 -41 116 54 -133 -40 124 8 -63 3 -201 -45 -296 42 -182 -110
6065 -110 106 146 -138 -314 -187 109 7 5 13 24 -32 -26 167 -270 -131 115 13 -198 122 43 -40 176 -351 -196
6089 -196 123 7 -48 -22 -195 -77 1 -16 113 13 118 29 -54 56 102 -129 -100 -137 0 -78 160 76 149 -30
6113 -30 235 -65 -72 117 258 190 -7 -226 217 -52 68 7 49 -53 -74 210 -89 219 112 44 -139 18 42
6136 42 7 155 -261 266 31 -75 158 -56 13 53 -204 -316 51 108 -6 -40 118 3 51 -196 7 171
6158 171 -83 -62 169 196 -145 317 175 -102 -181 280 123 216 272 -64 113 21 -72 -83 155 243 -29 211 -130
6181 -130 -57 7 -14 191 -149 39 -14 -18 64 -123 57 196 141 25 -7 -133 111 38 90 157 160 -62 199 125 -135
6206 -135 88 -80 -45 179 -60 157 0 254 -93 -109 23 -194 -192 -6 132 -33 -56 143 -237 220 66 232
6228 232 -79 70 78 -143 -49 13 215 -60 85 170 128 140 90 -152 -57 71 -49 -226 -52 -169 -293 92 -46
6251 -46 -159 -113 72 19 -101 -62 182 27 161 24 84 51 -157 -145 -30 93 -160 289 -242 -242 -134 1 87
6274 87 113 -35 -11 121 -16 80 -120 321 166 12 1 -24 -19 -65 -416 70 23 85 16 49 56 11 205 -328 26
6299 26 -18 -221 -1 -3 197 -66 124 -17 -5 -75 -2 5 28 11 -173 -60 -1 -31 23 34 150 -83 -235 58 -68
6324 -68 48 -64 -35 -140 113 95 -107 120 -66 -88 77 179 -109 80 20 73 -8 -166 12 -107 125 -228
6346 -228 41 -94 189 -24 -252 3 179 50 -63 -220 255 -237 81 64 26 38 108 -105 1 10 -159 -82
6368 -82 -37 -273 11 48 -8 -78 -112 137 -256 141 -147 -2 -105 -357 99 -256 -64 104 255 150 -57 71
6390 71 67 207 43 236 -125 325 46 -146 90 164 66 53 -19 52 110 -166 -105 -162 -70 19 20 96 32 -248 43 -199
6416 -199 13 23 -159 -126 -189 94 43 16 -173 -98 -231 -142 -272 -247 103 -169 -13 233 29 -17 -67 -235 -194 -15
6440 -15 -259 -106 115 -67 161 -11 36 -83 -211 -49 53 -134 248 20 -150 72 -36 4 198 -3 -148
6461 -148 -166 106 -94 165 -81 208 -162 36 174 -68 81 -126 136 148 -1 -65 46 200 -14 88 167
6482 167 60 -219 -156 27 -72 115 -203 164 166 74 159 114 -17 69 238 49 -120 -126 -165 63 68 141 -8 286 -153
6507 -153 -43 121 53 143 93 -126 19 39 46 -20 -48 27 104 -94 68 -200 -40 86 88 -75 145 67 -113 208
6531 208 -74 -70 148 -37 96 -125 179 -58 320 -131 9 -73 105 -114 173 143 -220 -180 164 -164 -79 243
6553 243 -94 203 -144 -6 128 -37 -17 12 181 -35 -3 72 -136 32 -149 -47 -10 105 196 28 42 -73
6575 -73 -26 -24 32 -204 8 -22 104 224 199 63 270 -116 -22 117 67 140 -103 -25 -5 39 74 21 -262 -169 -25
6600 -25 -118 -58 -161 -54 -69 -98 207 153 112 -3 -10 95 -22 -102 -138 26 -272 -65 -199 -94 -1 -65 -37 163 -91
6625 -91 -31 7 -109 -125 8 -61 53 -133 -93 373 39 -35 43 14 -35 -129 0 -158 193 -32 -38 -51 30 -15 141
6650 141 179 -115 38 -370 -110 -105 -109 134 -140 12 73 -41 47 -99 -66 55 93 -27 166 93 23 -74 -89 14
6674 14 91 -147 -174 -14 -42 67 117 -181 45 172 -292 -5 -389 210 102 -7 -28 236 -70 140 -114 -81
6696 -81 175 174 311 108 0 -4 144 72 -47 21 -122 57 -192 -68 119 -36 -159 -4 37 -141 -170 292 -35
6719 -35 -90 -57 47 239 10 234 -6 64 -218 -76 -46 -28 -202 -78 125 -50 144 -188 7 140 -230 162
6741 162 -107 -70 265 221 -123 106 -132 -169 -312 -54 -112 -48 23 -205 -115 -57 69 -64 -154 104 72 5 23 -184
6765 -184 6 84 2 -113 26 -83 -177 -232 -180 -38 167 16 182 16 46 -43 115 145 -64 -118 -17 113 -159
6788 -159 115 20 -107 40 -241 -26 224 -175 -33 140 -22 136 103 4 -167 -4 286 122 -151 109 165
6809 165 -113 -40 38 34 169 301 214 26 -92 -18 85 109 209 -248 -6 -71 -118 55 65 -1 -68 151 137 -66
6833 -66 136 -103 53 333 196 -303 52 43 101 354 -57 -83 252 245 -155 -120 130 51 36 14 117 -225 28 -27
6857 -27 55 184 151 -135 -19 2 -362 147 -17 61 136 37 -180 -99 12 -324 -113 -18 63 -322 235 71 60 -157
6881 -157 -100 -276 -139 73 20 -45 -142 34 23 -288 149 75 94 -107 194 262 -118 67 -33 -109 84 224 11
6904 11 -30 -101 -220 -79 -177 -29 -310 87 -60 46 -117 59 -93 49 67 -82 2 -59 57 94 40 -55 -83 85
6928 85 -189 165 105 15 26 24 -58 -214 32 77 96 -123 60 -194 197 74 55 -152 34 59 57 -102 260 31
6952 31 -241 144 76 70 153 144 -5 -255 37 43 27 259 62 128 -99 259 -4 56 95 180 33 -14 -21 -40 -78 3 -176
6979 -176 -211 72 22 -27 55 -9 -26 89 -30 -102 -55 136 -234 -67 -36 234 -166 -41 -70 53 -185 -361 122
7002 122 173 -113 -6 -44 -219 26 239 95 7 174 163 95 -37 0 42 -97 -92 66 -122 62 24 207 -171
7025 -171 26 94 34 187 11 -225 -59 38 -101 102 -175 35 -83 134 142 50 18 169 -209 -238 107 68 -5
7048 -5 4 135 -3 66 0 -158 -130 -50 3 175 73 265 -90 178 14 -248 1 66 -3 60 -136 154 -97 -34
7072 -34 -185 126 17 28 -54 14 3 -332 107 147 81 16 79 128 241 -71 295 -2 179 14 -295 206 22
7095 22 13 9 -13 8 100 144 -152 -108 -90 -197 4 83 -16 -156 56 -76 -68 -208 97 128 -86 -12 20 -132 -227 -114
7121 -114 -23 144 15 43 77 -46 58 -233 -56 162 -45 -148 231 -271 55 271 -170 323 -73 -50 37 -133
7143 -133 62 -49 -5 -40 160 -112 22 40 96 -44 113 -282 280 -84 136 410 -69 -26 -31 -122 -80 199 105
7166 105 -31 -41 -35 -112 -52 -19 -26 -15 -189 -75 -87 -44 168 -159 146 76 -73 49 -29 -22 -182 155 -136 -100 -29 69
7192 69 173 -114 -146 33 -182 283 281 -90 84 -158 181 94 -156 -77 -105 -83 -130 57 -4 -131 -50 41 137 144 -445
7217 -445 53 -53 66 77 -47 -76 -376 28 266 -232 -118 263 157 -44 47 -123 310 144 -86 -109 -322
7238 -322 111 -19 -51 -52 176 105 -82 -9 -63 82 33 101 -132 -205 150 -78 -64 -119 341 159 -123 179 3 101
7262 101 -3 66 -226 -42 -97 -63 159 -137 -82 -258 106 -53 147 50 -210 -42 -72 -36 176 180 -70 98 59
7285 59 37 136 149 -63 60 -90 22 33 25 -110 17 6 -95 -165 -5 230 92 189 22 -86 98 -11 192
7308 192 -170 58 -77 149 65 -8 26 -70 108 28 60 -101 31 -141 99 48 249 -149 -233 -53 251 -54 110
7331 110 -80 97 52 18 -90 118 92 -4 -139 70 90 117 -97 64 -156 60 -133 -31 -3 25 108 78 5 -153
7355 -153 73 209 159 131 195 -145 31 73 -61 135 20 -14 -121 -226 -265 196 30 -37 -337 -8 -85 -30 -38 -224
7379 -224 -45 54 129 -26 -34 1 -262 272 184 34 -31 34 162 -177 133 186 -12 -160 -309 78 -89 33 181
7402 181 43 143 138 57 -216 156 140 51 137 -140 69 22 -133 38 -96 -149 27 -222 -124 106 -107 -54 -126 117
7426 117 -140 40 -65 47 126 -49 251 -110 87 34 -96 140 229 222 -24 -289 -89 256 117 -126 18 8
7448 8 -75 2 -183 87 20 201 -156 170 175 -278 -15 -29 25 118 37 -152 -72 139 -37 -170 133 -41 84 197
7472 197 53 25 148 -162 88 122 37 159 -134 -30 78 80 -145 -66 -17 -50 10 269 234 110 23 148 -135 -79
7496 -79 -133 126 153 -281 -17 -149 -273 -215 -10 221 -75 209 -305 -160 -216 -314 128 15 90 5 -20 184 -42
7519 -42 -39 34 110 53 -28 71 95 211 18 -382 13 -109 130 -50 -138 -189 -242 -33 156 -201 100 -78 72 63 128
7544 128 -100 109 -63 168 55 30 -87 95 -124 -141 97 -161 -52 28 163 63 -43 -64 342 -123 38
7565 38 -2 -122 162 -84 -91 -52 -237 117 170 31 46 -102 -239 -237 -126 4 -354 -61 -82 -68 51 -78 -48 -5
7589 -5 177 135 -65 78 112 -64 -46 -81 75 233 -54 36 28 -91 204 81 32 86 -55 42 146 75 -16 -351 -49
7614 -49 106 -61 121 -45 138 146 -292 -37 -58 -17 -188 -57 90 -251 25 -49 -252 104 -88 30 131 -146
7636 -146 -32 -81 -96 -103 -179 -12 -156 -34 -284 -92 11 -199 114 49 139 -151 191 112 192 80 76 19 4 324
7660 324 236 -257 -208 -100 -3 39 -71 28 -133 -114 -131 -80 7 19 48 93 -180 144 -184 -5 42 -53 -97 35 10
7685 10 47 -115 -123 -252 283 -67 -178 50 -66 213 35 -33 -270 10 209 -326 184 -121 71 -21 -240 -2
7707 -2 -333 -14 160 -6 -187 95 -15 -11 -198 -2 -148 75 17 -149 130 -234 121 193 -166 18 45 15 53
7730 53 -8 46 90 166 64 10 -57 70 225 -27 -51 23 121 14 -158 -89 -98 -307 -1 -63 -80 119 -263 -122 223
7755 223 41 23 -87 -90 -66 75 211 -7 -123 -140 100 47 22 -104 130 30 -57 -167 -394 -54 293 -108 125
7778 125 -147 -20 161 -63 -26 54 41 -137 -127 64 -23 69 228 400 -94 -103 -2 -91 305 167 77 -84 25
7801 25 -85 -270 -17 -57 -218 -70 -47 22 1 44 17 108 -92 28 -85 25 19 28 -30 68 -2 11 28 -56 -27 -114 -47
7828 -47 -106 105 -87 5 -303 -213 106 -114 152 -66 -244 -36 176 -160 138 6 168 -60 68 263 166 -46
7850 -46 -67 -252 21 -30 -27 -46 139 -139 -111 -29 48 0 7 56 -208 114 -102 185 -45 -107 -178 99 -41 352 40
7875 40 -60 126 19 15 73 -84 -80 -81 -25 -67 -60 -19 144 23 -229 0 -29 18 94 -118 -19 -23 62 121 101 77 -29 175
7903 175 152 6 -1 76 181 -3 -110 83 -101 -112 38 -142 -57 126 -18 -68 74 95 66 133 -144 154 106 251
7927 251 -130 -293 -54 -154 -96 211 -15 -63 114 52 55 120 -7 143 -72 61 53 6 -50 -148 43 -72 245 -196
7951 -196 -232 -160 74 -209 10 -167 -93 102 -43 -46 45 -71 -110 -50 -87 93 -42 150 75 -12 182 145 103 200 14
7976 14 9 54 318 -94 -141 82 -29 66 -146 111 -60 89 132 -96 133 -61 -31 -112 38 45 -59 -101 137 86
8000 86 93 -50 108 2 35 153 -59 -175 -60 -5 -14 15 43 -71 -230 83 -168 33 -114 71 -140 120 79
8023 79 28 98 295 196 53 -137 167 88 -15 -18 -236 48 56 179 69 -3 188 -99 -162 -34 8 11 141 -22 130
8048 130 65 -51 -45 198 4 -203 -51 -232 143 97 253 228 63 20 160 153 -41 92 225 -32 102 109 -57
8071 -57 133 46 65 5 -170 218 -39 126 -60 -23 -242 -111 -374 -2 -2 -57 -85 166 209 187 -240 155 -37 -199
8095 -199 64 342 51 -183 -197 -191 1 24 61 -96 -227 -28 -74 -152 38 186 -75 84 63 -170 130 141 -31
8118 -31 69 -131 46 -64 -25 -91 -94 138 -67 1 -107 153 -11 -360 5 100 -72 -48 199 140 -157 28 -36
8141 -36 -150 -52 63 191 -75 -176 26 -33 177 320 141 232 -54 45 106 -18 -113 27 -103 -4 50 56 -84 116
8165 116 -12 -108 -71 -161 64 -162 -19 -102 -295 -158 134 -192 -112 88 52 -119 -182 -120 43 -264 -80 27 80
8188 80 62 -75 216
8191B16
##END NTUPLES=NMR FID
##END=
