##TITLE=1H_SL65-SPh
 CDCl3, 8 sc, 
 29.4.2019
##JCAMPDX= 6.0         $$ Bruker NMR JCAMP-DX V2.0
##DATA TYPE= NMR FID
##DATA CLASS= NTUPLES
##ORIGIN= UXNMR, Bruker Analytische Messtechnik GmbH
##OWNER= root
$$ XWIN-NMR		Version 3.5
$$ Tue Apr 30 14:03:08 2019 Russian Standard Time (UT+4h)  she@DPX200
##.OBSERVE FREQUENCY= 200.1315
##.OBSERVE NUCLEUS= ^1H
##.DELAY= (6, 6)
##.ACQUISITION MODE= SIMULTANEOUS
##.ACQUISITION SCHEME= undefined
##.AVERAGES= 8
##.DIGITISER RES= 18
##SPECTROMETER/DATA SYSTEM= spect
##.PULSE SEQUENCE= zg30
##.SOLVENT NAME= CDCl3
##.SHIFT REFERENCE= (INTERNAL, CDCl3, 0, 15.7039)
##AUDIT TRAIL= $$ (NUMBER, WHEN, WHO, WHERE, WHAT)
$$ ##TITLE= Audit trail, XWIN-NMR		Version 3.5
$$ ##JCAMPDX= 5.01
$$ ##ORIGIN= Bruker BioSpin GmbH
$$ ##OWNER= she
$$ F:/spectra/data/she/nmr/H-F/1/audita.txt
$$ ##AUDIT TRAIL=  $$ (NUMBER, WHEN, WHO, WHERE, WHAT)
(   1,<2019-04-30 14:02:13.68 +0400>,<she>,<DPX200>,
      <created by zg, POWCHK disabled, PULCHK disabled
       configuration hash MD5:
       00 E9 B6 7A A2 85 ED C7 34 08 36 98 17 FE 4E 26
       data hash MD5: 16K
       40 6B 52 77 22 DE A2 86 CA 91 5D 1F 84 0F 44 72>)
$$ ##END=
$$ 
$$ hash MD5
$$ C9 09 47 39 7C 59 EF EB 20 F8 1B 19 50 DB 52 46
##$RELAX= 
##$RELAX= 
##$RELAX= 
##$RELAX= 
##$RELAX= 
##$RELAX= 
$$ Bruker specific parameters
$$ --------------------------
##$DU= <F:/spectra>
##$EXPNO= 1
##$NAME= <H-F>
##$PROCNO= 1
##$TYPE= <nmr>
##$USER= <she>
##$AMP= (0..31)
100 100 100 100 100 100 100 100 100 100 100 100 100 100 100 100 100 100 
100 100 100 100 100 100 100 100 100 100 100 100 100 100 
##$AQSEQ= 0
##$AQ_mod= 1
##$AUNM= <au_zg>
##$AUTOPOS= <>
##$BF1= 200.13
##$BF2= 200.13
##$BF3= 200.13
##$BF4= 200.13
##$BF5= 200.13
##$BF6= 200.13
##$BF7= 200.13
##$BF8= 200.13
##$BYTORDA= 1
##$CFDGTYP= 0
##$CFRGTYP= 5
##$CHEMSTR= <none>
##$CNST= (0..31)
1 1 145 1 1 1 1 1 1 1 1 1 1 1 1 1 1 1 1 1 1 1 1 1 1 1 1 1 1 1 1 1 
##$CPDPRG= <>
##$CPDPRG1= <>
##$CPDPRG2= <>
##$CPDPRG3= <>
##$CPDPRG4= <mlev>
##$CPDPRG5= <mlev>
##$CPDPRG6= <mlev>
##$CPDPRG7= <mlev>
##$CPDPRG8= <mlev>
##$CPDPRGB= <>
##$CPDPRGT= <>
##$D= (0..31)
0 1.2 0 0 0 0 0 0 0 0 0 0.03 0 0 0 0 0 0 0 0 0 0 0 0 0 0 0 0 0 0 0 0 
##$DATE= 1556618533
##$DBL= (0..7)
120 120 120 120 120 120 120 120 
##$DBP= (0..7)
150 150 150 150 150 150 150 150 
##$DBP07= 0
##$DBPNAM0= <>
##$DBPNAM1= <>
##$DBPNAM2= <>
##$DBPNAM3= <>
##$DBPNAM4= <>
##$DBPNAM5= <>
##$DBPNAM6= <>
##$DBPNAM7= <>
##$DBPOAL= (0..7)
0.5 0.5 0.5 0.5 0.5 0.5 0.5 0.5 
##$DBPOFFS= (0..7)
0 0 0 0 0 0 0 0 
##$DE= 6
##$DECBNUC= <off>
##$DECIM= 24
##$DECNUC= <off>
##$DECSTAT= 4
##$DIGMOD= 1
##$DIGTYP= 9
##$DL= (0..7)
0 120 120 120 120 120 120 120 
##$DP= (0..7)
150 150 150 150 150 150 150 150 
##$DP07= 0
##$DPNAME0= <>
##$DPNAME1= <>
##$DPNAME2= <>
##$DPNAME3= <>
##$DPNAME4= <>
##$DPNAME5= <>
##$DPNAME6= <>
##$DPNAME7= <>
##$DPOAL= (0..7)
0.5 0.5 0.5 0.5 0.5 0.5 0.5 0.5 
##$DPOFFS= (0..7)
0 0 0 0 0 0 0 0 
##$DQDMODE= 0
##$DR= 18
##$DS= 0
##$DSLIST= <SSSSSSSSSSSSSSS>
##$DSPFIRM= 0
$$ [...]
##$SUBNAM2= <"">
##$SUBNAM3= <"">
##$SUBNAM4= <"">
##$SUBNAM5= <"">
##$SUBNAM6= <"">
##$SUBNAM7= <"">
##$SUBNAM8= <"">
##$SUBNAM9= <"">
##$SW= 24.9337058887773
##$SWIBOX= (0..15)
0 0 2 0 0 0 0 0 0 0 0 0 0 0 0 0 
##$SW_h= 4990.01996007984
##$TD= 16384
##$TD0= 1
##$TE= 0
##$TE2= 300
##$TE3= 300
##$TEG= 300
##$TL= (0..7)
0 120 120 120 120 120 120 120 
##$TP= (0..7)
150 150 150 150 150 150 150 150 
##$TP07= 0
##$TPNAME0= <>
##$TPNAME1= <>
##$TPNAME2= <>
##$TPNAME3= <>
##$TPNAME4= <>
##$TPNAME5= <>
##$TPNAME6= <>
##$TPNAME7= <>
##$TPOAL= (0..7)
0.5 0.5 0.5 0.5 0.5 0.5 0.5 0.5 
##$TPOFFS= (0..7)
0 0 0 0 0 0 0 0 
##$TUNHIN= 0
##$TUNHOUT= 0
##$TUNXOUT= 0
##$USERA1= <user>
##$USERA2= <user>
##$USERA3= <user>
##$USERA4= <user>
##$USERA5= <user>
##$V9= 5
##$VALIST= <valist>
##$VCLIST= <CCCCCCCCCCCCCCC>
##$VD= 0
##$VDLIST= <DDDDDDDDDDDDDDD>
##$VPLIST= <PPPPPPPPPPPPPPP>
##$VTLIST= <TTTTTTTTTTTTTTT>
##$WBST= 1024
##$WBSW= 4
##$XGAIN= (0..3)
0 0 0 0 
##$XL= 0
##$YL= 0
##$YMAX_a= 288288
##$YMIN_a= -344167
##$ZGOPTNS= <>
##$ZL1= 120
##$ZL2= 120
##$ZL3= 120
##$ZL4= 120
##$ABSF1= 10
##$ABSF2= 0
##$ABSG= 5
##$ABSL= 3
##$ALPHA= 0
##$AQORDER= 0
##$ASSFAC= 0
##$ASSFACI= 0
##$ASSFACX= 0
##$ASSWID= 0
##$AUNMP= <proc_1d>
##$AZFE= 0.1
##$AZFW= 0.1
##$BCFW= 1
##$BC_mod= 2
##$BYTORDP= 1
##$COROFFS= 0
##$CY= 11.3945322036743
##$DATMOD= 1
##$DC= 2
##$DFILT= <>
##$DTYPP= 0
##$F1P= 18.9103706918063
##$F2P= -1.10871071338519
##$FCOR= 0.5
##$FTSIZE= 0
##$FT_mod= 4
##$GAMMA= 1
##$GB= 0.15
##$INTBC= 1
##$INTSCL= 1
##$ISEN= 128
##$LB= 0.24
##$LEV0= 0
##$LPBIN= 0
##$MAXI= 10000
##$MC2= 0
##$MEAN= 0
##$ME_mod= 0
##$MI= 1.114404
##$NCOEF= 0
##$NC_proc= 0
##$NLEV= 6
##$NOISF1= 3.799351
##$NOISF2= 2.8
##$NSP= 1
##$NTH_PI= 0
##$NZP= 0
##$OFFSET= 15.70392
##$PC= 1
##$PHC0= -8844.543
##$PHC1= 0.0002555847
##$PH_mod= 1
##$PKNL= yes
##$PPARMOD= 0
##$PSCAL= 0
##$PSIGN= 0
##$REVERSE= no
##$SF= 200.130013532006
##$SI= 16384
##$SIGF1= 3
##$SIGF2= 2
##$SINO= 400
##$SIOLD= 16384
##$SREGLST= <1H.CDCl3>
##$SSB= 0
##$STSI= 0
##$STSR= 0
##$SW_p= 3612.71676300578
##$SYMM= 0
##$S_DEV= 0
##$TDeff= 0
##$TDoff= 0
##$TI= <>
##$TILT= no
##$TM1= 0
##$TM2= 0
##$TOPLEV= 0
##$USERP1= <user>
##$USERP2= <user>
##$USERP3= <user>
##$USERP4= <user>
##$USERP5= <user>
##$WDW= 1
##$XDIM= 8192
##$YMAX_p= 0
##$YMIN_p= 0
$$ End of Bruker specific parameters
$$ ---------------------------------
##NTUPLES= NMR FID
##VAR_NAME=  TIME,          FID/REAL,        FID/IMAG
##SYMBOL=    X,             R,               I
##VAR_TYPE=  INDEPENDENT,   DEPENDENT,       DEPENDENT
##VAR_FORM=  AFFN,          ASDF,            ASDF
##VAR_DIM=   8192,          8192,            8192
##UNITS=     SECONDS,       ARBITRARY UNITS, ARBITRARY UNITS
##FACTOR=    0.0002004,     1,               1
##FIRST=     0,             0,               0
##LAST=      1.6414764,     0,               0
##MIN=       0,             -344167,         0
##MAX=       1.6414764,     288288,          0
$$ Real data points
##PAGE= N=1
##DATA TABLE= (X++(R..R)), XYDATA
0 0 0 0 0 0 8 -8 8 -8 16 -16 24 -24 32 -40 49 -59 73 -86 102 -121 143 -163 191 -220 252 -289 330 -374
28 -374 427 -479 540 -607 683 -762 853 -951 1056 -1171 1298 -1443 1597 -1766 1956 -2167
44 -2167 2402 -2662 2959 -3295 3682 -4130 4659 -5293 6073 -7053 8332 -10080 12628 -16707
58 -16707 24319 -43498 197105 288288 16073 154158 279023 259469 121801 151747 218403
69 218403 221325 154778 167646 183382 159088 112692 131241 147552 129340 101005 120264 128596
81 128596 103727 76616 94891 108556 87866 59308 70430 89407 79094 48118 39666 48944
93 48944 50623 40258 41811 48566 42176 25855 25664 35635 28226 5027 -527 17269 26220 11441
107 11441 840 8453 13748 2282 -4924 1572 2974 -9588 -15431 -3143 3677 -7472 -17961
120 -17961 -11432 -3661 -7788 -12929 -10183 -9805 -18264 -20479 -12385 -8215 -15177 -18852 -12523 -8718 -14601
135 -14601 -17277 -12426 -10537 -16542 -19772 -13106 -8854 -12823 -16280 -12807 -9030 -11662 -14564 -12605 -9263
150 -9263 -9957 -11984 -10839 -9894 -10808 -11741 -9451 -7058 -7186 -8159 -8001 -6751 -6614 -7766 -8370 -7090 -6539 -5932
168 -5932 -4925 -4199 -4863 -5474 -4642 -3396 -4282 -5494 -4592 -2447 -2119 -3502 -3199 -1823 -2366 -3932 -3646 -1317
186 -1317 -955 -2259 -2238 -973 -1334 -1874 -2162 -860 -1022 -1947 -1435 7 -78 -1219 -1444 -297 -838 -1708 -1241
205 -1241 -69 78 -827 -1071 -526 -511 -1325 -669 -203 -196 -1156 -1078 -396 -225 -1002 -1347 -969 -1016 -1056 -994 -557 -485
227 -485 -802 -1350 -882 -963 -1570 -1195 -1451 -655 -817 -1247 -1230 -1080 -1357 -1239 -1209 -1106 -1246 -1851 -1196 -767 -1352
248 -1352 -1435 -1153 -924 -1263 -1654 -854 -883 -1135 -1576 -1192 -928 -1031 -1531 -1207 -910 -853 -1231 -887 -641 -1128 -1323
269 -1323 -1064 -878 -956 -1096 -916 -652 -692 -924 -803 -627 -890 -1009 -748 -550 -380 -959 -472 -293 -525 -737 -761
290 -761 -690 -608 -645 -442 -396 -158 -350 -339 -263 -88 -230 -409 -24 -397 -291 -418 12 -51 -197 -293 356 113 -48
313 -48 124 76 159 65 303 -284 111 -216 -157 -67 187 145 111 0 45 496 21 7 162 -40 123 380 52 288
337 288 46 235 487 452 303 -22 367 200 533 85 157 492 -8 319 246 507 469 293 313 173 -34 219
359 219 149 317 164 216 5 20 278 -232 158 239 112 85 -45 610 284 236 224 215 31 -75 278 157 -133
382 -133 -159 388 378 224 239 233 285 50 -69 25 -42 19 51 43 35 -15 306 30 -33 -181 -315 332 -95 30 136 -96
408 -96 -230 145 -392 -51 223 34 -185 -167 24 -56 -488 -52 112 -36 -12 -323 60 -152 -321 -203 -41 -58
430 -58 55 271 33 -23 -55 -69 -156 68 67 191 -88 195 -99 30 235 12 -132 -22 165 23 91 35 6 -213
454 -213 -10 -227 -212 18 36 -83 -130 -116 74 -76 28 -3 -58 130 314 265 207 132 -45 -43 391 84 -79 -18
478 -18 124 68 -29 287 -71 -117 135 -252 67 -99 160 212 -80 16 50 287 113 401 214 -245 129 205 -73
501 -73 243 141 219 25 44 24 316 199 199 209 306 156 -57 102 266 -197 223 318 -94 320 34 289 525
524 525 106 154 87 -128 170 151 -104 205 121 -54 126 153 -47 160 106 134 278 214 270 181 79 -262 334 77
548 77 150 485 227 201 225 68 261 215 -98 57 -38 -193 67 -64 -233 -94 167 -319 169 -274 62 -93
570 -93 -136 -13 54 -197 -66 -19 -271 -147 162 87 248 -28 -112 -241 -291 -364 -235 -467 -449 -253 -163 -212 -407 -267
594 -267 -381 -307 -333 -319 -323 -294 -167 -389 -224 -578 -434 -438 -602 -514 -288 -654 -522 -506 -244 -554 -306 -138 -601 -330
618 -330 -367 -296 -367 -434 -673 -551 -488 -409 -634 -360 -347 -219 -234 -883 -502 -774 -669 -506 -523 -283 -447 -498 -190 -673
642 -673 -512 -699 -313 -775 -590 -614 -582 -74 -364 -501 -279 -439 -329 -80 -334 -101 -368 -456 -433 -184 -377 -290
664 -290 -177 -267 -249 -186 -346 -443 -113 122 -19 -240 14 -290 -107 -31 99 228 -122 -88 -68 -88 -141 -83 -77 12 323
689 323 236 261 198 8 205 130 103 25 203 -104 107 330 509 196 199 205 -8 275 181 59 136 121 263 243 732
714 732 30 95 213 183 609 184 332 258 242 277 232 303 300 266 390 376 269 548 24 196 275 181 184 288 283 431
740 431 237 169 312 81 211 -191 281 252 334 493 298 101 -14 131 143 398 182 240 407 240 50 102
762 102 159 289 110 340 231 198 461 3 -60 88 47 104 421 265 475 254 205 -10 189 160 -14 279 275
785 275 311 41 101 241 356 275 100 168 -58 53 278 71 240 177 62 -128 246 -30 143 17 -40 228
807 228 -35 372 213 119 45 40 190 117 306 37 271 363 289 17 -63 61 94 -237 196 68 130 -160 51 -7
831 -7 -141 -68 -330 -48 -102 -31 -116 224 -63 -158 -63 112 -11 43 -116 385 57 -72 38 -22 71 -129 -66 74
855 74 140 -139 -202 210 -108 -180 -353 -38 91 -302 -405 68 -105 -243 72 276 -249 -320 5 -72 12 -161 295
878 295 -223 -53 -542 66 -71 -164 -188 138 -32 144 -30 -87 -154 -144 180 -412 171 342 56 315 478 -61
900 -61 -158 151 -180 66 176 300 88 -199 -1 226 212 119 -109 -66 77 154 197 7 186 479 101 -79 411
923 411 -57 11 -292 55 91 172 -348 107 475 188 144 225 -87 -146 -120 262 226 -172 206 22 -88 209 -249
946 -249 -169 -173 220 244 -89 73 11 -155 -223 -146 92 5 95 -212 202 -122 -248 114 -180 -235 -35 -149 87 -76
970 -76 65 158 -52 -102 0 -73 -156 -67 17 50 -210 -240 -249 -133 95 -282 -179 114 166 -343 -55 -83 128 23 -89
995 -89 97 -140 -34 -8 129 -148 350 -78 -51 -214 -194 69 145 -101 12 -341 -216 -63 -392 -43 -27 -104 -145
1018 -145 374 -145 -86 54 -312 300 37 -451 59 188 482 125 -152 -302 66 128 -182 -110 -82 198 -532
1039 -532 13 -181 -93 -114 -134 -87 -85 -95 -419 89 107 106 112 113 -404 94 -120 -43 21 -8 -77 -283 -55 -206 157 -70
1065 -70 -2 -64 -382 -192 58 121 -279 -9 -87 -252 216 213 63 148 157 0 214 68 -152 292 125 1 -287
1088 -287 -96 -160 -60 -231 77 -327 39 91 -12 182 -68 -23 -148 100 -73 217 193 42 -375 -16 67 15
1110 15 -178 75 82 -69 -78 -45 -80 -60 -397 105 6 10 144 140 34 -299 31 -59 107 -40 44 152 -105 219 25
1135 25 -142 302 -150 74 167 -36 -222 -166 251 102 200 205 1 -283 -62 -37 12 139 15 341 179 212 -128
1158 -128 130 -17 -92 -143 -518 -57 104 190 -248 82 178 74 -102 29 -44 13 -212 -23 -188 -51 -1 229
1180 229 35 247 37 33 70 -99 -383 -38 -4 -188 -179 -113 -41 250 -10 -138 -276 191 374 -49 -51 -84 -152 -20
1204 -20 -8 -67 -105 404 81 373 258 77 -358 166 172 -97 132 -1 -62 9 -182 -63 -83 24 62 -345 70
1227 70 278 97 -9 -59 0 -197 27 188 159 -106 -79 49 185 -98 86 -186 203 62 -188 -260 -106 -76
1249 -76 47 -227 34 -24 -148 -38 -202 139 59 107 41 -63 -3 175 -56 -315 -358 -180 5 56 135 262 375
1272 375 94 -118 -239 -128 242 -106 -95 38 -22 54 -111 -157 -142 161 229 96 -278 -237 120 -72 15 64 -67
1295 -67 -71 23 263 81 -24 15 15 38 -331 -288 -77 79 -53 25 -201 1 86 96 -248 119 42 -49 293 303 -87
1320 -87 -106 36 -7 -72 -41 334 -53 0 -40 -127 167 172 66 -41 78 55 -83 -63 -162 -227 -99 247 156 415 35
1345 35 113 -124 215 207 -38 242 -48 -126 -46 164 -228 57 77 162 131 11 -51 16 165 -54 -125 167 119 -87
1369 -87 176 -250 -208 22 -3 425 31 3 83 133 -93 144 297 -283 182 -71 141 -26 -243 260 28 -170
1391 -170 -142 63 231 -142 -114 380 -69 57 256 110 -50 130 427 -43 -32 95 -43 309 90 -317 42
1412 42 243 298 101 -136 -210 101 133 -295 -45 101 -174 -26 -42 198 119 -270 203 117 -115 164 152 256 14
1435 14 106 36 -6 53 157 160 -128 -39 37 85 160 -44 382 112 -39 189 126 -224 -4 -83 -231 -250 -164 -15 -253
1460 -253 294 346 130 372 -17 113 -27 412 -97 -55 187 74 -105 -47 -95 -191 132 -379 -99 -120 195 50
1482 50 -219 -67 -484 -70 48 223 133 -27 -47 106 -91 127 -89 145 72 125 54 -188 41 179 1 -46
1504 -46 -167 -46 26 81 -199 206 -130 80 249 -200 -71 99 -24 33 183 -28 55 120 -188 35 2 -118
1526 -118 8 -288 -201 -99 4 36 -232 -396 -131 155 115 138 -38 -11 200 -202 55 -124 -117 49 183 -157
1548 -157 180 13 -101 3 63 133 -224 -107 49 184 261 -233 266 312 -311 130 84 -194 -4 73 164 -102
1570 -102 68 -69 80 -144 209 -171 -406 85 161 -14 182 117 54 176 -27 4 -56 164 -149 105 323 133
1592 133 -70 16 -255 -144 -236 -175 -162 1 68 -282 -10 -305 153 -80 301 348 -53 174 256 177 -132 332 172
1615 172 -33 -207 -129 -83 -103 149 29 124 -98 -163 238 199 -7 45 -61 -16 -170 174 -64 43 -147 -85 63
1638 63 2 -169 7 169 142 356 -378 176 203 171 -69 55 -66 102 108 -79 143 80 234 287 -189 -286 21
1661 21 50 96 -155 5 193 -45 -123 -118 120 -49 56 153 149 28 94 274 -105 -55 -85 51 161 11 -51 236
1685 236 13 -71 192 -8 -26 104 108 19 77 -128 -430 93 391 25 -214 99 173 -78 92 -173 205 140 -98
1708 -98 -37 115 -30 38 -28 94 -196 -38 -171 -231 54 -10 237 70 -91 -4 -97 -95 213 -37 -90 -92 -50 -174 -305
1733 -305 -163 -125 24 125 104 -94 -218 260 -8 173 -70 -197 146 -3 -177 101 -124 -21 116 103 -4
1754 -4 50 63 175 48 107 -284 -238 -141 155 128 -202 248 224 -97 33 125 -10 200 -197 118 -262 -12 15 -4
1778 -4 157 -90 23 28 57 32 -33 41 34 50 -109 -188 355 -3 -143 327 -234 -93 415 -88 -14 -18 126 68 -367
1803 -367 81 133 245 -318 -240 -82 229 93 36 -6 -152 -70 306 99 133 15 -300 86 130 43 -139 -150 49
1826 49 -94 75 -219 -27 480 -31 -41 -225 44 -114 272 379 53 36 118 193 -213 81 -225 -27 -25 125
1848 125 214 214 -76 -216 106 -11 99 62 -238 -59 -275 129 15 -34 -37 -33 35 191 35 187 21 180 124 -49
1872 -49 -146 208 -175 48 267 -244 -523 130 109 -82 239 -324 221 68 75 86 88 292 134 157 122 -491 -83
1895 -83 55 27 -21 -343 101 242 -14 -61 -71 290 360 84 57 -143 -229 -14 149 -147 76 208 -35 240 36
1918 36 130 186 29 -200 16 10 -343 47 119 45 37 120 -81 81 -115 -96 -59 26 -181 153 -151 5 -24 -1 -3 -140
1944 -140 161 -44 -1 8 195 216 116 468 83 -60 -300 93 -215 162 -41 -117 137 46 154 116 127 157 71
1967 71 118 -13 4 -197 118 47 5 -128 -251 184 -1 50 35 -26 35 -234 35 -231 30 -43 152 -67 -163 -258
1991 -258 83 59 -1 -44 -177 82 -102 151 284 119 95 -62 -194 229 -9 51 -79 -206 60 9 -30 -69 -48
2014 -48 -55 193 451 -165 -122 -232 201 167 -3 -140 2 43 -455 52 42 272 -16 -233 232 73 -239 63
2036 63 -204 34 -127 -74 138 -130 49 -143 173 318 -92 -97 -59 20 109 157 15 -169 -319 61 -97 25 -203
2059 -203 -49 8 -91 -68 3 151 -273 2 86 -182 51 -158 62 278 -74 -276 141 371 -184 -308 -9 0
2081 0 -20 -112 -153 -137 -173 49 55 107 -148 58 -9 -86 233 43 65 5 32 291 99 6 -94 -66 -172 -94 174 -166
2107 -166 -109 -58 -163 26 247 34 39 -83 110 43 120 8 130 270 115 -122 81 251 -94 -128 -279 158
2129 158 119 311 -146 46 -11 -70 125 92 -315 23 -169 -10 170 152 30 -78 69 -1 -64 266 68 -239
2151 -239 156 -242 51 219 -70 -131 55 219 152 -283 -62 -372 -276 270 -29 -27 -169 179 -365 -275 -167 -7
2173 -7 -202 55 62 319 247 27 334 -38 -464 212 -15 -6 63 125 133 106 -119 -46 160 247 -163 132 69 296 32
2198 32 -104 11 8 205 58 415 -50 332 -147 197 323 229 -49 -98 33 -113 -74 102 -2 43 116 -131 -169
2221 -169 185 43 64 -203 94 0 24 -191 -137 188 -23 -167 -53 -194 -260 -1 268 -55 -77 184 -35 -75
2243 -75 -188 149 88 220 -127 -172 45 -79 -257 -393 -71 -85 -367 -2 -79 -101 234 -91 -16 -188 -171 254 -85
2266 -85 465 176 121 124 -49 -439 -221 81 232 -58 -186 -266 -270 29 -174 254 -290 -28 -121 -136 -9 186 -131
2289 -131 74 204 -39 -80 -95 -35 138 126 -18 -312 183 108 -23 -36 115 -253 57 45 173 -343 156 39
2311 39 -6 281 -72 139 -58 81 216 113 70 155 47 184 265 105 201 -257 25 233 -3 -31 42 -67 109
2334 109 -162 -274 6 388 -146 -203 144 -108 -86 244 49 12 -186 -115 -138 -38 72 113 243 61 -199 85
2356 85 -141 -184 225 25 -232 -84 237 64 -65 46 -78 98 42 10 -263 -138 97 -3 351 44 157
2377 157 -280 365 56 50 -86 129 309 162 -142 157 -31 -147 5 79 57 -418 -79 -50 93 67 -283 73
2399 73 35 -135 -192 -220 -64 -253 284 -18 -251 32 130 267 -280 -31 156 -184 -248 195 190 -118 113 -1 55
2422 55 268 -189 217 55 86 8 140 11 70 38 48 203 22 211 109 -104 137 -42 171 126 285 30
2444 30 233 371 31 -100 19 200 -10 60 55 141 -194 -102 13 21 -32 -150 -223 19 -68 -41 136 11 -244 -1
2468 -1 -151 93 -97 -57 -88 -307 183 -46 -214 -33 -121 -222 -211 -148 -324 9 376 140 -43 30 205 -64 2
2491 2 152 210 129 154 114 51 -194 -144 -19 -138 -220 -81 286 -165 187 114 3 -262 -21 -45 -201 -113 245 85
2515 85 99 -163 -342 -38 105 -322 -203 -75 -69 58 148 -72 -245 -31 290 -265 131 32 -531 42 -203 -172
2537 -172 226 -35 -372 -30 -27 113 54 -136 -81 73 -182 42 -97 -77 112 264 -54 366 -44 -120 48 122
2559 122 56 -438 -7 30 242 87 163 -195 -79 170 104 218 246 66 23 218 258 172 322 -59 167 -123 -157
2582 -157 -68 -97 -200 -96 26 -137 71 -250 280 178 -5 -304 -137 -204 12 -36 76 -163 60 -222 150
2603 150 382 -61 120 72 119 -117 -86 -140 210 21 -39 53 -83 31 -224 139 336 -3 -125 -98 -77 -58 -76
2626 -76 465 30 7 -2 -14 -194 -229 10 154 63 -137 100 -190 61 81 120 -49 19 123 60 -24 -8 173 -270
2650 -270 -3 -175 116 -457 55 -125 24 -86 -98 337 -274 110 -35 -12 258 -215 56 53 115 63 -50 -207
2672 -207 66 41 124 -82 -189 147 90 -95 127 199 224 -235 228 197 -187 110 261 35 -116 181 86 -28
2694 -28 373 -232 40 -216 -188 118 -13 54 -378 -82 307 249 -1 -24 -61 35 -185 69 -134 -205 -16 -191 68
2717 68 97 46 -138 119 -82 -41 -350 -258 -47 169 160 -44 149 247 -82 -56 -57 -16 97 -10 -27 27 4 -117 -22
2742 -22 137 -61 193 -148 102 -66 -26 412 56 -75 -18 31 -128 -130 -20 23 54 -294 -4 219 -43 -103 -159
2765 -159 105 78 -293 108 -132 -129 129 -139 168 49 -46 -84 -188 143 -81 -149 -135 -146 -62 254 66 8 -17 -114
2789 -114 -40 217 -206 -26 259 -250 131 139 256 233 0 -80 -214 -90 189 51 50 98 111 -138 -87 60 0 33
2813 33 -99 0 -156 39 -259 -142 178 -171 -64 296 -293 -72 -72 -172 -95 153 55 50 -133 64 19 -120 -62
2836 -62 64 33 -219 -84 294 -206 99 49 146 -192 20 -173 -153 248 46 -352 -115 -407 144 254 117 -5
2858 -5 156 356 -272 -9 10 23 127 -162 226 -64 -173 -220 285 -35 29 -103 -169 51 -290 63 -400 241
2880 241 -52 -275 -250 -17 196 71 -307 -215 286 46 333 152 -144 54 -39 -74 -107 -317 105 86 126 105 25
2903 25 42 38 -92 -24 -170 -289 -136 132 -17 299 -35 150 -81 -6 -389 51 21 -121 217 9 377 -91
2925 -91 127 -242 -102 173 -8 -73 73 71 133 -423 62 65 -94 -216 -180 137 -217 163 77 -38 -59 -162 -52
2948 -52 -159 -111 -9 -126 14 -43 123 43 -81 115 132 30 197 -124 -68 0 -44 -140 -64 -220 24 -120 5
2971 5 3 -112 131 -177 89 -126 273 66 232 -37 -190 -279 41 37 -19 -81 110 284 -192 228 174 6 -5 55
2995 55 125 23 76 -80 -91 -44 170 -151 77 -332 58 -21 79 -163 334 -251 163 269 -65 107 165 167 -255
3018 -255 -11 77 239 27 -24 190 -35 -20 69 -16 308 107 191 56 249 23 29 154 23 69 -162 76 202
3041 202 -4 22 62 -204 -33 14 -109 -137 59 -12 67 13 -363 -99 140 83 0 87 221 -253 161 -29 -219
3064 -219 339 -15 -189 143 -273 62 89 -169 142 402 -28 75 -152 -65 -110 -2 60 -274 -100 48 67 329
3086 329 -45 111 320 187 33 -220 240 -270 -102 96 28 2 -112 241 96 -115 407 -62 113 192 -115
3107 -115 -46 25 30 128 48 -58 71 -162 -184 113 -108 264 -161 5 98 37 -294 -130 26 -141 -189 -208 -48 55
3131 55 -143 55 50 35 139 -53 -92 159 -35 -24 -84 266 98 -63 -59 48 81 180 52 123 6 -57 -160 -119 41
3156 41 69 -303 3 -165 -19 -8 430 189 250 12 -49 -66 172 226 -227 -117 0 -203 89 16 -165 17 168
3179 168 -110 126 -76 -268 -47 504 219 370 287 13 30 -279 208 -257 125 -30 -342 -91 101 -220 77
3200 77 78 116 -144 -286 194 30 -60 -30 182 136 424 150 69 95 -38 125 -224 256 -31 -90 -302 24 -31 -160
3224 -160 -29 135 -235 180 -68 161 -49 48 187 -103 2 -73 2 19 -131 209 -122 -216 16 62 200 -42
3246 -42 48 34 137 -129 -232 202 83 15 -110 -182 142 99 229 -336 -91 -286 179 -35 42 -31 -127 -293 189
3269 189 -14 -81 143 220 -72 -57 -86 -108 -123 23 -247 -149 65 145 55 -173 -159 53 46 267 -259 -173 123 144 64
3294 64 63 -140 -130 246 -273 17 167 -53 -260 40 278 -126 -506 116 -5 -185 204 14 -293 -94 -127 -34
3316 -34 117 154 -58 25 -60 42 -23 100 104 260 80 -53 -277 -214 84 68 -112 -190 139 137 98 -50 -221 91
3340 91 156 62 -14 71 -109 64 97 118 53 -134 131 137 78 -69 71 -241 -463 192 -221 -8 129 -129 -307 -110
3364 -110 118 65 -46 134 -37 0 -118 -164 -35 11 55 125 44 72 261 -106 31 255 130 17 -34 2 157
3387 157 44 -137 223 30 30 -20 -33 147 -63 -187 87 123 -166 2 109 109 -29 101 111 -102 -98 -62 -79 157
3411 157 108 -223 36 345 -130 20 219 -206 -100 33 17 7 -153 -73 -160 -22 35 -117 201 4 -56 242
3433 242 -76 148 -77 -98 44 114 -170 89 -93 253 121 163 -60 -100 171 -151 -279 84 -94 -142 141 145
3455 145 133 177 -240 -101 35 -48 38 -57 151 295 163 60 -35 -127 -12 -176 68 -41 125 328 -126 -95 103
3478 103 -198 -295 32 -150 12 -127 -23 -189 73 -164 -74 -41 128 114 -60 -10 -133 -91 82 43 -132 99
3500 99 -102 -92 65 285 -94 -139 85 115 -36 -73 -321 274 47 43 -35 -68 -186 197 -179 136 -42 147 -36
3523 -36 217 -77 -218 -56 153 30 39 38 119 -154 60 289 284 69 -80 85 148 194 162 93 -55 -161 179 -409
3547 -409 17 -35 -136 223 274 -219 -145 7 -361 -91 193 207 -147 -37 386 -70 76 20 -116 178 -226 -127
3569 -127 -216 145 102 -35 11 -175 98 -150 35 11 -127 150 69 132 -30 2 -328 108 137 46 35 -47 -49 69
3593 69 -10 -50 -189 -140 206 -40 -1 -46 -11 -109 -70 -104 -140 62 141 -193 69 67 -83 115 -64 -85 -76 132 -61 -26
3619 -26 50 -186 -27 234 99 110 6 -180 78 103 90 -224 57 307 -35 -68 -335 -163 -83 -25 64 -42 226
3642 226 -28 62 -315 119 171 204 226 266 -136 121 -80 162 337 -84 -122 -237 16 -2 77 81 -89 66 99 245
3666 245 -60 26 221 94 -109 -265 -138 -57 419 207 1 -132 -369 -85 -140 -91 -22 -214 -45 209 61 -274
3688 -274 4 -379 -47 -80 -369 27 -14 -114 146 265 30 -192 -142 57 110 303 -150 -212 -140 -26 -44 254
3710 254 -65 139 -102 -267 126 -93 -131 74 9 178 -1 152 7 -84 -72 35 -34 -20 -37 85 163 85 -8
3733 -8 -149 12 74 51 -78 -60 -197 23 -282 -390 -4 307 -169 -373 126 105 60 2 -254 -5 -87 -159 -46
3756 -46 -43 -100 177 155 65 192 73 62 145 -20 155 217 47 129 -84 42 -39 72 78 -213 199 -140 57 -201
3780 -201 -104 -73 252 104 14 67 -181 -47 158 230 -110 -21 -169 173 326 -75 29 -67 88 123 -117 66 -82
3803 -82 143 -70 88 -89 -28 -82 -257 10 191 39 -274 -298 182 -168 -36 129 21 -375 177 -25 -175
3824 -175 431 -111 -169 108 96 -128 275 -192 -75 110 69 41 -330 58 21 82 150 -21 -73 -37 20 -141 -144 -220
3848 -220 -88 -111 -142 77 -10 17 124 137 -158 35 -266 -114 -20 122 -61 -14 -25 26 -187 84 44 -8 279 202
3872 202 95 373 -59 58 -164 -233 368 240 266 -183 14 51 29 -143 -220 -228 -54 -50 -81 -352 -164 164 161 49
3896 49 -13 -13 367 -42 180 212 -226 -159 -218 -191 75 197 -108 81 -66 -191 -202 379 370 391 -7 -162 -19 -318
3920 -318 -164 139 13 -3 -129 -10 116 146 -263 141 -60 -97 49 176 -69 51 -62 -81 4 62 4 72 51
3943 51 -93 224 -304 80 -178 -205 166 -45 38 22 -93 223 1 218 93 231 90 -12 186 -103 77
3964 77 16 -151 9 -48 88 -53 71 -376 111 35 93 58 -83 163 -211 244 -130 -299 -61 -40 265 -190
3986 -190 29 65 -34 -154 63 46 49 -60 88 -72 -72 191 -185 56 -134 -171 212 -67 32 38 -72 -40 329 -366
4010 -366 98 91 219 7 -451 81 -107 261 94 69 -150 227 20 284 159 122 217 64 119 152 50 16 -87
4033 -87 -13 135 -15 -55 285 205 81 -11 69 -43 -218 194 146 43 -53 -16 -368 -153 -77 -25 -204 -238 161 -118
4057 -118 197 -84 -296 -111 149 -136 -247 -8 -183 -251 -52 -173 -137 -10 207 156 113 33 186 -2 81 -107
4079 -107 212 -59 -176 27 -126 15 52 301 31 160 74 -130 -114 159 -46 131 -255 304 -80 -100 7
4100 7 -14 -23 36 92 -162 -141 -230 143 -137 124 108 -25 -208 114 -90 -153 -67 -109 -9 -331 -153 108 -168 23
4124 23 232 158 5 46 -12 -3 -27 103 164 109 -40 -183 99 -167 -238 79 262 -152 17 19 -235 -18 -104 83
4148 83 147 -37 94 -18 60 -195 25 78 -43 5 210 411 -84 -90 -64 -156 53 187 24 182 8 118 94
4171 94 -234 -125 20 -8 184 25 99 -80 -79 49 -117 62 131 -120 222 -71 198 -101 -140 215 70 208
4193 208 84 -97 -18 -128 138 -32 60 -51 238 -174 202 -25 -241 -31 -86 243 170 210 -181 -64 -346 -1
4215 -1 186 32 -51 -61 -223 166 134 133 564 -39 148 90 -79 52 -54 -139 -255 84 185 -70 47 46 10 104
4239 104 7 -267 10 140 397 -119 38 133 -49 307 -49 192 -68 -137 324 -127 -97 -79 42 -60 -94 -19
4261 -19 9 133 -21 -147 -52 311 -102 22 120 -335 -316 50 209 115 6 173 31 75 146 -18 -220 158 39
4284 39 -34 146 -30 11 13 -14 109 -106 60 -117 41 -199 141 -197 -52 -106 -26 -27 23 71 -193 -355 61 -266
4308 -266 -77 48 63 -399 121 13 104 68 -146 -20 -219 -112 -36 -168 -197 -115 -177 337 -488 72 201 -61
4330 -61 -51 -128 341 221 248 88 -250 -124 -15 136 181 -86 104 19 -196 -102 -102 199 19 165 114 -98 -112 144
4354 144 -32 49 -156 -76 40 98 189 572 -286 -3 -80 -102 -122 -30 391 114 36 -138 -38 -11 35 -177 -18 -99
4378 -99 270 160 147 -75 -227 35 30 -119 -158 62 -242 289 -72 136 249 271 10 -148 15 -191 198 400
4400 400 149 -101 76 -49 22 202 227 274 418 129 97 -161 -325 196 260 -39 -46 181 310 174 167 -196 -132
4423 -132 53 -120 -21 -194 -283 277 -11 114 -74 -193 -26 -132 178 312 321 84 -19 159 -72 200 109 30
4445 30 -99 103 1 222 -2 -133 30 288 141 92 -158 -178 319 69 -197 35 -120 -219 84 -104 -19 -80
4467 -80 2 -176 1 -21 -52 -24 -226 73 -151 -178 243 170 -92 37 -195 101 54 -173 268 -287 -175 12 -195
4490 -195 116 198 -199 236 185 28 -52 4 -37 -24 18 -42 -419 -342 1 -174 25 -17 -91 126 53 -110 14 118
4514 118 -4 -101 80 -138 -110 247 141 6 -227 190 149 -142 38 -31 51 175 24 108 -115 -108 102 -314 -70
4537 -70 242 148 244 -34 -59 106 179 -167 -9 114 17 -42 -4 57 -249 235 -172 60 53 77 204 -93 -53 -39 -117
4562 -117 122 153 122 -118 -346 -126 90 30 -109 -21 350 -289 111 -357 -156 -138 54 52 -135 63 -204 -464
4584 -464 -337 158 56 43 132 52 -378 -102 177 -104 -205 36 86 -211 8 -32 -77 -80 214 -60 166 -74 -143
4607 -143 86 124 60 -151 179 15 -5 -57 -179 121 -117 169 36 171 8 117 167 166 21 -218 -131 44 117
4630 117 -15 44 52 113 154 197 -245 -12 -15 -350 320 -122 151 379 212 88 131 -251 -97 -125 -67 213 -144 219
4654 219 -27 -12 139 14 140 -48 -89 155 51 92 -12 -38 137 -3 -109 -182 -87 287 -25 -76 245 1
4676 1 -131 -177 -18 250 -117 230 -180 -226 -130 -240 -110 126 -119 268 -174 -156 -243 54 134 -151 78 -119 5
4699 5 79 213 -57 138 67 -67 57 217 104 170 -110 10 67 30 262 75 -149 75 -181 -87 -104 -53 41 213
4723 213 -60 11 -293 -212 -546 -134 42 -16 74 163 72 137 198 -74 227 119 40 223 106 176 -250 -19 265
4746 265 140 -28 -118 -27 263 -24 -69 178 33 78 138 -54 -58 -76 100 48 -49 -117 -90 -230 -38 138 -320 0
4770 0 -80 -197 72 -121 -35 72 -86 -52 145 -43 -108 -177 233 -141 -9 -214 -60 -49 106 -16 -241 102 187
4793 187 155 48 -30 149 -136 -141 -41 -81 102 87 324 -88 80 -89 90 -133 78 -10 -162 218 -127 -120 -189
4816 -189 16 -165 230 21 -132 -260 -321 -107 85 -63 148 -34 200 -73 17 -12 70 65 -176 -176 194 -155 122
4839 122 107 -41 -230 -86 323 137 -71 115 71 88 103 -160 43 -117 251 -217 -93 165 -40 94 -64
4860 -64 -134 169 -226 -116 86 -74 -20 99 41 61 37 -154 -4 174 -193 98 -116 -138 -89 126 -271 -28 155
4883 155 247 265 -433 70 -176 -199 -95 -62 -46 13 22 -105 259 -101 131 118 -89 -207 -36 74 -236 -158 79
4906 79 47 -74 249 34 133 -13 233 157 37 299 239 -211 -286 95 119 55 -180 93 170 145 -120 4 -221
4929 -221 -332 -30 -13 60 165 -117 -349 112 296 317 -382 -188 -26 121 -128 -123 -1 -35 -30 -22 128 151 213 -111
4953 -111 19 218 166 149 -409 133 -59 -273 259 -17 8 -24 -409 -287 43 -197 -191 -12 -81 -94 -195 128 103
4976 103 -361 31 67 -17 123 339 -3 -145 -104 -34 14 73 21 57 170 56 3 93 -66 -183 -89 99 235 -126
5000 -126 177 -30 183 -19 80 -92 -64 -430 139 -26 -128 200 -3 -272 -90 -9 -113 -166 138 46 -105 118
5022 118 53 -73 127 -120 184 42 224 -92 -34 -98 -42 -1 13 -140 -75 153 -96 129 -102 40 182 -114
5044 -114 -62 -115 49 184 -97 236 -135 -120 248 49 102 96 179 43 138 -76 -137 220 48 -61 -211 -95 -87 -67
5068 -67 -37 98 -78 142 186 9 88 -79 149 48 -43 -39 14 -28 5 176 -327 -225 28 170 -13 154 101 61
5092 61 -75 -114 37 198 365 152 -37 78 -71 86 60 -51 -69 -281 -47 -54 -120 34 -6 284 106 122 -36
5115 -36 -37 133 -196 -30 -144 -176 -210 177 -236 160 -128 16 -183 114 -386 -23 127 -151 95 -109 -1 60
5137 60 -93 -36 -77 -220 55 121 76 68 -170 50 219 153 -51 -46 6 -6 -149 253 -45 253 32 173 -161 -159 -102
5162 -102 -135 108 -45 -271 -111 274 247 -157 -82 -20 -7 35 204 169 105 120 -195 54 -47 127 -20 -248 -168
5185 -168 -146 -38 -201 -114 -301 -135 -58 14 100 -93 173 151 -162 -101 113 106 -69 35 -39 63 -31 -13 -242 58
5209 58 -32 133 175 130 -168 81 -11 105 204 -10 302 70 -129 -230 -93 -7 127 -390 353 38 -212 78
5231 78 233 -177 -168 133 -35 349 79 -32 94 263 4 -27 -37 49 -132 22 -235 125 229 -190 -99 -221
5253 -221 86 -156 50 142 149 132 151 219 111 -117 -210 -35 -71 128 -136 -327 37 -44 -101 303 198 -253 159
5276 159 -43 253 105 80 -160 132 67 358 -103 -23 294 77 139 39 171 8 -90 153 162 359 94 -55
5298 -55 -125 -5 94 -246 -36 69 -32 33 13 -7 24 -2 157 -3 -243 -9 -187 313 -197 62 -18 -127 -38
5321 -38 -35 24 180 147 -87 -144 -110 -146 76 -65 -148 -135 -107 106 -12 -417 52 -210 -196 -12 150 27 91 48 -105
5346 -105 152 -5 121 100 -5 72 48 -128 30 231 45 -147 -54 173 -24 168 -144 33 -88 140 210 -87
5368 -87 61 47 75 -243 -48 135 114 289 223 -50 129 -129 -13 158 25 193 126 -95 64 -398 317 298
5390 298 -174 -32 -148 194 -130 -204 169 -105 6 -124 118 250 -77 115 -37 16 -159 274 102 -148 176
5411 176 31 11 -310 -166 -36 -31 -117 -15 -85 107 -4 -87 66 149 -147 -60 -55 35 207 -20 172 -109 -182 -48
5435 -48 -51 5 -67 -397 336 121 -64 80 -160 -19 -143 -108 12 44 130 51 -62 78 -11 201 -29 29 17 -113
5459 -113 82 41 -128 135 -80 26 177 86 -134 -147 28 -181 46 171 -170 105 274 23 58 49 -154 -209
5481 -209 363 30 -174 -187 -79 167 -63 -246 147 12 46 -5 -94 -34 -51 277 -217 58 80 304 -65 123
5503 123 -33 -5 223 -9 21 186 -73 17 185 -15 69 37 115 168 100 -26 236 162 -199 222 109 -96 28
5526 28 -369 35 -125 -155 59 -155 149 346 328 53 -137 -152 -129 -77 -123 59 -49 -96 180 -141 7 -105 11
5549 11 106 118 246 -182 -136 139 -149 -181 20 -271 -113 -188 -11 -11 92 -237 -247 2 88 81 232 -282 -41 288
5573 288 210 -180 -206 -60 15 -271 -58 -251 191 0 97 156 191 2 210 -27 -244 -12 5 182 -16 39 117
5596 117 155 -16 42 171 137 -110 3 220 58 -313 -118 -163 -176 -85 -106 86 57 148 -162 164 -18 29 130
5619 130 231 -114 -60 -127 -19 307 106 -52 -11 20 52 -63 40 26 -324 6 405 14 0 61 48 560 -231
5642 -231 255 -152 204 -202 -279 129 -388 38 -50 -131 -74 280 111 206 -248 1 78 -182 129 -222 -122 194
5664 194 105 -120 113 -226 -196 -89 -40 78 -11 48 -64 98 -60 339 46 -7 -73 -244 28 -79 13 -178 -94
5687 -94 224 249 253 33 40 -29 160 -2 82 268 69 202 -190 -4 -367 53 165 -10 77 -56 203 173 65
5710 65 3 -85 106 -266 31 221 -69 73 14 -17 107 71 -146 37 407 84 -60 133 -217 -265 -127 36
5732 36 -119 -24 148 60 77 -50 166 131 243 -206 55 -71 115 226 214 -49 -13 -113 -206 114 -118 200 200
5755 200 -2 -107 -4 -138 -185 -83 165 -115 -96 119 166 -48 -38 -92 16 -235 -16 -12 -198 100 -236 -150 -104
5778 -104 -38 213 155 -381 220 -332 96 -138 55 88 103 141 -209 -11 41 159 -74 -24 -192 -113 -62 -109 -58 -98
5802 -98 52 126 20 199 282 171 110 30 -110 85 -132 -112 75 -88 -160 -56 -99 92 119 -303 168 336 -77
5825 -77 -21 -12 237 63 29 -146 -34 -42 -87 -96 259 -66 205 345 -280 175 105 -130 -92 -18 124 -101 212 -232
5849 -232 209 88 105 235 310 385 -191 -375 -147 162 -177 -60 -204 -13 269 228 84 -447 -33 146 5
5870 5 -30 166 305 66 -16 199 44 -17 -33 -89 -37 129 -33 -101 -499 -113 211 33 -73 -144 -66 -208 59 68
5894 68 -100 -43 -117 70 118 218 112 -297 -103 -154 209 303 -91 -48 -64 268 -93 219 28 -106 -22 122 118 143
5918 143 19 44 80 -140 45 176 -69 -210 -80 92 167 -47 142 340 -120 -43 125 63 68 -87 288 -165
5940 -165 3 78 65 -1 91 -234 -103 -141 -71 -81 78 -72 3 124 290 -250 -193 193 164 66 -60 271 175 -134
5964 -134 105 271 -217 36 79 249 24 -176 -134 44 -12 -424 -92 222 -344 182 -97 -189 139 52 423 -108
5986 -108 -114 18 68 -129 -224 -138 -123 101 64 -189 27 -121 62 3 -107 166 -169 -149 151 -84 -27 -141 -220 -37
6010 -37 -123 26 -207 -119 -131 115 -213 -61 -232 -64 106 184 16 -121 43 180 -24 58 329 139 -116 -97
6032 -97 -316 97 194 61 89 -80 111 65 1 -185 -115 -67 -131 277 -74 -82 187 -38 57 109 107 -146 -99 -8 102
6057 102 -43 149 231 250 -276 -181 -195 -12 -95 23 -51 -314 27 235 -61 -238 281 167 -2 196 78 177
6079 177 -132 -85 -104 -97 37 -119 -11 253 67 -147 206 -167 -393 -201 229 -23 -2 112 -164 430 396 51
6101 51 50 -329 27 -9 38 -47 -6 135 106 295 -167 -218 -55 -284 46 178 174 143 -469 -399 508 -78 101 183 -48
6126 -48 -76 -32 -66 59 171 58 -205 91 52 -39 -69 -179 -199 -132 29 79 -132 -89 11 213 105 306 18 -295
6150 -295 86 -263 273 40 -138 -184 -229 53 204 118 -18 -264 131 -207 170 37 169 -91 103 -131 -83
6171 -83 -69 -25 142 -119 263 -24 -67 -85 133 83 -499 3 32 112 -180 -104 -138 -189 363 -131 54 85 210 -52
6195 -52 101 -92 193 105 105 140 252 -73 -81 -213 78 62 301 53 -9 -92 -327 280 -191 278 -115 -316 -143
6218 -143 163 127 -5 123 233 -180 44 254 191 -98 -131 -137 5 56 -73 -217 360 -294 54 -67 -140 -15
6240 -15 -228 153 44 95 51 -186 169 -33 -124 57 77 84 147 -133 208 -245 -9 147 165 -94 -176 -129 131 185
6264 185 213 69 35 -139 -119 156 294 -122 38 -230 281 91 18 28 36 93 124 220 153 29 215 149 -77 318
6288 318 42 -87 -268 -128 61 1 222 -86 135 -242 -201 -123 -32 -108 51 13 -94 73 217 133 159 -129 -141
6311 -141 -29 65 135 -101 -132 182 148 37 -74 96 -158 -98 -31 160 -78 -151 -518 284 -229 191 16 160
6333 160 -165 -56 -113 109 377 -99 -245 -80 325 -72 -56 -117 -92 -159 56 6 -24 305 -187 -70 71 -224
6355 -224 170 -34 -104 238 209 -62 24 81 257 -82 -49 -189 283 -102 7 129 9 -102 -58 -136 -101 10 -94
6378 -94 -170 -69 -52 -239 -150 66 -95 12 167 118 141 169 206 -303 -50 -196 -18 36 -280 -73 495 65 55
6401 55 -597 -121 98 -67 91 -169 -36 -90 212 -26 25 288 -37 -131 -82 130 74 -180 -125 293 -343 298
6423 298 46 -370 -245 63 112 78 12 -125 91 99 -166 -49 -11 -54 312 -2 -131 -80 -42 165 78 -142 -80 212
6447 212 -168 131 -93 -96 261 45 56 -35 226 -31 36 -187 -72 -74 277 231 175 182 109 86 148 79 80 -145 -177 -81
6473 -81 66 55 -407 -171 230 39 -152 -23 168 -141 -38 75 -177 -81 -25 157 -256 -333 39 237 81 135
6495 135 60 177 0 111 -3 -118 221 -116 340 -119 113 -19 100 -260 264 -283 -133 86 -148 10
6515 10 -246 -18 143 -50 -228 287 -134 -33 -187 -78 242 28 -52 -86 -34 -72 162 158 -133 174 199 -199 -153
6538 -153 213 296 197 -173 -16 -2 -136 -52 -111 58 -162 -101 -69 -28 249 48 -147 -269 -128 -102 133 287 86
6561 86 75 -117 21 -36 62 -23 217 292 -4 80 153 -65 99 200 -22 238 -13 5 18 -254 293 -214 201
6584 201 26 -12 172 234 0 150 95 81 133 -10 -120 -10 -203 -167 -156 -39 149 -50 -114 221 276 -256 -183
6607 -183 -126 -25 227 -46 56 20 68 -12 253 27 -18 168 114 -220 66 138 21 4 81 166 128 -185 -6 -67
6631 -67 -228 -124 -217 42 43 56 172 -58 -146 -34 194 -25 41 36 108 5 -138 173 75 23 -283 -338 15 -405
6655 -405 -9 52 61 6 -279 145 -36 -199 175 -110 92 25 -3 -123 288 42 -159 184 -84 -39 -3 1 427
6678 427 257 42 -40 97 142 -66 -43 117 369 36 -328 -35 75 239 77 112 38 46 136 41 -181 89 -84
6701 -84 -19 18 119 29 -205 -256 -152 273 -59 -192 -188 -139 63 42 -123 -54 -332 -76 -74 -74 -123 -248 269 82 -105
6726 -105 86 -238 210 -302 -114 89 74 32 75 -79 -339 341 -2 181 214 -3 -75 17 -52 33 -88 138 32
6749 32 -124 -39 -128 137 21 11 -154 -83 -16 -47 44 -89 -113 -86 -42 12 -210 18 -268 26 145 -19 -75 -282
6773 -282 -86 -286 128 50 -120 -188 105 -129 -88 93 -319 -77 -238 -281 -44 310 -122 -222 -82 219 103
6794 103 96 91 -55 201 131 27 -69 28 -72 -110 -160 86 22 -27 -130 126 -134 -145 187 149 211 131 54 68 -201 -253
6820 -253 -155 -196 80 -10 66 20 124 -118 -87 204 -172 104 -129 -7 11 -231 68 3 -146 -90 128 8 -119
6843 -119 -152 -561 342 -229 -155 42 -197 -66 9 67 2 -149 28 428 -21 -169 -32 -93 -96 61 -81 61 160
6866 160 228 -57 124 68 -101 -79 -83 -262 86 67 362 130 12 85 184 -51 -45 245 41 154 -392 -305 -91 -346
6890 -346 -107 158 158 36 -124 -313 36 -52 -21 132 -5 13 -56 -34 13 15 358 267 -342 166 -94 290 -18 179
6914 179 -12 -126 120 141 179 -111 12 -278 46 108 -221 -339 -24 340 58 -32 -1 -234 118 -305 191 -31
6936 -31 349 -48 -109 0 1 -178 -110 -265 -157 -203 -79 226 -73 -116 -114 62 -191 13 -92 155 126 -66 98
6959 98 287 115 -277 164 415 -256 -262 103 81 -135 41 -20 262 45 -87 -63 -38 -172 -89 -207 -18 19 -24
6982 -24 0 91 100 286 -250 -384 -445 -2 -34 171 75 -37 126 65 -156 1 8 -22 -17 -235 69 335 106 -244 2
7007 2 180 -8 -62 8 -216 -187 -64 108 -328 -130 -50 54 46 31 214 86 41 -100 -36 -82 -372 -79 -50 191
7031 191 82 50 -18 132 -160 280 125 262 -152 18 251 169 -97 -118 -184 -212 19 -113 168 158 -229 -43
7053 -43 3 49 -67 150 -273 -101 8 133 134 70 -25 62 -167 113 -35 5 115 28 138 -133 69 -1 -179 28
7077 28 -193 122 15 176 -139 20 0 -575 240 168 -284 38 265 227 84 44 -222 10 -13 -91 144 -32
7099 -32 -99 288 23 222 -45 -131 -81 -20 -69 -123 -181 -82 128 -22 81 130 98 -35 369 102 -171 201 -10 -201
7123 -201 -180 242 32 96 -19 18 105 125 206 -109 291 88 -116 -225 -6 51 95 228 -171 101 -180 122 278
7146 278 26 5 -78 58 201 -159 38 191 -121 66 -43 -156 -30 100 39 -41 -102 -32 102 -32 146 -37
7168 -37 60 84 476 257 -109 -146 114 194 -3 -197 -80 -37 -4 65 -104 79 46 129 81 -69 -11 106 178 -134
7192 -134 -243 90 33 34 147 -103 189 -98 178 -70 -112 -231 30 109 -285 -425 42 48 -15 91 -193 77 54
7215 54 -101 289 -104 -112 140 185 -5 -82 -23 52 102 -184 222 -72 13 -145 296 -21 -7 162 -117 -116 81 143
7239 143 270 94 -81 -202 190 -35 -191 -75 312 -226 -78 246 135 494 50 148 226 22 96 -18 183
7260 183 39 41 283 281 -172 20 -107 -72 -37 -55 -44 79 252 247 -194 -50 -180 -79 -52 -56 139 55 36 -157 -124
7285 -124 176 399 -199 134 187 49 -124 124 -12 -95 -199 -116 112 25 -58 -157 -19 -262 -141 -350 26 -150
7307 -150 -187 36 -320 -152 129 19 32 119 -87 194 -71 -82 -93 -76 71 -219 127 -18 116 8 22 78 10
7330 10 -140 -158 -145 142 -202 -253 79 9 283 -34 -71 21 209 130 -45 292 -96 -272 384 -62 207 250 -82
7353 -82 -212 -377 81 127 -11 209 -269 -105 147 -62 97 -5 85 116 78 235 -56 5 -140 -90 308 -193
7375 -193 -44 202 266 -181 281 188 44 -134 -126 337 13 486 -7 -171 42 -32 27 274 304 -110 302 -17
7397 -17 -124 -154 -61 -37 -65 230 105 161 160 -161 183 80 53 -59 -44 -129 -120 186 -55 -185 -88 -119 11 95 -134
7422 -134 -86 -96 -16 -33 97 -87 99 56 -249 9 136 37 26 188 -244 -119 259 18 -238 80 -50 -177
7444 -177 -290 386 -31 43 109 176 31 -58 -25 -76 -278 -169 -302 -248 319 192 -108 -47 152 -40 221 -46 217
7467 217 -26 -36 192 -29 51 -47 -165 -75 -163 -12 -20 163 -231 -107 -52 -189 -58 243 -190 168 -84 -73 158
7490 158 -347 113 394 -31 193 38 -84 129 -298 -112 301 -126 -12 353 -47 377 -31 -1 -28 159 -172
7511 -172 -297 -86 -18 101 -4 -56 34 137 223 42 -297 -79 198 87 -40 -273 -154 271 -209 464 -123
7532 -123 -159 -170 361 118 -77 43 -46 48 63 -298 -75 117 230 -66 -239 -92 59 81 -121 -338 -97 211
7554 211 17 193 456 222 -279 -20 -103 284 126 114 -36 -129 -87 269 67 137 142 59 48 233 113 50 33 -164
7578 -164 -39 254 338 -17 -195 184 204 -24 -4 200 -256 98 175 190 -292 -40 36 269 -266 -114 301 42
7600 42 279 163 116 -203 33 253 -46 43 146 -23 93 -30 231 48 47 -79 24 -68 290 -18 24 166
7622 166 -101 128 179 -147 -442 330 -254 -242 33 -161 -111 -394 -183 60 -45 199 281 -249 -290 -158 115 -54
7644 -54 -94 -20 -78 -167 32 57 19 -198 -158 -116 214 -149 -80 -193 -65 -201 188 -7 32 163 138 228 385 149
7668 149 65 -283 284 -7 -87 158 62 99 -75 -74 45 -162 -105 130 -180 24 133 95 220 -58 385 64 -254
7691 -254 58 28 92 -308 48 -50 324 179 82 75 -355 112 151 140 -79 118 215 279 72 234 149 105 45 -282
7715 -282 -286 54 75 64 215 320 -4 78 346 -57 -53 139 -2 160 -3 151 184 -25 -36 -178 -274 121 -178
7738 -178 327 2 147 104 18 -150 -18 -273 -31 199 -2 154 -370 383 -229 -53 149 -55 -23 -86 21
7759 21 98 -256 85 133 -161 -75 -84 92 78 5 -36 166 -21 -114 33 -23 -134 -183 -173 140 -186 260 -36 56 45
7784 45 -35 308 -35 53 142 -24 64 12 -430 359 41 206 -137 59 78 -286 138 177 -67 105 152 -201 38
7807 38 -221 -284 379 -28 -40 -23 -84 86 132 -156 138 -13 -49 -91 -122 106 -63 -271 102 -322 -204 -190 -309
7830 -309 38 21 160 142 26 -152 -104 87 -200 -185 -66 -352 141 -49 20 -239 -47 -105 -97 -85 15 264 195
7853 195 -407 -243 213 -176 -57 85 221 157 -188 -276 -116 -15 -114 -34 31 47 -118 101 -78 18 35 105 282
7876 282 -25 1 -13 197 36 -202 152 179 178 -158 -40 85 -92 -270 -176 -238 74 -28 297 -66 65 -186
7898 -186 160 125 -223 -171 47 -159 -18 -161 -34 -20 -3 166 -219 -85 176 -59 83 302 60 -99 108
7919 108 290 -182 133 137 116 292 -118 284 51 -99 12 -24 -149 175 -104 -128 145 -188 27 -306 3 88
7941 88 85 13 -205 -115 -47 290 -55 304 19 135 257 158 311 -52 151 116 129 60 138 33 -272 -162 230 188
7965 188 214 282 177 -264 -46 -18 -151 -136 26 201 5 86 28 71 -266 -240 -153 278 264 -186 -54 198 133 50
7989 50 133 -75 -174 -137 85 66 38 24 154 168 118 74 47 61 -21 47 63 109 -20 285 285 -133 210 21 55 54 118
8016 118 -102 214 -24 -9 202 -270 12 -55 203 33 -122 -7 -211 118 3 68 95 -8 -129 -156 184 183
8038 183 -163 -9 362 112 55 9 -2 59 -253 32 17 14 -110 -26 -134 -45 -8 118 -130 5 357 70 1 302
8062 302 -108 -135 318 -130 153 26 35 -142 -169 13 -131 440 52 77 -186 11 143 231 71 10 -33 -43 41
8085 41 151 -177 177 234 -215 -3 -24 -74 -180 -127 -91 -49 282 3 262 -1 55 -144 -90 63 -106 172 75
8108 75 -129 -95 51 -111 20 143 109 108 -8 140 89 116 158 -196 289 -4 -174 -325 -208 -129 -110 107 1
8131 1 224 86 72 38 -14 132 -118 182 -120 38 13 146 295 -81 -103 216 215 -318 -121 -113 84 -105 169 -23
8155 -23 162 -121 51 187 155 125 146 245 -218 -15 178 210 -111 -87 -95 -133 -135 -168 238 67 16 57 396 -215 -61
8180 -61 -333 55 29 -97 14 44 260 110 -186 -364 -74
8191g4
$$ Imaginary data points
##PAGE= N=2
##DATA TABLE= (X++(I..I)), XYDATA
0 0 0 0 0 0 0 0 0 8 -8 8 -8 8 -16 16 -22 24 -32 35 -41 48 -58 67 -77 90 -101 116 -133 151 -169 192 -216
31 -216 242 -273 304 -340 377 -419 465 -518 572 -633 702 -776 861 -953 1058 -1177 1311 -1470
49 -1470 1652 -1868 2131 -2455 2870 -3420 4187 -5337 7244 -11000 21214 -106238 -344167 -154017
63 -154017 20782 -27422 -167903 -132714 -38414 -43723 -116879 -110652 -77459 -92342 -125334 -98261
75 -98261 -67617 -81028 -103654 -81599 -63863 -83245 -101647 -76860 -55525 -72077 -92167 -73827
87 -73827 -50232 -59639 -84783 -81513 -58482 -49263 -55237 -52420 -42667 -45965 -56473 -52757 -39135 -41247
101 -41247 -55540 -50911 -26696 -16611 -31164 -39696 -27094 -17775 -26056 -31413 -20885 -15023 -22711
114 -22711 -23816 -9185 -892 -11332 -18877 -8286 2288 -1627 -7286 -3361 -188 -4258 -4060 5878
128 5878 10469 3777 769 8132 12299 6969 4271 9807 12931 8030 6302 13908 17666 12818 9390
143 9390 13351 17173 14301 11247 13806 17395 16052 13613 14060 15697 15029 14431 15770 17771 16809 14579
159 14579 14279 15461 15155 14149 13527 14770 15699 15528 15586 14819 13880 12630 13210 13921 12837 11237 12087 13847
177 13847 13420 11070 10574 11437 10621 9200 9299 11000 10948 8858 7864 8963 8758 7079 6804 7903 7459 6463
195 6463 6334 7297 6556 4766 4493 5355 5236 4027 3970 4990 4949 3510 2784 3407 3436 2986 2552 3075 2902 1844
215 1844 1874 2227 2049 1199 907 1522 1273 1157 990 1348 1227 561 36 775 659 -121 196 413 572 302
235 302 55 119 24 -388 -512 -341 -305 -226 -354 -406 172 -392 -705 -551 -434 -443 -583 -456 -247 -615 -925 -530 -473
258 -473 -535 -671 -595 -307 -667 -956 -718 -643 -632 -626 -732 -554 -241 -720 -711 -451 -939 -650 -1179 -757 -682 -846 -543
281 -543 -155 -598 -841 -690 -503 -509 -614 -748 -369 -595 -686 -652 -762 -735 -586 -670 -349 -564 -610 -639 -873 -538 -511
304 -511 -772 -618 -479 -569 -225 -479 -369 -177 -463 -674 -619 -608 -747 -493 -469 -554 -638 -379 -319 -217 -205 -334 -353
327 -353 -545 -813 -149 -85 -197 -253 -125 -211 -168 -269 -224 -407 -487 -354 -193 -259 -249 -89 -424 -181 -80 -373 -452
350 -452 -385 -287 -457 -236 -225 -203 -452 -272 -127 -285 -194 -179 -211 -144 -91 -541 -586 -119 -110 -332 -317 -623 -198 -321 -289
375 -289 -58 -517 -173 -438 -97 -188 -204 -117 -251 -157 -411 -76 -109 -331 -58 -46 -146 -167 -381 -489 -478 -231 -244
398 -244 -355 -114 -229 -347 -66 -401 -377 -371 -295 -276 -199 -328 -386 86 -293 -353 -38 12 -33 -181 -131 -214 -297 -64 -116
423 -116 -65 110 -321 -213 -201 107 -102 -148 -97 107 -97 -358 -110 -48 -241 -6 -154 -69 -167 2 -86 35 -5
446 -5 -366 -166 182 -45 250 195 -176 31 55 154 58 60 277 226 243 40 -259 -348 130 -34 -3 241 136 151 -197
471 -197 -109 217 -53 -181 -252 427 417 -51 95 15 244 360 61 213 132 180 -2 313 57 138 81 25 361
494 361 205 66 374 249 250 319 360 170 426 226 84 67 351 292 406 522 208 716 28 308 323 329 482
517 482 462 342 226 481 372 54 188 25 -87 263 207 166 214 414 134 140 366 -62 286 88 178 354 295
540 295 391 556 313 208 162 -23 361 41 -4 119 191 141 -22 -80 -128 281 -357 93 163 -31 33 104 75 59
564 59 122 -80 -112 66 15 -188 125 -19 -155 57 -220 -150 -92 27 178 -116 -36 -10 -61 -38 -151 -324 94 -273
588 -273 -318 -379 -330 -150 -365 -153 -347 -386 -530 -172 -74 -46 -342 -249 -18 -308 -424 -239 67 -400 -319 -164 -549
611 -549 -341 -215 -309 -162 -224 -156 -285 -360 -282 -11 -77 -58 -213 -180 -131 62 -132 -216 -63 -256 -242 -34 -65 128
635 128 -31 13 0 85 -453 242 -286 105 248 -15 -9 -124 74 -147 -68 -108 16 -45 -27 -183 63 150 -66 37
659 37 -75 24 114 104 119 57 108 201 -346 141 -212 236 77 116 -99 -47 259 302 19 117 52 190 51 73 300
684 300 0 -159 132 135 68 64 0 -35 -232 66 -92 151 130 -306 -177 206 18 118 -190 -234 -97 -2 147 178
708 178 -215 -288 -104 -399 -127 53 -25 -361 -166 -308 -3 -208 58 -141 -254 34 -288 -213 -65 -72 -187 -161
730 -161 -46 -436 -579 -165 -128 115 -133 -210 -287 -208 -414 -136 -383 -64 114 -281 -165 -221 -629 -129 -237 -43
752 -43 -301 -108 102 -408 -24 -50 -282 46 -112 -416 -332 -80 -139 -258 -346 -36 -300 -101 -319 -294 42 -207
774 -207 -254 -225 -212 -105 -143 -474 -256 -90 -239 -252 43 -59 97 -181 -205 36 49 -68 331 67 46 -130 303
797 303 15 89 -33 -52 -30 2 165 -38 22 -83 66 108 -333 205 156 -101 29 124 35 -107 162 360 -71
820 -71 30 57 -172 182 -33 -169 -61 -321 -138 274 102 -14 362 -143 -15 8 -281 -43 244 -246 95
841 95 12 63 -186 206 188 123 31 -74 193 -24 51 43 193 62 58 139 460 273 135 321 302 194 -26 231 154
866 154 -104 193 23 364 239 383 270 -40 289 329 107 258 279 37 306 207 -41 386 366 279 179 388
888 388 297 105 310 205 575 561 80 211 197 229 239 215 325 132 377 191 246 350 -1 125 208 230 11
911 11 91 243 -109 398 -9 -270 226 65 171 -26 184 105 89 -6 298 316 -24 -9 67 208 -297 283 -59
934 -59 110 -154 -25 111 -272 35 11 -163 258 -19 -63 -192 -221 -281 63 275 36 -298 51 -413 -206 26
956 26 180 -236 -311 -148 -98 -285 109 -66 -46 -64 146 -90 -140 192 129 -35 -189 23 -251 -109 212 62 -130
979 -130 135 -30 214 -176 -54 -104 182 256 27 9 62 19 -81 -43 -400 -25 -21 -203 -143 57 -44 -52 70 83
1003 83 -148 -106 35 -79 -198 -79 -37 62 -439 41 -12 349 -109 10 -34 -13 190 120 129 -69 207 -138 -115 3
1027 3 -53 -44 -3 147 242 158 -190 114 -187 44 71 181 285 131 72 71 -73 -40 12 55 315 56 -197 103 -72
1052 -72 -6 -141 124 -197 123 -144 94 31 -197 -63 -337 195 134 127 183 272 -99 -438 48 18 -2 -13 107 89
1076 89 150 -71 -57 -33 -24 7 -87 -16 -103 -85 -37 -139 -214 109 -169 18 148 205 -32 -209 -255 -48 192 -117 46
1101 46 -102 -34 -2 -90 8 -294 -19 -47 28 115 81 -96 -30 72 64 -25 -53 -43 47 246 -174 -41 -78 193 216 -86
1127 -86 154 -172 151 -57 265 111 347 -61 88 147 -103 -32 273 251 -13 159 -138 69 -60 -185 156
1148 156 38 208 -135 71 -10 4 136 257 138 96 12 -72 108 13 285 -11 92 203 22 213 -25 -73
1170 -73 169 -70 -147 81 141 -66 -130 -40 -87 123 74 -230 -182 254 32 152 -146 -72 -209 -41 32 221 -123
1193 -123 -24 39 -223 225 -418 -124 -28 199 -14 8 -415 154 144 65 -34 -14 241 -99 72 144 45 77 -15 -247
1217 -247 -22 31 -84 132 156 -79 157 220 73 -66 -48 -143 -68 -200 -34 236 -31 69 172 -163 -16 -45
1239 -45 -21 8 -362 136 9 -61 -143 -310 360 -442 -23 127 -57 133 -86 125 -113 49 192 88 362 -20
1261 -20 26 90 -33 -175 -231 -128 -60 -130 -284 -268 -121 82 -87 -110 115 -79 -27 324 -78 270 124 153 89 -81
1285 -81 -35 -74 6 491 247 33 -99 -173 -113 322 46 44 197 83 140 -4 -177 187 334 -2 -92 -110 -13 184
1309 184 53 1 91 -131 103 2 -38 97 483 -18 -74 -3 -308 136 306 207 231 -191 20 -99 -203 129
1331 129 -163 -177 110 365 269 40 215 125 -113 50 -119 -41 -44 138 -19 -68 336 -89 98 141 82 86 293 -135
1355 -135 -89 235 -164 -180 191 73 -108 51 143 156 366 373 -84 -35 18 -109 129 18 -92 -418 94 -237 52
1378 52 68 -211 177 -20 149 -140 -139 -43 -3 13 232 55 -174 96 -423 -291 156 386 -38 -74 106 -67 -72
1401 -72 235 19 -67 -17 -240 64 -103 -107 63 252 162 142 -228 42 356 193 -83 -86 207 40 -270 245 210
1424 210 -94 20 -224 -264 -9 -66 -235 -230 -253 91 136 -64 63 -34 106 -11 29 297 73 -85 89 -254 36
1447 36 -23 -51 -11 -64 -231 235 -67 -212 -83 -75 81 -141 85 118 38 75 -231 -26 255 -228 347 198 104 -205
1471 -205 84 -105 -202 198 164 -14 -190 -163 -14 -71 353 -88 420 352 -43 -19 -231 -20 -116 216 208 72 59
1494 59 206 132 304 -57 -179 302 294 -207 -112 33 -76 -405 293 75 -258 -219 193 -69 43 -128 -43 -18 172
1517 172 -72 131 261 9 445 31 272 84 132 176 16 170 253 7 -54 -112 -16 -309 177 -73 -134 -229 -151
1540 -151 52 32 64 194 40 -94 -110 162 283 -93 119 38 108 82 249 40 185 146 -25 -65 -21 144 -12
1563 -12 -29 227 -46 -53 76 1 -90 -133 20 -177 -31 -42 69 279 6 -286 72 -176 -383 -192 -16 -227 37
1586 37 -121 120 80 23 198 23 -114 -28 -107 -55 -148 11 -185 4 -45 35 -60 -136 -28 54 -56 44 90 282
1610 282 58 23 -250 -440 71 -112 -160 -100 113 113 14 -162 90 -38 -12 110 266 5 -39 118 -45 -133 -67
1633 -67 -235 -21 -86 -88 -84 -59 17 -234 -37 74 139 40 209 36 -101 -133 16 23 36 158 22 -68 152 -59 41
1658 41 223 -123 -165 -170 48 -204 -183 -170 22 -141 -26 100 32 56 -127 50 77 210 27 -84 41 -122 74
1681 74 153 -24 -18 -114 -158 -386 -8 -118 -34 -132 -27 89 15 -244 206 17 69 18 -62 -212 -40 -187 -132 -116 -239
1706 -239 321 -286 327 -9 -70 -33 215 -237 116 -86 -220 136 -142 61 184 -274 155 -41 5 -67 -73 157
1728 157 -114 85 6 84 64 -80 -220 38 126 105 53 44 158 -47 269 -253 51 81 118 275 205 300 207 -102
1752 -102 -32 -134 -64 86 113 -88 60 -270 -137 197 105 -82 -69 311 146 -184 35 -271 114 66 69 -220 -157
1775 -157 -176 -177 -181 -102 -160 173 -259 -80 -33 0 240 -18 25 -15 112 37 71 -86 -74 75 -11 173 106 -16 74 -47
1801 -47 73 -14 -79 -123 60 -48 -96 -16 98 50 57 -57 -123 -6 145 -234 -90 243 -70 -119 -417 270 275 338 0
1826 0 193 105 290 -65 -133 85 -326 -65 -17 -51 -69 233 195 24 -18 339 -38 0 -140 -19 -238 56 -26 23
1850 23 -123 39 67 86 -156 -197 -134 19 -100 -123 214 -33 37 -220 108 44 -29 -251 -401 382 -143 -191 268
1873 268 119 17 42 350 -253 -38 157 160 212 -243 246 66 104 -221 -127 217 -268 -190 -133 -4 177 96 -88
1896 -88 -4 70 242 139 -33 -64 -76 -158 -249 101 -171 -157 111 96 -52 -167 64 291 -166 313 -168 155 7
1919 7 286 -245 218 -260 160 41 -268 -169 -52 121 -205 -26 -38 3 -36 -23 112 -135 340 -134 19 -28 125
1942 125 111 91 293 142 -72 -100 182 61 -73 -55 -21 -225 203 53 188 -297 173 -208 69 -209 -146 -32
1964 -32 269 51 -271 -45 161 354 151 -58 318 194 -159 13 82 -167 177 168 23 -271 -28 79 -50
1985 -50 -63 101 123 16 85 -390 28 340 -82 -304 -32 99 224 78 154 337 59 -56 250 -277 -173 -161
2007 -161 -139 -93 -32 155 314 46 48 -314 -47 -57 -87 71 69 -139 -134 -208 -212 191 -21 -300 -294 118 -184 -31 -243
2032 -243 -159 92 -267 -159 -117 -104 87 -65 44 -303 247 295 -128 -197 309 42 74 -1 -82 -243 -228 171 169 -125
2056 -125 -358 227 30 90 63 -142 173 -103 -52 -46 67 93 -110 -61 117 77 -19 28 135 9 224 -84 -261
2079 -261 132 -39 522 108 -169 -186 169 51 98 162 -48 178 94 54 -187 54 78 -231 -81 -255 -199 -17
2101 -17 5 58 7 85 -51 -108 51 -31 88 71 -84 174 -461 215 -60 -90 18 -66 -212 68 118 -313 18 -1
2125 -1 -43 -52 -5 99 -124 -45 -32 -39 153 -153 217 -223 -6 334 63 -303 -224 89 -24 303 100 75 -69 -152
2149 -152 17 60 26 -48 49 13 -286 -203 -40 55 -90 1 309 102 -120 141 124 -264 108 -31 -292 99 -116
2172 -116 -172 -432 229 139 143 52 85 -96 27 154 361 -191 -44 -42 104 -29 122 70 -111 17 -111 -66 -118 -201
2196 -201 44 -36 -40 40 -230 -11 64 326 35 144 -74 18 -274 -91 200 -156 70 -57 14 88 29 36 -191 -15
2220 -15 191 -5 -112 -216 132 -199 82 -121 -242 59 -26 55 -323 10 -96 285 -262 19 -148 -17 -27
2241 -27 -176 160 399 79 29 12 214 73 63 32 -243 -197 -81 375 182 145 -336 113 39 32 -10 57 -357 86
2265 86 55 -342 6 -42 -124 -72 -129 66 226 -60 8 284 163 94 89 242 267 -45 -23 76 -259 31 -25 -69 159
2290 159 -161 -23 128 256 58 -52 -27 -70 -79 -306 50 -112 48 9 -167 146 -199 -31 37 47 -72 139
2312 139 -240 -157 16 -77 -363 -20 152 163 -284 94 -341 -50 -10 72 76 -229 334 52 -124 -97 327 -246 -13
2335 -13 15 -157 -48 344 -70 -198 98 141 -55 60 85 111 19 -33 -4 -88 -122 -184 287 -4 116 163 -125 164
2359 164 -183 -145 382 -147 71 183 74 94 220 -99 -91 255 146 38 18 -89 205 90 -259 200 -43 122
2381 122 -139 -223 -332 -119 161 29 68 210 -219 -94 4 144 7 -188 177 119 80 368 79 -26 40 -431
2403 -431 -338 -222 32 -53 -32 -25 242 17 -184 -22 -62 -44 -106 -111 -109 10 30 -10 -108 -389 -224 209 -412 157 76
2428 76 77 75 197 -7 147 157 131 -293 151 -112 39 -110 181 -148 -34 -47 37 -115 -362 -77 -22 71 -92 259
2452 259 -77 186 -20 -44 -147 31 72 27 -297 -3 137 -15 151 263 162 73 -142 -186 -200 148 -215 -72
2474 -72 10 -8 -108 119 -50 -30 -233 39 112 -70 257 11 -171 58 125 -59 -120 -42 -105 -125 -352 71 67 -137
2498 -137 17 37 44 -300 -61 5 -2 303 192 -98 352 -348 28 -255 178 36 -186 -366 -191 -68 -3 -214
2520 -214 -206 75 -39 -390 -222 -633 267 -77 147 -43 -30 321 -207 22 -170 -164 -178 -30 -168 -201 293 -118
2542 -118 -98 133 21 294 -236 -88 -137 -153 13 75 -363 142 -167 -43 4 107 304 -118 -60 -35 -197 56
2564 56 -14 51 96 -9 27 6 85 222 -4 -47 -246 -128 -127 -261 401 -95 -163 -181 -199 58 55 208 -114 101 -127
2589 -127 -45 -125 40 165 -40 114 -116 292 207 -204 -368 135 112 -153 -93 -13 -87 -52 -40 8 -16 -17 -99 -217 -61
2614 -61 85 67 -99 92 133 59 123 -315 90 -3 339 43 159 148 165 139 -26 -88 -367 -194 -37 -473 -118
2637 -118 -87 -340 -170 -22 -54 18 55 -58 -29 -277 -152 -246 -189 57 -117 -2 28 -162 -176 -179 -1 -114 240 -52
2661 -52 -74 -183 210 146 -55 49 -220 -54 182 -53 -4 -35 55 41 241 -142 54 -7 -58 180 -57 229 17
2684 17 288 36 5 -28 61 57 116 -11 -23 151 131 3 -235 -30 88 -106 -141 -110 -16 140 138 191 -177 -2 -62
2709 -62 31 -220 -319 43 211 -50 -21 -143 210 180 -51 -328 -55 111 134 70 -105 292 76 144 -120 -8 86
2732 86 -349 23 -248 -176 -124 84 -64 307 67 -105 262 300 -73 28 57 -163 136 -48 -44 24 284 88 47
2755 47 162 -213 19 109 -88 -71 59 -22 -29 -100 27 93 -34 197 -237 205 269 72 -297 -62 94 25 166
2778 166 124 -224 252 51 -87 -83 11 4 16 73 222 200 -114 141 236 88 84 -260 114 192 112 -78 -284 98 -44
2803 -44 -113 -3 -64 229 -219 -101 -265 -218 214 -230 -129 -91 84 -57 -131 9 -192 248 -21 124 225 66
2825 66 -144 -73 331 28 34 -35 -99 71 485 -69 -169 237 203 -196 182 -108 -11 53 -350 -26 281 -200 -380
2848 -380 97 15 58 -40 180 94 -24 306 -22 -170 232 -29 33 -339 27 -277 56 -251 -65 27 -90 -238
2870 -238 -192 162 143 102 143 231 110 -28 135 -44 149 223 -150 -19 92 -108 145 161 82 97 3 12 93 -182
2894 -182 242 4 -59 88 92 16 -97 -65 -45 -45 -85 187 14 238 181 -139 58 26 18 -221 -16 -78 -103 -46 -157
2919 -157 85 60 152 -17 129 -144 234 273 60 158 74 -212 -183 -11 15 130 40 40 28 -70 334 127 156 -3
2943 -3 -15 48 -317 214 -238 60 181 -89 -110 183 -122 1 -152 100 -134 -357 -142 83 75 165 -56 -45 124
2966 124 135 59 216 -26 -145 107 -140 -1 -263 -166 -72 -454 -106 132 282 23 212 -59 -102 97 -54 35
2988 35 -333 101 -113 101 33 16 -17 263 309 210 -88 -23 -73 167 -306 -87 154 -88 279 -23 -227 -44 68
3011 68 -12 6 11 98 -79 -75 -45 81 -58 -482 -48 313 -166 107 -7 293 104 179 -161 -100 17 112 -12 144
3035 144 -308 17 99 106 8 332 -18 -215 25 -156 168 98 -193 123 -175 115 120 76 211 -44 185 -334 185
3058 185 95 -300 -256 -22 119 -132 189 64 302 242 -96 71 47 177 66 -4 -2 -54 41 201 198 -10 187 57
3082 57 200 -31 196 -202 156 19 -91 113 -91 -192 82 -97 -168 42 -74 -1 106 -225 198 -142 -133 178
3104 178 26 83 159 218 273 85 -98 -176 -173 30 128 -198 -42 61 136 131 211 -159 -216 -58 -56 68 -83 68 46
3129 46 -27 -27 55 245 -390 -35 -142 -221 -4 -153 109 7 -141 -85 -1 -73 58 121 -5 -15 149 -32 176 -43
3153 -43 -111 -133 161 -78 -93 207 -252 12 292 -40 17 95 66 -169 34 -33 129 -318 -103 -103 255 -123 -253
3176 -253 -15 -140 -232 107 252 -245 38 16 -166 -55 41 36 4 66 311 129 447 140 145 17 116 -8 -295
3199 -295 91 -169 -103 -400 217 44 -97 -53 -129 54 -180 83 437 250 94 222 303 -224 144 108 188 180 33
3222 33 267 -84 44 -33 -222 295 -138 -261 374 64 -4 83 -125 -132 47 83 -25 -65 81 -31 -53 -212 39
3245 39 195 94 322 258 210 -103 -201 -80 -294 262 202 80 -290 -131 201 -62 -69 181 -193 -95 104 38 -163
3268 -163 -58 -109 5 -97 -418 14 41 -144 219 228 32 131 206 -66 -18 -112 -21 50 -184 100 227 159 93 -98
3292 -98 58 -277 -60 182 -314 -72 -218 148 57 -33 -178 138 -145 183 -55 84 87 -215 136 -46 -271 -219
3314 -219 435 -21 158 -139 249 -114 197 314 -16 -61 -294 278 52 88 -144 115 78 186 -108 -274 -3
3335 -3 31 -114 90 -191 128 -73 -163 -51 226 97 -313 -13 14 108 356 -295 190 -107 2 59 -1 14 -72
3358 -72 -232 212 127 -240 -536 -155 -35 -223 -23 -211 -2 -121 219 9 -257 -117 -38 46 27 157 -76 40
3380 40 256 59 -225 -41 -91 205 33 -194 167 -125 19 145 14 -78 77 -83 26 -56 -140 -151 119 112 -352
3403 -352 -278 92 303 0 -48 -1 16 -195 -152 72 -86 224 -129 78 95 -73 -144 216 154 -103 18 -106 229
3426 229 -86 -14 -8 239 -136 1 155 111 34 -95 93 -186 -78 68 -98 39 82 15 115 210 -11 49 250
3449 250 71 62 18 -91 -7 -334 114 -129 162 180 -14 12 -92 -219 -281 -35 -13 -40 -55 77 -335 -272 -65 -57
3473 -57 -153 148 268 225 49 51 -161 185 128 434 -37 17 0 -19 3 -154 89 -138 100 172 -104 -12 -119 74
3497 74 -40 -61 -181 12 16 -74 72 -113 -3 -181 73 -22 24 -309 118 -148 46 106 -77 11 33 -64 30 -23
3521 -23 100 -51 27 83 -139 350 20 166 372 75 189 47 -138 13 233 62 50 124 90 99 104 67 196 -85
3545 -85 70 195 -114 47 193 327 -213 3 64 232 -198 -146 196 56 133 -108 -94 315 -10 57 -207 164
3567 164 10 12 -66 59 294 -78 303 446 -161 -111 105 -89 85 -104 74 191 -98 -84 -209 -75 -45 60
3589 60 -6 -255 -215 -304 -106 -95 16 46 154 257 -28 129 -307 46 61 -115 -160 -227 -164 -23 -6 142 -202 128
3613 128 8 -122 97 88 53 213 45 -162 -16 -104 -30 -190 136 65 -134 -401 122 -142 241 -374 -286 -20
3635 -20 -7 59 94 141 -60 -108 143 -27 -426 -60 108 80 -15 -47 125 21 -139 56 -74 -43 -77 -97 114 -113
3659 -113 344 130 -143 -4 73 -36 -188 140 229 -18 110 -166 -34 244 167 -18 169 -268 -194 97 290
3680 290 -238 3 -244 -105 -67 230 -351 -251 35 -11 375 -46 -233 -13 82 -84 -38 357 -21 77 -205 89
3702 89 8 -184 64 -378 -147 136 -5 277 1 53 -54 52 78 185 -169 -367 237 -124 132 115 -66 -131
3724 -131 57 170 229 31 -333 207 -418 93 32 75 42 -55 -108 148 100 148 237 50 -156 295 -143 138 88
3747 88 23 -241 -220 -236 38 -69 37 -59 -54 -6 358 -262 102 -234 -227 9 -364 180 -385 -114 73 -78 99
3770 99 -110 -84 83 78 76 -198 -93 -294 -196 -22 -62 175 144 108 150 93 39 22 -235 -79 208 -67 95 128 -242
3795 -242 112 246 -2 -40 -160 -31 -319 -142 168 258 14 -136 -106 123 12 135 -96 -204 -75 121 -251
3816 -251 -74 -62 -153 81 15 -41 -282 -128 -346 462 -65 113 -163 107 -177 -110 -144 65 119 -273 -87 -172 281
3839 281 82 -45 -6 -148 324 404 -98 -32 105 94 -164 -28 -26 -52 -90 184 -202 -199 114 91 278 -134 -28 -183
3863 -183 -143 109 -2 -147 57 -39 -125 -58 96 -170 -9 -8 90 357 -223 -99 -89 146 -80 -60 97 -154 238
3886 238 274 57 -65 284 47 -44 -178 -66 -253 -197 223 -300 99 114 149 -77 -218 -146 -60 -241 -16 208
3908 208 127 21 2 199 -133 74 -119 33 175 -35 129 -95 -32 -262 -9 -60 27 -155 -47 274 -154 200
3930 200 -397 -304 -154 -22 -140 -122 228 122 -8 -30 -163 233 39 -18 -256 -14 -259 61 214 -205 -183 49
3952 49 309 90 -17 72 -213 -132 -59 -15 -15 139 -68 -143 209 -208 7 -253 317 -16 94 -138 19 310 -4
3975 -4 52 -200 -50 118 2 135 -128 100 -147 169 -281 -116 162 -162 -7 286 108 -13 90 -337 116
3996 116 64 74 109 -119 132 150 197 -39 340 -438 -173 210 -86 -32 212 -80 -127 85 0 201 -126 -163 27
4019 27 -76 350 103 280 -102 -50 -80 -283 -185 -157 172 -79 -217 155 35 109 150 -124 -236 -118 -41 39 -90
4042 -90 29 209 -323 115 204 -116 -250 -54 -31 209 -160 -33 -180 272 210 -43 -208 -19 -268 -110 98
4063 98 -125 10 23 49 98 89 258 -137 -5 -300 -176 19 176 44 -197 -197 -321 108 -7 -118 -18 113 -221
4086 -221 -19 -108 169 241 36 132 -200 -36 -160 -248 199 -247 83 212 -85 187 -108 101 85 -219 230 -42
4108 -42 15 -230 -62 -198 -37 209 -16 -259 -319 157 -265 -145 96 300 -34 -120 -228 125 -53 23 -72 -108
4130 -108 -72 -6 393 -117 210 66 -306 134 1 -363 39 -164 -49 -29 74 -147 124 177 -111 -78 -118 75
4152 75 66 -69 -38 -10 -79 -196 -19 139 263 69 -4 -239 65 63 91 81 79 -142 -166 -95 101 61 -176 53 144 288
4178 288 127 -185 -94 197 185 333 117 12 -67 -221 240 170 39 -353 214 -101 -178 -257 218 288 27 22 -383
4201 -383 -98 141 385 237 167 -282 -98 224 238 69 54 159 64 313 -169 -129 -193 196 289 -146 -177 35 -147
4224 -147 -215 47 49 -235 32 -64 -154 -20 23 72 49 -118 7 125 -129 280 78 -233 -225 65 31 182 161 45
4248 45 -198 -38 -155 -259 55 0 144 59 44 -64 177 -197 -281 -112 -9 59 66 99 20 -52 198 -37 -386 37
4272 37 -52 170 117 50 -36 -69 25 56 -45 110 -265 -193 28 124 -118 51 29 10 104 -8 -104 -141 -474 -189 258
4297 258 26 -147 -291 219 -91 364 179 -53 -115 22 126 -19 -54 92 -123 -157 289 -250 132 62 -6 -1
4319 -1 54 343 61 -58 60 95 39 -110 145 201 -112 -231 -143 178 66 8 223 156 21 54 -23 -137 136 -201
4343 -201 -79 -255 129 45 79 151 106 136 -54 -365 -107 19 -37 -77 -74 73 3 -33 -49 31 24 -86 121 36 26 179
4369 179 -124 -102 -70 5 -148 -127 -301 415 24 -74 -128 -144 107 150 -3 -108 5 66 -253 -228 172 336 -225
4392 -225 95 -60 63 -38 -121 205 46 -57 -325 -105 -178 -49 205 -81 -278 -121 217 130 -74 -154 -424
4413 -424 -47 -193 114 -107 194 18 -209 -19 408 1 -55 226 10 -76 189 225 -39 315 58 71 -89
4434 -89 166 -12 -273 128 -1 -247 15 -111 -147 122 167 173 256 29 -213 -207 -314 156 136 209 -88 132 -256
4457 -256 -38 168 -56 -324 40 -16 -64 -40 -201 -239 -21 248 -159 -97 120 138 253 -100 515 18 24 75 128
4480 128 66 -63 -230 -163 -99 46 204 -326 -461 -269 136 -194 198 -4 -89 -253 158 42 82 134 377 -14
4502 -14 -340 -127 24 73 -226 -76 -61 37 -51 -104 -53 141 -164 -31 261 144 -164 74 -255 287 -60 16 -96
4525 -96 66 0 24 30 -11 301 61 -73 -175 117 -185 -143 -514 -36 124 118 278 118 -37 154 95 72 258 34
4549 34 121 -144 -90 175 121 98 -87 -20 2 -241 24 -147 181 49 -359 -203 2 -69 170 -146 0 -11 -160
4572 -160 99 315 -42 112 46 -202 270 -167 60 89 139 197 -94 -159 185 -295 205 -88 -82 -115 228 8 -8
4595 -8 164 -202 69 -107 50 318 -9 184 101 -428 47 71 91 -18 -149 25 -164 -93 -81 -28 96 -282 -224
4618 -224 224 -292 133 128 167 117 -119 -74 314 -133 28 24 4 -92 -212 -350 -83 240 -280 -228 -145 3 54 -42
4642 -42 3 -143 -88 89 -14 26 -149 9 130 -36 -182 237 13 -223 -138 155 -96 33 -195 -25 115 -212
4664 -212 -247 184 38 -306 -164 -106 90 43 -102 139 -70 -63 80 241 44 -93 -31 19 -36 95 -86 61 -98
4687 -98 -215 187 198 -39 73 -141 -194 -4 11 189 119 -11 -44 64 -277 -18 -297 -16 153 97 -333 -153
4709 -153 165 34 139 -264 42 116 -89 67 123 -198 48 254 12 -86 -104 193 112 121 46 93 -129 126 -161
4732 -161 -181 -65 -233 13 77 -379 -248 66 95 95 36 -203 -119 35 79 -98 -378 178 30 31 57 108 -44 466
4756 466 -98 120 -216 -5 152 -109 -145 -292 -83 153 -21 -120 108 -131 -135 208 20 -87 -79 132 -86 181
4778 181 -44 -66 165 175 -184 -62 -94 -42 -55 -132 -84 -112 -215 141 158 236 102 -18 37 42 -89 -57 90 -21 -245
4803 -245 65 -60 118 -161 65 187 5 -7 152 -172 -94 -119 -45 41 31 -105 -45 228 125 91 -184 -122 -5
4826 -5 108 -94 312 -257 82 8 236 164 64 60 -30 -156 152 -294 67 144 123 -15 -96 20 -38 295 -67 -20
4850 -20 -26 -23 192 -339 -152 -183 102 230 255 128 -34 -131 102 63 15 139 -270 79 16 -11 61 -43 160 -32
4874 -32 -9 -144 128 335 -212 -97 -168 17 211 -141 -94 -8 101 -76 138 -219 -413 80 -158 -70 -44 -57 -63
4897 -63 -139 96 93 71 206 56 174 -58 136 -222 322 -53 -172 200 -25 -148 -18 60 -243 -352 58 -42
4919 -42 -97 235 -263 -60 307 -63 243 208 132 -85 -30 226 -253 139 -23 -177 -118 96 -49 107 238 -41
4941 -41 221 29 31 481 -121 95 -94 58 56 67 373 225 -88 13 79 133 -197 -170 -311 -182 83 -238 75
4964 75 137 74 -130 -118 -38 22 45 21 -122 -344 93 14 -316 115 -24 246 108 136 179 107 34 70 -139 112 326
4989 326 -29 -12 -116 219 -142 -23 55 110 88 -24 -348 -100 28 113 7 -106 -74 199 -66 -49 -175 1
5011 1 132 -63 -181 -330 -156 77 58 134 -24 -86 -69 -87 -173 141 157 -46 -4 119 218 -155 39 -7 140 257
5035 257 231 -203 393 207 -36 145 -46 -37 -210 112 -60 -71 -116 0 170 184 31 -418 -97 -13 175 -92
5057 -92 -181 149 191 306 210 -56 116 130 56 194 195 -50 -104 18 278 -93 91 -84 -18 -73 109 30 156 468
5081 468 31 -125 7 -211 117 -259 204 6 -68 186 201 -127 -149 50 52 1 -110 59 302 -157 -87 -142 -195
5104 -195 227 307 169 16 43 59 -129 -36 261 6 123 -212 -265 122 304 -23 -145 -176 153 -56 143 60
5126 60 -63 -173 -399 274 -23 178 70 -30 -72 -246 -122 -129 209 108 187 9 -39 -168 215 -4 91 -394
5148 -394 39 241 -21 93 -44 -112 25 396 -80 146 -79 227 39 -162 -63 -76 126 114 -87 -70 -119 23
5170 23 96 -85 105 124 -183 235 38 -89 16 128 -43 163 31 -117 -191 49 -137 388 151 63 75 -290
5192 -290 -77 -405 38 52 56 -185 -490 421 216 27 -65 -357 263 142 -253 -44 -485 -43 263 80 67 115
5214 115 -77 -48 252 -98 68 85 -240 -9 221 27 113 -114 282 100 -26 -309 33 -51 279 -129 227
5235 227 90 -160 22 86 288 56 177 40 245 -49 -32 98 -45 -85 -109 205 0 128 406 -149 126
5256 126 -156 -64 -166 -160 66 -364 -367 -172 -113 -304 171 234 46 -113 141 -58 -502 48 85 249 92 -49 29
5279 29 -107 -153 146 34 -25 -63 -313 -67 -18 238 160 -38 94 -392 -37 185 -72 26 -54 -25 13 -62 81 56
5303 56 200 -166 -72 40 -290 105 -108 11 -152 68 159 -47 55 59 528 73 36 -13 310 294 -274 -51 1
5326 1 -190 -112 225 233 271 294 -149 88 87 -55 -95 82 312 200 -23 200 248 -3 46 318 -33 103 -261 -241
5350 -241 228 -95 -144 -56 -27 13 302 -70 169 -159 -291 71 292 56 5 -16 93 66 -286 -143 -41 -170
5372 -170 81 19 -62 229 87 292 116 184 -163 -90 -13 -376 88 -334 -157 -36 -68 -55 198 -121 -275 206
5394 206 183 142 59 181 92 -356 75 -23 113 105 27 128 127 90 134 -143 -128 -1 261 1 358 -58 56 -208
5418 -208 -52 -71 -110 -219 -214 109 -20 59 -79 41 62 99 -123 -83 17 -186 16 -170 -10 79 86 -70 221 137
5442 137 -114 91 171 -132 -82 -207 112 -99 -109 -91 35 -352 354 -296 34 -43 -111 74 10 288 -152 63
5464 63 139 -70 -175 133 144 24 201 88 -178 87 -13 10 12 236 -144 -51 95 -59 -127 39 79 -122 39
5487 39 368 79 271 -55 81 -31 -45 204 23 91 218 -70 -72 -127 46 36 34 363 -120 -151 -108 -6 -136 -80
5511 -80 94 -229 -346 -104 -47 49 -292 -452 -157 -34 -133 170 -20 -98 69 -150 -191 -36 -24 -164 -37 35 -274
5534 -274 103 -110 82 -30 71 142 -9 -120 -310 82 -96 146 257 -21 -56 7 -243 -105 77 -56 -177
5555 -177 -132 -45 1 82 -59 172 14 -61 14 182 49 40 280 -166 152 -12 -139 -199 -535 98 -160 -255 -219 206
5579 206 222 -88 -76 -66 -41 30 -173 23 -6 154 -2 132 53 -99 147 -169 248 -116 -110 -60 -89 177 -99 48
5603 48 -145 -443 -143 -29 134 241 208 -429 116 -173 -114 -46 -37 -35 173 126 87 -233 -85 17 158 186 -258 364
5627 364 313 -217 172 119 75 340 110 -205 -112 46 107 -58 -28 192 -84 -124 19 -192 94 -313 13 -19 233
5650 233 -252 -24 -120 55 -117 50 7 -196 -49 178 -45 -60 -1 -36 -143 15 166 113 -42 -171 -21 -128
5672 -128 36 32 -102 266 73 269 -153 -241 -236 112 122 389 28 98 103 -70 57 -96 -157 349 -165 -135 166 200
5696 200 216 -214 -197 -202 -175 286 126 -243 256 -83 120 110 42 32 173 228 293 208 57 144 64 23 -24 96 153
5721 153 -254 113 -83 32 19 88 -287 -57 160 -55 -31 -82 118 -77 -63 172 -215 79 247 -26 67 165
5743 165 325 -61 -60 219 -268 -22 57 -435 -73 -35 -133 -83 -54 -118 71 206 157 -301 195 -90 -280 -468 93
5766 93 -92 -164 -260 41 -60 -104 36 -63 361 43 -247 -60 -9 -147 58 53 -419 -49 129 157 -62 -21 269
5789 269 25 -145 -385 60 59 120 -355 176 -25 -240 163 65 18 -61 117 -123 14 -139 -39 49 374 221
5811 221 257 -90 206 -83 -326 142 52 89 -114 98 -15 239 83 -146 -42 -330 138 -360 -257 167 153
5832 153 197 101 65 64 -285 -163 47 167 63 136 169 231 253 -28 -460 -102 -165 29 65 138 253 124 147 27
5856 27 -1 288 103 -68 414 -372 -100 -134 5 126 -83 48 176 -320 90 95 5 -139 -118 -174 -315 -46 256
5879 256 -91 146 -179 -19 -277 -107 136 270 132 -366 156 -54 176 -126 -157 -94 71 -139 -250 191 -238
5900 -238 -283 -50 226 -14 352 118 67 -108 144 -50 -118 -82 -16 222 -15 24 241 -73 136 72 -149 -137 31
5923 31 269 -112 -195 267 -285 -269 -20 -6 54 -23 -56 -66 139 195 335 275 -17 -67 -285 318 105 67 -253 132
5947 132 185 95 -1 -40 -384 55 11 -211 119 -32 -9 227 -140 95 -99 -401 -116 52 377 191 -50 180
5969 180 179 -200 -193 -44 152 10 78 -121 192 119 -206 227 -11 -199 -94 273 200 19 175 -131 70 -61
5991 -61 -407 -45 -65 -44 -61 -253 -91 -186 57 21 61 -172 -127 -12 -47 -244 80 -135 208 -286 -87 52 16
6014 16 -157 78 -81 64 325 154 213 86 274 137 93 109 130 69 192 -206 105 -24 77 20 114 -205 268
6037 268 286 -5 146 361 -108 113 23 105 -147 -65 -2 7 -57 -233 -10 -2 186 -122 90 -132 -62 29 67 -40
6061 -40 144 -48 100 79 119 -28 237 -129 -150 -259 -27 -228 105 216 -135 253 170 -12 8 -66 -8 118 -390
6084 -390 6 83 54 -40 -231 23 117 -134 -112 91 -230 68 -152 40 167 37 12 175 47 81 261 -11
6106 -11 -322 -48 -251 -13 297 -405 -237 38 152 -215 -93 -179 72 86 4 207 -115 -105 398 -71 -333 -10
6128 -10 189 -125 356 51 148 164 -140 3 -99 211 75 80 292 -85 35 7 -109 33 -18 -81 -207 -17 -158
6151 -158 -91 -326 -122 -257 90 -140 317 -147 -340 -194 -39 220 3 -137 -196 200 -120 -39 220 59 109
6172 109 13 -111 156 -49 62 166 -231 35 298 69 172 42 -45 -5 -8 46 142 88 -30 -35 349 -71 91
6195 91 -359 129 313 323 -39 -275 101 -198 -177 -100 240 158 -65 478 276 224 -73 387 -131 33 -2 307
6217 307 -245 45 -5 -109 91 -332 15 -192 47 -112 110 151 106 -82 330 -9 -58 -184 -219 206 334 37
6239 37 -142 -153 33 107 -57 36 -26 242 331 239 403 -121 -160 9 57 -109 -282 200 -164 70 -69 -122 187
6262 187 -80 -346 -45 113 -35 120 118 -93 -167 -174 119 237 216 79 168 -41 -111 -127 -93 -23 -176 -6 -11 -230
6286 -230 1 -22 -86 -12 37 -202 -24 80 -70 -44 -187 275 137 184 -275 100 176 37 -36 190 205 25 -144
6309 -144 -164 -381 308 -62 -279 287 98 49 -52 27 -162 185 109 25 -268 -234 -170 -165 -19 -244 128 -248 80
6332 80 239 -203 -102 3 -145 -115 -221 162 -38 383 129 -331 -203 42 153 1 -191 107 -31 123 -43
6353 -43 -199 -162 156 52 -104 -143 112 0 374 -219 -85 209 -24 -178 102 -179 49 -139 -108 -226 -248 -129
6375 -129 49 356 -80 16 33 223 225 28 37 -73 6 75 133 203 -386 -199 -84 -259 164 24 -228 232 95
6398 95 -276 38 -110 -93 302 38 173 81 121 -49 -257 199 -33 -62 68 -1 30 -3 167 194 271 -14 -13 -39
6422 -39 10 30 164 162 474 34 -22 -118 -285 8 -42 -88 82 108 -175 -230 21 -25 13 -147 1 48 -150 90 150
6447 150 -263 -64 -186 139 -26 94 190 170 -207 421 -26 -102 76 120 -53 188 287 257 3 -50 34 333 19
6470 19 219 67 66 439 18 -33 132 121 -64 63 -19 128 165 30 268 -110 172 -327 70 66 51 78 -143 30
6494 30 -43 -59 -150 -142 43 159 -138 -92 34 506 -101 36 160 -130 56 115 192 8 156 -156 -144 5 38 -219
6518 -219 -120 251 -80 -209 -15 -10 -235 -128 263 61 -59 68 131 -206 -302 179 -83 -2 17 -50 87 116 -47
6541 -47 33 -16 253 133 192 182 383 84 -151 93 -26 -33 173 4 239 -207 197 -255 107 178 -1 274 -280
6564 -280 -146 -10 -44 1 -86 -80 -326 -99 -76 -58 -24 116 63 66 23 65 45 -123 -28 -77 18 -155 87 -13 -59 110
6590 110 63 -40 72 -40 -269 -181 -78 62 348 -19 -43 -113 301 67 41 -292 -227 180 -161 63 -224 117
6612 117 226 -40 -90 -108 61 8 -9 -14 317 -30 -61 62 76 88 3 -182 38 -178 125 -45 -127 135 -56 -10
6636 -10 -275 -120 -52 106 -149 152 232 19 239 -318 -369 37 219 -68 39 -415 -38 -200 -261 -188 -49 -91
6658 -91 -191 22 73 -150 184 -36 -205 -106 0 99 1 48 -47 198 -16 -230 40 -32 56 -196 46 -69 98
6681 98 -19 -89 246 -90 -107 167 38 -22 69 0 -15 341 31 -162 -131 153 -34 -310 -32 96 4 -164 152
6704 152 -231 140 -40 101 6 -35 24 232 487 -180 -108 -157 157 -371 -177 102 -121 -76 259 -93 -6 -292
6726 -292 131 -15 41 7 -195 38 150 107 -368 -122 -19 -77 -125 219 -62 109 -85 -59 -63 -3 111 -19 -86
6749 -86 -174 123 -149 -161 196 -123 83 407 146 98 50 87 243 20 238 -150 -147 161 143 -215 -33 120 35
6772 35 229 -113 38 73 -12 -163 -111 50 -65 -11 256 -92 15 -381 -21 12 -96 -68 -298 -95 113 2
6794 2 -62 78 -30 -27 179 -44 51 -215 155 -214 -130 -266 -87 -109 -234 -269 -98 0 -11 217 89 151 -1 40
6818 40 -230 -151 -71 -241 45 -559 189 122 -170 -17 -8 187 -152 -62 203 176 -169 195 124 -68 289 -69 -250
6841 -250 -350 -94 424 -57 120 119 -378 -56 69 147 57 -274 138 -93 -285 67 119 194 96 322 13 -268
6863 -268 -86 -137 30 130 62 -54 248 -294 -157 223 -84 -47 258 -99 140 -182 -292 -53 -127 -271 35
6884 35 -130 -187 -154 163 90 44 -24 80 60 193 207 80 67 16 -298 46 30 67 33 -200 249 179 181 275 -47 -35
6910 -35 -262 67 245 -138 -110 12 80 106 -42 9 44 21 -124 10 -58 -71 -228 -283 -74 282 106 92 -306 -8
6934 -8 239 95 85 -45 -127 132 4 -137 73 -163 51 139 35 -227 -7 -31 224 26 -320 161 127 93 -90
6957 -90 26 -46 50 103 49 60 -14 97 -68 43 -201 71 -48 -233 -242 157 276 88 0 199 -190 14 338
6980 338 -214 -87 -138 -95 234 239 -111 60 42 -254 124 -248 169 278 35 109 -212 -81 28 19 -32 -3 -72 9
7004 9 -112 13 74 -25 177 23 -3 145 -218 -93 -25 -362 158 -246 -192 175 -56 86 130 -221 -91 37 5
7027 5 -111 -171 -25 244 181 -188 171 65 -50 64 -326 -55 344 258 -19 371 -25 -43 -15 -82 -6 -9 104 -157
7051 -157 25 3 249 -4 76 -317 -57 -165 -78 27 280 73 -194 -24 -112 -217 -15 20 87 -126 11 -253
7073 -253 -240 236 120 -146 -212 -135 -206 -60 319 125 -38 65 61 -78 6 9 108 -72 -82 81 -161 82 29 168
7097 168 -227 420 150 -25 367 -132 -50 194 146 -130 -27 78 32 -57 -148 72 58 39 288 5 -81 104 -93
7120 -93 119 262 -113 347 -42 65 -144 79 124 -7 287 117 108 348 93 104 31 24 -31 -110 -160 -31 363 203
7144 203 -28 263 -59 -43 107 -52 -56 39 -137 -50 -97 25 316 277 -40 -89 91 -3 -59 71 13 175 117 -252
7168 -252 112 298 -227 135 -323 2 -284 166 -153 132 112 208 -224 -37 313 -11 -81 89 98 -111 46 30
7190 30 20 -97 67 77 51 -33 366 211 191 228 109 -138 -244 -15 148 62 -24 -60 -2 -123 35 -266 -104 -15
7214 -15 78 4 -64 -242 91 -109 8 -146 -101 -135 76 -175 -285 -66 35 225 22 -214 192 75 17 11 -361
7237 -361 -189 146 -10 -156 229 -47 -22 61 131 -5 -176 -83 -117 143 -241 -133 132 98 -318 -20 -65 165
7259 165 40 -104 93 68 7 137 -64 -32 -145 -27 89 -281 -35 -48 -19 37 41 -124 -251 5 -136 13 -308
7282 -308 -25 -139 -115 -146 -231 -113 64 79 -165 -175 -111 85 -26 -1 3 126 130 46 30 167 -275 5 -70 -335 -40
7307 -40 47 -31 41 131 -56 215 405 58 -269 84 59 -200 -117 250 -21 -41 -148 -53 -201 -59 -62 254 114 250
7331 250 -136 96 98 -91 50 319 138 -10 8 -113 -29 158 -11 -118 -63 -75 -378 -53 -117 -270 166 -169
7353 -169 -150 273 408 186 151 -59 -8 -245 176 267 79 69 174 92 57 55 93 227 213 -18 32 297 15 -226
7377 -226 -147 6 276 60 -95 -80 64 193 60 187 -47 158 124 -47 -130 199 125 55 -22 60 121 -90 285
7400 285 -38 -12 107 -9 6 -142 111 5 -141 -82 41 -126 56 -202 -346 23 -222 -26 -111 -32 173 140
7422 140 -46 164 40 -64 87 -119 194 83 64 97 130 323 -86 93 118 -195 -44 -91 61 6 -109 289
7444 289 93 -23 -167 -318 -340 176 263 79 36 -285 -262 -74 -76 -5 155 -88 -135 -68 -345 181 111 -33 107
7467 107 -60 134 142 -68 25 -120 -68 74 51 28 277 4 64 -3 -32 11 128 198 55 -300 -2 138 -36 -330
7491 -330 319 161 107 57 196 -5 288 51 -34 -56 117 53 -125 22 -192 -146 40 -147 -217 -125 -265 -151 -22
7514 -22 -15 -23 -101 -80 13 160 -84 -56 203 74 -120 -141 110 81 -15 -170 65 216 113 -44 110 39 -200 -109 -112
7539 -112 213 48 -189 183 33 -76 -375 -64 -184 112 38 -69 109 -60 0 101 181 -6 127 135 -163 -208
7561 -208 -112 -221 -3 90 133 -115 -116 -127 -170 228 192 64 -51 -52 114 -57 146 -125 93 211 -147 -71 55 -42
7585 -42 -78 4 86 36 -45 246 -3 100 -58 -135 8 -143 -4 240 -301 107 14 -278 92 196 79 69 -29
7608 -29 -53 20 -253 -105 17 223 173 52 189 218 117 105 216 282 -22 207 -146 15 325 -63 132 0
7630 0 -211 6 -43 -65 288 28 -184 -183 195 61 148 -56 -170 348 31 88 142 102 131 292 -65 211 35 356
7654 356 -134 82 -67 13 134 -39 93 75 -99 -148 -8 -142 12 -79 277 146 -70 21 -299 144 27 -261
7676 -261 65 12 117 -41 -164 191 -100 141 35 -30 120 33 39 22 41 140 53 -152 -185 -253 61 2 -71 -17 4
7701 4 -78 260 -41 -47 94 117 251 176 -170 -65 80 -195 251 -110 39 88 -150 7 -45 7 -9 110 -268 180
7725 180 -156 -60 173 213 62 -205 202 -68 156 -141 67 -103 -246 114 -55 -98 288 104 75 17 -29 106
7747 106 5 34 112 -35 -202 -96 226 169 -161 392 55 111 58 -58 -125 24 -18 68 44 38 -165 283 -190 -174
7771 -174 -99 -331 -63 -19 -254 6 -104 29 140 258 -111 124 215 -32 350 -352 -71 -1 72 68 188 36
7793 36 -435 161 99 -94 332 103 -89 -320 27 119 24 -43 -1 -43 -35 -110 161 34 -106 263 34 23 -178 -127
7817 -127 -118 -114 -187 39 -87 128 147 116 -164 4 -64 -46 -89 -140 133 -36 -87 -132 -131 -20 148 -127 -111 266 120
7842 120 29 -153 256 -214 126 -230 -23 -304 326 61 -249 -179 -157 84 -109 -209 -47 61 101 -64 28 -31
7864 -31 63 226 -84 223 3 -117 118 -154 149 -109 59 92 13 -115 -6 168 79 -226 249 101 63 144
7886 144 -41 -118 67 73 233 74 -136 297 94 -273 195 -71 -74 -311 -179 82 104 261 -310 -112 27 -33
7908 -33 61 358 109 260 -24 490 109 175 188 61 117 30 15 -295 -43 -150 119 36 -205 63 -112 -54 -183
7931 -183 74 -25 202 25 243 -27 206 -94 -29 161 3 98 -24 -116 -42 76 16 -295 -76 -299 -234 -31
7953 -31 63 87 98 -133 88 140 -197 28 45 170 -259 -3 292 -35 11 -11 -171 173 401 4 -171 76 -156
7976 -156 -87 -6 63 -139 -21 -74 -200 285 41 111 -155 -122 286 -14 159 -126 83 166 -109 150 4 -27 -35
7999 -35 -67 257 108 138 27 -140 -44 68 -29 140 100 76 184 222 30 188 191 -71 299 255 -178 21 119 63
8023 63 -22 -258 -302 180 -131 82 -249 254 -17 117 97 -42 -2 -285 67 -162 44 179 -87 -147 108 408
8045 408 103 -70 -14 -154 -344 44 15 51 277 -75 237 -169 -206 -192 21 62 113 -106 -284 -258 -23 -15 -155
8068 -155 -44 -100 -105 -70 14 -225 -251 -262 114 -140 -67 52 52 -28 -138 145 20 42 6 -65 -3 -288 -27 73 203
8093 203 -125 -107 -55 -175 202 122 -24 266 87 21 82 -186 239 -54 -134 -85 -30 216 85 -122 103 98 52 63
8117 63 -195 -38 27 -78 -129 187 -209 -10 24 155 -117 -211 388 80 23 -198 -7 -64 -34 -59 207 -56 63
8140 63 -48 73 -254 -78 159 -154 107 62 92 57 157 114 -199 38 -56 -12 139 -28 124 24 98 17 -130
8163 -130 -82 147 -21 17 -38 28 -113 -66 163 40 -140 83 137 38 -121 -42 -286 298 150 -201 59 22 -22
8186 -22 -63 73 80 -103 75
8191G5
##END NTUPLES=NMR FID
##END=
