##TITLE=1H_SL65-SPh(2)
 CDCl3, 8 sc, 
 30.4.2019
##JCAMPDX= 6.0         $$ Bruker NMR JCAMP-DX V2.0
##DATA TYPE= NMR FID
##DATA CLASS= NTUPLES
##ORIGIN= UXNMR, Bruker Analytische Messtechnik GmbH
##OWNER= root
$$ XWIN-NMR		Version 3.5
$$ Tue Apr 30 15:31:09 2019 Russian Standard Time (UT+4h)  she@DPX200
##.OBSERVE FREQUENCY= 200.1315
##.OBSERVE NUCLEUS= ^1H
##.DELAY= (6, 6)
##.ACQUISITION MODE= SIMULTANEOUS
##.ACQUISITION SCHEME= undefined
##.AVERAGES= 8
##.DIGITISER RES= 18
##SPECTROMETER/DATA SYSTEM= spect
##.PULSE SEQUENCE= zg30
##.SOLVENT NAME= D2O
##.SHIFT REFERENCE= (INTERNAL, D2O, 0, 15.7039)
##AUDIT TRAIL= $$ (NUMBER, WHEN, WHO, WHERE, WHAT)
$$ ##TITLE= Audit trail, XWIN-NMR		Version 3.5
$$ ##JCAMPDX= 5.01
$$ ##ORIGIN= Bruker BioSpin GmbH
$$ ##OWNER= she
$$ F:/spectra/data/she/nmr/H-F/1/audita.txt
$$ ##AUDIT TRAIL=  $$ (NUMBER, WHEN, WHO, WHERE, WHAT)
(   1,<2019-04-30 15:30:10.29 +0400>,<she>,<DPX200>,
      <created by zg, POWCHK disabled, PULCHK disabled
       configuration hash MD5:
       00 E9 B6 7A A2 85 ED C7 34 08 36 98 17 FE 4E 26
       data hash MD5: 16K
       48 63 8F 4F 52 CF 39 54 1F 81 5B C4 E5 85 9D 95>)
$$ ##END=
$$ 
$$ hash MD5
$$ 6E 5A AA B2 86 A3 57 4A 2E 00 DC 29 B0 68 02 DB
##$RELAX= 
##$RELAX= 
##$RELAX= 
##$RELAX= 
##$RELAX= 
##$RELAX= 
$$ Bruker specific parameters
$$ --------------------------
##$DU= <F:/spectra>
##$EXPNO= 1
##$NAME= <H-F>
##$PROCNO= 1
##$TYPE= <nmr>
##$USER= <she>
##$AMP= (0..31)
100 100 100 100 100 100 100 100 100 100 100 100 100 100 100 100 100 100 
100 100 100 100 100 100 100 100 100 100 100 100 100 100 
##$AQSEQ= 0
##$AQ_mod= 1
##$AUNM= <au_zg>
##$AUTOPOS= <>
##$BF1= 200.13
##$BF2= 200.13
##$BF3= 200.13
##$BF4= 200.13
##$BF5= 200.13
##$BF6= 200.13
##$BF7= 200.13
##$BF8= 200.13
##$BYTORDA= 1
##$CFDGTYP= 0
##$CFRGTYP= 5
##$CHEMSTR= <none>
##$CNST= (0..31)
1 1 145 1 1 1 1 1 1 1 1 1 1 1 1 1 1 1 1 1 1 1 1 1 1 1 1 1 1 1 1 1 
##$CPDPRG= <>
##$CPDPRG1= <>
##$CPDPRG2= <>
##$CPDPRG3= <>
##$CPDPRG4= <mlev>
##$CPDPRG5= <mlev>
##$CPDPRG6= <mlev>
##$CPDPRG7= <mlev>
##$CPDPRG8= <mlev>
##$CPDPRGB= <>
##$CPDPRGT= <>
##$D= (0..31)
0 1.2 0 0 0 0 0 0 0 0 0 0.03 0 0 0 0 0 0 0 0 0 0 0 0 0 0 0 0 0 0 0 0 
##$DATE= 1556623809
##$DBL= (0..7)
120 120 120 120 120 120 120 120 
##$DBP= (0..7)
150 150 150 150 150 150 150 150 
##$DBP07= 0
##$DBPNAM0= <>
##$DBPNAM1= <>
##$DBPNAM2= <>
##$DBPNAM3= <>
##$DBPNAM4= <>
##$DBPNAM5= <>
##$DBPNAM6= <>
##$DBPNAM7= <>
##$DBPOAL= (0..7)
0.5 0.5 0.5 0.5 0.5 0.5 0.5 0.5 
##$DBPOFFS= (0..7)
0 0 0 0 0 0 0 0 
##$DE= 6
##$DECBNUC= <off>
##$DECIM= 24
##$DECNUC= <off>
##$DECSTAT= 4
##$DIGMOD= 1
##$DIGTYP= 9
##$DL= (0..7)
0 120 120 120 120 120 120 120 
##$DP= (0..7)
150 150 150 150 150 150 150 150 
##$DP07= 0
##$DPNAME0= <>
##$DPNAME1= <>
##$DPNAME2= <>
##$DPNAME3= <>
##$DPNAME4= <>
##$DPNAME5= <>
##$DPNAME6= <>
##$DPNAME7= <>
##$DPOAL= (0..7)
0.5 0.5 0.5 0.5 0.5 0.5 0.5 0.5 
##$DPOFFS= (0..7)
0 0 0 0 0 0 0 0 
##$DQDMODE= 0
##$DR= 18
##$DS= 0
##$DSLIST= <SSSSSSSSSSSSSSS>
##$DSPFIRM= 0
$$ [...]
##$SUBNAM2= <"">
##$SUBNAM3= <"">
##$SUBNAM4= <"">
##$SUBNAM5= <"">
##$SUBNAM6= <"">
##$SUBNAM7= <"">
##$SUBNAM8= <"">
##$SUBNAM9= <"">
##$SW= 24.9337058887773
##$SWIBOX= (0..15)
0 0 2 0 0 0 0 0 0 0 0 0 0 0 0 0 
##$SW_h= 4990.01996007984
##$TD= 16384
##$TD0= 1
##$TE= 0
##$TE2= 300
##$TE3= 300
##$TEG= 300
##$TL= (0..7)
0 120 120 120 120 120 120 120 
##$TP= (0..7)
150 150 150 150 150 150 150 150 
##$TP07= 0
##$TPNAME0= <>
##$TPNAME1= <>
##$TPNAME2= <>
##$TPNAME3= <>
##$TPNAME4= <>
##$TPNAME5= <>
##$TPNAME6= <>
##$TPNAME7= <>
##$TPOAL= (0..7)
0.5 0.5 0.5 0.5 0.5 0.5 0.5 0.5 
##$TPOFFS= (0..7)
0 0 0 0 0 0 0 0 
##$TUNHIN= 0
##$TUNHOUT= 0
##$TUNXOUT= 0
##$USERA1= <user>
##$USERA2= <user>
##$USERA3= <user>
##$USERA4= <user>
##$USERA5= <user>
##$V9= 5
##$VALIST= <valist>
##$VCLIST= <CCCCCCCCCCCCCCC>
##$VD= 0
##$VDLIST= <DDDDDDDDDDDDDDD>
##$VPLIST= <PPPPPPPPPPPPPPP>
##$VTLIST= <TTTTTTTTTTTTTTT>
##$WBST= 1024
##$WBSW= 4
##$XGAIN= (0..3)
0 0 0 0 
##$XL= 0
##$YL= 0
##$YMAX_a= 116347
##$YMIN_a= -98860
##$ZGOPTNS= <>
##$ZL1= 120
##$ZL2= 120
##$ZL3= 120
##$ZL4= 120
##$ABSF1= 10
##$ABSF2= 0
##$ABSG= 5
##$ABSL= 3
##$ALPHA= 0
##$AQORDER= 0
##$ASSFAC= 0
##$ASSFACI= 0
##$ASSFACX= 0
##$ASSWID= 0
##$AUNMP= <proc_1d>
##$AZFE= 0.1
##$AZFW= 0.1
##$BCFW= 1
##$BC_mod= 2
##$BYTORDP= 1
##$COROFFS= 0
##$CY= 11.3945322036743
##$DATMOD= 1
##$DC= 2
##$DFILT= <>
##$DTYPP= 0
##$F1P= 18.9103706918063
##$F2P= -1.10871071338519
##$FCOR= 0.5
##$FTSIZE= 0
##$FT_mod= 4
##$GAMMA= 1
##$GB= 0.15
##$INTBC= 1
##$INTSCL= 1
##$ISEN= 128
##$LB= 0.24
##$LEV0= 0
##$LPBIN= 0
##$MAXI= 10000
##$MC2= 0
##$MEAN= 0
##$ME_mod= 0
##$MI= 1.114404
##$NCOEF= 0
##$NC_proc= 0
##$NLEV= 6
##$NOISF1= 3.799351
##$NOISF2= 2.8
##$NSP= 1
##$NTH_PI= 0
##$NZP= 0
##$OFFSET= 15.70392
##$PC= 1
##$PHC0= -8857.863
##$PHC1= 22.60026
##$PH_mod= 1
##$PKNL= yes
##$PPARMOD= 0
##$PSCAL= 0
##$PSIGN= 0
##$REVERSE= no
##$SF= 200.130013532006
##$SI= 16384
##$SIGF1= 3
##$SIGF2= 2
##$SINO= 400
##$SIOLD= 16384
##$SREGLST= <1H.CDCl3>
##$SSB= 0
##$STSI= 0
##$STSR= 0
##$SW_p= 3612.71676300578
##$SYMM= 0
##$S_DEV= 0
##$TDeff= 0
##$TDoff= 0
##$TI= <>
##$TILT= no
##$TM1= 0
##$TM2= 0
##$TOPLEV= 0
##$USERP1= <user>
##$USERP2= <user>
##$USERP3= <user>
##$USERP4= <user>
##$USERP5= <user>
##$WDW= 1
##$XDIM= 8192
##$YMAX_p= 0
##$YMIN_p= 0
$$ End of Bruker specific parameters
$$ ---------------------------------
##NTUPLES= NMR FID
##VAR_NAME=  TIME,          FID/REAL,        FID/IMAG
##SYMBOL=    X,             R,               I
##VAR_TYPE=  INDEPENDENT,   DEPENDENT,       DEPENDENT
##VAR_FORM=  AFFN,          ASDF,            ASDF
##VAR_DIM=   8192,          8192,            8192
##UNITS=     SECONDS,       ARBITRARY UNITS, ARBITRARY UNITS
##FACTOR=    0.0002004,     1,               1
##FIRST=     0,             0,               0
##LAST=      1.6414764,     0,               0
##MIN=       0,             -98860,          0
##MAX=       1.6414764,     116347,          0
$$ Real data points
##PAGE= N=1
##DATA TABLE= (X++(R..R)), XYDATA
0 0 0 0 0 0 0 0 0 0 8 -8 8 -8 9 -16 16 -18 24 -28 33 -40 48 -56 65 -73 83 -97 111 -124 141 -160 180 -202
32 -202 227 -253 282 -315 351 -390 434 -479 532 -589 652 -721 800 -887 987 -1097 1226 -1376
50 -1376 1553 -1764 2024 -2351 2779 -3364 4219 -5592 8170 -14767 72127 116347 48160 85551
64 85551 111116 107518 71246 80241 97385 98966 77712 78069 84060 84242 70100 67949 67927 68888 66137
79 66137 67176 60271 52230 50923 58263 55266 42337 37003 45495 47876 36654 24525 28104 33116
93 33116 27360 17563 19884 26463 21821 9610 8069 15283 11503 -2076 -5714 4743 9605 -310
107 -310 -9505 -6204 -1474 -5712 -10070 -10958 -12638 -16595 -15564 -9888 -11363 -18032 -19341 -14779 -14755 -17796
123 -17796 -15837 -12748 -18590 -25926 -21417 -10800 -11144 -19777 -20322 -12393 -9953 -14600 -15703 -10242 -9660
138 -9660 -13730 -13145 -7110 -3723 -5828 -7034 -5087 -2459 -1630 -282 1536 1716 2372 4390 6166 5066
154 5066 5017 8678 12874 12413 10837 12370 16667 17553 15273 14628 17085 20228 20150 21323 24112 24351 21969
171 21969 21433 24632 26773 25365 23540 25697 27934 27773 28048 29369 28196 24732 24764 29100 30571 27398
187 27398 26286 28960 27843 23692 24537 28994 28634 22648 20681 26146 28115 23236 19552 21660 22782
202 22782 19193 16981 20082 21490 18467 14941 15190 15810 13974 13145 13959 13409 10067 9179 10905 10849 7416
219 7416 5141 6140 6497 4208 3079 4901 5441 1585 -1990 -492 1380 -347 -3729 -3746 -1278 -1952 -4534
236 -4534 -4510 -3619 -4863 -8642 -8956 -6562 -6288 -8678 -9747 -8950 -8736 -10135 -9652 -8722 -10189 -12882 -12444 -10624
254 -10624 -10737 -12848 -12402 -11179 -12003 -13543 -12764 -9738 -10428 -13689 -13999 -12231 -11920 -13219 -13395 -11747 -11300
271 -11300 -12781 -11950 -10179 -9807 -11655 -12780 -12376 -11923 -11973 -11067 -9867 -10221 -11177 -10419 -9081 -9068 -9995 -10383
289 -10383 -9770 -9766 -10390 -9366 -7816 -7851 -9246 -9099 -7521 -6608 -7486 -7969 -7900 -7571 -8275 -8120 -6599 -6185 -6532
308 -6532 -6857 -6506 -5626 -6093 -6222 -6231 -7015 -8246 -7134 -5329 -4466 -5749 -5832 -5290 -4869 -5930 -6165 -5080 -6138
327 -6138 -7091 -7015 -4994 -4676 -5817 -6294 -5439 -5437 -6667 -6584 -5726 -5983 -8054 -8224 -6581 -5544 -6181 -7357 -7007
346 -7007 -6948 -7833 -7963 -7506 -7702 -8770 -9106 -8433 -7824 -8440 -8061 -7752 -7789 -9310 -9636 -8200 -7917 -9281 -10409
365 -10409 -9946 -8760 -9123 -9131 -8470 -7821 -9034 -9921 -9303 -8645 -9259 -10198 -9479 -8881 -8490 -8310 -7822 -7285 -8420
384 -8420 -9815 -8808 -7538 -7336 -7928 -7536 -7187 -7123 -7025 -6246 -5264 -5629 -7197 -6109 -4811 -4565 -5098 -5209 -4398
403 -4398 -4650 -4535 -3561 -2193 -2261 -3124 -3567 -2019 -1655 -2231 -2210 -1316 -1234 -1362 45 1204 966 -573 -545 127
423 127 600 168 1010 2059 1818 1371 1118 2548 2717 1726 1141 1873 2324 2368 2653 3219 2813 1392 1588 2575
443 2575 2799 2580 2180 2073 2219 1572 1235 2169 2002 559 89 824 1418 843 85 -102 -385 -1296 -1277 -833
463 -833 -621 -1315 -2493 -2613 -2195 -2536 -3394 -3523 -3520 -4784 -5123 -4903 -4173 -4912 -6122 -6743 -6719 -6887 -7416 -7211
483 -7211 -7522 -8564 -9393 -8825 -8708 -9518 -9978 -10364 -10626 -11234 -11260 -10558 -11017 -11841 -12744 -12168 -11858 -12071 -12862 -13434
503 -13434 -13504 -13595 -13791 -13372 -12933 -13573 -14236 -14160 -14061 -14101 -14192 -13784 -14042 -14727 -14929 -13591 -13064 -13755 -14556 -14409 -13774
524 -13774 -13531 -13595 -13327 -12439 -13153 -13838 -13261 -11706 -11683 -12102 -11754 -11292 -11316 -11509 -10718 -10076 -10592 -11228 -10311 -8399
544 -8399 -7764 -8087 -7660 -7383 -7680 -8181 -7395 -5985 -5677 -5871 -5638 -4416 -3970 -4229 -4174 -3172 -3356 -3295 -2529 -1378
564 -1378 -1016 -1653 -1860 -961 -188 -271 -225 935 1500 697 587 1515 2522 1145 1135 1817 2746 2983 2826 3230
584 3230 3429 2036 1654 2462 3571 3310 2331 2692 3025 2698 2907 2839 2846 1616 526 1086 1718 2040 1545 1213
604 1213 819 -353 -123 -163 298 -367 -1649 -2018 -1633 -1503 -2517 -2733 -3169 -3458 -4106 -4263 -4007 -4571 -5505
623 -5505 -6309 -6555 -6674 -6987 -7014 -7494 -7929 -7926 -8313 -8845 -9062 -9657 -10254 -10629 -10667 -10540 -10916 -10654 -11073 -11497 -12052
644 -12052 -11678 -11575 -11814 -12152 -12648 -12701 -12534 -11919 -11688 -12276 -12435 -12618 -12278 -11733 -11360 -11885 -11835 -12025 -11769 -10421
664 -10421 -10118 -10423 -10454 -10462 -10278 -9930 -9127 -8229 -7916 -8080 -8246 -7181 -6327 -6115 -6058 -4844 -4536 -4388 -3974 -2994
684 -2994 -2203 -2430 -2892 -1487 -558 248 302 925 1737 1499 1343 2763 3768 3556 3315 4235 5567 6171 5845
703 5845 6513 6878 6847 6645 7564 8662 9163 8489 8979 9991 10390 9820 10065 10810 10619 10510 10856 12063 12372
722 12372 11306 11035 11884 12698 12434 12166 13193 13141 12651 11935 12539 13270 12875 12341 12668 12873 12280 12319 12956 13365
742 13365 12006 10999 11706 12341 12653 11834 12032 11592 11036 10754 11144 11621 10908 9892 9761 10486 10623 10468 9796
761 9796 9707 8939 8656 9419 9939 9971 8312 8319 8557 9086 8336 8124 8136 7896 7827 8274 8010 8258 7457 7057 7534 7622
783 7622 7600 7486 7253 7196 6593 6610 6516 6773 6375 6751 6697 6312 6285 6225 6563 6683 5840 5275 5674 5893 6004 5838
805 5838 5663 5134 5169 5593 5523 5271 4948 4617 4747 4388 4830 5045 4819 3771 3652 3831 4118 4160 3778 3253 2811
826 2811 2623 2947 3439 2844 2453 1914 2223 2562 2243 1881 1833 1195 1146 1001 1397 1348 674 183 245 783 721 -46
848 -46 -181 -118 -318 -815 -348 -99 36 -996 -1059 -805 -630 -712 -907 -955 -1097 -1719 -1210 -476 -589 -1138 -1264 -830
870 -830 -1244 -1599 -1486 -599 -872 -1524 -1230 -245 -321 -759 -1033 -748 -412 -900 -424 174 380 -129 -621 -215 693
891 693 995 699 559 999 872 943 1334 1584 1473 1025 1323 2182 2470 2558 2307 2525 2122 2240 2699 3209 2862
912 2862 2514 2713 3195 3528 3252 3316 3164 2794 3085 3409 4113 3891 3453 3250 3437 3416 3324 3435 3795 3892 3305
933 3305 3150 3573 3610 3331 2755 2864 3052 3146 3456 2913 2471 2201 2365 2371 2400 2425 2076 2095 1856 1522 1353 1760
955 1760 1304 776 794 921 953 975 860 548 -98 -531 -307 128 135 -135 -866 -1022 -937 -812 -865 -1001 -1383 -1457 -1462
978 -1462 -1141 -1086 -1376 -1928 -2051 -2455 -2458 -2253 -1558 -2136 -2667 -3101 -2446 -2483 -2625 -2849 -2363 -3078 -3064 -2743 -2206 -2312
1000 -2312 -2864 -2975 -3121 -2654 -2492 -2424 -2411 -2583 -3006 -2756 -2467 -2325 -2415 -2581 -2608 -2188 -2122 -1861 -2237 -2400 -2305 -2250
1022 -2250 -2038 -1515 -1799 -1639 -2018 -1918 -1771 -1331 -1231 -881 -1425 -1421 -971 -922 -1022 -1289 -645 -788 -695 -648 -368
1043 -368 -203 -484 -541 -453 -79 -172 36 293 95 -284 -217 315 324 247 -175 157 483 295 630 409 391 103 64
1066 64 427 877 376 467 277 302 314 295 744 427 177 222 615 517 409 644 236 176 381 159 406 692 254
1089 254 -52 137 224 242 365 13 238 -104 230 74 339 213 -41 1 144 -67 58 12 122 -209 -313
1110 -313 59 149 128 -625 -140 -294 -54 -100 -237 -153 -689 -568 -621 -13 -225 -340 -465 -278 -41 -487 -476 -213
1132 -213 -386 -663 -347 -69 -208 -616 -367 -576 -446 -689 -356 162 -368 -502 -672 -815 -192 -585 -484 -455
1152 -455 -790 -534 -545 -163 -500 -557 -859 -570 -640 -359 -825 -565 -762 -1234 -1358 -433 -868 -1041 -1111 -983 -995 -1012
1174 -1012 -1324 -1150 -1625 -1270 -1415 -1368 -1148 -1674 -1631 -1994 -1838 -1859 -1468 -1585 -1879 -1981 -2033 -1798 -1737 -1894 -1972 -1815
1196 -1815 -1892 -2111 -2371 -1824 -1885 -2325 -2390 -2270 -2042 -2090 -2284 -2166 -2171 -2895 -2587 -1993 -1976 -1773 -2354 -2486 -2352 -2581
1218 -2581 -2281 -2268 -2225 -2322 -2584 -2174 -2348 -2095 -2306 -2084 -2289 -2458 -1915 -2201 -1932 -2378 -2134 -2319 -2057 -1871 -1888
1239 -1888 -2152 -1969 -1901 -1931 -1859 -1817 -1857 -1736 -1662 -1700 -1582 -1402 -1482 -1069 -1525 -1454 -1359 -1253 -1177 -1105 -1335 -1209 -993 -993
1263 -993 -1343 -1328 -1065 -1089 -650 -643 -874 -1015 -940 -785 -609 -434 -718 -786 -879 -926 -969 -532 -256 -555 -456 -531 -741 -377
1287 -377 -257 -435 -342 -247 -430 -325 -163 -84 -245 -357 -550 -418 -141 -79 -291 -270 -276 -159 -84 -441 191 55 -3
1310 -3 -2 -38 -95 13 40 -39 118 105 309 399 343 148 26 -382 98 217 373 448 156 96 -49 239 328 317 124
1335 124 -48 265 334 187 165 195 -9 -70 -157 345 35 -341 24 -24 -57 -23 11 60 -500 -862 -633 -432 -607
1358 -607 -698 -568 -844 -937 -993 -1180 -1047 -1018 -1371 -1420 -1303 -1086 -1176 -1603 -1747 -1724 -1922 -1624 -1804 -1750 -1904 -2226 -2204
1381 -2204 -2108 -2099 -2326 -2239 -2272 -2549 -2807 -2567 -2268 -2298 -2506 -2624 -2496 -2223 -2514 -2840 -2561 -2831 -2632 -2548 -2611 -2799
1403 -2799 -2287 -2500 -2498 -2508 -2522 -2132 -2102 -2194 -2228 -2069 -2280 -1894 -1575 -1637 -1998 -1581 -1216 -1009 -1088 -933 -1315 -944 -967
1426 -967 -488 -269 -572 -513 -452 -331 -25 105 825 491 353 662 376 1146 1213 1042 722 1286 1500 1808 1867
1447 1867 1799 1497 1671 1931 2225 2099 2096 1878 2191 2454 2229 2601 2545 2683 2220 2280 2504 2877 2584 2359 2363 2371 2434
1470 2434 2531 2441 2668 2335 2384 2152 2131 2307 2101 2091 2142 1820 1739 1898 2100 1822 1618 1576 1377 1249 1175 1034 818
1493 818 819 764 421 611 662 390 -7 -180 170 -92 -16 -263 -447 -701 -792 -548 -785 -607 -903 -1497 -1090 -1293
1515 -1293 -1272 -1529 -1628 -1231 -1706 -1507 -1731 -1540 -1666 -1793 -1791 -1526 -1398 -1758 -1758 -1794 -2018 -1869 -1836 -1572 -1411 -2056
1537 -2056 -1736 -1660 -1650 -1579 -1560 -1365 -1456 -1508 -1449 -912 -998 -913 -978 -1106 -777 -805 -793 -755 -751 -875 -545 -85 -135 -176 -44
1562 -44 2 24 274 392 338 654 467 87 533 691 645 968 996 707 783 1241 1002 1151 790 853 1292 1606 1466
1585 1466 1523 1518 1105 1298 1135 1647 1341 1489 1529 1291 1432 1635 1501 1600 1420 1290 1373 1652 1405 1652 994 1313
1607 1313 1474 1081 1431 867 1397 873 1153 1158 1304 1094 960 1180 1080 1008 1128 910 1009 638 585 796 909
1628 909 793 666 773 708 717 449 726 494 260 673 430 442 752 590 331 465 443 382 510 649 814 564
1650 564 327 715 560 669 555 615 548 136 545 686 553 313 201 642 732 534 790 855 768 685 644 777
1672 777 700 817 723 496 774 580 947 951 838 1028 591 841 599 1051 1008 750 625 691 934 694 901 765
1694 765 635 905 898 801 631 678 613 496 411 412 589 284 89 446 406 266 562 561 -100 -234 320 59 286 319
1718 319 -12 3 -237 -391 -177 -113 -115 -235 -401 -265 -408 -318 -244 -679 -377 -267 -204 -157 -485 -922 -746 -581 -765
1741 -765 -695 -672 -833 -756 -890 -687 -565 -748 -671 -879 -766 -1133 -523 -611 -525 -746 -898 -1024 -984 -374 -796 -1032
1763 -1032 -805 -860 -578 -840 -864 -681 -360 -948 -802 -296 -156 -356 -312 -776 -556 -110 -30 57 -212 -112 -290
1784 -290 107 51 20 136 -17 91 105 220 477 374 487 630 620 385 346 628 700 563 496 1064 860 1184
1806 1184 685 771 1091 1203 1244 1099 1280 1069 1414 1260 1430 1199 1677 1432 960 1305 1212 2088 1557 1625 1028
1827 1028 1555 1827 1506 1642 1924 1399 1346 1523 1545 2005 1611 1755 1356 1740 1454 1824 1620 1495 1533 1879 1316
1848 1316 1518 1628 1300 1334 1717 1718 1438 1737 1305 1583 1354 1399 1339 1654 1194 1180 1404 1207 1361 1307 1049 1093
1870 1093 1085 972 1141 1128 758 1119 736 611 597 790 472 489 638 245 525 401 404 241 414 363 261 49
1892 49 179 14 30 -118 -362 -246 53 -240 -127 -390 -75 -363 -132 -459 -384 -532 -477 -714 -598 -442 -283
1913 -283 -679 -1015 -762 -920 -693 -521 -676 -562 -631 -953 -492 -797 -575 -976 -751 -861 -688 -695 -703 -1003 -752 -774
1935 -774 -482 -727 -527 -564 -161 -297 -907 -260 -363 -757 -361 -594 -383 -23 -1 121 -185 -157 257 -177 -16
1956 -16 221 278 187 230 221 753 604 815 457 232 673 806 1050 762 688 958 913 891 966 652 786 1170 964
1979 964 1116 1347 1564 928 1095 1192 1318 1421 1029 1412 1251 946 1399 1260 1602 905 1133 1370 976 1185
1999 1185 1120 1334 737 1257 1164 1139 893 989 913 728 733 594 497 877 1030 376 520 181 259 523 566 24 -81
2022 -81 11 -82 -177 99 -18 -320 -419 -328 -640 -483 -444 -723 -788 -1064 -1026 -841 -1011 -1038 -1284 -1175 -1399 -1393 -1024 -1344
2046 -1344 -1345 -1285 -1477 -1747 -1627 -1391 -1615 -1679 -1738 -1630 -1846 -1492 -1775 -1977 -1898 -1930 -1932 -2035 -2040 -1918 -1889 -1769 -1783 -1664
2070 -1664 -1799 -2041 -1771 -2166 -1516 -1601 -1573 -1465 -1836 -1678 -1298 -1238 -1078 -1473 -1413 -1042 -985 -1018 -1016 -1129 -706 -693 -676
2093 -676 -592 -517 -500 -542 -410 -403 -300 12 -562 -278 -674 152 26 81 242 399 -129 11 51 501 674 382 591
2116 591 705 474 235 1112 749 601 339 759 867 845 828 550 370 637 658 651 844 783 680 321 763 705
2138 705 450 402 227 334 328 568 184 662 363 332 -13 333 259 411 427 210 33 -299 208 128 -21 65 -334
2161 -334 -208 -360 -146 -412 -358 -231 -487 -430 -394 -518 -720 -493 -718 -673 -919 -616 -848 -693 -995 -930 -680 -739
2183 -739 -753 -1165 -934 -941 -1114 -667 -823 -949 -832 -957 -1224 -1049 -894 -844 -958 -950 -796 -689 -708 -519 -1027 -1014 -581
2206 -581 -473 -440 -494 -693 -505 -372 -99 -462 -686 -50 -149 -435 1 -164 -109 -217 -207 15 -229 -287 155 311
2228 311 -38 161 308 308 229 520 82 300 549 344 236 546 547 179 548 525 671 730 778 731 565 748 671
2251 671 498 700 535 564 441 644 529 705 550 697 496 198 497 530 558 378 270 510 352 714 375
2272 375 665 395 412 60 572 502 388 116 -53 562 226 -74 126 -52 214 -27 -32 35 64 0 -232 -63
2294 -63 -60 -149 239 -17 -126 -147 -259 102 8 -223 -147 -228 149 46 -235 -17 -135 -59 -80 198 284 -110 -229 165
2318 165 -89 -48 212 186 340 494 337 289 254 358 815 360 87 525 629 437 782 749 820 453 603 1106
2340 1106 830 854 826 1119 884 904 1098 630 1146 947 934 956 1064 1191 782 821 1190 916 1223 1198 1023 794
2362 794 704 1259 1023 1349 1288 882 586 659 894 729 909 442 775 767 482 369 606 240 385 325 582 230
2384 230 276 284 203 111 -108 -187 76 -284 -224 -258 -120 -196 -544 -531 -319 -574 -646 -831 -832 -1071 -1115 -1006 -1038 -1152 -1220
2409 -1220 -1443 -1082 -1257 -1300 -1388 -1568 -1389 -1356 -1885 -1561 -1627 -1536 -1953 -1809 -2018 -1897 -2010 -1807 -1936 -1871 -1997 -2190
2431 -2190 -2103 -2126 -1841 -2261 -1992 -2073 -2081 -2379 -2228 -2181 -2012 -1990 -2444 -2294 -1965 -2051 -1879 -1560 -2173 -1830 -1970 -1726
2453 -1726 -1790 -1947 -1815 -1420 -1780 -1906 -1666 -1676 -1430 -1626 -1233 -1286 -1053 -1445 -1201 -1056 -1424 -1098 -1104 -825 -943
2474 -943 -1018 -880 -754 -715 -351 -676 -1054 -604 -496 -633 -360 -735 -279 -324 -512 -181 -239 -75 119 -283 -74
2495 -74 -311 -59 152 20 83 126 -79 13 175 216 141 -303 72 444 299 283 447 134 -8 197 562 423
2517 423 541 488 345 186 344 625 160 85 -25 161 346 259 164 89 -174 75 172 513 59 113 -92 -148 -28
2540 -28 198 21 24 271 61 82 -133 -25 -190 -175 -233 174 -143 -227 -354 -55 -208 -346 -196 -64 -44 -282 59
2563 59 -191 -218 -227 -29 -419 -173 -144 -76 -115 114 -10 -496 -231 -512 -121 238 -66 -242 -429 -372 -85 -296 241
2586 241 -218 -169 -241 -186 223 -51 -23 -299 -188 -264 -6 -121 -251 26 57 -134 -82 8 -26 381 332 -10 176
2609 176 297 103 133 -2 233 66 317 446 222 219 -120 -35 102 322 379 40 403 117 394 137 446 333
2631 333 7 43 239 365 106 367 293 115 302 327 475 605 331 437 176 304 548 465 239 388 240
2652 240 279 620 522 612 343 222 237 275 637 742 627 233 -115 569 152 484 600 406 478 214 546 277
2674 277 492 376 258 426 283 623 516 491 214 290 350 497 341 445 697 62 182 311 751 406 316
2695 316 230 359 202 371 -172 189 81 -46 319 452 314 262 313 417 -22 44 314 144 222 100 264 178
2717 178 191 271 129 91 115 151 189 -167 55 448 203 348 186 228 170 31 306 429 431 317 -28 230 -8
2740 -8 -126 221 101 152 439 93 81 231 269 512 164 121 161 191 167 334 18 -74 236 359 309 217 662 266
2764 266 267 347 106 266 135 132 303 -132 18 283 373 -167 8 -23 174 187 39 329 71 -137 188 87 -25
2787 -25 -170 -2 -85 231 -23 -53 -2 207 178 -148 281 3 124 -5 297 -94 -65 34 413 276 -64 -97 146
2810 146 -2 106 -33 -26 107 -44 24 31 15 216 55 11 -199 9 113 138 -121 127 -180 -7 410 354 219
2833 219 -139 11 282 694 663 663 350 456 556 401 525 514 718 426 447 734 718 705 745 265 524 592 955
2856 955 367 698 541 427 483 582 588 434 586 758 486 869 537 746 617 771 650 419 631 680 350 318
2878 318 504 791 729 459 663 393 423 633 577 518 358 398 187 179 458 210 345 247 205 -172 215 117 214 -150
2902 -150 -236 45 4 -3 -100 -8 -241 -85 -57 -194 -473 -99 -169 -495 -371 -120 -278 -131 80 -276 -68 -272 -282
2925 -282 -69 -290 -177 -61 -320 -18 -348 -161 91 -91 244 103 50 -293 -132 -62 180 97 191 83 232
2946 232 183 122 52 339 447 212 302 234 149 503 741 548 234 726 513 789 648 813 827 646 465 825
2968 825 750 954 984 1113 649 850 733 849 713 976 1160 1152 990 1092 903 875 1193 983 950 1059 1205 1074
2990 1074 1173 920 695 1247 1318 1090 836 1117 835 998 1147 911 819 924 839 836 727 1012 834 571 776 1026
3012 1026 564 1001 760 916 689 782 186 608 150 842 290 263 361 177 433 467 302 253 36 232 7
3033 7 270 399 226 82 98 125 1 -17 36 -261 -220 -173 -98 -266 -558 -291 -417 -194 136 -288 -350 -358 14 -545
3057 -545 -409 -111 -620 -320 -417 -388 -426 -487 -479 -718 -305 -528 -125 -337 -545 -811 -756 -421 -371 -306 -492 -335 -487
3080 -487 -751 -546 -274 -124 -210 -354 -522 -481 -200 -681 -510 -403 -308 -535 -620 -261 -301 -494 -13 -333 -455 -551
3102 -551 -201 -649 -234 -335 -575 -421 -217 -677 -415 -542 -455 -548 -431 -465 -561 -678 -858 -526 -386 -349 -265 -456
3124 -456 -366 -333 -451 -427 -125 -292 -531 -442 -603 -381 -474 -459 -270 -617 -579 -377 -531 -704 -814 -797 -552 -500 -578
3147 -578 -816 -995 -933 -642 -945 -1112 -764 -994 -888 -663 -1053 -657 -889 -1025 -993 -1056 -1034 -1147 -1034 -787 -944
3168 -944 -907 -1182 -960 -1092 -1309 -1191 -1338 -1081 -1280 -1302 -1052 -1456 -1564 -1038 -1074 -1348 -1292 -1217 -1588 -1192 -1237 -1142
3190 -1142 -1218 -1048 -1237 -1127 -820 -999 -913 -990 -1180 -1383 -1242 -1098 -727 -917 -911 -1076 -915 -884 -831 -757 -615 -885
3212 -885 -738 -573 -610 -686 -477 -784 -621 -475 -101 -384 -400 -463 -591 -198 -322 -145 -164 -90 -61 -370 -400 -196 -260
3235 -260 -35 27 -250 36 -70 24 7 -166 -15 -110 -25 11 59 -46 -107 68 -224 59 33 65 172 -140 80
3258 80 15 38 -49 20 20 -168 -143 -6 -53 -481 22 -180 -128 -313 -516 -85 -160 -322 -469 -474 -183 -13 -799 -358
3282 -358 -249 -215 -389 -539 -549 -497 -782 -588 -463 -677 -472 -679 -799 -479 -896 -755 -546 -853 -749 -1089 -729
3303 -729 -1094 -494 -707 -1017 -638 -616 -570 -486 -749 -949 -809 -694 -719 -827 -318 -1051 -618 -760 -496 -591 -388 -617
3325 -617 -278 -422 -425 -816 -429 -438 -187 -240 -252 -50 -91 -355 19 135 -140 -613 -59 -135 66 -77 94 72 -127
3348 -127 306 138 200 371 334 542 481 438 258 336 680 446 323 801 600 396 769 942 649 421 717 893
3370 893 633 715 773 708 716 843 564 749 980 1007 750 998 782 759 1015 1100 703 691 628 618 845 801 807 618 997
3395 997 925 595 657 758 515 828 837 608 569 503 207 178 549 583 287 375 104 317 257 328 68 245 141 49
3419 49 -3 28 1 -175 124 -33 -106 -133 101 -236 -422 -373 -220 -335 -521 -254 -182 -364 -546 -77 -493 -648 -610
3442 -610 -465 -564 -712 -549 -455 -661 -547 -466 -568 -410 -583 -535 -590 -577 -580 -609 -332 -204 -541 -394 -567 -1044 -386
3465 -386 -465 -556 -398 -607 -367 -399 -462 -409 -234 -109 -410 -121 -334 138 -339 11 -38 -224 312 78 129 53 278
3488 278 -77 89 341 299 253 447 577 372 579 546 540 577 644 447 447 823 967 750 593 890 710 748 907
3511 907 755 649 1116 1016 886 767 1336 1109 986 1160 935 1150 1098 1021 1311 898 1238 1014 1301 1051 1041
3532 1041 1022 1317 1103 1022 1408 986 757 933 1156 1165 1002 825 854 782 773 869 1246 711 870 435 929 645 931
3555 931 1036 296 687 657 766 763 563 433 678 248 680 605 585 592 413 410 313 414 85 291 433 264 116
3578 116 344 208 252 278 267 110 479 112 362 193 325 108 55 71 125 47 79 126 189 -70 75 489 65
3601 65 20 331 279 267 39 203 448 406 352 253 300 291 283 431 485 564 293 276 377 485 154 338 721 264 519
3626 519 669 712 316 479 697 557 418 682 566 712 660 533 393 719 646 836 780 757 761 587 685 671 743
3649 743 578 642 758 632 533 448 470 793 816 388 551 614 640 559 820 370 761 754 773 160 572 908 364 444
3673 444 416 329 623 815 298 308 590 495 371 124 393 555 241 264 240 422 160 184 374 485 423 331 173
3696 173 -136 118 295 183 419 -67 300 -107 -169 33 320 -71 145 296 -206 287 -344 -35 -1 72 -153
3717 -153 130 397 162 331 -21 -139 279 -58 -146 132 -140 -289 -143 -90 -7 357 2 58 -67 307 139
3738 139 -136 83 -227 -151 -10 -317 -55 -196 133 123 -224 -172 67 -97 -449 -51 -318 -371 -66 -296 -351 -87
3760 -87 -445 -330 -202 -258 -137 -70 -281 -132 -33 -169 -114 -247 77 -321 -344 -204 -128 -267 -224 -406 -207 -329 -365
3783 -365 -276 -296 -238 116 -540 -243 -216 -167 -488 -88 -125 -364 -195 -548 -526 -141 -512 -187 -136 -424 -216 -522 -371
3806 -371 -290 -407 -59 -764 -344 -548 -196 -243 -356 -660 -729 -234 -502 -461 -613 -422 -365 -167 -434 -430 -689 -265
3828 -265 -370 -181 -235 -270 -765 -268 -395 -317 -72 -169 -443 -319 -333 -299 -311 -403 -191 -456 -224 -218 -557 -449 -435 -302
3852 -302 -400 -186 -503 -379 -390 -65 -79 -234 -156 -223 -354 -11 74 -307 -66 -420 3 49 -54 -161 -97 -112 -45
3875 -45 -358 89 41 -30 -34 -300 -148 8 -304 249 -83 22 303 -61 -13 97 21 5 22 415 193 125 -211
3898 -211 88 -7 313 -185 -352 77 63 -163 -332 -199 -105 159 15 -189 -1 -178 -165 -347 -393 -208 -213 -26
3920 -26 -206 -316 -171 -164 -525 -419 -79 -179 -568 -229 -565 -299 -408 -487 -223 -358 -70 -393 -552 -556 -634 -615 -619
3943 -619 -420 -682 -116 -421 -493 -560 -302 -470 -563 -657 -510 -469 -269 -595 -677 -313 -452 -292 -663 -218 -662 -539
3965 -539 -429 -647 -693 -585 -566 -363 -407 -637 -525 -386 -583 -468 -39 -584 -328 -180 -415 -658 -467 -237 -135
3986 -135 -529 -144 -582 -186 -396 -391 -299 -350 -518 -55 -554 -274 -384 -206 -110 -148 -96 57 -116 -309 -303 -240 -190 27
4010 27 -271 -227 -214 -372 -83 -40 -218 -207 45 -203 -211 -71 -92 -127 -126 -117 87 -285 -145 -315 -156 -102 -271 76 -50
4035 -50 -101 -175 -251 -149 -63 88 -249 -131 -420 -163 -243 89 -57 -105 -87 142 33 -149 -131 31 -131 -50 78
4058 78 -170 -36 -31 -374 158 -127 -177 -24 100 75 -193 247 -256 27 -12 -273 -10 -150 -59 105 -143 -151 173
4081 173 -446 -61 -254 -163 100 -419 68 -30 269 -401 -381 -158 -176 -407 102 -5 59 -447 -3 -192 -99 -58
4103 -58 -247 -224 -417 -275 6 -427 -58 -256 -164 -100 -206 -58 -235 -127 85 -473 -239 -256 -443 37 -201 -212
4125 -212 -636 -330 -336 -220 -686 -298 -548 -572 -430 -273 -282 -207 -357 -158 -212 -444 -474 -630 -385 -560 -337 -277 -456
4148 -456 -749 -652 -603 -294 -454 -133 -58 -396 -571 -714 -85 -522 -366 -296 -561 -667 30 -486 -86 -428 -176
4169 -176 -367 -388 38 -525 -414 -446 -467 -258 91 -357 -251 -32 -515 -173 -94 116 179 -40 -231 -36 1 32
4191 32 -68 -144 340 -10 -27 37 121 -166 198 -120 -28 271 271 95 38 77 185 88 211 474 55 -57 30 359
4215 359 76 285 198 153 -33 47 487 265 -3 195 275 368 100 203 335 512 214 122 402 114 290 487
4237 487 465 429 373 569 450 164 330 358 3 220 349 322 515 164 342 389 477 490 336 491 257 305 152
4260 152 534 230 265 358 277 404 377 913 103 534 -38 315 394 116 303 543 266 287 581 566 245 228 182
4283 182 389 303 292 241 170 407 340 229 443 221 246 -59 -274 -20 156 261 -56 141 134 -154 477 435 51
4306 51 234 253 -48 31 370 120 -92 6 -23 288 -45 -238 100 358 466 -1 99 298 183 -84 -8 248
4328 248 148 321 70 227 156 507 274 363 393 -61 243 -94 82 171 96 85 -73 226 175 400 325 318 54
4351 54 298 3 362 245 160 527 55 281 598 187 527 559 325 237 17 164 239 209 281 425 262 477
4373 477 239 484 787 809 397 297 365 388 325 232 156 609 683 466 378 582 345 284 456 322 659 515 202
4396 202 412 481 455 138 127 437 492 228 718 131 281 256 165 483 303 284 514 159 210 311 204 -79 -5
4419 -5 88 314 -18 53 -68 37 151 298 404 60 112 329 353 202 151 141 370 186 -132 288 13 -188 -20
4442 -20 168 9 -414 76 -77 187 -53 158 205 -32 156 -35 123 135 20 -84 -41 189 -7 -315 255
4463 255 -213 -199 88 -246 -209 0 -256 -1 -97 -133 223 264 -187 -135 152 -276 -150 59 -386 -80 82 -224
4485 -224 -55 -222 -49 8 53 -47 -197 -204 -73 -130 -175 63 -24 58 -385 11 -115 181 -94 -194 -423 -54 133
4508 133 -357 -348 -195 -277 -137 54 -220 -338 52 83 -68 179 -103 224 -156 124 -73 98 -116 -270 187
4529 187 -189 234 302 -1 -65 65 -324 -107 -37 51 66 -226 93 168 161 61 -265 103 -56 167 132 109 262
4552 262 -60 -60 244 -15 220 432 28 337 -117 298 210 -150 360 175 65 436 191 304 373 265 282 139
4574 139 200 185 473 282 271 234 403 389 305 335 206 229 73 308 573 165 125 224 304 98 18 206 187 172 128
4599 128 325 121 232 216 -64 168 -364 -174 138 -341 122 103 180 -49 25 -405 118 363 74 231 -376
4620 -376 -69 -344 -287 -65 -76 141 -263 -35 -87 -381 26 -340 -36 294 -123 -596 -181 -303 -431 -109 -194
4641 -194 -390 -674 -258 -309 -300 -495 -287 -707 -143 -152 -696 -500 -483 -335 -391 -375 -184 -110 -161 -835 -15 -117 -92 -189
4665 -189 -608 -142 -387 -495 -154 -404 -144 -404 -390 -268 -172 -206 -53 -254 -171 -336 -84 -248 -184 -52 -63 -17
4687 -17 -73 -56 -296 -276 -63 65 -10 17 210 -11 82 -68 66 -57 -341 101 -189 -3 2 -38 -37 20 219 -128
4711 -128 -159 -169 -104 -87 242 -105 -359 -109 -18 139 89 -87 -143 51 267 -178 -164 209 -144 -278 -166 -111 -155
4734 -155 -123 -236 78 -57 192 -448 -104 -436 -116 -183 48 372 -26 -9 -137 215 -363 248 -347 -87 -112
4755 -112 -252 -132 -129 -73 -69 -489 -172 -429 -320 -359 -264 -255 -307 -110 -184 -49 105 -247 -227 -294 -395 -183 -306 -255 -219
4780 -219 -458 -368 -71 -328 28 -306 -353 -232 -148 -57 -128 -312 -296 -224 -225 -86 23 -230 -27 -165 -321 -43 -139
4803 -139 90 -269 -309 -220 -372 -247 66 224 -7 -171 -44 -306 12 -133 32 99 -14 57 -173 -408 -231
4824 -231 80 107 44 -213 -96 -163 -6 -153 -48 -337 105 -38 -95 342 259 -51 -318 -31 97 -149 94 -15
4846 -15 -176 241 -97 -171 -252 247 -208 81 188 -160 -194 322 -80 -49 -198 23 -142 -291 -74 86 -160 385
4868 385 -249 -91 -93 -295 137 -100 -200 -337 9 -4 139 195 -178 -23 -10 -129 72 77 149 -64 -145 -95 162
4891 162 85 40 -316 -220 -171 -132 -298 229 -113 147 -107 46 131 115 -135 -37 -50 125 161 136 139 -48 -296 -218 210
4916 210 -115 -80 42 71 29 227 346 26 215 -125 -20 208 267 -239 67 9 -19 -183 -20 -6 -459 224
4938 224 10 224 -33 -259 181 170 304 349 25 165 243 44 90 47 -85 248 281 96 182 67 31 -10 87
4961 87 336 -35 66 202 259 296 182 142 135 -97 -108 -14 -345 -212 36 222 268 -93 193 93 -134 126 -53
4984 -53 -2 333 -48 -214 -138 220 -4 84 117 -16 292 -40 374 120 109 49 -3 48 -87 -206 -290 -264 -165 -243
5008 -243 76 26 256 183 206 -7 -70 208 -14 -42 -30 -112 36 -128 -161 -195 -114 207 -81 188 137 -3 62 -133
5032 -133 -52 61 -28 253 231 -32 109 -118 143 -8 101 136 -47 192 -71 46 135 26 65 299 39 -4
5054 -4 71 13 7 -156 -120 -15 -70 -156 41 130 138 100 207 -126 -241 26 -47 -52 39 95 186 181 205 174 -211 -6 246 65
5082 65 37 125 411 413 454 174 98 -136 -37 42 -193 14 109 288 193 362 113 182 -98 35 186 203 290 185 138
5107 138 430 164 241 101 -132 -1 483 535 296 50 149 397 19 196 547 361 135 313 136 366 421
5128 421 351 -42 277 474 480 188 -13 362 320 -70 421 191 179 239 133 602 -27 173 197 8 30 -67 -20
5151 -20 -50 174 159 149 88 152 -33 301 467 -26 -9 -178 -48 50 215 49 -64 -115 -216 328 190 -108 170
5174 170 57 271 33 -84 -238 -80 -29 -156 -102 150 114 163 -290 -142 114 -110 5 56 272 60 161 198
5196 198 -92 8 -51 183 -149 -585 104 -45 238 -238 -104 -73 -176 -145 -9 -56 161 10 125 -286 -325 0
5218 0 -145 235 -18 25 -86 -25 47 8 -73 243 36 -162 -151 -23 -174 -136 324 216 -107 -93 329 -72 -107 -329
5242 -329 256 148 146 484 -226 -238 104 0 175 105 -218 -37 -35 176 33 49 139 -442 202 -120 41 9 45
5265 45 47 75 153 16 253 -15 -51 90 181 353 64 -334 278 -33 -110 -281 253 138 48 -57 -28 -130 -80 410
5289 410 -250 96 196 -142 -39 -230 182 -146 92 -33 131 -331 76 103 10 -169 -353 -38 -318 -92 21
5310 21 81 -125 108 164 -10 -266 64 -352 231 349 -166 -83 -323 -127 195 -156 -194 -119 -147 -305 -111 52
5332 52 -67 -122 265 -338 -187 -100 355 -213 -293 -176 -152 -399 -99 -252 -120 246 -57 -162 12 257 -7 -174
5354 -174 -169 -38 -64 -36 -425 -29 -226 -260 -61 -230 -339 -59 -77 -160 -180 48 -89 -108 -22 -256 -8 -128 40
5377 40 -20 18 106 -108 -88 -37 -342 -117 -8 81 -40 16 -384 -274 -117 -118 216 -273 -25 33 -141 -256 46 -292
5401 -292 -9 -185 35 -304 -220 98 -113 -18 -73 -148 -310 35 -175 -26 -116 -470 63 -437 -288 -270 -293 -103
5423 -103 -288 -104 -271 -15 -227 -344 -57 74 -86 -146 -81 -288 -140 -317 293 -185 -234 -128 -8 -143 -93
5444 -93 -126 -199 112 -32 -110 -164 -62 -32 -155 -68 -46 -229 -58 82 -88 128 -230 303 2 379 116 89 127
5467 127 66 13 173 -99 -38 115 -72 263 -8 30 -158 303 -85 43 288 -53 57 254 119 47 112 52
5489 52 -110 -271 125 -69 -24 133 26 44 -35 -212 350 253 54 17 221 94 36 1 180 65 121 80 -33
5512 -33 -114 212 133 10 116 28 -143 -231 12 -110 52 120 39 118 -258 -238 -49 -100 125 -49 1 246 -103 129
5536 129 -41 -23 150 180 173 345 74 -118 -254 -166 -176 -1 -55 -138 150 237 107 -192 -13 110 29 103 -37 -333
5560 -333 85 -41 -184 -66 229 176 -135 214 56 -39 -199 19 -13 -141 -152 162 61 -167 74 -62 -6 -172
5582 -172 366 -209 153 -52 -376 18 -221 280 -294 -81 4 -201 -154 -343 -302 -160 35 -110 -60 -78 36 -365
5604 -365 -90 -76 -150 -232 14 310 -352 -170 350 -221 -94 -76 145 -200 -231 63 -233 -102 64 -314 7 -63
5626 -63 128 199 -166 -139 -335 216 129 436 262 109 218 40 144 -52 43 176 -224 -95 -72 -86 7 191 92
5649 92 92 -15 2 -4 -209 -118 -143 31 224 184 -142 -4 -1 17 -15 8 22 -91 117 144 10 -260 320 251 202 -64
5675 -64 171 187 197 -187 -11 -335 258 202 63 22 -112 82 -151 84 165 -28 -78 2 -119 -183 -52 266 -17
5698 -17 92 -211 -40 -2 195 -14 41 -248 -317 -75 148 -46 -122 139 -59 -156 354 -250 20 -253 -118 -221
5720 -221 291 -154 -24 301 -342 24 -49 204 -98 -165 43 -2 -18 -154 -180 -73 -77 146 -216 8 203 95
5742 95 -358 247 96 -248 -377 50 182 -284 -109 63 158 -36 55 -367 166 -158 150 42 -154 91 -390
5763 -390 -166 -177 -53 -309 -310 -190 -15 121 14 -192 -130 5 162 -14 -134 -114 -216 -91 -121 8 186 72
5785 72 -56 169 0 13 149 49 363 470 -190 39 -23 -94 220 82 323 548 290 254 31 -300 104 72
5807 72 10 33 213 121 -279 70 133 54 22 344 -7 -77 142 37 329 -21 -200 216 63 -267 70 -186 45
5830 45 319 179 -280 -143 13 -155 106 -6 22 -147 82 -116 180 -80 -131 -270 52 226 -279 -124 332
5851 332 21 237 -270 -127 164 -257 -275 -57 -247 -284 406 54 45 104 29 43 -120 126 -205 -102 -112 124 -121
5874 -121 -95 -61 -1 -138 -401 121 285 30 -227 -278 7 72 149 9 30 -199 -167 150 -32 209 -6 -118 143
5897 143 32 -100 328 4 -37 53 -15 327 149 -225 48 122 -176 56 -301 -65 -74 7 -71 -252 -145 -304 239
5920 239 151 106 -415 1 -204 -427 -198 85 1 -444 29 -420 -41 130 296 -27 -353 165 67 -130 -431
5941 -431 176 66 -46 -130 -48 67 -225 -210 -329 -195 61 136 -345 -74 281 50 -147 -209 -85 -259 -263 -96
5963 -96 -240 -29 -13 40 -290 -59 -29 -187 -33 71 -204 -178 -129 156 -151 5 172 -64 145 96 -167 74
5985 74 14 135 -227 77 -26 -59 97 -216 67 36 -181 -83 207 -181 -266 36 -48 -240 -81 346 -10 36 -10
6008 -10 260 -37 -134 -186 128 -143 348 44 -112 36 -7 5 -209 185 232 272 -256 -228 -125 -210 178 -46 211
6031 211 -161 -296 151 165 -49 154 -177 -358 -40 -30 -177 -113 -102 -40 4 -47 -10 130 261 222 237 114 -218
6054 -218 -435 4 -29 180 -43 -162 -393 -226 238 -159 -84 27 -240 -231 -110 -315 202 87 -76 -405 -53
6075 -53 -77 -29 203 -9 -485 -143 -177 -17 -116 19 -9 52 178 12 21 -370 37 -55 -382 -20 60 -99 23 -112
6099 -112 -36 243 166 24 -5 -120 7 92 34 121 -355 5 -213 -105 -180 -73 190 174 60 250 74 172 360
6122 360 -138 6 59 -243 69 -64 52 -78 27 2 -157 -120 -142 -86 -32 -255 -50 101 55 -126 -78 48 45
6145 45 -128 -101 207 -12 13 250 -31 34 70 13 316 -215 68 227 -9 -85 -115 327 180 -43 157 88 -24
6168 -24 187 -157 -187 -62 116 301 14 5 119 219 111 103 -460 64 196 -40 178 128 106 127 -62 -287 93
6191 93 -111 -180 71 199 160 91 111 -243 9 33 11 -91 109 -106 57 136 -53 -25 129 -265 -38 5 207
6214 207 110 -17 33 -1 -253 262 120 255 30 24 -258 14 51 22 166 37 -58 -12 -28 -131 -104 71 170 196
6238 196 -186 109 16 -19 -21 -15 -188 223 -148 -25 -239 -271 -28 104 -326 -400 -139 -124 74 167 47 -116 91
6261 91 74 27 114 156 75 181 165 172 70 -94 441 -334 -115 57 -290 -147 158 68 67 274 171 -134 50 -260
6285 -260 -110 -166 -72 129 179 -116 72 126 139 7 103 59 144 34 208 125 10 315 -113 250 139 -175 62
6308 62 -139 25 -21 2 -230 -95 -69 71 -42 -202 221 352 138 408 306 90 9 202 157 282 178 -3
6330 -3 218 85 215 404 -45 -29 40 -21 -258 -59 500 -158 -117 -3 121 -79 -107 51 -115 -67 115 20 -160
6353 -160 257 205 34 160 38 -151 -85 277 24 -22 -115 -114 -37 -78 4 -4 8 -334 -387 -191 16 -40 41 -72 -137
6378 -137 -235 -83 40 77 -103 37 -36 119 237 26 -137 93 16 -81 -147 -43 -58 229 -60 1 117 46 304
6401 304 285 -164 10 -145 33 137 -110 130 0 -2 67 -36 -109 14 -329 189 321 -34 -102 306 176 141
6423 141 -38 -140 -61 204 -11 -190 -25 -146 244 -65 -83 91 -270 149 150 -120 48 -59 -64 -182 -128 18
6445 18 74 12 34 18 -121 370 104 34 37 13 -204 52 319 -190 239 -39 -49 -232 117 -25 -301 -53 36 252
6469 252 100 201 431 45 104 -62 -40 178 96 -225 260 -182 -253 -243 187 243 -240 61 -86 95 224 179
6491 179 -49 176 -147 -38 -45 -228 59 -16 -46 15 159 -135 -103 -166 63 125 278 86 164 421 199 195 -76 73
6515 73 185 -207 40 424 -79 291 175 103 -89 247 -207 45 -190 -177 -80 371 29 141 295 179 -286
6536 -286 -125 -10 -71 199 -271 -50 176 -119 73 -177 -339 15 58 83 112 170 226 -127 -139 42 77 54 86
6559 86 98 -206 -139 141 -209 -117 9 -142 256 11 -198 257 100 127 32 -180 -57 -25 -12 -11 208 -321 -50
6582 -50 35 -64 226 69 -162 -243 -266 -191 -7 386 52 77 -56 65 -30 -124 -181 2 -62 -161 29 -207 -131 -198 -147
6607 -147 -109 59 -19 -501 -311 297 119 17 -262 83 19 -15 -75 61 78 -218 -170 173 -98 -56 93 -55 111
6630 111 282 45 -178 -3 180 -58 36 -303 -37 -400 -116 82 -20 63 -49 62 -125 235 -68 -11 187
6651 187 264 49 -42 24 -36 32 240 3 -251 189 -48 -187 20 -324 -127 100 -370 18 -155 25 -172 247
6673 247 -45 -85 -15 -74 162 13 28 -60 -196 -1 16 -105 175 58 -42 -84 -234 198 -198 -107 244 273 -182
6696 -182 -12 -60 31 125 -124 211 -202 -17 -198 126 24 -146 -278 -21 177 136 -29 -418 182 -33 9 -398
6718 -398 26 -214 -3 158 -117 -217 -278 -83 79 61 -10 145 -141 -64 -183 78 344 -257 -147 -63 100 -182
6740 -182 151 -200 -310 4 -79 -57 -7 -173 179 -134 -57 -84 -96 -121 106 70 -138 91 38 -178 190 -363 -139
6763 -139 -201 166 -105 -93 66 -194 -186 -423 -228 -130 218 -148 100 -116 -28 6 -118 -387 -271 -134 78 93 116
6786 116 -164 29 -125 39 8 -17 -360 23 -98 -387 -17 -393 -51 -116 14 -25 -67 -364 -175 97 253 48
6808 48 -169 -191 -224 17 238 -157 -257 -237 -41 363 -178 -78 72 -364 96 -204 -112 -222 219 -71 24 230
6830 230 -26 181 16 241 112 296 -393 -448 -34 230 29 21 65 224 -152 22 -52 272 187 426 -144 2
6852 2 -5 -77 131 -175 77 -165 101 16 45 191 337 -49 -86 -253 237 -354 299 99 -10 -61 -114 -4 -60 118
6876 118 -97 -100 194 -88 -65 302 -206 4 86 -169 40 219 48 198 183 -105 -36 221 -143 175 -43 350
6898 350 -109 83 -245 172 -271 -126 -111 183 -80 -135 137 156 84 -166 57 -131 -131 -139 155 63 -63 261 -144
6921 -144 -73 117 75 17 -28 -35 -47 287 -90 47 56 -53 255 384 152 180 -28 10 -139 -224 -513 -90 126 244
6945 244 -107 -28 139 -187 11 226 165 -74 281 60 40 -138 -280 -28 -25 -224 -113 76 104 108 63 12 -9 191
6969 191 -45 -133 183 126 132 213 -132 43 93 22 44 -49 25 139 -117 54 263 71 79 -54 156 54 -289 104
6993 104 404 -158 422 140 180 87 -1 -46 266 -85 -138 85 -90 -59 -74 -202 193 -34 118 247 103 -79
7015 -79 -99 199 18 -1 -391 -106 83 150 80 253 120 20 31 192 448 -92 -116 -324 159 82 46 299 -7
7038 -7 -192 -9 -34 -81 202 -180 462 364 -71 146 103 -240 -221 144 -160 120 95 -60 169 -119 150 145 175 -56
7062 -56 -14 -49 -37 135 361 47 51 199 172 85 68 271 108 -233 0 30 -4 37 235 56 29 88 428 -39 125
7087 125 163 -84 110 -135 -62 -14 -257 379 -58 -155 -183 20 149 69 110 -36 235 -105 -244 -417 -12 -314
7109 -314 150 164 -43 148 122 -42 86 -140 -104 339 -52 -177 -205 -124 43 348 -38 55 15 -49 48 -84 27
7132 27 -69 -221 -23 -10 -139 226 -69 54 217 -116 -156 -291 -222 -352 -74 121 -219 -146 -153 -147 -158 -21 -103 -128
7156 -128 192 43 -149 -216 159 20 60 -266 -100 398 -40 -212 87 96 21 -130 75 79 -60 102 53 -144 -21
7179 -21 160 136 178 170 42 74 -213 92 -55 190 -65 -207 -10 -157 -29 -17 400 -39 80 -172 79 -461
7201 -461 166 183 186 274 152 130 -283 -68 17 -12 -52 139 40 7 -6 -63 116 491 238 -221 24 -11 344 168
7225 168 61 -39 -88 134 154 404 -227 -342 -241 31 -44 66 -80 115 62 63 34 85 -141 147 -104 -69 -6
7248 -6 -167 293 -70 -57 83 -74 1 253 3 79 -97 -159 206 -190 127 76 -110 100 -70 18 200 56 -103
7271 -103 99 -154 -121 -267 14 98 -42 -247 215 -57 136 15 139 115 360 7 110 119 52 503 243 32
7293 32 182 -11 -69 -44 -23 -51 525 152 35 88 -139 -15 111 259 166 10 137 91 51 281 40 74 -24 14
7317 14 -10 -232 12 -188 -65 82 212 -273 -210 79 138 77 -103 68 54 -17 -36 112 -327 -179 159 41 367
7340 367 -49 -164 -260 236 211 -267 -180 -269 -94 19 165 -38 200 70 -244 216 45 57 12 -46 133 -21
7362 -21 -51 -115 -72 152 -29 -59 -48 30 16 -85 135 -197 -240 -96 -148 -68 33 -13 -254 -5 -148 10 -223 -122
7386 -122 532 -123 -57 -74 168 208 -11 -380 -236 174 10 242 -129 24 58 60 227 98 52 -27 -158 -90 -126
7409 -126 287 -178 -187 -285 -66 -148 73 67 59 460 -3 86 -165 -47 642 -325 -109 65 -101 89 46 48 -165 257
7433 257 56 -248 316 -69 -233 55 83 69 -99 -297 -283 11 -131 -155 128 33 19 -153 -107 45 -100 -8 20
7456 20 24 -221 -98 -193 -269 -80 31 -165 -239 339 140 -90 347 -186 -227 10 -309 -315 1 32 -80 -75 -55 -324
7480 -324 -289 -145 20 -106 0 -268 -309 -227 21 127 -82 86 142 -152 -159 -1 -94 148 -391 -168 -53 -388
7502 -388 -12 -272 -1 71 -163 -13 -150 362 -281 38 -163 -111 -212 -2 84 5 104 -42 -118 -101 67 -72
7524 -72 -14 -68 -24 98 -146 269 96 159 101 220 34 -8 113 -24 -334 44 -24 174 221 286 93 -105 -36 120
7548 120 -43 76 -36 324 180 21 -185 45 -197 485 -43 125 68 -238 -193 -66 272 -8 117 80 4
7569 4 -75 -170 208 469 185 435 -355 -109 262 -105 367 156 179 39 -84 22 104 40 169 -228 36 185
7591 185 -176 98 12 -13 -30 49 -180 25 40 -64 -202 118 191 84 -79 -191 165 -263 -185 -39 262 155
7613 155 42 -22 -251 -327 -285 -142 175 -155 -132 21 99 -78 -103 -303 228 -92 16 -138 -9 -76 -106 22 -247
7636 -247 105 0 7 -134 -208 76 -145 -116 -258 -250 -232 -4 140 -63 -67 -21 34 -128 92 100 -213 151 108 54 -85
7661 -85 14 15 116 210 255 46 249 -325 76 -179 -76 -88 -276 -181 -172 142 -340 -53 179 -135 155 53 -124
7684 -124 243 126 132 201 10 35 7 67 4 146 16 180 109 -27 -124 -143 209 -68 11 129 -109 -76 -191 83
7708 83 -90 -58 -44 111 322 -65 -260 131 195 -8 -18 338 66 103 -395 -364 -80 17 -41 75 -111 185 176 108
7732 108 19 75 -331 -103 189 -291 -150 273 -1 -24 -48 137 12 -268 294 61 133 -260 210 180 27 -265
7754 -265 43 190 128 -102 230 167 -101 105 193 412 -12 98 61 -133 103 97 119 -170 -39 -107 338 -211 1
7777 1 -206 13 178 20 -175 431 -6 -170 -97 37 56 68 130 -145 81 -102 0 -136 101 -98 -304 -313 -89
7800 -89 205 139 20 68 -224 -163 -259 -4 190 12 95 21 69 12 77 132 -202 106 362 199 29 222 7 112
7824 112 115 -28 -218 -8 -176 -122 135 -246 145 -111 -4 123 -20 -113 -144 -21 -36 -85 105 71 -151 -4 76
7847 76 -149 230 10 397 -222 237 -319 39 194 -193 136 278 -98 -220 -23 -85 39 -62 411 364 -93
7868 -93 -177 71 288 -42 134 87 -314 185 110 -144 4 5 -108 -39 132 -240 -205 -362 -171 -83 199 228 37
7891 37 -90 -79 146 -53 231 -27 504 195 359 39 -322 -99 -16 27 69 14 54 -61 75 172 37 45 -56
7914 -56 343 154 -29 150 201 9 24 52 85 256 230 -43 48 -28 13 10 36 234 51 27 111 116 39 190 49 -154
7940 -154 57 399 235 -9 61 299 -181 -1 238 96 332 39 151 -5 -136 -24 8 -83 -109 -178 242 50
7962 50 64 -194 128 -53 -43 -6 81 -41 -54 103 -219 -177 -11 46 192 111 174 265 -139 78 16 108 -86 -97 -33
7987 -33 115 242 193 -10 402 -121 -151 13 -264 203 -241 83 -67 -142 38 -15 38 -295 -220 103 -56 -491
8009 -491 319 185 -76 144 -97 -119 30 -244 -329 7 -223 -39 193 -159 72 -86 -153 -5 -16 206 -67
8030 -67 77 248 -123 -29 -158 -16 383 -43 -269 266 155 -174 -54 -4 -128 196 -88 -100 -188 -73 -172 422
8052 422 116 88 -18 40 29 -33 47 88 -10 95 115 100 134 -235 155 -93 -41 -233 80 201 -280 248 144 64
8076 64 29 -206 -34 -177 -145 -24 83 -187 -272 -76 -163 277 -72 72 60 60 57 -98 115 -77 -5 264 175 -12
8100 -12 2 -128 213 -303 -125 44 21 -12 30 200 -34 -145 15 -327 170 -125 -84 115 219 152 -29 187
8122 187 -38 290 225 38 -99 155 -264 -95 -47 -51 103 13 26 157 -260 -169 43 -244 15 -310 158 115 -110
8145 -110 193 26 145 -235 -118 -93 166 376 -82 -434 -109 198 344 -15 136 16 336 -59 156 -10
8165 -10 55 150 -275 -28 78 -57 281 34 -177 79 311 111 15 43 -130 -4 -337 85 -187 95 17 319
8187 319 114 20 181 158
8191A58
$$ Imaginary data points
##PAGE= N=2
##DATA TABLE= (X++(I..I)), XYDATA
0 0 0 0 0 0 0 0 0 0 0 0 0 0 -8 8 -8 8 -8 10 -16 16 -18 24 -25 30 -34 40 -44 50 -58 65 -73 81 -93 103 -115
35 -115 128 -141 156 -175 195 -216 238 -264 293 -324 359 -398 445 -498 560 -633 720 -830 964
54 964 -1148 1401 -1776 2392 -3592 6802 -32983 -98860 -53821 -19587 -32610 -69242 -60940 -38179
68 -38179 -40821 -63824 -65016 -54287 -54223 -66139 -66888 -60983 -58499 -60951 -60540 -63838 -68592 -66199 -57740
83 -57740 -58369 -67727 -69469 -58087 -53898 -63415 -70192 -61627 -51896 -55006 -60786 -54873 -45709 -48556 -57417
98 -57417 -54408 -43221 -42603 -51039 -48386 -34194 -27491 -35622 -40846 -32568 -24140 -25127 -27655 -24184 -20059
113 -20059 -19456 -14840 -7591 -6207 -9977 -7941 63 3308 1891 5085 9880 7902 5103 13364 24955
128 24955 25026 17170 18505 28663 32228 27993 27871 34595 36531 34047 35355 42344 45937 42875 41123
143 41123 44334 46845 47668 48370 49282 49297 49691 51399 52364 51395 51174 53932 56443 54832 51562 52216 55245
160 55245 55204 51619 50566 53186 54989 54031 52630 53295 52095 48665 47475 49909 51000 47761 45387 46574
176 46574 47648 45917 43976 43516 41973 39024 38772 42098 41981 37316 34898 35829 34969 31477 30881 34308
192 34308 32994 27000 25662 29822 31076 25220 21024 23459 24853 21303 19390 22067 22939 19228 15689
207 15689 16680 18193 16612 15540 15885 15257 12795 12745 14223 14476 11699 10079 11620 13030 11705 10487
223 10487 12118 12435 8967 6754 9489 12706 10698 7848 8873 11833 11469 8760 8921 10639 9860 7371
239 7371 8327 11539 11609 9620 8709 10456 11299 10240 10450 11655 10651 8595 9675 12084 12068 10242 10430
256 10430 12249 11762 10233 11463 13849 12758 9609 9332 12010 12532 11143 11154 12897 12826 11550 11924 13089
273 13089 12592 10588 9626 11073 11924 11638 11691 12238 11804 10731 11225 11487 11157 9777 9243 9845 9862 9446 10367
292 10367 10597 9897 8412 8020 9523 9345 7608 6544 7246 7156 6413 6442 7470 7509 6389 5308 5896 5837 4758
311 4758 3746 3612 3294 2701 3710 4743 4582 2561 1636 2500 2287 1103 457 996 698 -610 -138 1585
329 1585 1488 -362 -1041 -485 -37 -1332 -2204 -1437 -1333 -2801 -2817 -694 -328 -1343 -2614 -2285 -1776 -2704 -2938
348 -2938 -2318 -2298 -2902 -2994 -1581 -1250 -1458 -1965 -1454 -1792 -2463 -2468 -903 -979 -2109 -2506 -1238 385 283 -180
368 -180 227 766 -168 -798 146 1225 896 600 1317 2324 2844 2845 3261 2885 2251 1589 2854 4386 4637 3736
388 3736 4041 5335 5135 5145 5152 6058 5033 4912 5639 6863 7219 6111 6107 6572 6498 6763 7546 8416 7567 6864 6332
409 6332 7399 7521 6841 7059 7166 7577 7455 7781 8026 7457 5884 5778 6615 6815 6925 6816 7143 6540 5641
428 5641 5592 6026 6117 4439 4050 4612 5267 5223 4447 4281 3615 2621 2802 3565 3632 2645 2306 1882 1882 1378 1168 1511
450 1511 1235 302 -169 774 901 -189 -713 -728 -800 -1201 -1292 -546 -832 -1716 -2576 -2319 -1706 -1913 -2486 -2250 -2098
471 -2098 -2835 -2778 -2057 -1726 -2422 -3330 -3220 -2790 -2648 -2338 -1925 -2310 -2929 -2693 -2016 -1795 -2047 -2329 -2145 -1442
491 -1442 -1877 -1450 -360 -194 -1094 -1528 -645 663 209 -259 -368 319 759 943 1410 2051 1606 1041 1533
510 1533 2427 3038 2628 2913 3269 3143 3436 4329 4975 4545 3519 4128 5424 6023 5284 5433 6281 5553 5073
529 5073 6248 7482 7450 6855 6397 6958 7105 6955 7256 7411 7239 6499 7080 8523 8268 7896 6893 6969 6775
548 6775 6269 6696 7586 6935 6571 6173 6653 6665 5603 5019 5247 4660 4373 4590 4540 4684 3109 2176 3014 2767
568 2767 1554 1549 1308 1072 -57 -913 -814 -821 -2165 -3206 -2722 -2077 -2823 -4070 -4287 -5119 -6694 -7262 -6831 -6469
588 -6469 -7235 -8809 -8658 -8702 -9584 -10232 -10709 -11389 -12587 -13692 -13032 -12384 -12899 -14370 -15048 -15376 -15932 -16251 -15915
607 -15915 -16018 -17211 -18042 -18100 -17658 -17748 -18359 -18956 -18654 -18984 -19128 -19320 -19294 -19810 -20249 -20191 -20129 -19365 -19416 -19787 -19459
628 -19459 -19420 -19258 -19313 -18896 -18850 -19352 -18979 -18432 -17696 -17542 -17012 -16556 -16846 -16932 -16336 -15748 -15299 -14965 -15034 -14310 -13579
649 -13579 -13454 -12146 -11720 -12004 -12124 -11508 -10304 -9781 -9572 -9042 -9069 -8922 -7902 -6842 -6295 -6088 -6637 -5873 -5376
668 -5376 -4761 -4235 -3655 -3285 -3631 -3310 -2315 -1364 -1192 -1643 -848 -360 -378 -133 416 681 142 169 824 1902
688 1902 1697 1252 1508 1505 1556 817 1276 2283 1947 970 1438 2363 2462 1500 1229 1202 1115 864 1198 2006 868
709 868 65 -64 762 621 -340 -294 -49 -133 -1189 -1008 -277 -513 -1797 -2750 -1944 -1694 -2506 -2768 -2444 -2454 -3609
730 -3609 -3998 -3387 -3001 -3720 -4440 -4344 -3677 -4790 -5045 -4369 -4405 -5711 -6247 -5546 -4223 -4682 -5547 -5703 -5501 -5753
750 -5753 -5808 -5332 -5067 -5539 -5922 -5737 -4559 -4628 -5420 -5489 -5514 -5728 -5494 -4757 -4189 -4672 -5030 -5076 -4413 -3776 -4212
771 -4212 -4740 -4184 -3984 -3923 -3616 -3286 -3226 -3791 -3928 -3155 -2935 -2917 -2843 -3143 -2815 -2766 -2805 -2542 -2462 -2354 -2410 -2265 -1674
794 -1674 -1937 -1781 -1608 -1844 -2373 -1901 -1381 -1008 -980 -847 -1147 -1424 -1479 -864 -530 -780 -1042 -906 -815 -426 -218
815 -218 -149 -322 -646 -927 -132 300 -176 -314 -424 -404 -190 425 917 532 -369 -340 549 971 562 371 423 751
837 751 741 1507 1586 1783 1350 1001 1630 2146 2346 1747 1726 2260 2544 2397 2984 3588 3371 3013 2818 3584 3834
858 3834 3784 3707 3972 4359 4562 4637 5364 5640 4805 5104 5338 5525 5514 6068 6175 6375 5627 6055 6997 6913 6518 6350
880 6350 6638 7175 6985 7367 7577 7982 7252 6800 6959 7802 8006 7468 7392 7357 7579 7418 7506 7616 7321 6588 7123
901 7123 7921 7553 7292 6974 6449 6334 6393 6613 6993 6600 5868 5786 6226 6201 5479 5346 4977 4864 4980 5242 5688
922 5688 4802 4065 3429 4132 3995 3160 3524 3582 3203 2898 2315 2648 2615 2232 1811 1694 1190 1604 1516 1057 581
943 581 219 576 603 516 191 -69 64 -96 -760 -574 -358 -635 -949 -1222 -532 -675 -1002 -1297 -998 -1421 -1641
964 -1641 -1332 -723 -887 -1529 -1687 -1737 -1164 -1449 -1122 -1400 -1560 -1295 -1050 -835 -1022 -1177 -1273 -1209 -1035 -858 -290
985 -290 -598 -668 -1040 -890 -604 -177 -521 -494 -339 -339 -13 587 378 187 28 -4 598 909 1031 1132 1260 669
1007 669 799 814 1518 1615 947 1123 1633 1550 1816 1618 1672 1642 1703 1643 2087 2641 1891 1699 1897 2099 1873 2172
1029 2172 2541 2203 1843 1817 2099 2277 2258 1959 1916 2616 2244 2253 2291 2476 1903 1764 2033 2656 2545 2138 2160 2097
1051 2097 1964 2078 2191 2351 1933 1516 1502 2010 1812 1930 1780 1617 1041 1463 1623 1955 1866 1598 1086 1014 1377
1072 1377 1451 1601 1324 1086 1085 1037 1432 810 856 827 785 749 1110 1486 1256 902 501 911 1007 961 844 1047 1027
1095 1027 1027 1062 1125 1148 516 567 524 945 966 906 873 768 805 837 792 484 613 729 848 1196 843 893 860 911 415
1120 415 927 961 1351 1186 1024 885 845 1119 699 952 945 706 656 932 999 1323 835 648 741 636 600 893 1090
1143 1090 913 455 471 400 381 771 340 527 737 258 708 724 567 -59 -30 310 602 380 617 248 74
1164 74 172 321 617 484 -496 -144 2 -23 53 284 1 -187 -370 -213 236 183 -207 -62 -164 146 -193 207
1186 207 310 -189 -641 -72 263 3 439 -75 -77 21 -204 111 580 424 -94 -87 137 527 293 494 187 335
1208 335 305 500 250 493 477 364 486 636 855 616 665 696 401 873 923 788 532 361 671 439 730 654
1230 654 889 1325 1053 556 699 1404 945 560 1210 1013 821 698 1101 1243 933 535 757 1040 1329 935
1250 935 1005 1002 976 902 952 1166 923 653 686 917 921 966 955 355 522 532 771 729 778 485 312 292 449 565 600
1275 600 122 24 2 300 426 476 287 163 -13 -29 157 429 102 121 132 -153 -240 37 129 65 -273 -298 -75
1298 -75 -164 -72 -501 -126 -505 -282 -491 -441 -665 -448 -524 -713 -435 -465 -933 -831 -1036 -779 -965 -605 -858 -1021
1320 -1021 -1508 -1192 -1065 -1312 -1217 -1351 -1294 -1483 -1393 -1683 -1458 -1460 -1728 -1718 -1577 -1654 -1681 -1772 -1843 -1711 -1975 -2197 -1774
1343 -1774 -1757 -2105 -2272 -2421 -2436 -2216 -2176 -2466 -2552 -2412 -2536 -2614 -2370 -2221 -2414 -2683 -2686 -2766 -2496 -2342 -2668 -2727 -3097
1366 -3097 -2883 -2567 -2533 -1965 -2802 -2751 -2924 -2539 -2238 -2449 -2307 -2660 -2565 -2432 -2050 -2262 -2154 -2017 -2048 -1832 -1764
1387 -1764 -1645 -1330 -1341 -1584 -1376 -1357 -868 -695 -1082 -817 -552 -690 -442 -404 -39 -502 -163 -43 -78 138 192
1408 192 613 301 376 503 805 687 995 1227 993 1275 1558 1562 1346 1151 1033 1369 1682 1707 1535 1569 1582 1618
1430 1618 1753 1886 1636 1610 1275 1239 1419 1472 1849 1424 1310 1347 1314 1624 1482 1463 731 489 952 898 832 745 516
1453 516 712 304 92 334 -86 -16 -280 -420 -424 -383 -186 -627 -1045 -1020 -1083 -1067 -1089 -1386 -1349 -1888 -1867 -1484 -1824
1476 -1824 -2087 -2138 -2660 -2427 -2223 -2706 -2371 -2454 -2812 -3324 -2982 -2894 -2703 -2799 -3335 -3228 -3275 -3105 -3162 -3160 -3172 -3504 -3129
1499 -3129 -3236 -3261 -2870 -2958 -3109 -3001 -3100 -2894 -2668 -2930 -2871 -2944 -2970 -2617 -2357 -2418 -2416 -2549 -2106 -2136 -2070 -2030 -1749 -1679
1523 -1679 -1900 -1730 -1152 -1250 -1327 -1304 -1052 -910 -711 -719 -447 -801 -900 -614 -338 -3 -71 37 18 33 -5 276 738
1546 738 667 508 329 713 779 975 892 638 1062 840 996 1169 993 1127 967 1102 1104 1293 1195 1057 984 1017 782
1569 782 1102 1371 1117 971 854 527 682 703 1068 641 811 611 814 867 448 416 393 266 377 707 446
1590 446 198 304 10 59 389 258 41 216 -62 9 -128 -255 54 -260 -904 -529 -418 -348 -426 -588 -666 -547
1612 -547 -777 -472 -536 -758 -611 -672 -446 -304 -514 -857 -324 -988 -830 -543 -319 -714 -407 -718 -518 -336 -479
1633 -479 -376 -539 -671 -664 -480 -695 -610 -212 -211 -238 -282 -151 -252 -367 -196 -556 -227 -297 -258 -18 -218 -476 -99
1656 -99 -214 303 -41 -8 -460 -212 -84 28 260 -89 -137 -86 -256 -213 -293 187 -221 -411 -157 -254 -315 -171 -79
1679 -79 -305 -428 -378 51 -68 6 -355 -400 -357 -406 -425 -9 -655 -880 -528 -485 -256 -510 -611 -610 -753 -746 -713 -512
1703 -512 -507 -976 -927 -550 -654 -894 -1001 -827 -935 -1098 -857 -568 -776 -437 -636 -899 -569 -937 -811 -883 -1128
1724 -1128 -999 -630 -587 -667 -702 -506 -764 -831 -622 -529 -218 -459 -795 -772 -538 -416 -297 -718 -304 -398 -203 -158
1746 -158 -23 -193 -216 -199 -557 -330 -63 57 -81 153 -136 283 262 650 453 31 499 314 799 717 750 774
1768 774 524 642 435 814 733 954 818 759 931 814 922 744 618 768 1309 1048 1087 1192 821 790 989
1789 989 1269 1449 1051 1261 1294 767 1235 817 1221 1152 1277 1037 852 1138 1138 911 944 1051 696 1170 1023 716
1811 716 862 772 833 829 894 708 723 260 570 611 679 1098 705 212 433 384 648 330 296 346 189 -33 382 106
1835 106 65 200 77 -1 59 56 10 -297 -377 -115 -93 -226 -225 -476 -448 -519 -867 -391 -223 -649 -383 -602 -753 -584
1859 -584 -515 -454 -801 -920 -684 -646 -863 -853 -977 -1238 -761 -828 -1070 -693 -927 -1155 -1326 -846 -1238 -932 -887 -662
1881 -662 -1321 -1218 -913 -812 -770 -1078 -940 -756 -935 -1069 -546 -623 -1013 -843 -730 -618 -626 -532 -478 -660 -820 -429
1903 -429 -347 -473 -537 -576 -666 -370 -63 -38 -153 -134 -525 -10 83 21 58 245 356 318 609 630 460 945 680 610
1927 610 939 721 792 869 926 1157 1139 1443 1186 1297 1151 1225 1155 1383 1520 1622 1711 1412 1806 1738 1640 1831 1846
1950 1846 1832 1806 2118 2034 2027 2213 1544 2194 1778 2122 2240 1805 1959 2030 2055 1676 2003 2245 2058 1610 1712 1882
1972 1882 1888 1869 1914 2049 1476 1421 1824 1863 1225 1416 1343 1489 1553 1463 1170 1199 1219 1193 1007 846 906 864 427 668
1996 668 926 818 231 292 410 490 227 161 20 -20 -70 -92 -106 -69 -329 317 96 -154 -485 -83 19 -543 -108
2019 -108 -589 -608 -602 -413 -592 -509 -455 -535 -772 -371 -469 -655 -417 -348 -618 -727 -559 -363 -100 -475 -503 -674 -379
2042 -379 -106 -342 -36 -293 -309 -234 -204 133 -365 -194 36 231 180 288 65 310 329 354 486 620 550 519 474
2065 474 755 933 977 1048 911 1116 1211 838 1182 1372 926 1125 1251 1482 1191 1509 1308 1263 1531 1774 1520
2086 1520 1649 1608 1594 1478 1414 1518 1504 1442 1672 1437 1329 1286 1551 1241 1582 1391 1290 1472 1336 1220 928 1257
2108 1257 961 698 711 1024 507 473 560 658 895 716 703 386 319 100 170 251 283 529 134 -138 -15 -369 -219
2131 -219 -647 -266 -802 -816 -372 -563 -529 -768 -1003 -988 -1001 -1107 -969 -1429 -1441 -1346 -1088 -1295 -1523 -1404 -1591 -1358
2153 -1358 -1324 -1287 -1081 -1206 -1526 -1442 -1648 -1576 -1087 -1804 -1604 -1589 -1601 -1560 -1275 -1052 -1510 -1542 -1671 -1371 -1309 -1460 -1206
2176 -1206 -1211 -1283 -1294 -1559 -1233 -918 -958 -1379 -1316 -954 -888 -751 -1014 -1049 -893 -932 -712 -622 -519 -857 -919 -626 -793
2199 -793 -138 -151 -428 -42 -712 -733 -248 -152 -324 141 -142 -352 69 -75 86 23 -53 26 252 10 84 215
2221 215 -204 108 167 -112 455 -5 -26 105 237 146 206 210 132 57 441 96 267 119 129 333 -79 342 327
2244 327 164 -65 39 -100 -163 41 112 112 -213 -337 -220 -46 42 46 -45 -137 -517 -224 -147 -150 -213 40 -129 -144 -387
2269 -387 -362 -370 -42 -141 13 -108 419 52 -224 -231 -282 -93 172 325 -36 -118 -5 212 146 384 18 141 87
2292 87 219 481 405 547 -65 540 400 364 816 664 375 829 652 869 723 761 1063 824 1075 1111 1337 1349
2314 1349 1180 940 1079 1100 1197 1327 1356 1291 1297 1124 1594 1095 1371 1320 1173 1250 1499 1492 1346 1511 1121 1209 1510
2337 1510 1568 1359 1637 1241 1269 928 1251 1118 1283 1131 773 1195 990 1107 1063 879 776 857 907 991 665 484
2359 484 476 545 577 759 313 524 244 295 488 19 -56 60 -11 234 -339 -25 -176 -294 -294 -269 -536 -89 -171 -459
2383 -459 -147 -619 -256 -708 -596 -404 -1016 -916 -550 -689 -986 -801 -585 -889 -999 -843 -626 -646 -366 -767
2403 -767 -810 -787 -674 -809 -739 -617 -491 -776 -629 -654 -576 -793 -364 -813 -832 -356 -703 -452 -260 -615 -302 -349
2425 -349 -436 -50 -11 -160 -78 -78 -121 157 -256 -98 2 27 5 484 246 375 430 500 678 709 906 474 732 401
2449 401 399 669 1001 787 664 639 775 857 823 1107 1244 673 816 763 972 931 945 1039 853 974 926 1002 1005 986 748
2474 748 790 819 872 667 1022 996 719 1000 519 830 951 948 814 741 622 358 768 385 508 456 578 458 289
2497 289 291 -129 32 -15 104 229 91 -138 -110 -187 113 -265 -272 -231 -382 -672 -549 -375 -399 -931 -735 -594 -679
2520 -679 -523 -866 -1011 -857 -905 -682 -705 -510 -806 -1527 -988 -1415 -1212 -1199 -848 -1196 -987 -1132 -1172 -900 -1315
2541 -1315 -1231 -1279 -1327 -1193 -1068 -935 -1120 -1393 -1160 -1387 -1405 -1251 -1235 -1238 -1156 -1353 -1445 -1006 -1075 -1118 -1434 -1099 -1021 -1207
2565 -1207 -1100 -1059 -1342 -1123 -899 -1144 -1090 -1268 -919 -1089 -982 -974 -973 -1034 -1204 -962 -1060 -926 -939 -717 -885 -1024 -905
2588 -905 -870 -1011 -669 -759 -1016 -1103 -653 -719 -898 -271 -861 -1008 -883 -731 -552 -374 -904 -350 -329 -825 -549 -440
2610 -440 -594 -397 -767 -673 -536 -235 -445 -738 -563 -318 -70 -253 -465 -594 -464 -455 -532 -66 -431 -476 -526 -403
2632 -403 -375 -222 -333 -109 9 -501 -414 -341 -287 -536 -633 -266 -348 -421 -169 -261 -35 -325 -251 -117 -178 -174 -312 -289
2656 -289 -51 -385 -94 -229 -167 -133 -349 -387 133 -17 12 -353 -298 -293 -59 -171 -324 14 -283 -117 -55 -25 164
2679 164 -357 -132 -274 -207 49 51 135 -143 -143 -49 104 76 65 331 -243 163 -14 152 116 103 138 160 -160 38
2703 38 161 118 50 449 97 217 77 249 247 261 -24 361 197 92 232 -167 73 594 707 87 32 196
2725 196 8 107 293 232 416 223 447 376 253 229 197 240 185 491 -47 354 401 466 307 17 435 60 320
2748 320 302 174 -166 -97 160 245 327 472 241 184 95 -20 254 369 69 53 314 10 26 11 36 44 255 -131
2772 -131 -78 227 -356 -296 266 -274 52 85 136 -113 -233 175 27 109 143 94 300 121 30 130 -223 -144 18
2795 18 -169 -17 296 -53 -131 -31 167 -339 140 127 54 352 -10 -75 126 129 -31 -4 -25 93 -228 -94 69
2818 69 -213 67 63 449 143 339 -98 67 120 -19 -86 311 158 5 42 -110 36 136 173 -62 -317 -252 -114
2841 -114 232 271 -175 -450 51 -321 -400 119 -340 -359 -388 -102 226 42 100 -229 -335 -392 -402 -544 -314 -356 -336
2864 -336 -473 -298 -195 -975 -615 -283 -276 -911 -1097 -450 -501 -599 -779 -865 -790 -852 -642 -940 -822 -873 -606 -672 -827
2887 -827 -865 -977 -542 -752 -901 -849 -826 -579 -854 -578 -771 -902 -685 -814 -567 -462 -637 -626 -249 -636 -521
2908 -521 -656 -356 -267 -270 -497 -442 -436 -492 -78 -153 -121 -428 -217 -105 113 167 47 -314 -16 193 341 167 365
2931 365 58 222 447 509 521 320 472 188 685 750 1006 607 826 653 631 877 889 616 975 1109 687 939
2953 939 895 811 751 1197 959 1108 1055 943 1016 1102 733 1100 800 790 850 857 621 990 1268 981 1072 1040 660 627
2977 627 1160 735 680 942 988 632 847 539 805 747 962 693 626 670 733 685 653 508 390 436 593 420 563
3000 563 529 377 373 274 299 342 147 426 422 846 482 293 341 233 213 205 518 561 97 124 258 199 272 237 147 272
3026 272 388 406 179 383 611 584 227 255 249 332 315 533 499 453 381 467 480 172 623 416 443 513 681 791 580
3051 580 550 774 556 437 942 792 833 564 730 593 971 504 1025 843 760 736 676 708 957 900 971 1283 1209
3074 1209 1044 645 893 1111 924 1092 1032 942 905 934 973 749 1093 898 1049 651 1136 1037 946 834 1047 947
3096 947 879 1000 850 988 841 1078 872 603 767 494 822 945 843 647 702 453 802 746 636 659 618 826
3118 826 817 799 520 527 293 423 505 644 638 571 518 537 -34 633 535 137 261 -136 176 297 292 148 91 222 120
3143 120 241 140 57 112 -113 78 -239 208 -5 37 -543 -290 -186 168 279 -234 -41 -144 -350 -98 -34
3164 -34 -79 -246 -377 -49 -8 -315 -1 -193 -120 -112 -235 -194 -276 71 -47 -61 -13 -128 162 307 155 24 136
3187 136 -254 216 270 -181 67 -79 154 269 -165 57 184 114 48 141 84 98 -83 -14 207 636 495 202
3209 202 90 -9 134 194 134 40 -164 -20 -138 282 151 -60 -85 70 147 -18 57 -43 -13 61 -489 61 -263
3232 -263 -269 -225 -292 -368 -107 -197 -256 -355 -492 -329 -387 -496 -396 -642 -400 -98 -485 -426 -488 -864 -491 -813 -812 -851 -923
3257 -923 -728 -1040 -627 -1095 -603 -597 -771 -934 -1184 -1199 -1107 -1162 -749 -1177 -981 -957 -1138 -1108 -945 -941 -900 -1078 -1085 -1052
3281 -1052 -1313 -1275 -1178 -1046 -1160 -855 -1162 -907 -956 -832 -961 -1154 -904 -651 -887 -987 -839 -1071 -845 -620 -731
3302 -731 -803 -556 -721 -998 -909 -363 -443 -413 -200 -754 -435 -550 -388 -289 -722 -316 -130 -434 -333 -94 -109 -287
3324 -287 -143 -119 -215 -104 136 -216 151 54 169 -66 1 -110 -236 177 265 327 296 48 219 95 72 541 85
3347 85 289 -34 213 181 330 -37 -50 -49 153 144 203 221 -180 431 -109 74 151 109 -280 -362 -301 -39 -367 -162
3371 -162 -270 -7 -83 -258 -191 -433 -269 -315 -348 -473 -285 -683 -338 -678 -883 -633 -989 -765 -779 -904 -682 -883
3393 -883 -609 -1001 -775 -935 -463 -946 -1239 -1062 -842 -937 -1114 -1115 -986 -1166 -1152 -962 -753 -850 -1106 -1374 -819 -1102
3415 -1102 -1108 -1099 -1301 -936 -1476 -1304 -1192 -708 -1412 -950 -979 -888 -926 -1075 -976 -1008 -1067 -1216 -708 -977 -766 -1157 -1074
3438 -1074 -740 -646 -868 -1151 -540 -1003 -742 -843 -746 -600 -524 -867 -557 -623 -566 -370 -526 -405 -209 -323 -309 -295
3460 -295 -395 -76 -46 -113 -44 -153 17 -6 -198 -187 -130 187 395 122 221 103 262 410 13 260 -229 114
3482 114 607 158 554 450 462 72 375 292 680 424 190 472 519 136 402 618 329 229 228 662 252 605
3504 605 426 383 194 202 140 394 441 146 231 20 118 191 361 282 18 47 -37 -287 -2 -24 -65 -219 -271 -173 -166 -124
3530 -124 -380 -626 -318 -297 -366 -356 -401 -462 -619 -397 -600 -953 -561 -486 -788 -511 -863 -819 -625 -950 -881 -743 -582
3553 -582 -650 -599 -715 -970 -686 -424 -1012 -660 -935 -912 -584 -528 -1060 -837 -349 -826 -866 -879 -742 -320 -318 -676 -642
3576 -642 -301 -489 -560 -243 -563 -443 -245 -434 -118 -487 -159 -86 -269 -87 -158 -169 -269 -170 -80 163 -42 338
3598 338 118 206 -9 48 18 318 421 180 480 348 235 195 512 24 384 230 266 326 190 720 373 529
3620 529 478 508 430 562 517 581 750 589 371 378 403 366 369 616 589 553 452 392 570 551 466 430 626 508 525 383
3646 383 664 753 525 829 271 517 400 556 560 305 124 569 441 448 494 373 353 303 461 346 570 675 316
3669 316 336 465 492 404 181 423 400 462 234 469 418 241 565 299 318 575 563 494 347 223 493 335 525
3692 525 466 523 211 267 285 348 140 529 412 520 467 389 792 453 635 318 735 403 731 670 480 303 244
3715 244 657 453 510 318 555 484 450 816 957 801 266 487 793 415 607 599 541 616 247 757 650 778
3737 778 907 723 699 698 703 618 893 349 314 437 410 602 409 468 518 452 778 452 673 394 557 539 543 541 483 700
3763 700 480 382 580 694 774 600 400 535 398 738 655 513 502 501 388 583 340 569 358 568 488 427 420
3786 420 451 819 425 312 316 494 493 324 679 325 462 246 259 609 700 432 229 619 617 145 109 257 262 122
3810 122 93 159 611 463 372 253 412 522 297 490 65 198 333 287 -97 499 413 138 441 455 360 212
3832 212 49 57 213 338 262 218 264 425 174 127 391 283 105 336 334 343 263 396 325 -166 335 287 324 189 427
3857 427 431 348 400 50 150 591 217 237 249 122 513 538 204 127 369 -98 -116 -60 316 269 -43 110 398 1
3881 1 -225 230 -43 73 -63 -117 -61 70 -229 -231 8 116 -17 -167 -79 -230 -283 -210 -462 -80 31 -118 -261
3904 -261 -516 -278 -413 -163 -346 -294 -374 -310 -74 -233 -96 -299 -658 -544 -325 -202 -138 -360 -348 -264 -438 -365
3926 -365 -451 -280 -159 -293 -408 -426 -276 -152 -430 -283 -448 -218 -115 -288 -507 3 -192 -142 -151 -78 -269 -124
3948 -124 -407 -222 -310 -214 -87 -418 -390 19 104 -229 177 120 -50 -1 347 236 -65 -70 -141 228 14 138 -14
3971 -14 345 137 77 26 225 380 306 154 374 193 84 261 -36 306 260 246 257 425 372 -91 491 343 313
3994 313 155 245 290 326 461 219 177 176 285 199 355 360 404 269 269 388 346 237 253 110 178 397 136 174 99 369
4020 369 197 157 389 32 305 24 250 156 278 142 270 64 116 123 206 231 -71 138 56 -201 105 -104 40
4043 40 -192 136 509 119 363 9 27 73 -42 154 -119 -342 81 66 81 126 -34 -267 -162 161 226 36
4065 36 -13 -17 46 -34 -105 -165 103 -237 -164 -342 -397 -369 -494 -293 81 -281 -207 -316 -63 -275 -167 -195 -518 -456 -318
4090 -318 -88 -304 -619 -367 -90 -338 -265 -535 -369 -654 -96 -275 -215 -251 -636 -358 -196 -521 -473 -140 -622
4111 -622 -532 -116 -537 -543 -658 -465 -486 -510 -656 -491 -278 -531 -467 -332 -520 -626 -654 -562 -360 -409 -729 -658 -349
4134 -349 -359 -269 -680 -726 -237 -457 -697 -521 -420 -541 -356 -130 -558 -262 -418 -488 -434 -281 -296 -163 -623 -347
4156 -347 -282 -200 -322 -401 -182 -187 -602 -464 46 -645 -74 -102 -430 -565 -462 -218 -82 -697 -341 -130 -304 -34
4178 -34 -640 -208 35 -400 -201 -14 -358 -162 -83 -460 -191 54 -185 -194 -314 -219 -141 -449 -89 13 -390 -276
4200 -276 80 -343 34 -144 -397 -308 -425 -446 -154 62 -384 -557 -263 -240 -285 -359 -122 -304 13 59 -26 -109 -28
4223 -28 -235 -282 -276 -84 -171 -251 -176 -561 61 -102 -316 -520 -490 -11 -469 -223 -203 -187 -222 -263 -187 -581 -265 -224 -158
4248 -158 -249 -150 -605 -393 -222 -36 -447 -222 -105 -214 -631 -350 -378 -355 -444 -731 -395 -310 -516 -412 -274 -318
4270 -318 -151 -498 -578 -466 -262 -571 -139 -259 -571 -188 -122 -307 -232 -496 -126 -493 -220 81 -384 -302 -320 -380
4292 -380 -405 -407 -287 -82 -428 -451 -476 -288 -303 -242 17 -440 -305 -228 -423 -528 -19 -100 -206 -105 -179 -358 -131
4315 -131 146 13 -197 -260 313 146 -155 62 -11 50 -9 120 46 -27 -89 -34 182 -7 45 -117 300 75 -51
4338 -51 157 98 289 186 -38 68 255 151 488 156 522 230 233 349 -22 418 208 162 211 186 175 135 434
4361 434 -12 261 148 317 327 133 377 350 312 324 339 -56 252 243 212 383 388 373 325 88 100 -112 183 169 494
4386 494 198 129 135 423 257 -38 238 -15 269 219 5 208 -20 244 89 106 -193 25 378 235 253 -198
4408 -198 -179 81 -144 -24 -276 -315 313 -102 -15 -308 172 37 -299 -134 -273 -2 -27 355 -246 239 154 276
4430 276 -46 36 -46 -48 12 75 306 97 68 -204 -245 -112 138 -12 114 350 37 -24 -41 -271 15 219 22
4453 22 -16 -227 168 -129 87 81 135 82 -231 -199 -372 129 60 -84 -198 42 -90 45 99 -40 -145 -83 16 -198
4477 -198 103 345 91 329 116 82 25 167 291 160 146 195 195 12 155 47 -5 425 41 50 71 159 -34 150
4501 150 -2 103 -74 181 63 -100 62 -124 497 214 357 457 108 234 638 270 250 443 459 457 424 259
4523 259 249 284 490 136 -114 68 400 42 180 304 304 203 267 520 608 428 217 581 269 398 296 300 335
4546 335 472 393 755 309 467 572 470 382 -93 315 553 409 745 478 413 192 273 236 161 49 362 328
4568 328 216 475 -71 56 15 248 277 24 73 203 207 212 -128 142 28 -167 57 -16 66 116 201 -138 43 -195
4592 -195 -472 -246 -12 -130 -215 -171 -153 -90 -161 -45 -148 -6 -149 -7 -400 -375 -555 -58 -286 -194 -388 -234
4614 -234 -135 -233 -74 -214 -147 -110 141 -250 -255 107 341 -105 -150 -12 -48 238 95 -82 -392 -341 -54 76 -152
4637 -152 -61 69 -21 -112 164 -311 82 -8 25 11 117 307 -123 -11 128 -65 -16 186 203 -15 105 75 264
4660 264 209 190 155 125 76 128 98 357 144 78 550 183 424 262 265 27 69 11 472 320 310 212 471 331 116
4685 116 277 120 229 179 211 313 160 -75 77 285 418 70 21 409 255 516 72 314 301 156 86 105
4707 105 144 -51 172 68 271 240 76 42 335 122 -388 40 -195 15 -3 118 289 327 189 32 4 56
4729 56 57 77 -158 111 76 48 -117 10 14 -6 85 44 -133 -215 -191 -120 -184 -175 107 20 118 -267 120 -204 -22 18 -55
4756 -55 191 -205 -124 -31 170 -325 -114 -128 -253 -136 -313 -39 -118 -238 -230 -27 -202 17 -66 136 64 -212 -44
4779 -44 -92 -428 24 -114 -89 235 -290 -37 82 -57 171 186 118 -101 -261 60 -170 -181 -43 -134 -154 166 -32
4802 -32 -94 2 -164 -69 -369 -1 -180 180 -41 -152 -26 -246 -13 -219 -101 -429 -191 -211 -441 -219 -385 -54
4824 -54 -182 -147 -224 -167 132 -130 -394 -322 21 -223 -254 -30 26 -401 242 -40 -234 -326 -277 -165 160 -187 -232
4847 -232 30 210 -197 -190 -244 -94 5 -50 156 -164 -466 -311 -107 -550 -235 -287 6 -90 -110 -333 -181 -236 -119
4870 -119 -112 -163 -203 -21 -95 -463 -248 -297 -325 -226 -266 -171 -97 -377 1 -117 -72 -12 -212 -118 -204 60 -529 168 -283
4895 -283 257 -92 -82 -4 79 15 -180 38 46 -57 -64 -98 -13 177 -196 -119 -92 -39 135 -434 30 -462 -42 -316
4919 -316 -107 -234 275 -255 169 -183 -117 274 -132 -253 -323 -168 -200 242 70 211 -260 -426 58 13 -347
4940 -347 -92 -270 -253 117 76 187 -264 44 -145 21 -73 68 -31 -262 16 -9 -41 -458 317 36 3 -139
4962 -139 -115 -439 -75 -35 20 -151 47 -132 154 -109 -30 -401 75 -388 -410 -298 -78 -121 -391 -4 -136 -290
4984 -290 -254 99 -79 -113 -163 -17 -147 -451 -163 -301 -100 -25 -310 -200 -70 95 -288 -212 62 -170 -620 -29
5006 -29 86 -19 -161 -368 -290 -72 -259 -45 -163 -305 -21 -201 -90 -264 58 23 -181 -323 132 -156 -242
5027 -242 -346 -16 -28 -283 -162 -71 93 55 -164 17 33 116 -162 48 -59 -423 -136 -241 -301 -106 -167 185
5049 185 79 17 -181 -130 -62 -105 -80 110 -80 -20 188 119 -202 265 140 -174 2 68 179 -85 -56 138 80
5072 80 29 12 160 39 12 60 74 91 97 155 70 -4 -58 -97 57 -132 -79 52 195 -70 111 139 -31 154 -83
5097 -83 -137 -29 332 50 -162 48 61 -190 59 -355 159 -29 -83 224 -179 165 234 316 -286 -73 270 136
5119 136 70 -155 -71 299 4 201 53 -72 -133 176 268 289 -330 -155 -121 -74 14 -148 -13 222 43 -132 -29
5142 -29 -54 -159 -64 -257 105 -68 -193 -214 81 31 -112 -77 91 -146 -128 -73 -245 16 -259 -78 -8 -264 -54
5165 -54 -325 -146 -82 175 -32 -270 -86 196 -137 182 -180 -122 -187 56 -236 -18 119 -191 -304 -280 122 40
5187 40 -16 64 271 -51 -178 -218 508 -82 108 50 -179 17 -213 94 353 -3 427 364 361 226 -365 70 369
5210 369 254 299 179 -168 339 300 80 353 -243 95 113 257 191 86 179 325 265 100 174 -136 68 28 62
5233 62 113 403 256 232 194 170 246 115 442 199 195 352 229 171 355 316 285 -10 369 136 -160 472 184 -1
5257 -1 80 -32 95 388 90 327 -97 274 153 58 181 387 253 -144 45 -139 6 470 47 239 219 -99
5279 -99 -54 -116 232 -134 12 -76 162 -106 -79 22 100 105 -340 -52 110 226 23 -119 364 73 -261 247 1
5302 1 151 -92 42 -126 158 79 -122 170 226 98 -123 -257 199 38 115 214 175 -61 69 165 -76 -30 334
5325 334 119 305 242 126 61 161 202 296 231 -23 48 181 168 -26 -204 -45 106 43 151 87 -124 80 -17
5348 -17 -90 147 -58 143 117 -170 119 9 73 65 125 26 14 -80 22 85 -32 -158 136 647 -28 113 -107 -38
5372 -38 12 -35 -245 -109 -198 35 225 -245 251 91 -144 45 -270 -147 120 221 16 -44 -1 -57 -5 -230 -218
5395 -218 -240 125 -212 72 -87 30 -111 -235 -104 69 -339 -13 -112 -55 -47 -144 -190 -22 -29 159 -122 162 -28
5418 -28 -112 361 -75 -63 183 -60 303 197 -359 180 183 -112 -73 69 79 27 39 10 78 242 -136 143 36 145
5442 145 51 181 -178 -199 58 -92 -86 238 41 66 -99 220 -83 -72 116 -57 -63 121 -17 191 33 -179 -228
5465 -228 187 220 120 243 -179 84 39 4 149 91 -40 127 -67 13 63 166 232 -4 -54 -33 91 -88 315
5488 315 31 320 -49 -201 251 36 263 15 -20 0 -71 -69 -107 101 -169 -56 141 99 -46 -261 -8 -27 34
5511 34 112 1 -246 -125 -357 177 -369 61 -80 -215 106 -39 -1 -85 -431 -474 -70 -125 105 -84 -34 -123 21
5534 21 -367 -55 -113 -138 -100 -180 226 -144 39 -173 -119 142 -165 171 8 163 -190 -192 -51 231 -4 52 290
5557 290 64 88 -203 358 40 41 -200 -102 -38 -154 -124 -76 335 92 202 -130 60 275 -126 -159 80 -278 110
5580 110 144 -9 371 173 16 -292 143 -19 -67 147 -160 279 -33 37 82 90 11 84 -44 101 148 409 5
5603 5 165 192 -136 30 -48 -21 81 -225 202 282 410 -126 -125 -9 136 34 257 221 308 105 -24 192 78
5626 78 475 338 228 84 122 263 199 242 -186 -72 181 26 92 49 83 206 236 -19 84 54 -177 7 6 -131
5650 -131 158 124 -81 -148 68 138 293 205 -117 241 -269 -136 -131 22 86 18 -49 145 -128 -122 -124 -104 -81 -70 -55 -112
5676 -112 170 -71 109 -60 68 -100 -8 119 84 18 -77 3 9 -59 -24 -144 -256 -333 -61 -14 -124 -55 213 -146
5700 -146 -99 216 -79 -14 90 17 -217 -93 -55 -451 -44 -195 -89 274 -163 -62 88 -207 -158 -213 121 -319
5722 -319 -87 -226 178 -97 -170 -303 -169 131 151 -117 -159 15 214 -300 -61 78 169 -100 -8 -117 -50 -114
5744 -114 -93 129 248 19 -210 -51 -190 83 313 -448 -121 88 46 61 -43 -168 300 -105 -183 290 384 121
5766 121 -54 -24 187 101 51 -130 256 87 78 333 -101 103 49 23 235 342 -91 82 30 118 32 42 -138 153
5790 153 -70 143 193 -109 146 -204 -57 -13 -215 -74 -35 -60 42 76 -206 -141 1 -25 -6 172 8 -51 -35
5813 -35 181 97 -143 -52 102 -8 172 -126 -119 10 103 134 -402 -266 -42 32 91 7 -6 -106 -313 76 158 99
5837 99 -115 33 22 57 -196 -349 -11 67 84 -1 86 223 -166 348 57 -178 -193 112 82 131 210 -154 -174 156
5861 156 20 -181 103 29 -309 -111 -72 -37 6 -110 -261 64 39 172 -2 141 172 -102 -249 -111 295 -31
5883 -31 1 22 -27 -146 116 -106 215 -171 116 89 79 -81 -225 -70 170 -141 -275 219 16 -242 -292 -234 164
5906 164 -188 -38 -143 150 12 -118 -214 241 -4 321 -43 139 -99 283 -2 119 -11 134 28 226
5926 226 -167 10 -213 160 94 -237 -130 176 117 131 125 -160 -147 13 -195 -40 -290 -37 55 23 -106 20 -70
5949 -70 232 96 -229 47 -3 -112 5 51 170 -37 104 90 -48 -96 195 386 -233 -112 -167 -148 -154 103 82
5972 82 21 58 36 158 86 471 199 320 -24 125 255 -37 27 34 21 -24 34 86 342 -253 -97 175 -268 238
5996 238 153 -145 -129 308 73 -277 33 59 256 -2 260 163 -103 -58 6 30 69 185 -290 171 -164 43 -179
6019 -179 -150 221 -263 -143 20 9 -85 -206 -40 -20 -3 34 -165 -89 146 64 325 98 -127 5 -62 333 -218
6042 -218 6 -72 131 -124 219 45 -130 105 -21 53 -33 194 122 300 172 -295 -68 -156 -176 -134 -290 -101
6064 -101 -65 394 -416 164 108 -82 -16 0 37 -23 69 10 -112 -39 -108 192 -210 -79 8 -34 -228 157 -155 -98
6088 -98 -251 -175 180 -100 197 167 46 -215 -43 -115 -213 26 -97 150 95 -38 -64 168 -141 -39 246 -114
6110 -114 152 -59 -87 85 155 158 -112 -202 -22 -42 -253 -64 -120 158 85 69 -144 132 -224 -42 15 54 134 297
6134 297 -47 -45 123 148 -174 14 178 -83 -60 49 -102 7 -26 201 -184 -41 34 -89 -234 155 -213 0
6156 0 62 -45 347 -233 -1 -51 86 20 267 249 95 -121 -38 426 -69 38 -359 12 -121 -34 71 67 -12 -122
6180 -122 5 -104 -160 -220 -187 3 -35 -81 -246 -80 154 150 284 -215 -1 -196 49 -199 39 -195 86 -318
6202 -318 60 -190 -78 -399 -227 -316 -3 1 129 -147 -84 13 -156 10 -113 269 12 77 -43 22 15 86 -54
6225 -54 -3 -107 -124 -116 -282 63 240 -55 -110 32 -8 36 -63 -155 79 -310 7 164 -58 53 -207 -58 -112 293
6249 293 -143 174 281 -120 80 213 -90 -20 -161 -24 132 216 -152 -390 -7 214 137 211 -118 -9 268
6270 268 -285 -80 -42 179 142 159 -162 137 63 39 443 58 76 150 122 67 203 -34 78 -102 -27 11 96 -142
6294 -142 -324 145 108 14 63 114 -91 -27 79 119 109 41 -196 311 -175 316 199 -162 -13 -67 -57 -50 -124 -166 77
6319 77 -39 -115 -182 136 -21 -106 -88 183 -249 -226 125 189 -104 -158 -50 -34 47 96 72 -103 -67 -165 -140 -177 391
6344 391 37 328 -188 -64 66 66 -177 88 102 214 -95 159 -90 52 -301 -38 205 -358 54 147 -50
6365 -50 -392 96 -219 -31 -230 109 279 -51 -357 -54 -55 192 262 -79 -251 123 -7 132 108 -71 -146 31
6387 31 -165 -144 109 91 -160 182 37 74 100 -4 1 -10 197 276 -50 -164 25 32 -163 -52 267 -293 -157 60
6411 60 147 35 204 206 216 80 206 217 42 -11 -81 100 -208 259 -43 -111 -206 -62 158 157 -168 305 120 -23
6435 -23 -82 154 -50 305 22 248 -113 -15 -180 223 281 -49 -179 -12 -38 51 -256 283 387 63 -428 -83
6457 -83 -104 22 -90 -19 -194 -153 79 -46 39 238 -46 310 128 219 -20 -230 55 69 34 114 88 95 389 108
6481 108 -281 -231 77 345 80 -244 275 -19 -29 109 181 -125 78 128 125 -63 -214 -97 -32 226 -248 -190 88
6504 88 -18 40 143 -225 -78 -4 -6 -60 390 -32 172 23 -39 153 136 160 -127 93 296 56 51 -83 34 -159
6528 -159 220 140 -127 -27 -221 4 -89 -152 -73 157 -285 25 285 155 -100 10 403 -110 -8 -93 -235 -10
6550 -10 58 -309 28 50 259 -95 -128 191 298 90 0 -110 -346 128 352 -9 -55 -1 -89 -138 -390 118 140
6573 140 -37 -325 164 -4 -185 326 71 -48 -162 12 -44 -197 -12 104 24 -132 -134 372 50 -93 -3 43
6595 43 175 51 -163 -220 175 220 7 165 -242 -91 149 -225 -213 -249 189 15 138 -127 4 283 64 -109
6617 -109 -26 -77 -26 209 196 290 -99 128 141 -47 93 -216 -29 -195 -5 151 91 58 204 22 -2 1 197 102
6641 102 38 178 127 283 -112 19 77 -113 92 163 -122 59 219 407 -46 196 -306 176 115 -48 -116 130
6663 130 144 -2 183 43 177 20 253 -109 131 126 -25 334 -321 -196 77 58 147 1 -326 52 121 -27
6685 -27 52 -140 38 -62 14 95 -6 -75 -246 -161 -12 -106 143 24 -60 -138 24 15 -172 64 -45 -2 -113 -10
6709 -10 71 106 91 37 52 7 -31 5 -23 -94 50 -266 38 100 -48 -207 -144 69 245 -144 140 -11 247 3
6733 3 -238 189 59 93 -237 224 137 43 193 387 113 44 -177 -238 145 -195 226 107 -131 117 -134 -175 49
6756 49 44 58 37 1 -276 121 297 -295 71 305 -298 65 -138 200 91 103 -13 -247 283 -230 -56 -26 -23
6779 -23 -168 -48 -41 -93 4 -152 182 -219 93 68 132 15 -234 13 -11 -44 31 225 199 -111 41 135 -236 93
6803 93 -145 -91 93 196 -62 133 -65 -105 0 -34 297 -495 -54 473 -76 -42 -327 -112 -203 112 -83 -115
6825 -115 -170 198 99 177 57 76 -27 -234 -557 -260 90 4 -71 250 -140 95 -93 -191 228 -125 -41 -73 345
6848 345 -237 -277 -68 -79 114 9 -127 7 -187 81 368 114 -36 -149 -7 -392 15 247 101 -183 134
6869 134 84 -49 -322 -45 -303 -14 -193 -206 -343 45 -189 14 -85 -90 -204 -214 157 -158 -93 39 -121 -81 -304
6892 -304 -69 -175 -263 -57 -132 7 197 0 15 -59 -58 -153 -164 -44 -376 -133 60 -76 -182 -3 -15 -155 74
6915 74 -111 25 11 -121 -73 -32 322 -561 -265 -135 248 -98 127 -157 -253 -195 56 -66 -235 -49 197 79
6937 79 22 -159 -226 -229 69 -134 -31 -252 178 72 -27 117 22 268 -63 -180 54 31 -189 31 12 11 187 -55
6961 -55 -106 -131 -247 376 -104 162 171 95 265 207 12 145 -68 -70 24 -322 -4 161 249 92 151 111 -380 329
6985 329 -205 -122 189 9 285 -113 -49 -203 152 147 -44 67 219 2 -98 -63 119 106 101 -194 -92 130 -96
7008 -96 214 1 183 84 2 -155 27 -50 276 6 166 -187 -4 -70 -42 224 41 -176 30 -182 91 -29
7030 -29 -408 62 -156 -118 -214 67 -48 -291 -269 217 106 -28 -81 -111 -142 69 -123 -14 308 21 200 34
7052 34 -211 29 -90 188 65 -1 14 -8 17 132 323 -173 243 -17 11 -23 -2 118 -192 -12 240 36 70
7075 70 86 89 -206 -78 -42 -189 -241 -152 68 181 -38 61 126 -316 -82 169 171 -168 75 -130 -108 214 -9 55
7099 55 -273 -109 -25 4 -100 94 -167 37 285 141 14 -299 -73 -2 -61 222 -181 -28 3 191 -333 -122
7121 -122 -232 -7 93 -265 -197 -129 87 150 112 -307 17 85 289 168 125 242 68 64 -78 169 189 -54 -16
7144 -16 263 159 399 16 -166 133 86 -128 213 -42 69 -234 -129 114 131 32 -53 -202 285 -65 230 273
7166 273 39 23 -24 85 41 211 90 108 12 -19 -92 -49 -65 -6 -129 153 227 -16 -212 -69 -87 125 147 -118
7190 -118 -94 -17 109 425 95 250 270 145 -106 238 -10 133 313 9 -244 -36 131 158 56 103 -113 -125
7212 -125 127 -65 204 -40 204 -146 -177 -120 -127 72 120 60 -43 290 10 -16 48 85 243 -79 145 -128 423
7235 423 223 22 -155 1 -88 -23 -14 293 -83 -21 -206 87 -326 -273 -15 7 -37 105 181 -168 78 -4 102
7258 102 205 -20 70 79 69 77 325 9 26 93 -298 -62 89 41 106 194 -292 241 -159 -84 -113 421 86 201
7282 201 -71 36 48 32 168 -179 -125 -266 -223 -277 -71 -352 99 204 322 96 145 86 80 280 -346 -224 -20
7305 -20 55 -322 129 156 -104 -36 279 -12 -75 65 87 -267 15 344 -28 101 -59 559 -47 -509 65 -325
7327 -325 177 228 89 -260 53 -87 -373 -373 -191 104 260 114 -322 37 165 30 -141 146 378 -63 -152
7348 -152 -121 129 182 90 52 155 -89 421 237 58 80 117 12 -64 186 -47 276 22 276 -268 -48 -208
7370 -208 -83 182 214 279 457 192 137 190 -154 93 11 58 528 -199 501 95 149 245 384 153 60 631 207
7393 207 -103 35 499 -141 -40 155 -6 192 184 -68 157 109 -172 -11 23 316 -8 53 -113 98 292 -141
7415 -141 109 154 44 -129 198 -38 26 319 -147 0 75 253 232 -203 76 385 23 5 -55 208 84 92 -40
7438 -40 -123 -20 -100 86 -62 21 -42 -80 -65 -114 28 -54 8 139 6 -54 68 -92 -227 -80 -264 -83 -13 -301
7462 -301 -146 -116 10 17 109 104 -55 149 -221 111 28 6 -64 138 -34 309 293 53 158 20 199 -209 -158 127
7486 127 173 -12 61 -274 88 -92 -63 102 103 -43 236 -207 439 -69 -182 121 -139 151 75 24 109 178 -58
7509 -58 35 158 -12 224 -75 123 199 -13 -84 403 7 242 -63 -254 -327 186 84 364 -71 -162 29 94
7531 94 34 168 228 60 -33 -155 -219 59 -227 -197 119 120 43 118 475 -237 -167 -115 -281 -61 321 -282 -310 -206
7555 -206 -166 -95 41 -13 234 -19 -113 -183 -79 -58 -30 -30 -307 -98 -362 -46 -9 92 -149 -370 -206 202 -80
7578 -80 -168 -381 -225 -74 -219 -127 -48 -29 -275 -98 -31 -93 -104 -15 75 -43 -174 53 74 -53 -208 207 -162 -113
7602 -113 285 -463 -81 -159 135 -50 18 246 16 -169 -129 355 122 137 403 38 -150 -223 -38 -158 -16 -86
7624 -86 -174 283 -263 -151 190 -29 21 55 -116 -336 -157 -151 6 88 -138 -176 -171 -208 -135 -95 246 -36 -191 -98 -120
7649 -120 158 -57 -96 -19 -38 255 40 229 13 -65 -61 45 -105 -96 196 94 -132 89 9 -18 372 295 -23 -12
7673 -12 23 191 -269 -36 -77 14 -22 83 92 -117 -310 153 113 69 -99 -204 302 124 -126 49 18 -45 72 -161
7697 -161 -99 -109 -78 -225 -54 -40 -24 7 33 -220 -94 -3 -31 -44 -88 75 -13 81 4 -38 94 -142 156 -42 -152
7722 -152 151 59 -57 10 43 -1 -156 -41 136 -18 -46 185 -108 42 152 -276 -169 -55 -292 108 -162 -17
7744 -17 -224 40 -103 77 -107 -164 -39 -165 -85 20 -118 -263 -143 -94 84 -56 109 20 -102 -248 -99 228
7766 228 71 -311 -128 -15 -246 -12 -348 61 13 10 23 177 7 -106 -81 -178 87 -281 160 107 81 37 72
7789 72 -179 22 106 228 -334 135 -196 159 -153 -184 115 -93 84 -226 -78 -238 -18 -231 -23 -92 -18 43
7811 43 -130 -159 -82 -11 -146 -243 -76 -122 336 24 -190 -130 -250 48 28 -143 -108 -64 -216 85 -63 -377 35
7834 35 -97 74 -124 -75 -74 294 -551 115 90 -100 -284 -54 -186 -160 243 -226 25 122 -269 0 -192 94
7856 94 -79 -215 -59 3 70 -146 -116 117 167 66 -71 31 87 -131 101 26 -80 -2 86 84 4 -144 -21 188
7880 188 198 -63 290 -101 -352 234 54 -1 -103 -82 -65 40 199 -126 -248 -16 -151 -82 335 169 -33 -91
7902 -91 -373 49 -87 -297 86 -147 25 -26 35 364 31 -93 -31 -83 81 -172 236 256 229 183 -65 263 -22
7925 -22 -11 161 -175 231 135 -113 -250 -121 99 -179 121 113 -49 -360 5 239 73 52 92 -96 201 -164
7947 -164 405 -156 28 258 127 110 -22 222 -61 -226 229 -228 -198 -220 51 247 28 122 -65 325 55
7968 55 -73 -69 -51 127 -162 127 258 -350 -18 48 -121 -14 95 106 63 51 -179 -100 -112 -112 140 31 -18 -126
7992 -126 -1 66 126 134 75 120 19 -97 -180 -141 36 163 222 55 98 -129 -248 -63 198 335 -35 -73 -264 81
8016 81 -120 24 -276 413 4 -138 -60 -155 119 108 8 59 153 91 171 287 -9 18 -77 194 48 -138 209
8039 209 -6 100 104 139 -80 59 -30 458 -160 195 231 202 -120 -66 104 202 218 -69 -227 13 -33 -35 526 -19
8063 -19 148 206 -142 167 43 147 -290 93 -122 130 -84 210 152 -251 33 -206 30 -246 104 -73 -467
8084 -467 -50 -36 -29 -331 -7 2 26 134 -221 31 71 160 53 -228 536 -64 72 336 99 80 -214 33 78
8107 78 253 215 -98 -323 -267 -123 31 37 34 99 20 -116 -16 41 -304 207 -111 226 -16 -50 182 15 39 190
8131 190 162 -160 106 53 18 -213 -220 -225 18 -300 -157 -275 85 84 249 -64 332 -75 5 144 -12 -106 -95 560
8155 560 -55 -256 197 -380 56 -204 15 -103 -110 21 70 39 -77 122 89 341 -20 -94 211 512 -78 -197
8177 -197 -151 117 -26 304 199 36 -214 0 -238 -53 -136 254 141 -86
8191h6
##END NTUPLES=NMR FID
##END=
