##TITLE=1H_SL65-SPh(-1)
 CDCl3, 8 sc, 
 30.4.2019
##JCAMPDX= 6.0         $$ Bruker NMR JCAMP-DX V2.0
##DATA TYPE= NMR FID
##DATA CLASS= NTUPLES
##ORIGIN= UXNMR, Bruker Analytische Messtechnik GmbH
##OWNER= root
$$ XWIN-NMR		Version 3.5
$$ Tue Apr 30 14:36:43 2019 Russian Standard Time (UT+4h)  she@DPX200
##.OBSERVE FREQUENCY= 200.1315
##.OBSERVE NUCLEUS= ^1H
##.DELAY= (6, 6)
##.ACQUISITION MODE= SIMULTANEOUS
##.ACQUISITION SCHEME= undefined
##.AVERAGES= 8
##.DIGITISER RES= 18
##SPECTROMETER/DATA SYSTEM= spect
##.PULSE SEQUENCE= zg30
##.SOLVENT NAME= D2O
##.SHIFT REFERENCE= (INTERNAL, D2O, 0, 15.7039)
##AUDIT TRAIL= $$ (NUMBER, WHEN, WHO, WHERE, WHAT)
$$ ##TITLE= Audit trail, XWIN-NMR		Version 3.5
$$ ##JCAMPDX= 5.01
$$ ##ORIGIN= Bruker BioSpin GmbH
$$ ##OWNER= she
$$ F:/spectra/data/she/nmr/H-F/1/audita.txt
$$ ##AUDIT TRAIL=  $$ (NUMBER, WHEN, WHO, WHERE, WHAT)
(   1,<2019-04-30 14:35:19.28 +0400>,<she>,<DPX200>,
      <created by zg, POWCHK disabled, PULCHK disabled
       configuration hash MD5:
       00 E9 B6 7A A2 85 ED C7 34 08 36 98 17 FE 4E 26
       data hash MD5: 16K
       6C DA 16 6C CF 33 DD 36 E9 E6 28 7E 3F 67 8F 6A>)
$$ ##END=
$$ 
$$ hash MD5
$$ A4 DD 48 C9 17 27 C0 06 5F 25 37 C6 AB E2 BD 72
##$RELAX= 
##$RELAX= 
##$RELAX= 
##$RELAX= 
##$RELAX= 
##$RELAX= 
$$ Bruker specific parameters
$$ --------------------------
##$DU= <F:/spectra>
##$EXPNO= 1
##$NAME= <H-F>
##$PROCNO= 1
##$TYPE= <nmr>
##$USER= <she>
##$AMP= (0..31)
100 100 100 100 100 100 100 100 100 100 100 100 100 100 100 100 100 100 
100 100 100 100 100 100 100 100 100 100 100 100 100 100 
##$AQSEQ= 0
##$AQ_mod= 1
##$AUNM= <au_zg>
##$AUTOPOS= <>
##$BF1= 200.13
##$BF2= 200.13
##$BF3= 200.13
##$BF4= 200.13
##$BF5= 200.13
##$BF6= 200.13
##$BF7= 200.13
##$BF8= 200.13
##$BYTORDA= 1
##$CFDGTYP= 0
##$CFRGTYP= 5
##$CHEMSTR= <none>
##$CNST= (0..31)
1 1 145 1 1 1 1 1 1 1 1 1 1 1 1 1 1 1 1 1 1 1 1 1 1 1 1 1 1 1 1 1 
##$CPDPRG= <>
##$CPDPRG1= <>
##$CPDPRG2= <>
##$CPDPRG3= <>
##$CPDPRG4= <mlev>
##$CPDPRG5= <mlev>
##$CPDPRG6= <mlev>
##$CPDPRG7= <mlev>
##$CPDPRG8= <mlev>
##$CPDPRGB= <>
##$CPDPRGT= <>
##$D= (0..31)
0 1.2 0 0 0 0 0 0 0 0 0 0.03 0 0 0 0 0 0 0 0 0 0 0 0 0 0 0 0 0 0 0 0 
##$DATE= 1556620518
##$DBL= (0..7)
120 120 120 120 120 120 120 120 
##$DBP= (0..7)
150 150 150 150 150 150 150 150 
##$DBP07= 0
##$DBPNAM0= <>
##$DBPNAM1= <>
##$DBPNAM2= <>
##$DBPNAM3= <>
##$DBPNAM4= <>
##$DBPNAM5= <>
##$DBPNAM6= <>
##$DBPNAM7= <>
##$DBPOAL= (0..7)
0.5 0.5 0.5 0.5 0.5 0.5 0.5 0.5 
##$DBPOFFS= (0..7)
0 0 0 0 0 0 0 0 
##$DE= 6
##$DECBNUC= <off>
##$DECIM= 24
##$DECNUC= <off>
##$DECSTAT= 4
##$DIGMOD= 1
##$DIGTYP= 9
##$DL= (0..7)
0 120 120 120 120 120 120 120 
##$DP= (0..7)
150 150 150 150 150 150 150 150 
##$DP07= 0
##$DPNAME0= <>
##$DPNAME1= <>
##$DPNAME2= <>
##$DPNAME3= <>
##$DPNAME4= <>
##$DPNAME5= <>
##$DPNAME6= <>
##$DPNAME7= <>
##$DPOAL= (0..7)
0.5 0.5 0.5 0.5 0.5 0.5 0.5 0.5 
##$DPOFFS= (0..7)
0 0 0 0 0 0 0 0 
##$DQDMODE= 0
##$DR= 18
##$DS= 0
##$DSLIST= <SSSSSSSSSSSSSSS>
##$DSPFIRM= 0
$$ [...]
##$SUBNAM2= <"">
##$SUBNAM3= <"">
##$SUBNAM4= <"">
##$SUBNAM5= <"">
##$SUBNAM6= <"">
##$SUBNAM7= <"">
##$SUBNAM8= <"">
##$SUBNAM9= <"">
##$SW= 24.9337058887773
##$SWIBOX= (0..15)
0 0 2 0 0 0 0 0 0 0 0 0 0 0 0 0 
##$SW_h= 4990.01996007984
##$TD= 16384
##$TD0= 1
##$TE= 0
##$TE2= 300
##$TE3= 300
##$TEG= 300
##$TL= (0..7)
0 120 120 120 120 120 120 120 
##$TP= (0..7)
150 150 150 150 150 150 150 150 
##$TP07= 0
##$TPNAME0= <>
##$TPNAME1= <>
##$TPNAME2= <>
##$TPNAME3= <>
##$TPNAME4= <>
##$TPNAME5= <>
##$TPNAME6= <>
##$TPNAME7= <>
##$TPOAL= (0..7)
0.5 0.5 0.5 0.5 0.5 0.5 0.5 0.5 
##$TPOFFS= (0..7)
0 0 0 0 0 0 0 0 
##$TUNHIN= 0
##$TUNHOUT= 0
##$TUNXOUT= 0
##$USERA1= <user>
##$USERA2= <user>
##$USERA3= <user>
##$USERA4= <user>
##$USERA5= <user>
##$V9= 5
##$VALIST= <valist>
##$VCLIST= <CCCCCCCCCCCCCCC>
##$VD= 0
##$VDLIST= <DDDDDDDDDDDDDDD>
##$VPLIST= <PPPPPPPPPPPPPPP>
##$VTLIST= <TTTTTTTTTTTTTTT>
##$WBST= 1024
##$WBSW= 4
##$XGAIN= (0..3)
0 0 0 0 
##$XL= 0
##$YL= 0
##$YMAX_a= 198052
##$YMIN_a= -234390
##$ZGOPTNS= <>
##$ZL1= 120
##$ZL2= 120
##$ZL3= 120
##$ZL4= 120
##$ABSF1= 10
##$ABSF2= 0
##$ABSG= 5
##$ABSL= 3
##$ALPHA= 0
##$AQORDER= 0
##$ASSFAC= 0
##$ASSFACI= 0
##$ASSFACX= 0
##$ASSWID= 0
##$AUNMP= <proc_1d>
##$AZFE= 0.1
##$AZFW= 0.1
##$BCFW= 1
##$BC_mod= 2
##$BYTORDP= 1
##$COROFFS= 0
##$CY= 11.3945322036743
##$DATMOD= 1
##$DC= 2
##$DFILT= <>
##$DTYPP= 0
##$F1P= 18.9103706918063
##$F2P= -1.10871071338519
##$FCOR= 0.5
##$FTSIZE= 0
##$FT_mod= 4
##$GAMMA= 1
##$GB= 0.15
##$INTBC= 1
##$INTSCL= 1
##$ISEN= 128
##$LB= 0.24
##$LEV0= 0
##$LPBIN= 0
##$MAXI= 10000
##$MC2= 0
##$MEAN= 0
##$ME_mod= 0
##$MI= 1.114404
##$NCOEF= 0
##$NC_proc= 0
##$NLEV= 6
##$NOISF1= 3.799351
##$NOISF2= 2.8
##$NSP= 1
##$NTH_PI= 0
##$NZP= 0
##$OFFSET= 15.70392
##$PC= 1
##$PHC0= -8853.846
##$PHC1= 15.80026
##$PH_mod= 1
##$PKNL= yes
##$PPARMOD= 0
##$PSCAL= 0
##$PSIGN= 0
##$REVERSE= no
##$SF= 200.130013532006
##$SI= 16384
##$SIGF1= 3
##$SIGF2= 2
##$SINO= 400
##$SIOLD= 16384
##$SREGLST= <1H.CDCl3>
##$SSB= 0
##$STSI= 0
##$STSR= 0
##$SW_p= 3612.71676300578
##$SYMM= 0
##$S_DEV= 0
##$TDeff= 0
##$TDoff= 0
##$TI= <>
##$TILT= no
##$TM1= 0
##$TM2= 0
##$TOPLEV= 0
##$USERP1= <user>
##$USERP2= <user>
##$USERP3= <user>
##$USERP4= <user>
##$USERP5= <user>
##$WDW= 1
##$XDIM= 8192
##$YMAX_p= 0
##$YMIN_p= 0
$$ End of Bruker specific parameters
$$ ---------------------------------
##NTUPLES= NMR FID
##VAR_NAME=  TIME,          FID/REAL,        FID/IMAG
##SYMBOL=    X,             R,               I
##VAR_TYPE=  INDEPENDENT,   DEPENDENT,       DEPENDENT
##VAR_FORM=  AFFN,          ASDF,            ASDF
##VAR_DIM=   8192,          8192,            8192
##UNITS=     SECONDS,       ARBITRARY UNITS, ARBITRARY UNITS
##FACTOR=    0.0002004,     1,               1
##FIRST=     0,             0,               0
##LAST=      1.6414764,     0,               0
##MIN=       0,             -234390,         0
##MAX=       1.6414764,     198052,          0
$$ Real data points
##PAGE= N=1
##DATA TABLE= (X++(R..R)), XYDATA
0@%%%%%%Qj6J6j6K4l2M0m9N8p3Q9j06J28j52J78k09K41k79L21l66M19m78N43o15
30c26O93p78Q74r80J094j219J356j507J675j860K060k280K524k794L096l432L810
47B006m239M729n295N958o748P705q899J0433j2489J5408j9908K7853m6083J65300
61A35731N6703j84373R9091R0900j6151r8187K5027N3310J680m8481R151J2246
73A36647j8852l1408J8192J0791j8681j8346K0936O122k7457k0846K2372J2698
85I2168k3476k5857J4919J9306j4120l1159n791J1725J110q142M103N621j1846
98B8561j7000N651J1231j5302k7915K203K7507N469k3385r578J4792K547j7046
111a2265n917J2162k713j9555R7K1735M029k1615r276J5941R173j0318m706O214
$$ plain form
0 0 0 0 0 0 0 0 8 -8 8 -8 16 -16 24 -25 33 -40 49 -57 71 -81 97 -112 129 -150 171 -195 224 -254 289 -326
30 -326 367 -411 463 -517 577 -642 714 -793 882 -978 1082 -1198 1326 -1468 1628 -1804 2006
47 2006 -2233 2496 -2799 3159 -3589 4116 -4783 5650 -6839 8569 -11339 16514 -29569 135731
61 135731 192434 8061 107152 198052 181901 83714 108741 162051 163731 115250 124401 136647
73 136647 117795 86387 104579 115370 96689 78343 99279 105401 77944 57098 79470 92168
85 92168 68692 42835 57754 77060 62940 31781 25990 37715 38825 30683 34786 40407 28561
98 28561 11561 17212 28443 13141 -14774 -12571 14936 20405 -2980 -12558 2234 4781 -12265
111 -12265 -18182 -6020 -8733 -28288 -28191 -6456 -2427 -24042 -33318 -17377 -8204 -18522 -23228 -17014
125a7014m265j3108M235J7834L49j3866M39J3642O45j1375P57J1531k688j2439
139b5323L448J6544K586j2044j430J1460L874p787k293P942M645l494j473L685
153C40Q15k820J720P319M168l217k340K279L050j493k078J771K382J347L306L067
169A9616j838l935K61N054K70n735p22P274M680m354l808M104J650n990l113O552
185A9966N259m577m064L589J998m715k897M301J714n106j757N222K398n742m333
200A1256L156K473n329k692M798L144l918m150J381P28l151k089L588J238l426
215G007k797J905J692l681l573J897J943j866j946J800J940l191l879N85K275
230A11j817l200J171L444n02k851m46J464j742k819M44K536o33k582J48K566k73
$$ plain form
125 -17014 -21279 -34387 -30152 -12318 -11969 -25835 -25396 -11754 -11109 -22484 -21727 -10196 -12884 -25323
139 -25323 -21875 -5331 -2745 -14789 -16219 -4759 -885 -8672 -10965 -3023 1622 -1872 -3345 340
153 340 1155 -1665 55 7374 11542 8325 5985 8264 11314 9821 7743 9514 11896 13243 16549 19616
169 19616 17778 13843 14104 19158 19428 13693 12971 20245 24925 20571 16763 20867 22517 16527 13414 19966
185 19966 25225 20648 16584 20173 22171 17456 14559 18860 20574 15468 13711 18933 21331 15589 11256
200 11256 14412 16885 11556 8864 13662 16806 12888 8738 10119 10847 7696 5607 9195 10433 7007
215 7007 4210 6115 7807 4126 553 2450 4393 2527 581 2381 4321 1130 -2749 -2164 111
230 111 -1706 -4906 -3735 -291 -793 -3644 -4090 -2626 -4368 -7187 -6743 -4207 -4840 -7422 -7274 -4708 -4981
247d981k567k97K134q49k768N84K884q56l498N11K340L77k282N81K570m32k114
264h663k74J050l35k268N75K328P61j113M88J528o00j813o01J255k97p40M08K087
282f224L90q39j65J232k77j617%J110L40o29k56J362O01k87k89J192K24j463n52
301f147R35K90n90k59J017M87L68j60J236Q7j389m35L45K97j323J5J480J322j336
320c760l6J201Q93j651j012N28K61o14M1J174N12o63q7J019k2p04m71J39m07r04
340d563L40J526N09p90p52R66M91l48j314K76l02K27l11P67L96m14l48P05K95
359b644q27o64P71j39p65j54M42O32l44j78J062M61l12j033J1K77l60o01L15R54
379c096N82m26K33K44k32p52k4M93Nl45m6J060J14m98J78N62l02p24M55N19L42
$$ plain form
247 -4981 -7548 -7845 -5711 -6560 -9328 -8744 -5860 -6716 -10214 -9703 -7363 -6986 -9268 -8687 -6117 -6549 -8663
264 -8663 -8937 -7887 -8222 -10490 -9915 -7587 -6826 -7939 -7451 -5923 -6523 -8336 -8937 -7682 -7979 -8719 -8311 -6224
282 -6224 -5834 -6673 -6838 -5606 -5883 -7500 -7500 -6390 -6050 -6679 -6935 -5573 -4972 -5259 -5548 -4356 -4132 -5595 -6147
301 -6147 -5212 -4922 -5512 -5771 -4754 -4267 -3899 -4059 -2823 -2736 -4125 -4560 -4215 -3918 -5241 -5226 -3746 -2424 -3760
320 -3760 -3796 -2595 -1702 -3353 -4365 -3837 -3576 -4190 -4149 -2975 -2463 -3126 -3213 -2194 -2216 -2920 -3391 -3252 -3659 -4563
340 -4563 -4223 -2697 -2188 -2978 -3730 -2764 -2273 -2621 -3935 -3659 -3961 -3734 -4045 -3278 -2882 -3296 -3644 -2939 -2644
359 -2644 -3471 -4135 -3364 -3503 -4268 -4422 -3980 -3348 -3692 -3870 -2808 -2347 -2659 -3692 -3681 -3404 -3764 -4365 -4050 -3096
379 -3096 -2514 -2940 -2707 -2463 -2695 -3447 -3471 -2978 -2973 -3318 -3364 -2304 -2190 -2688 -2510 -1948 -2250 -2974 -2519 -2000 -1658
400a658l58n61O34J93j09j00R86K05l91r2L94Lr10P4P92K75K19K05M01j62n18
421d78m01P30o5m80N40L44N28k12j15m8L53n23r07Q02P61p2m65J22j12l4J95M5
443E08J16k45J10J69o0r7o12K52L42p07K60M50K02m96n77L28K82m12l18K6L47
464a32l51p1k3M77o13l56k24O77m22l81O59Q7m60o60N00j0n30O4K8K00r2q45O28
487a850Q7o18n35Q45J29m99l46K56M61l45p10O41k82Q9o34P1L02Mj60L2K23l35
509c174J19k5J84m66j15J69J18o3K48k07K93J34q00o8J138n1m46J84r9N9l68L
531c233L79L75n3l14M57J05m38K66j48O0k02L06P20m1o8j88M8L13l24o6L72P5
553a599N21j37O5M61k54m07K84K44j03L13K1L87l06j68M34M62j49j02L53J46j22
$$ plain form
400 -1658 -2016 -2577 -1943 -1750 -1859 -1959 -973 -768 -1159 -1251 -857 -854 -1764 -1690 -898 -623 -404 -199 202 40 -478
421 -478 -879 -149 -214 -694 -154 190 718 506 391 343 696 173 -734 68 829 757 292 414 302 268 463 508
443 508 624 379 489 658 598 501 -111 141 483 -224 36 486 688 192 -385 -57 225 -187 -505 -479 -132
464 -132 -483 -554 -577 -100 -713 -1069 -1293 -616 -1038 -1419 -760 -673 -1133 -1793 -1293 -1303 -1833 -1769 -1741 -1541 -1633 -2478 -1850
487 -1850 -1763 -2381 -2916 -2071 -1942 -2441 -2787 -2531 -2070 -2415 -3125 -2484 -2766 -2677 -3311 -3240 -2938 -2934 -3094 -3062 -2839 -3174
509 -3174 -3055 -3080 -2896 -3362 -3477 -3308 -3190 -3253 -3005 -3212 -2919 -2785 -3585 -3653 -2515 -2566 -3012 -2828 -2927 -2868 -3236 -3233
531 -3233 -2854 -2479 -2532 -2846 -2389 -2284 -2722 -2456 -2604 -2544 -2746 -2440 -1720 -1761 -1829 -2017 -1969 -1656 -1980 -2046 -1674 -1599
553 -1599 -1078 -1215 -1150 -689 -943 -1350 -1066 -822 -925 -612 -591 -204 -510 -678 -244 218 69 -33 320 466 344
574C44J80k39q7k04j04N61P1L54j86K40Q2m81k42P9M84m90J60N21K99n21j0K14
596A025J63n60m74K46O31L98m39l3P4m30J7L43l23L9m16L94Q1k18k22L62l07L53
618G04n87K3K61l87J09l10J21j67j44KM14kn18J51j84j39j19K92J54l08l50K44
640g40N9R2k69r1M1K73p72L23m3J46Lo4J86P4k38rj42K84r3k66K26k4j69P7L71
665g65l67j30j97L21L60k2j8J03K0k45L35j47J02o3K08M2m4j25J40J91J19j90
687c72j74L74K45K15l53j26M91k53j68M67q0j10M13K69k89q8L36j68J53k29j57
708C96L97L63k70j33K75k90M16j70K49l23M73k17J10q4j62LJ89j1J08p6j12M24
730A555k41k40J21j28M06N4M8j39P6l44L44k51j91J87k18K75j25l87M96q5k44
$$ plain form
574 344 524 285 198 -6 -110 451 522 876 690 930 1012 531 289 368 852 362 522 1043 1342 821 811 1025
596 1025 1188 628 154 400 1031 1429 990 957 1031 601 618 961 638 677 261 655 736 518 296 658 351 704
618 704 117 140 401 14 123 -187 -66 -233 -377 -375 39 37 -481 -330 -514 -653 -772 -480 -326 -634 -984 -740
640 -740 -681 -589 -858 -949 -908 -635 -1407 -1084 -1127 -981 -978 -1042 -856 -782 -1020 -1029 -1171 -887 -980 -1246 -1020 -1044 -1213 -1136 -765
665 -765 -1132 -1262 -1459 -1138 -778 -800 -818 -715 -695 -940 -605 -752 -650 -713 -505 -463 -507 -632 -492 -301 -182 -372
687 -372 -546 -172 73 288 -65 -191 300 47 -121 346 266 156 569 838 549 461 797 629 782 553 396
708 396 793 1156 886 753 1028 738 1154 984 1233 910 1383 1166 1276 1192 1030 1033 1222 1211 1319 1243 1131 1555
730 1555 1314 1074 1195 1067 1473 1527 1575 1436 1512 1168 1512 1261 1070 1257 1039 1314 1189 802 1298 1213 969
751I69J40j51M09l92k14N22n32K63J61m30L88R2m72L87jk21k12K11j13K43m39
772F08l3K26M4J36k25K30k66k5J40Ql72J72J2J03KJ51k08K27k79n3k25M73l46
795E00j65N17j41l39L57m09J76K2r1L11k45lJ93k85K77l73J36j43j40J81j87J96
817C45Q%j01j74L43j08J09j7j47l46O8M94p25J85p5L04J21o0j62k42N29k23j69
840d3N4L5j67K2j64L1K25m18J40J77j3J27m15K65l4M17n51k0N73l81J88o4m26
863d42J72J19k44K65R0j67Q1o6j05j40P6k4K89K9k88J98m09M58n8o0OL27n11l9
887d43J06J18M9n5K13j06L38n41J06J07j26J73J72o13K27K70j62K12k53O00o61
908b69J53J32K38O0n32N2J57L4o3j83K27n8R3m41O00o8j99P3l0K89o56K37M73
$$ plain form
751 969 1109 958 1367 975 761 1283 751 1014 1175 745 1133 1225 753 1140 1139 918 706 917 804 1047 608
772 608 575 801 845 981 756 986 720 695 835 843 471 643 655 758 760 911 703 930 651 598 373 846 500
795 500 335 852 711 372 729 320 496 518 427 738 493 490 683 398 675 302 438 295 155 336 149 345
817 345 353 353 252 78 421 313 422 405 258 -88 -20 474 -251 -66 -141 163 284 224 62 -180 349 126 -43
840 -43 11 46 -121 -99 -263 -232 -7 -425 -285 -108 -121 6 -409 -144 -178 239 -312 -332 241 -140 48 -16 -442
863 -442 -270 -151 -395 -130 -40 -207 -126 -192 -297 -437 -361 -385 -96 -67 -355 -157 -566 -108 -166 -226 -220 107 -404 -443
887 -443 -337 -219 -170 -225 -12 -118 220 -321 -215 -108 -234 -61 111 -502 -275 -5 -167 45 -208 392 -269
908 -269 -116 16 254 314 -218 -166 -9 25 -38 -221 6 -52 41 -400 200 132 -67 6 -24 265 -391 -154 319
931C19k07j39J2j27L33l67K35k09M74j17J83l95R4J16k43j4K57k1k33J99j11J59
953A98J56l28j20K65mm8l1P6j84k46K50j62O4p3M85m17L10k15k21L33lj54Nq5
977a49J46K31m38J89j50j87J39J72J64j57j4j51N6rJ29MM49l72k50o9M66k83K90
1000B06j79n1l3l91L11J25L8l64N26m05M73l89L32Q8j20k27R3k08K12k94M13j58
1022bJ02k82K26l05K29J34J51l96J44M3j4j8l17N69k74j41M6N5k08L01k96J10
1044a43J69l91N19m25R6K5J20J60mp0k69K41j24rr6N8l7l1K58l01J22K69m03L44
1068G8J24k94J58k8k3k45J36j13J91J08n5p9R8N4j36kq4n1o3J11K50j94q3l57
1092d99L33J63K59P2l47L03k00k22K23l9N8J96k56m50N29J97m22N38m44k15N20
$$ plain form
931 319 112 -27 -15 -142 191 -176 59 -150 324 207 390 -5 89 205 -38 -52 205 184 -49 150 39 198
953 198 354 26 -94 171 167 119 88 164 -20 -266 -16 -178 -114 -187 298 -119 191 -24 -245 88 85 -69 -64 -149
977 -149 -3 228 -210 -21 -171 -358 -219 -47 117 -40 -54 -205 -149 -158 -29 -25 424 52 -198 -267 199 -84 206
1000 206 27 -24 -57 -448 -137 -12 26 -338 188 -217 256 -133 199 287 167 -60 33 -175 37 -257 156 -2
1022 -2 100 -182 44 -261 -32 102 253 -143 1 44 30 12 -305 264 -10 -151 -105 -50 -258 43 -253 -143
1044 -143 26 -365 154 -271 -175 -150 -30 130 126 56 -213 28 -96 -105 -201 -143 -180 -211 47 -254 -132 137 -266 78
1068 78 202 -92 66 38 15 -230 -94 -207 -16 92 37 -42 56 110 -26 -28 -112 -163 -226 -115 135 -59 -142 -499
1092 -499 -166 -3 256 328 -19 284 84 -138 85 46 104 300 44 -406 123 320 -102 436 -8 -223 297
1113B97p8j80j19K0j8L60j47L2pl0o3k31R5K6J5K84k92K20J5j75j20K62k11j1
1137e6K32j14j43M51k20j63L44k69L3k79M14m37P0J3m3R1J90Lj96K66M1r5j22
1160A1o3m6J99k52J18N2J50j94Oj23K02k5k60M00n40K36j6K5N9L75o17M51NP5
1184B28m06K2M9K79m08M18P5k5m8k07q4L2K09k77J11q4Q3m1J99J6j95P4j46J19
1208gm7Q4l53J62M42k41j73J14Q3n0l51J37K16j41K47r1j70R9K84k40r3J9k13
1231b83L38K4kk21J38m9j84J71L41mk06J69j99m4k5J25J04R8k36q2j39K32k89
1254b23K87j46K48j41k70R6L33o0j5m0j03J73k33J60j04l3J47r0J92k82K97j38
1276E5k28J15j92j85M68j59k43O01m71K97k4k71J38n6M6q7J65L23j20j32j32J05
$$ plain form
1113 297 219 39 -80 -60 -78 282 135 167 160 130 67 -164 -69 -43 -28 256 -36 184 199 24 -96 166 -45 -56
1137 -56 176 62 -81 370 150 -13 331 62 95 -184 230 -207 -137 -124 -167 -76 114 117 -79 187 228 133 11
1160 11 -52 -98 101 -151 -33 19 169 -25 -19 -142 60 35 -225 175 -365 -129 -145 -120 -61 314 -303 148 153 228
1184 228 -178 -156 -107 172 -236 182 257 232 184 -23 -107 -75 134 -143 -32 -116 -33 -74 125 141 -54 20 -126 -7
1208 -7 -54 30 -323 -161 281 40 -133 -19 64 14 -337 -200 16 -125 122 31 -139 -40 244 4 -89 -70 -283
1231 -283 55 79 77 -144 -6 -55 -239 -68 273 269 63 232 33 -11 -36 89 193 291 55 -27 -166 66 -223
1254 -223 64 -82 166 25 -245 -149 184 124 109 69 -34 139 -94 66 -38 -71 76 -14 178 -104 193 55
1276 55 -173 -58 -250 -435 33 -126 -369 232 -239 58 34 -237 -99 -155 -109 -196 -31 292 172 40 -92 13
1298A3j06lJ87j57L7o9J52j11q5J33l16K55l32L82m8O4o7J25j4j44K02m62K92
1321g2J87k97J7K21M8j83J08L3r5m8j06L31k27K27k81P2j3l62J38J27J7K9J21
1344hJ7j39j19K06k43P6K72k74p9J87K44j94l3J05m7M3m70K43K01k5j97J23j55
1367b66K88k21O6Q5l61L50j7J36j20m7J85J03k67K07j99J09k43J20k29M2M1N5
1389a83J2J02J06k64K43k4k52O9J85K7j83J82r3N0k43K54J66l18j27J83q4M6J92
1412D6K6J9N0j15l80N59j59L9j12j1L4K7P1r9J9k52J17K96j90J25R1k20j97L87
1436A71o6Pm2j77M1K47k85J88r6l9M2j06K69p8j55J54J63O7j06J5J1j17j78L78
1460C08k57l74L84j04J79k18L07k19J34Nl52pL17j66k09J57j56K49R1j94L41j58
$$ plain form
1298 13 -93 -96 91 -66 -29 -98 54 -57 -142 -9 -325 -70 -402 -20 -68 -4 -71 54 40 -104 98 -364 -72
1321 -72 115 -182 -165 56 104 -79 29 62 -33 -81 -187 144 -83 144 -137 -65 -78 -440 -302 -175 -158 -129 -8
1344 -8 9 -130 -249 -43 -286 -210 62 -212 -291 -104 140 -54 -87 18 -29 14 -456 -213 -12 -37 -234 -111 -266
1367 -266 22 -199 -133 -48 -409 -59 -76 60 -60 -107 78 181 -86 121 -78 31 -212 -92 -321 -279 -238 -183
1389 -183 -171 -69 37 -227 16 -8 -260 -191 -6 21 -162 20 -73 -23 -266 -12 154 -164 -291 -108 -192 -146 46
1412 46 72 91 141 26 -354 205 46 85 -27 -38 -4 23 94 -5 14 -238 -121 175 -15 110 201 -19 -216 171
1436 171 105 112 70 -107 -66 181 -104 84 -12 -51 -9 -115 154 76 -79 75 238 305 199 214 225 108 -70 308
1460 308 51 -323 61 -43 136 -82 225 6 140 145 -207 -214 103 -63 -272 -115 -271 -22 69 -125 216 58
1482E8K2l00L19k15p2J02l2k9J60l92L34m3k76K45p1j19J69J63k04M1K64p4j23
1505g3l09O36n47J28J17r2M6k11J05l7J91l06k6K12J80k46P0J65k71L6M02j75
1527ek24L02k90J5J07r4K70j79m7K01k12r8M03j12l99L58K54m44M07J5l88J14
1549d6J96j72l1J40Oj82L17M6j33k54K36j10R2J10k97K56j60P8j12O6j74K88r5
1572F5P6O9k49nL22l51J1K71k32J53K17m45r0L69k85o3J10l5L53k14J82l04k57
1595c32J24J10M59l42k9K1J37Q0k22k50M06M4MJ99k99J16l45q1R1J58M9m22J85
1618a39L93m7l87K24k2j43n3O08n77J2J44m3J13rj47QK24p7K45m35K65l23J93
1641B7N9q3j86K75l0l3k3k67M87k58J8N8m4j46K25k28N4L48j21j14j0K9N9P5Q2
$$ plain form
1482 58 80 -220 99 -116 -188 -86 -118 -147 13 -379 -45 -88 -364 -119 -190 -309 -140 23 -181 -140 124 50 -73
1505 -73 -382 254 -293 -165 -48 -140 -94 -305 -200 -237 -46 -352 -378 -166 14 -232 -162 3 -268 -232 170 -5
1527 -5 -229 73 -217 -202 -95 -189 81 -98 -145 56 -156 -254 149 37 -362 -4 250 -194 213 228 -160 -46
1549 -46 150 -22 -53 87 93 -89 228 274 141 -113 123 13 105 215 -82 174 14 92 -20 46 -128 160 65
1572 65 141 210 -39 -44 278 -73 -62 209 -23 130 347 -98 -188 181 -104 -167 -57 -92 261 47 229 -75 -332
1595 -332 -208 -98 361 19 -10 11 148 228 6 -244 162 206 210 409 110 226 -119 -200 -109 49 98 -324 -139
1618 -139 254 207 -180 44 22 -121 -174 434 -143 -131 13 -30 83 74 -73 -65 159 82 327 -108 157 -166 27
1641 27 86 3 -183 92 62 29 6 -261 226 -32 -14 44 0 -146 79 -149 -95 253 132 18 8 37 96 171 253
1666B53k92L06j73M1K3k04L03k72m3N0N1J67p5lmj46j21J56K36k74j12O7J34j63
1690i5J98k35K8K48j79k3P6p1M14k94J45k08l7M17o32K36R1k45L66k87j56K39
1712dk90N8L92J95n54M11n8n57N02N9j67m1O5l7K68o22J0K91nL67M7m21J17%L1
1737E7n4k53J31o1p2L72j14k5n4j24J19j72p1L26M3l51K71q0L32m11J93k71J09
1760a60J89J91k29n3M68k57k35J10L15k33J58j78k07K02j31J14kq7N5j93J05K97
1782B39k40J57Q4j66l02N26j91k45K9J74J69k23K89m47K63M0k18q6J11L72l84
1803d9PJ05J0K6Po9L58o01J91K57l26J24k57L45j38K68l61L5J67k43K19K32j38
1826A69RM3m0j20k78J97J32n9q3Q4N6N7M6l2j79j64K78R4l25J41M0j1M6p4k0k7
$$ plain form
1666 253 -39 267 94 135 158 -46 257 -15 -58 -8 43 210 135 132 128 -18 -139 17 253 -21 -133 -66 68 -95
1690 -95 103 -132 -104 144 -35 -58 18 -53 361 67 212 4 -33 384 -248 -12 79 -166 200 -87 -243 -4
1712 -4 -294 -236 156 351 -203 208 150 -407 95 154 -13 -54 11 -26 242 -380 -370 -79 -84 283 330 -91 26 26 57
1737 57 3 -250 -119 -180 -252 120 6 -19 -73 -197 -78 -250 -321 5 48 -303 -32 -112 220 -191 2 -269 -160
1760 -160 29 220 -9 -62 406 149 -86 24 339 106 264 86 -121 81 -50 64 62 -25 30 -163 -58 239
1782 239 -1 156 240 74 -228 298 107 -138 -109 65 234 11 300 -147 116 156 -62 -148 -37 335 -49
1803 -49 -42 63 73 99 106 37 395 -206 -15 242 -84 40 -217 128 -10 258 -103 -68 99 -144 75 307 169
1826 169 178 221 181 61 -217 -20 112 53 -30 54 110 167 213 181 2 -162 116 210 -115 26 66 55 101 27 7 -20
1852b0L34m84Q4M34n4j51q3j29j88K10R6J18k50o0M52o51N16J67k90r0p7L18K40
1875D42k08k47K04k09J60j44N6j38K24M6R0l09k42K10K43o7o2J40p7j38r1L09
1897A92k97k1r1K95j41J05K9j0K71j80Oj33j2rj49N4Q1K9m7J17j70j01J14K78
1921B10m15J56M0Q9k05K85p0k57L83q7m01N61k29k6n9o4J84j30J52p5k73R4R5
1944d2j52K40K14o71M20J00Ok60M11Ol63j7K42l53J20M19j95M8q6L3l0Mk24L7
1968i3l4J90M18o39M29j24l46K51j47J22O6j05J08n16P08k55k00o2L90K20n13
1989a32J57o5K32j71J05J03j91L22l07k91L86j66Q0L7l31K82Q3Q5n7l34L78k9
2011A76k1o7j32J38j79K21j02j08p3M50r3k91j39J51L0j89M26k23J33l79M2rJ05
$$ plain form
1852 -20 314 -170 -86 348 294 143 60 -69 -257 -47 49 167 -83 -143 309 -342 174 341 51 -39 -116 202 442
1875 442 234 -13 191 -18 142 -2 54 -84 140 186 276 -33 -275 -65 178 111 49 189 112 -26 -117 192
1897 192 -105 -126 -217 78 -63 42 71 61 332 152 158 25 13 4 -145 -91 -10 19 -28 89 -81 -182 -68 210
1921 210 -205 -49 -9 80 -125 160 90 -167 216 129 -272 289 60 34 -25 -89 95 -35 117 42 -231 -137 -42
1944 -42 -194 46 260 -411 9 109 115 -145 266 272 -91 -108 134 -219 -99 320 125 173 87 120 90 94 -130 -93
1968 -93 -127 63 481 -158 271 147 -199 52 -95 27 93 -12 96 -420 288 33 -167 -229 161 381 -132
1989 -132 25 -40 192 21 126 229 38 360 53 -238 148 -18 62 99 -232 50 133 218 161 -173 205 176
2011 176 155 88 -44 94 -85 136 34 -74 -147 303 210 -81 -220 -69 -39 -228 198 -25 108 -271 -229 -238 -133
2034a33K20J07l56K24k15K05J19l9j18j16O8LN2m1J52k26J84l28J47J0O0o7J14
2057B6%pp1j38O5K06j12l44M70l03q6J46k14N55j83k24K82n2o7K47l28K40l9q4
2081a5M1q3j33Q9K14p5j31l49M16J73n3j54K31j79K08n61K22K20K29Kl56k7k29
2104c00O9O28n35J06n4P9j09R3oL28J8k90%n62N90J57k65K9k74O9J78J43j36Q5
2128D1K77m22j4Q5J99j52r0Kk02K99l3L4J62J40j32j56J20j9j63p8N87p29J32
2151a12J83j24K15m17N04k80k93K90q8K51j72J10j7R7o83L70K54k98J13o3J09
2172e1RR2j00P9O6k70L63l5pj41r8qK08n7m15M25J03j97K6k23M9Q0L15p6l63K26
2198@L2p2J32j39L52l60j09K54p8n4J32j15j17l2J11J7J99k60p1K16j29j75k0
$$ plain form
2034 -133 87 194 -162 62 -153 52 171 132 14 -102 -34 -31 21 -20 132 -94 90 -238 -91 -81 -21 -88 26
2057 26 26 19 -52 -190 -125 81 -31 -375 95 -208 -294 -148 -362 193 10 -214 68 16 -51 196 -132 108 69 -15
2081 -15 26 -57 -190 -101 113 38 -93 -442 -26 147 94 -60 171 -8 200 -361 -139 81 310 312 -44 -71 -300
2104 -300 -231 397 -138 -32 -86 -7 -116 -23 -29 299 317 27 27 -535 55 212 -53 -24 -298 -229 -51 92 -44 41
2128 41 318 -104 -118 -33 166 14 -76 -74 -276 23 -10 24 186 326 194 38 158 139 -24 -102 485 -244 -112
2151 -112 71 -53 162 -255 249 -31 -324 -34 -122 129 -43 67 50 147 -536 -166 88 -210 -97 -160 -51
2172 -51 -42 50 -50 29 95 -175 188 153 146 5 -93 -101 107 50 -365 60 163 -34 -8 -231 -182 -102 213 137 -226 0
2198 0 32 -40 92 -47 305 -55 -164 90 12 -42 90 -25 -142 -174 -63 -46 153 -107 -178 38 -91 -266 -286
2221b86O35k59j26O7K8k51J55k54L43m96N60k55K69K2l1O3k46K84k02O3j37J69
2243A15m51K77L0Ok09j50L91j25M43l8m83L39J54m28J28L38n78J05J07L07m04
2264a26j61O12l95O8J39l17J54J73l36L13J02r3n12L43p4O8Qj00n6l37R35j03
2286C05l51n3K18K06m24J73Q5j50k0K7j18M7P4Q0j26MM6k9J69k29kj29K60J27
2310A90j73k42J36L25k75O3K2j74L18j87K05k01L0R4l83M27j74J98n05K49J19
2331F2l65L14O5k10M66l10m98Q33l66O2n7m7k97N32P1l06R7J57k59l7L30k33j85
2354a81L17k42K08j10N9K45j55k91J14J07J06l91j44N18Pn65Q36k85j9%J12k22
2376B4l08L38k09P9k13K09J69k13Q0N3L10l55j02j9K27j97J89J65j05o3j33n2
$$ plain form
2221 -286 349 90 -36 31 59 -192 -37 -291 52 -444 116 -139 130 152 121 184 -62 222 20 83 -54 115
2243 115 -336 -59 -29 -23 -232 -382 9 -116 327 289 -194 145 299 -129 -1 337 -241 -136 -29 278 -126
2264 -126 -287 325 -70 -2 137 -180 -26 147 -189 124 226 133 -379 -36 -110 -42 -34 -134 -190 -527 408 305
2286 305 -46 -99 119 325 -99 74 159 9 -11 16 -102 -55 19 99 -27 -23 23 -6 163 -66 -68 -197 63 190
2310 190 17 -225 -89 236 -39 24 46 -128 190 3 208 7 37 131 -252 175 1 199 -306 -57 62
2331 62 -303 11 76 -134 332 22 -476 357 -9 53 -4 -51 -348 184 255 -51 46 203 -56 -93 237 4 -181
2354 -181 136 -106 102 -8 51 296 141 -150 -36 71 177 -214 -358 160 167 -398 438 153 134 134 246 24
2376 24 -284 54 -155 -76 -289 -80 89 -124 -44 9 319 -36 -138 -157 70 -127 62 227 122 59 -74 -126
2398a26J67Qk09m7j29L43On6k86M03k23J58R1p1j14N3J20K4k92j99K74K11k02
2421i6J25K68l91J88j65j31K22j63K70j03Q6k13j78K0L16m3J08m04M47K7l97j18
2443c25R5N10n2m38P2K84l10J14o6K49j55l5K0j25Nj25M25k54q5K16J80k55K04
2466A49r2K78k45m8l91M07j25J37k05O9p2O9K89l9k39J25l7j13L4l99N31K3Q8
2489A94j15n8k76j26L35K42k53q6L65k95R7L93l64j69J65L16k14j21J89m04M28
2510B43k33K29l4k48J96j06k31j26N34j00R4k35J19rn19M21k15J63J70k4Pl41
2532b45L71L8L16n31r9M26l99P1J12j65j20K43ql2m7r2j23O35n55l5m23O47K11
2555A96J0k70L59j30k25J94k34J38J21k29o3N67l35k17r7M29j2k18k42L35k71
$$ plain form
2398 -126 41 49 -160 -207 -336 7 13 -43 -329 74 -149 9 100 29 -85 -32 88 112 -180 -379 -105 106 -96
2421 -96 29 297 -94 94 -71 -202 20 -143 127 24 110 -103 -281 -261 55 12 120 -284 163 190 -207 -325
2443 -325 -230 280 228 -210 -138 146 -164 -50 -116 133 -22 -57 -37 -162 -157 -282 143 -111 -196 20 200 -55 149
2466 149 57 335 90 42 -349 58 -67 70 -135 -66 -138 -69 220 181 -58 67 30 -83 -49 -448 83 106 194
2489 194 79 21 -255 -381 -46 196 -57 -143 222 -73 24 417 53 -116 49 365 151 30 219 -185 243
2510 243 10 239 205 -43 153 47 -184 -310 224 124 218 -17 102 93 -426 -5 -220 -57 113 89 96 -245
2532 -245 126 164 480 -51 -150 276 -123 -52 60 -105 -225 18 10 -22 -69 -161 -284 351 -204 -239 -662 -15 196
2555 196 206 -64 295 165 -60 134 -100 38 159 -70 -133 434 99 -118 -215 214 202 -16 -258 77 -194
2576a94M20p8k09K56J32l50j28K11p2N0L9k80N07l04K65l22p3L26l84L07k88L57
2598A88m36O40j21K2k3n30K24K11k03o4J62l9N5j56K32m70L79k00P8O9k00kj44
2621c28M73j41J29pk23k94K95L25m15J73J25j87J43k40L10pl85L25l67L29j75
2642a42K42l3j93k2p7J79K39j78J55j09k69L34j40K04k89K99p1L1l65L69j28k3
2664A3j24J41j13L19j67l06J51J25k67L6J74L7l2j13K02o8j38K63m1K1m0l93L33
2687A3k66L09q8k99M30j16O2m1pK56m27m3q3K73J04j24N01p16P9J32J15k69m2
2710b47M48m09L24l64J71L09l36n9M52l67o5o0M19m59L45k12R7l7K00l90J28K80
2732A68n1K16l07k12J55q3J09q4J43m9J90k08K45n2l91J61oR7L4n11J4K85mJ44
$$ plain form
2576 -194 226 148 -61 195 327 -23 -151 60 -12 38 77 -203 304 0 265 -57 -130 196 -188 119 -169 188
2598 188 -248 392 271 293 270 -260 -36 175 -28 -92 70 31 86 -70 162 -308 71 -129 -51 18 -182 -184 -328
2621 -328 145 4 133 126 -97 -391 -96 229 -186 -13 112 -75 68 -172 138 131 -254 71 -296 33 -142
2642 -142 100 67 -126 -148 -225 -46 193 15 170 61 -208 126 -14 190 -99 200 129 160 -205 164 36 13
2664 13 -111 30 -83 236 69 -237 -86 39 -228 -192 -18 19 -13 -126 76 8 -130 133 92 113 73 -320 13
2687 13 -253 56 -32 -331 99 -17 45 4 -3 253 -174 -217 -300 -27 77 -47 454 -262 -183 -51 64 -205 -247
2710 -247 201 -208 116 -248 -77 232 -104 -163 289 -78 -143 -203 216 -243 102 -110 -13 -50 150 -240 -112 168
2732 168 117 333 26 -186 -31 -114 -5 -89 54 5 195 -13 232 180 -211 -50 -56 41 75 -436 -422 -137 -141 3
2756CJ03j5K71m44J59n9J12k34P2n0mj14L39j31P1j12m5l8J48rm4P8l40M03r3
2781B7r6M15j79o41J71K87J37p4j49k07K83o1L0L81l42L5K61l56K45j86k1K02
2803A62j06O8k72K27k03J9m5L74p4k5o0P7k20N1j60M65k54j97K56j06M57k22l39
2826a27Q6l8K55j5N2l14o5j54K37K42m3j97k4K44p2K8pj09q9K39j2N9o4Q0k79
2851h7r5K76k51J45L45k71j72K58j40QJ35Q0j12j47k8O1L09n22K86k0j18j11j60
2874c31K31L6M9K17q2j89k2J4n1K30L10k35l00N7Q3K90j99k06J1J53j00J58o9
2897E5j15j55J27RK01r3Q8o5l01L44j20L34k85Q5P0Lj48k6J11j34M8m1k59J28
2921a39J88p1r3J42l1j24K01l5o1J09J21k62O2k12L33j34j63K81l17J32P8o2L10
$$ plain form
2756 3 106 91 362 -82 77 18 130 -104 -32 -82 -86 -200 139 8 79 -33 -78 -116 32 23 -21 57 -283 120 27
2781 27 -69 346 167 -474 -303 -16 121 47 -102 -309 -26 -87 -57 324 -18 17 278 -78 167 -19 -40 162
2803 162 56 124 -148 79 -124 -105 -150 224 150 125 65 142 -78 -27 -187 278 24 -173 83 -23 434 212 -127
2826 -127 -41 -79 176 161 213 -101 -166 -320 -83 159 116 -81 -105 139 67 95 88 -21 -110 129 117 176 112 192 -87
2851 -87 -182 94 -157 -12 333 62 -110 148 8 16 151 231 119 -28 -56 5 314 -208 78 58 -60 -171 -331
2874 -331 -100 -64 -15 202 120 -69 -91 -77 -128 102 412 177 -123 -66 17 307 108 -98 -87 66 -34 124 55
2897 55 -60 -215 -88 -79 122 29 117 52 -249 95 -25 309 24 109 179 182 34 8 119 -15 33 -8 -267 -139
2921 -139 49 -22 -115 27 -4 -128 73 38 -23 86 207 -55 7 -205 128 -6 -169 112 -205 -73 5 -57 253
2944B53j52P5m37N19K6l36k49J59nk28O77l06j79J85N7n7j21K03L43o07M44l28
2966f4j04J55k57L05N0l40R8M50l94L21k59L2n9J28J33k33K14N2m1j97m52N39
2988G7k40K9O2J46q0L12k68P7j77j05P1j14K10q2J45R8K8m51P25l03k03N40m12
3011H5j94J21K38l07J89k70K55o2j5k8N2N1J43j55l10q1J82K40o7K97k10l20R3
3034g3N3j46K22q1p5M10m5j73K07m24J54l27M29l0j83J17l19P34k75j77J75l40
3056a67j57J76K16k31J51j08N0O5J05J63j40k83O8L6R6k10K55l42M0L64l07K2
3078a38M27k70K3j96K41n2k02K37Qj18K8k63J83K38N8k9k14J97k31K3J41q4J86
3101A93j40K4J42l08r5J72N3O5K1l35L98l41K5J08K78k02j30L9N8l13L38k12L02
$$ plain form
2944 253 101 176 -261 258 284 -52 -301 -142 -147 -375 302 -4 -183 2 59 2 -119 84 427 -180 264 -64
2966 -64 -168 -13 -270 35 85 -255 -157 293 -101 220 -39 -7 -66 62 195 -38 176 228 187 -10 -462 77
2988 77 -163 -134 -72 74 -6 306 38 115 -62 -167 -96 -210 0 -82 63 161 189 -262 463 160 -43 497 85
3011 85 -109 12 250 -57 132 -138 117 55 40 12 64 115 258 103 -207 -288 -106 134 67 364 154 -166 -73
3034 -73 -20 -166 56 -25 -100 310 265 92 299 -125 29 -298 131 101 -82 35 -284 450 175 -2 173 -167
3056 -167 -324 -148 68 -163 -12 -120 -70 -5 100 263 123 -160 -92 -56 40 -170 85 -257 -217 147 -160 -138
3078 -138 289 19 42 -154 87 35 -167 70 78 -40 -12 -275 -92 146 204 175 -39 158 -73 -50 91 7 193
3101 193 53 77 219 -89 -184 -12 41 106 127 -208 190 -151 -126 -18 260 58 -72 -33 25 -288 50 -162 140
3124A40Q4l37O2j22K32k06l9j56K25J82l4n5J4L8J21l60L65O3m95N77k55R5k95
3147a56J59p1J61k16J57k39J41O5K5K6J80m14oJ36jK4j2j91L19l47L18q1R9k09
3171a33J65l5m7K67m38M39o0j34J02n1k46J10J35k8j43O9k7Q3J1J39r4j31j51
3194a98J07m9L93n60K62J33l99M34k36K18%n9J8Q5k10q4M6K26R8j26j08J31m54
3217c32L29k57J32R9P6j9l9k03o7L21p7K74l57K04j92j05K11K95m76p4L32J66
3239B41l18K5oo1J22k48N1M27k41q5J86Q7j3J77j50l51K32l1O9m83K53J90L7r2
3263A8j49J15Q2j46L19k07j29k9J9L59k02p5q0J28P3j74Q1l14M1j4J2K40J84k34
3287h2L53l3l43M6J62o5l27K74N0P4L4L4j70m6L9R1k83J46J2K49j45J90k90JJ04
$$ plain form
3124 140 224 -113 -51 -173 59 -147 -186 -342 -117 65 31 -24 -10 28 149 -211 154 217 -278 299 44 139 -156
3147 -156 3 -68 93 -123 34 -205 -64 1 26 52 232 -182 -188 -52 -53 -29 -41 -232 87 -260 58 -23 76 -133
3171 -133 32 -3 -50 217 -221 218 158 24 126 75 -171 -61 74 46 -97 -28 -55 28 39 178 84 -47 -198
3194 -198 -91 -140 253 -307 -45 88 -311 123 -113 105 105 46 64 149 -61 -145 -99 127 225 99 -9 122 -332
3217 -332 -3 -260 -128 -29 47 28 -11 -214 -281 40 -37 237 -120 84 -108 -213 -2 293 -183 -257 75 241
3239 241 -77 -52 -58 -119 3 -245 -194 233 -8 -93 93 180 167 344 194 -157 75 44 113 -370 -117 73 110 18
3263 18 -131 -16 66 -80 239 32 -97 -126 -107 252 50 -25 -105 23 96 -78 3 -311 -270 -284 -272 -32 152 -82
3287 -82 271 238 -105 -59 103 38 -289 -15 35 109 143 177 7 -39 0 91 -192 -46 -34 215 70 260 -30 -29 75
3312G5K04n51J73N3j60N20l66LJ03l82M28K0j52K39j27j14k3O7p7J46j08M7J32
3335A50l11O7J86p3j63K72j17q0M3K33m53M24J13k79R0k44L54m09L94l71J83M88
3357D97j81n05L29l56M46l26J56j25J87J10j56l2O1j99J92q3k49L02oj69N9pj8
3380g3J19J1q8j38O67l10j56Pj52k02K10K33M7m20N85j68n5j64K77r5j79rK07
3403A54K30k46j75K09m16L44m42N76l00J2J81k66j20K63J28l20J91r4K42oj43
3424Bm2M81p54K76j02J17n1j73J88k0L99l27k71L22J0j78L41k34J98k37K51j95
3446AqJ56l00J81J53j61Q2O8k6P4m20J63M3k9k73K92o7J35j20k44K22M5r4j55
3470b82Q3K21Q8j56Q9j49oq5J10J02q6J95O6j23q5j7k79L63l1J10k85j2J36K1
$$ plain form
3312 75 279 -272 -99 -46 -206 314 -52 -49 54 -328 100 120 -32 207 80 -34 -57 10 -67 79 -29 18 150
3335 150 -161 -94 92 19 -144 128 11 -69 -26 207 -246 178 291 12 102 -142 212 -197 197 -174 9 497
3357 497 316 -189 140 -216 230 -96 60 -65 122 232 76 44 105 -94 98 15 -234 68 62 -107 -48 -55 -73
3380 -73 46 57 -31 -169 498 188 32 39 -113 -315 -105 128 175 -245 340 172 117 -47 230 135 -44 -53 154
3403 154 384 138 -37 172 -244 100 -342 234 -66 -54 127 -139 -259 4 132 -188 3 -91 151 145 2
3424 2 -40 441 -313 -37 -139 -22 -73 -246 -58 -78 321 -6 -277 45 55 -123 218 -16 182 -55 196 1
3446 1 -7 149 -151 30 183 22 104 172 146 220 -200 -37 6 -23 -296 -4 -71 64 -56 -300 -78 -33 -127 -282
3470 -282 -199 22 110 -46 43 -106 -112 -197 -87 15 -71 124 190 67 -18 -35 -314 49 18 128 -157 -169 -33 -12
3494a2J3p4J73r3l9k00J24R4j96rJ32K54o9jQm21M15J75m63J12q3k5L01j30k8
3519d2Q4k80n4K26J74j65r2K93m02J5l2K38K97j60j45j1k4j84K59M0P7k4j60L92
3543C20o16M63j86m38L85j1p5J12k0L6j0m29Q05j05m03K94J25J55j52m57J03K57
3565A53j82K46m30J59J94j38J50m39M20M3k95J15o0J92k68M1J07r9K72k15R4m2
3587A8j39r6J74p1K84m75J51P7J02j04J82j86R3L2k59R0J35N4K03k00n6k09J49
3610e1J49J42L0l37l3J11J8j45J09l1J82l62K69j7j18J66k22l0k9J4O46o16k06
3633c61L06nJ28m51K30r7P5l8K21J55l37J79j38m4Q4J78j1k18k36J9J85K59l75
3656b92K59J8J69n35J12o4O23m60L5m5J88J9J66l75L84l37m8K73j48J07J43r7
$$ plain form
3494 -12 1 -73 100 7 -32 -232 -108 -14 -210 -219 -87 167 98 97 105 -316 99 274 -189 -77 -160 -185 116 -14 -42
3519 -42 42 -238 -292 -66 108 -57 -149 144 -258 -243 -275 -37 260 100 -45 -56 -80 -264 -5 35 112 88 -72 320
3543 320 -296 167 -19 -457 -72 -83 -158 -46 -66 -30 -40 -469 336 231 -172 122 247 402 250 -207 -104 153
3565 153 -29 217 -213 -54 140 2 152 -287 133 176 -119 -4 -64 128 -140 -99 8 -91 181 -34 60 18
3587 18 -121 -217 -43 -114 170 -305 -154 -77 25 -79 103 -83 10 42 -217 -127 8 62 265 65 9 -200 -51
3610 -51 98 240 270 -67 -100 11 29 -116 -7 -38 144 -218 51 34 -84 82 -140 -170 -199 -185 461 -155 -361
3633 -361 -55 -60 68 -383 -153 -250 -175 -213 8 163 -174 5 -133 -177 -93 85 74 -144 -380 -361 -176 83 -292
3656 -292 -33 -15 154 -381 -269 -333 290 -170 -135 -180 8 27 193 -182 202 -135 -183 90 -58 49 192 95
3678I5j61J74L8n38K39J46K04N2m02L3J69L6l6Pj21J88j81M10n91p4M26l21R8
3701a10p4J17q5J19o0K03j81j55K04k12K26k02K19j68O0L62k21k70J86k67L89
3722H0o8m8o7L98n10p6R3M20q0n1j14J87k9k07Q8j20KM03j94j54J21j28j69j73
3746c96O35m79K23L3O8M8j82j20L19K4m52K00r3L3K80k59J94l14M07p7J2r8J26
3769A32Nnk7o4L26j44p9j7J53j40l29J78n1J60k28r6K98L6j46J0M4Q8k5j39l1
3794i1L96q7k40k32l5L49J04j61q7J65k99K36o2QK22J5k49J33j94j25k3R6M6J15
3818@q0K36k07j47J74k37L88k12Q7j23J31n8M29m12P4k4J83O7j04k93J01Mo9N
3842h7M0j08J57p3n5r8J16K57J18k67k53L60J09j51k39J58l63L31J64r2O1j8q3
$$ plain form
3678 95 -66 108 146 -392 -153 -7 197 249 -153 -120 49 85 49 56 -65 123 -58 352 -239 -313 113 -208 -110
3701 -110 -184 -67 -152 -33 -93 110 -71 -226 -22 -234 -8 -210 9 -159 -99 263 42 -228 -42 -309 80
3722 80 12 -36 -103 295 -215 -291 -198 222 142 91 -23 164 135 -72 16 -104 -102 301 107 -47 74 -54 -223 -396
3746 -396 239 -240 -17 16 84 132 -50 -170 149 173 -279 -79 -172 -139 141 -118 76 -238 169 92 104 6 132
3769 132 137 132 105 41 367 223 144 127 280 140 -189 -11 -62 98 -130 -226 72 108 -38 -28 16 104 79 -60 -91
3794 -91 305 218 -22 -254 -289 60 164 3 -84 81 -218 18 -44 -36 186 201 -48 85 -109 -234 -257 -161 -115 0
3818 0 -80 156 -51 -198 -24 -261 127 -85 2 -121 10 -48 381 -31 43 19 202 269 165 -128 -27 -23 -92 -87
3842 -87 -47 -155 2 -71 -126 -224 -108 149 267 0 -253 107 216 65 -174 -16 -379 -48 116 24 85 67 -16
3865a6k63L90K17n53M98k70r3j18L78k74N5k45L26l54O5K39o6k02K58p7j20J84
3887d1J49M2j92Q1K56k30Rj4k42L62k42K03m78K05K50m1j19M4J65m09L53p0J55
3910A96k34J94j58p6p6J90l23M47j33J56J35L8k67q7M67o29J10n2q8K63k79J86
3932b0k73L74L2m45M50j42L12m4k40nk38K42J66j18R4m36K90J17j67j45L73l22
3954a45K02m8j67J00J88m29M60l3L4l22J61l0n6K36m9j87K25J53k59L2K71j62
3976A75j52k47J34m6k8L16L9k85P5J14q7k22J05J63K23j14j25j89J82o3K35k25
3998b2J23j6O9pn03O32l78L22r2k88J96J30j58P7k8p0n6l8O8n5J14J29k23J52
4022G8K02j41p5J09k41r2J47J17l3N1N4j64O7p7M36m21Q0j00R7k02K61j11M19
$$ plain form
3865 -16 -279 111 328 -225 273 3 -90 -208 170 -104 -49 -294 32 -322 -257 -18 -84 -286 -28 -105 -225 -41
3887 -41 108 150 -42 39 295 65 74 60 -182 180 -62 141 -337 -132 118 77 -42 2 167 -242 111 41 196
3910 196 -38 156 -2 -78 -154 36 -287 160 27 183 318 356 89 2 469 -160 -50 -102 -190 73 -206 -20
3932 -20 -293 81 113 -332 118 -24 288 244 4 -1 -239 3 169 51 145 -291 -1 116 -51 -196 177 -145
3954 -145 57 9 -158 -58 130 -299 161 128 162 -160 1 -29 -85 151 102 -85 140 293 34 66 337 175
3976 175 23 -224 -90 -136 -164 152 191 -94 -19 95 8 -214 -109 54 277 163 38 -151 31 -32 203 -22
3998 -22 101 85 154 147 -356 276 -102 220 128 -160 36 166 8 85 57 -13 -69 -107 -39 -94 20 149 -74 78
4022 78 280 139 64 173 -68 -160 -13 104 71 122 176 12 79 2 438 17 97 -3 94 -108 153 42 461
4045D61m89J89j91j03K64j15j59j07K58l4q3K70k74N0K62k76k9K35k1J11j22j05
4067hJ82R8k32k56J96J35O4j76O3j81M07k66J64l75K43n5J6J88k80JP6J95k48
4090d9p2l0LO12m60n7m0KJ26j19M0j03j35M05k72L75j05j00m61K68K3L21j12O7
4114A27O3l62M2L45k2k3K73o08K57l83L96np7j4r2L92k55N7j0M4J55m0j39k45
4138a24R2M2J24lq6P1r6p1k31L83m5j50J54J33k12k39J80J51j43j17K30M69l22
4161A90j89j54O1r9K34J19k65K2Lj21K86k81K17L02l80j73K60J04J69j78k56m83
4183f12Q15k29N4j33L33q8k40L62m52Q4K41j67j47M78k11J13N5j85k80J66K46
4204B03K51m35j46K40n5J26k91J89j76K35L7j6P5m76N73j42k47J58J93k78j18
$$ plain form
4045 461 -28 161 -30 -133 131 16 -143 -250 8 -26 -109 161 -113 -63 199 -77 -106 129 108 219 97 -8
4067 -8 174 272 40 -216 -20 115 179 3 66 -115 292 26 190 -185 58 3 19 207 -73 -72 4 199 -49
4090 -49 -121 -151 -148 464 4 -53 -93 -91 35 -84 -44 -147 -282 123 -149 226 121 21 -440 -172 -149 172 60 127
4114 127 190 -172 -130 215 193 170 443 -165 92 -291 105 100 23 9 -83 309 54 111 101 145 300 260 121 -124
4138 -124 -32 10 134 131 45 116 20 -51 -282 101 56 -94 60 193 -19 -258 -78 73 -70 -187 43 512 190
4161 190 1 -153 -92 -191 43 162 -103 -81 -78 -199 87 -194 23 325 -55 -228 32 136 305 127 -129 -612
4183 -612 203 -26 28 -105 228 140 -100 262 -190 -106 135 -32 -179 299 88 201 256 71 -209 -43 203
4204 203 454 19 -127 113 58 184 -107 82 -94 141 178 162 237 -239 334 192 -55 103 296 18 -100
4225a00J09K38l16k13K92l2k81K68k45J61q2J23K95j67K16k34l9j16M52k89K2
4246F2L51l62j02Q8J09L4j40p3R0j44J42O4N4nk18J68o2oj46J0j02K74l06K29
4270In4K12n67M21q5J53j69O3k72L89R1j60J77l23L01l10J12j6m1k15J06J29j15
4293a64K4N8R9K9k25K58r3Q8p0Q9n7j25K27j93J21r4L29j90m42M00J21j42K2l6
4317C4j08K38L5j92J80k92j64L07j7l99L82j5N2K09j89L8k13o0K95j93j79K90
4339C9L1j2K8q2j40Or0K95m8j70K36j1q9J32j84j4J19K2l38J63k66K71R9%Q0m03
4365c26M57p0k10K29j58Rj44K24j22P6J20L6q1Q5k11j18K14K60j89J23l29J32
4387GJ68j59L63l17J05k02J81k17J14k39P9P5N1J16J26l96K54%l61L51J00j5m8
$$ plain form
4225 -100 9 247 -69 -282 10 -22 -303 -35 -280 -119 -201 -78 217 50 266 32 -7 -123 329 40 62
4246 62 413 51 -51 37 146 180 40 -33 57 -87 55 119 173 168 -50 118 56 50 -96 -86 -188 86 -220 9
4270 9 -45 167 -400 21 -64 89 -80 -17 -289 100 191 31 208 -115 186 -124 -12 -28 -69 -284 -178 -49 -164
4293 -164 -140 -82 17 46 -179 79 -14 74 4 93 36 -89 138 -55 66 -28 301 111 -331 69 190 48 70 34
4317 34 -74 164 199 7 187 -105 -269 38 21 -378 4 -11 41 250 61 99 -114 -174 121 -72 -251 39
4339 39 70 58 86 4 -136 -130 -220 75 27 -143 93 82 -7 125 -59 -73 46 68 -270 -107 -373 -102 -3 -3 77 -326
4365 -326 131 61 -149 80 -78 -69 -213 11 -111 -35 85 121 40 125 -86 -204 10 270 81 204 -125 7
4387 7 175 16 379 62 167 -35 146 -71 43 -196 -117 -42 9 125 251 -145 109 109 -252 99 199 184 136
4410A36m24K11J34r2l0n6M4J86q9R2j95J64j56kk70M46l5P7k53K46n1j34J76m44
4434c19O2L28J29j58j56%J86p6K98n9o5l37L23j76J34j03L20k58J33l32j76Q3
4456b19L50j52l4k7J11j20lJ76m28N14j26k29O7J09M5o4J84L4k06N6q0j45r4M54
4480A73l80p1J71q6Q0K76k04l5p3J52N0Q4k99J80n8k27J85j26L56J7j05k54L9
4503a55M15k52k42K09O7O7J56k17l4l94L34K41l39J02j81J21k2M44r4j44n6R4
4525A20k63M24k21k03P3M8L08l07J8l55R4L46r5K27m11K99q6l73N87r5o2j66j13
4548b06N4K98k04R9K0q7j34L78l74mJ71o1J86r1K44l38k23K96j15Q0m0j94K8K38
4572B1J36q3J19Q7n2m38M63r4J02k91k2Q2j55K76n62L66k83N9K9K11k36L50KQ2
$$ plain form
4410 136 -288 -77 57 -35 -65 -121 -77 109 20 112 -83 81 -75 -77 -347 99 64 141 -112 134 83 -51 125 -319
4434 -319 -257 71 200 42 -114 -114 72 -4 294 235 170 -167 156 -20 114 11 331 73 206 -126 -302 -219
4456 -219 131 -21 -55 -82 29 -91 -94 82 -346 168 42 -187 -120 -11 34 -30 154 188 -18 38 -42 -187 -281 173
4480 173 -207 -278 -107 -193 -113 163 -41 -76 -149 3 53 137 -162 18 -40 -267 -82 -208 148 165 60 -194 -155
4503 -155 260 8 -234 -25 42 109 265 48 14 -380 -46 195 -144 -42 -223 -102 -124 320 226 82 26 120
4525 120 -143 281 60 -143 -70 -22 286 -21 -3 -358 -264 82 -13 214 -197 102 16 -357 230 135 73 -93 -206
4548 -206 -152 146 -58 41 61 -26 -160 218 -156 -160 11 -50 136 45 289 -49 -272 24 -91 -11 -51 -245 -217 21
4572 21 157 74 193 280 228 -210 253 159 261 -30 -52 30 -125 151 -411 -45 -328 -269 -240 -29 -265 85 87 169
4596A69k34j80N18m01M6O8j12J78o2L6r8j22L64r1m84L76M5j24J96Q5O7n37L55
4619E8J6l38J97k1J26k5J72j22J16j21k27K89j51j36J46J11j22l06M35q3p3r5
4641a54K25l09K56R2k96J2n0M28j91l2K48r3k99K10k22J7L48m01M55k85K5J15
4663I9p4p7k32M00m6J14r5q8k15O2K05j81j83k1L14K96k97j66M99l76J47KM1K29
4687C57p08M34j12K4J58k10K46J23o8k95P2K50p33N36j6J67l75j40K52j16l4K14
4709B6rl28K29J88K3l00K84j22J97J39k27j40p2K77jl24j57Q2K06l92O50J05l18
4732A6l92L11K84j55j15K3k47M2K84k77j15L39K34n15K95J84jk42m1J82lo6j31
4755a06MJ99j14J37j24j0L62l98L64p9k52J25m73M14L9l7K48j99k96k5L66n17
$$ plain form
4596 169 -65 -245 273 -128 -82 -14 -126 52 -10 26 -72 -194 170 79 -405 -29 16 -108 88 173 240 -297 58
4619 58 74 -264 -67 -88 38 13 185 63 179 58 -169 120 -31 -167 -21 90 -32 -338 97 14 -59 -154
4641 -154 71 -238 18 110 -186 -174 -224 204 13 -19 229 136 -163 47 -175 -158 190 -211 244 -41 -16 99
4663 99 25 -52 -284 116 70 184 89 1 -214 -152 53 -128 -311 -332 -18 278 -19 -185 314 -62 85 87 128 357
4687 357 -351 83 -29 -5 153 -57 189 312 244 -51 21 271 -462 74 58 225 -150 -290 -38 -154 -188 26
4709 26 17 -311 -82 106 129 -171 113 -9 188 327 100 -40 -112 165 164 -160 -317 -235 -29 -421 229 334 16
4732 16 -376 -65 219 64 -51 -28 -275 -233 51 -226 -341 -2 232 -283 12 196 195 -47 -88 94 91 25 -106
4755 -106 -102 97 -17 120 -4 -14 348 -50 314 235 -17 108 -365 49 88 51 299 100 -196 -221 145 -372
4777c72L71J34j45J13J89m04K58k39J04k1J29K9p7l15J92QK92k93j59L27p9k46
4799b04M15j99o9J27Mq6NL00l74QR4j2p5J95q4m09K72J12K0k57K46p0J09n3j39
4824a24n4J63j02k23J94N40j59l49L9Q5k14J37O2k17K71K0k37M9Q6j41K14j8M5
4847F7k3M5j60L4J50L7k31M81o25M5N91l39L7k26r8M84q0j99L34l03MNk60K68
4871C8Q4j60P2j98Q8j70J26K04k30L80j3l45j8j30R1L85k93J80m6l05K84K47J08
4894C79k44j23J34j82K41j82j87K16K23l17j59r7J01M54k92j9O5j29K46K04l42
4915a0j75P7m8j46M24n8l4%K88o10J35J26L65l71j2K04m32L73k27O27j65m30J2
4938h7r7K38J21j69p6O1Q8J50j02K8Kj40J62oJ71m30r9J17M6j85R2J30k62L12
$$ plain form
4777 -372 -1 133 -12 101 290 -114 144 -95 9 -12 117 146 69 -246 -54 -46 246 -47 -206 121 42 -204
4799 -204 211 12 -57 70 74 -12 -7 293 -81 -73 21 9 -66 129 45 -364 -92 20 40 -217 29 -41 68 15 -124
4824 -124 -178 -15 -117 -340 -146 394 235 -114 -75 10 -204 -67 -5 -222 49 69 -168 -119 -33 -174 40 22 67
4847 67 44 89 -71 -37 113 150 -81 400 -225 -180 411 72 109 -117 -215 269 189 -10 324 21 25 30 -230 38
4871 38 122 -38 34 -164 -76 -246 -120 84 -146 234 221 -124 -142 -272 -181 204 -89 91 45 -260 24 271 379
4894 379 135 12 146 -36 205 23 -164 52 275 -42 -201 -298 -197 257 -35 -54 11 -118 128 332 -10
4915 -10 -185 -108 -156 -302 122 64 30 30 318 -292 -157 -31 334 -37 -49 155 -277 96 -131 496 331 -99 -87
4938 -87 -184 54 175 6 -70 -9 79 229 127 155 157 17 179 173 344 -86 -185 -68 -22 -207 -115 15 -247 65
4962F5L9j8j40K32k5q1j71J76j08K9K22J40l70K45m32J32P1j00K25l94J36r1J10
4985a08J5r9L04J15k71j45M29P3m98J44k3J12J67j76j1%J04k73j5J88Q9L57k35
5008B43O4l96Oj58K37j8J65n9o7p8N4j22M3L1l06R0K79k78l0O10q9n3o19K75K56
5033H0j09K41mO2J4n93K14J61M6m63M26p3J6q8K06j07n0Lj60M85k44m3l66J28
5057b18K71lN2k81J01P4M9K51j15m89K48K63k81j30K50N7m45N67k56k99L43p4
5079f5j97J90m6J67m06N59k97Q0J21K3k80J23K54l17kJ61K76j77Nk01q8Q0J56
5102A19k11K14j75r2Q7J43l0j1k13J12J07l29K68j63J98L00n06K68k6n8J22K27
5124C51m80KK54l46N42r2j19%j67M5L8m2L06k02lk52M51j65q3J48j12p6J25q1
$$ plain form
4962 65 104 86 -54 178 153 72 -99 77 -31 -2 220 360 -10 235 -197 -65 6 -94 131 -263 -127 -218 -108
4985 -108 -93 -192 112 227 -44 -189 240 313 -185 -41 -64 48 215 39 28 28 132 -141 -156 32 121 478 243
5008 243 307 -89 -83 -241 -4 -22 143 84 17 -61 -7 -129 -86 -55 -361 -271 8 -270 -300 310 221 168 -451 -176 80
5033 80 -29 212 208 270 284 -309 -95 66 112 -351 75 2 18 -70 136 29 -21 -18 -178 307 63 20 -346 -218
5057 -218 53 50 102 -179 -78 -4 45 296 181 -308 -60 203 -78 -208 42 99 -346 221 -35 -334 9 -65
5079 -65 -262 -72 -118 49 -357 202 -95 -15 106 129 -151 -28 226 -91 -93 68 344 167 172 -29 -117 -37 119
5102 119 -92 122 -53 -145 -58 85 55 44 -169 -57 50 -279 -11 -174 24 324 -182 86 60 2 124 351
5124 351 -129 -127 127 -219 323 231 112 112 -55 -10 28 -14 292 90 87 -165 286 121 38 186 74 -2 123 42
5148D2k92N68k32J17j01J75l07j15N7K38j31J73m18J14J50J30j51k46K92l61L53
5169E5l85N08k45R4J3m12L31J05l3K17p7%k13j48J42k31R7M07l8k43K70j22j26
5192c4O3j78K29L1j0m2j6m21L57m8R2j54K69L8m00p2R1L18l44J00O2l7M83n17
5216a40m5Q3J40k25M5K23k3K89k85O4J3rj03l56O09k30K3k6l2M3k59L26J2k41
5240a04J71k21J79J14L0r4j18O4r6L19k90L75l99P8L8N8k03P8j1O3j58j1J79K06
5264B47o03M31j46K39l11J13m8N0M72q49K58K07J2J27k72j86K53J51o0N1k03o1
5286a28l2K45k63K87j08j85K28j94L49r5k1q0j17K96Jj39P0l20R9N5ML51k34m5
5310B4R8j2j75j89K06o7J56n9l38L07J33j65L4j57L57j45j49M4J19j35m7M55k91
$$ plain form
5148 42 -250 318 86 203 102 277 -30 -145 -88 150 19 192 -226 -112 38 168 17 -229 63 -298 55
5169 55 -330 178 -67 27 40 -372 -41 64 31 248 171 171 -42 -190 -48 -279 -182 225 187 -56 214 92 -34
5192 -34 29 -149 80 111 101 59 43 -378 -21 -69 23 -131 138 176 -224 -296 -205 113 -231 -131 -69 -106 377 -140
5216 -140 -185 -102 38 -187 -142 81 58 347 62 126 139 130 27 -329 280 50 73 47 15 58 -201 125 137 -104
5240 -104 67 -154 25 139 169 75 -43 21 -75 244 -46 329 -70 8 46 104 -99 -21 -32 31 -127 -138 41 247
5264 247 -356 75 -71 168 -143 -30 -78 -28 444 -405 -147 60 72 199 -73 -259 -6 145 85 136 -67 -128
5286 -128 -160 85 -178 109 1 -184 44 -150 199 104 83 3 -114 182 183 44 114 -206 -107 -52 -48 303 69 24
5310 24 122 110 -65 -254 -48 -115 41 -18 -356 -49 84 -81 -47 -204 153 8 -141 -97 22 -113 -160 295 4
5333Dj89L25k86N9j66P2K47j17K4k62L37J6N4m14J16J46k64M05m8o8j79J86Q8
5356H6O3m30L52j97J54k18K29j04J44K59l29J22j07k42R8L58k97j32j5K05o2p7
5378a40R8k23K07k8R2j52J63l7J60j36L0J10K6K6j50j69Q1M2J4J22l66J06k62
5401c86N10l58K18M5l50P31l15l21L21l30R7K92j60J48j8K77m96P1j03L79j63
5422H9Q4m01Q3L57k69mJ07k33J92O7k58J14r4J31p1L3R0j30J91K04n62M27j59
5445a2k04K74j94K75l03L38j03l4n5P2j07Lj02Lj0l8J99l01M3K08o0Q2n4n2R1
5470d1L48m64qo3J65P3j00J64J83n44K39J98L6j15L7k35L30l36L11j18J4k32L69
5493B11k64k3J91q9J21J96m27n0L77p7o4k13J76j56K04k03L46l90J34p3j96M67
$$ plain form
5333 4 -185 140 -146 -87 -253 -181 66 -51 -27 -289 48 64 118 -296 -180 -34 -298 107 59 -9 -188 -2 86
5356 86 149 -281 71 -126 28 -190 39 -65 79 338 9 131 24 -218 -120 238 -59 -191 -206 -1 -63 -140
5378 -140 -42 -265 -58 -86 6 -146 17 -20 140 4 34 144 170 196 46 -123 -42 0 14 136 -230 -124 -386
5401 -386 124 -234 -16 29 -321 410 95 -226 95 -235 -138 154 -6 142 124 401 -95 -24 -127 252 89
5422 89 173 -228 -145 212 -57 -61 46 -187 5 72 -186 -72 -166 -35 -106 -73 17 -113 78 282 -280 147 -12
5445 -12 -216 58 -136 139 -164 174 71 37 -18 54 -53 -50 -152 -149 -159 -197 2 -299 -256 -48 -108 -26 -80 -132 -41
5470 -41 307 -157 -165 -228 -63 10 -90 74 257 -287 -48 150 186 71 108 -127 203 -133 178 60 74 -158 211
5493 211 -53 -76 115 26 147 343 -84 -134 243 166 102 -111 65 -91 113 -90 256 -134 0 -73 -269 198
5515A98k02k44J85J80j87K03M4l58K22J99k98L03j89j74N4p8j7j47M7K63q4lL18
5538B35k74J26l5jk81M7N26m68Nl9P5j50L08j7k17o4M72n66N65l28J11j29J26
5561B7j02k5L4L34j49K3j02j29K35o5N9k12J86m4J56n08L99k88J84L1J20lk72
5584a11j2r1L50j52l02M12k57J73K12k67L9M54p44Q8K92l90J41L18k44J99k77
5605a69J17J37J7j22L86k30L4m2l61L33J10j94J54M4m10J79r3J81l47L86Q1l05
5627a14L02l22J89j66l0L07m68K72o4O2j69N3J50jj72K05P2J21j65j61J86j0L0
5650A07l86M38l1N7j24r5k56K85j27L8L86j10o0k1L81o87L59k01k64J15K54k34
5672a76l03M12L33j74p1o2J09k43J35J90j13l0J42J18j27l32J48P5JO4k41J54
$$ plain form
5515 198 -4 -248 -63 117 -70 133 177 -181 41 240 -58 245 56 -118 -64 -142 -159 -306 -259 4 -80 -83 235
5538 235 -39 87 52 51 -230 -183 343 -125 -120 -159 -84 -234 74 57 -160 -224 248 -318 247 -81 30 -99 27
5561 27 -75 -100 -66 268 119 142 40 -89 146 81 140 -72 114 70 226 -282 117 -171 13 44 164 161 -111
5584 -111 -123 -214 136 -16 -318 94 -163 10 222 -45 -6 448 -296 -208 84 -306 -165 153 -91 108 -169
5605 -169 -52 85 102 -20 366 136 170 128 -233 100 210 16 170 214 -196 -17 -110 71 -276 110 191 -114
5627 -114 188 -134 55 -111 -141 166 -302 -30 -94 -32 -201 -148 2 1 -171 34 106 227 62 -99 87 77 107
5650 107 -279 159 128 185 61 -34 -290 -5 -132 -94 292 182 122 101 482 -205 154 -47 -311 -196 58 -176
5672 -176 -479 -67 266 92 21 -41 68 -175 -40 150 37 7 149 267 140 -192 -44 31 32 96 -145 9
5694IL1l6k25r5L91Mo7j84K59m7Q9j83R7j51J46J23k93J52k16K28j75J54Q1J12
5718B04m4l37K29M4l37m6M52l80K98m7j86L08r5n7j56R9k40L80k70J39k24J03
5740a63N17m7k14k81K57j06K7N0K65k07P3j55J79l34P9R2K13k68m4M2J24m4o5
5763a0M04k59K1k59K94l57O6O3K00m7J49K1m24N70k83k83K66k4m4%j44J56J31
5786B07j15j94K10J21k56oN4J84j77k17M90l25K52k09q6L4jR3K84l76j21O0N42
5809D48j96O9j32l14J50j88r2P0J32k10Q0O5P4P0j38J28j23O5j58L59j09K77l90
5832f3l22N12l26K51k47K07J5l3J5l03nJ12N57l33j7j9J84J7j99m1j27J53P4j88
5856a26O16m87j80K56k52P8J60q7M9k80N18l68K8R5m6J24n8K2NL3l8MK81m49L53
$$ plain form
5694 9 40 4 -221 -316 75 79 12 -172 87 40 129 -54 43 -108 38 161 -132 20 -196 32 -143 11 92 204
5718 204 160 -177 52 96 -241 -287 165 -215 83 36 -150 158 63 6 -150 -51 -291 89 -181 -42 -266 -163
5740 -163 354 307 93 -188 69 -37 -10 40 305 98 171 16 195 -139 -60 32 245 -23 -67 -25 99 55 -10
5763 -10 394 135 156 -103 191 -166 -100 -37 163 116 265 286 -138 432 149 -134 132 108 64 64 -80 76 207
5786 207 92 -102 108 229 -27 -33 21 205 28 -189 301 -24 228 19 -67 -33 -34 59 343 -33 -154 -94 448
5809 448 252 321 189 -125 25 -163 -255 -185 -53 -263 -183 -118 -44 26 -112 16 -107 -42 -200 159 50 327 -63
5832 -63 -385 127 -199 52 -195 12 27 -6 9 -294 -299 -187 370 37 20 1 185 202 3 -38 -165 -12 62 -126
5856 -126 490 3 -177 79 -173 -95 65 -22 27 -253 265 -103 -75 20 -26 98 40 62 67 100 62 66 347 -102 251
5881B51m39pK22Qm18J73J16J84j9L6j41P5k99L70J3J3o3j81j8j1L34K9l0j36l00
5906b38K95j27PK73J6m9R2m71N22n87J22K55k0l45K90J6j51L95m32J48J59r0j06
5929b6p8J29k08J96Q5k94J72j19K10O6l28M11m2k22j56P1J99k0j10j44J94K53
5951B39j99j01jJ80k17j2J88K00o6k05n0j58J72j71O6J86l3j52Q3j37J90k15J13
5974a00Q6k01K15m7k1K50k2k51M36l72lK39p7L20p39K82P3l13L44l09K28L0l02
5997b54M07j86j56J25P9l32L93jj64L46k17qr2L1r9K01m21K85m8J10q3M9mLQ6
6022E0j35J35J49k21J8J11q2q1Pk5k55M33J90l71j37K23K85j4k63N2J52k45L51
6045C27k9m56L04k14L8p5L58r4l35K46k1l14J75K55j02k24L52p4J03lk76L7n0
$$ plain form
5881 251 -188 -195 27 35 -383 -210 -94 90 71 107 -34 41 -258 112 125 138 75 -106 -124 -135 199 228 198 62 -238
5906 -238 57 -70 -63 210 226 177 269 -202 320 -267 -145 110 90 -255 35 51 -100 295 -137 11 170 80 -26
5929 -26 -104 25 -183 13 98 -196 -24 -143 67 133 -195 216 174 -48 -204 -133 66 46 -64 -208 -14 239
5951 239 40 -61 -62 118 -99 -111 77 277 211 6 -44 -202 -30 -201 -135 51 18 -134 -51 -188 2 -213 -100
5974 -100 -14 -215 0 -47 -68 182 160 -91 345 -27 -30 209 132 452 -287 -5 68 -245 99 -210 18 48 -254
5997 -254 153 -33 -189 -64 15 -317 76 75 -89 257 40 32 -60 -29 -128 73 -348 -63 -111 -1 -84 -35 -39 -36 50
6022 50 -85 50 199 -22 -4 107 25 -56 -49 -74 -329 104 294 -77 -214 9 294 280 17 69 221 -24 327
6045 327 298 -158 146 -68 -30 -105 253 159 -176 70 49 -265 -90 165 63 -161 191 117 220 217 -59 -22 -72
6068g2K16n0j20K91k99m5J82j49j21J44l7K12j07l79K20M2L27j59J78j64j63K74
6090B21j46RJ65j97k11k8n7K55n0K0J08j94M04j68j30m6J11M2m51M94l43J09M3
6113d0n3r3j32M9L11qm1k5k3K7J58l43J45J58j90L23j77j85K6K63K4O7n39P62
6137D64m36L29k82j00J93N3m84K98j33j42K05k2R5j9l8l9J12m2l74M43j41J21
6159F1o1J2r5kK54M1k98j69K03n0L7J07M5o3L36k49r4J15o3l8k34J23K46j90J78
6184A52J19j10m85J8K24K96j09j07O0k9L07k66j87L78j81l52N27k63o9J69r5j03
6206a06L47j52j54J50J08l31L63K79q11J22L2q7K41L13m18K86k28J8O6K49n3n01
6228b67L43k19N3K27l36K9J79N3j63n6O5J35m9j86O9K95l9J5J85n47L43l4K3j72
$$ plain form
6068 -72 144 94 -26 265 -34 -79 103 -46 -167 -23 -60 152 45 -334 -114 -72 255 96 274 110 -53 221
6090 221 75 84 249 52 -159 -187 -244 11 -39 -19 89 -105 299 131 1 -45 66 108 -343 151 -192 -83 -40
6113 -40 -93 -186 -318 -269 42 34 -7 -32 -55 -28 130 -213 -68 90 -100 223 46 -139 -113 150 174 241 -298 464
6137 464 28 357 75 -25 168 221 -263 35 -98 -240 -35 -57 38 19 -19 -58 54 12 -362 81 -60 61
6159 61 0 12 -83 -85 169 210 -88 -257 -54 -104 -67 40 85 22 358 109 15 130 67 29 -205 -82 164 -26 152
6184 152 271 161 -324 -306 -82 214 105 -2 58 29 336 70 -117 261 80 -272 255 -8 -77 92 -3 -106
6206 -106 241 89 -65 85 193 -138 225 504 -307 -185 -153 -240 1 314 -104 182 -46 -28 38 287 234 -267
6228 -267 76 -143 -90 137 -199 -170 9 62 -101 -157 -92 43 -6 -192 -123 172 133 148 333 -214 129 95 118 -54
6252e4M9j42K72k09Q0n3k25L08j0P2N31k04o03K39LP0l24JK50j08K55j96k64K64
6276BJ41r3R9k94K42l29J86rK6J32j61N2J33n9k35J35K09j34j49J01j19J46j06
6299h4Q8K64k58P3P9j07l0m5M3O3J17k13L39k02K1j6k03J90j41l14J55K02j7k26
6323b22L86R2m34L69j49kk07P4J55m30N14o6j17J74l0J5N2j86n1j07L95l01j28
6346b04K24k97L09Q6P5j35K6J20k63j07K46Q6ml2j24j34j71K37j02K22k90K2J48
6369f2Nj36J75oQ3l31J18K95j25J3J3l72L16J06J40l06J71n9L96k29j85k19J52
6392d7J16N2J84n49L08j62J01M5K0l62N49l47Q7k17lJ48K77j78m30P12l46r4j44
6415b80J21J55J32n42L61l4J83L2k49L50n5K9p0kp4l8k5J56j41j91L25R7k99J07
$$ plain form
6252 -54 -5 -147 125 -84 -4 -57 -282 26 16 88 619 415 -188 51 54 124 -200 -199 51 -57 198 2 -262 2
6276 2 143 50 149 -145 97 -232 -46 -55 -29 103 -58 -6 127 68 -167 -32 177 43 -106 -5 -124 22 -84
6299 -84 4 268 10 83 162 55 25 -20 23 86 203 -10 329 127 148 132 -71 119 -22 -336 -181 21 4 -222
6323 -222 164 256 -178 191 42 40 -167 -93 62 -368 146 80 -37 137 107 122 174 -12 -63 -170 225 -76 -204
6346 -204 20 -277 32 118 193 58 84 204 -59 -166 80 166 162 130 6 -128 -299 -62 -164 58 -232 -210 -62
6369 -62 -57 -193 -18 -24 59 -272 -154 141 16 29 42 -330 -14 92 232 -74 97 38 434 205 20 -199 -47
6392 -47 69 121 305 -244 64 -98 3 48 68 -294 255 -92 -5 -222 -225 -77 200 22 -408 304 -42 -136 -280
6415 -280 -159 -4 128 -414 -53 -87 96 128 -121 229 174 203 133 131 57 19 -6 150 9 -182 143 240 -59 48
6439D8j54L75j79K9l78M59k91M76j51k91K0l52L21M7J7p1J74j83K87k33j98J37
6461i1J64J46l14L61j28k68M7J26J8j96O8j37Q3J39k24J09M47k43l14L59k18J39
6483G3l15L84k48k6K13J05j77L3o0l17P4L32j79q2K73J28j9l07J05p8J26q6Q6
6506C8K04m94M2M60k34n3L22k8k44R5o6n1j9J58j48j48J58O0L1m0j52L17r7j15
6530dj63L68k73M4q9j0mJ88j34r6N70l18j78J75n2n68M03K82k44K64o1o3Kk9j29
6555a19j19L83r1r8K24l16m3j19K31J55j9Q4j61n4Q9J38m8m09K83k58nJ68K25
6578A21o1j09k49J58K07m2Q4k31K18Kk52L38l51L75Nj15l4N0r7oJ3J26o5k14K15
6603H6Qj1j42m8mJ54j10J58l39N37l32M70m93l0L12j72K7l19j3M78k41j23K78
$$ plain form
6439 48 -106 269 90 119 -259 200 -91 385 234 -57 -37 -389 -68 -21 -4 -75 99 -84 203 -30 -228 -91
6461 -91 73 219 -95 266 138 -130 -83 43 61 -135 -67 -204 -121 18 -206 -97 350 107 -207 152 -66 73
6483 73 -242 142 -106 -132 81 186 9 42 -18 -335 -261 71 -108 -190 83 211 192 -115 -10 -88 38 -48 38
6506 38 242 -252 -210 250 16 -37 285 257 13 108 42 -9 -28 130 -18 -166 -8 52 83 43 -109 208 111 -4
6530 -4 -167 201 -72 -28 -117 -127 -131 57 -77 -173 397 79 -99 76 24 -544 -141 141 -103 161 100 37 39 10 -119
6555 -119 -238 145 54 -44 180 -136 -179 -298 -67 88 69 153 -8 -62 27 165 117 -292 -9 -267 -272 -104 121
6578 121 60 -49 -298 -140 67 25 109 -122 96 98 -154 184 -167 208 213 98 64 114 17 11 24 150 85 -129 86
6603 86 94 83 -59 -107 -111 43 -67 91 -248 289 -43 427 -66 -96 216 44 71 -248 -261 217 -24 -147 131
6626A31k21J94j05n5nJ04m0J75j87o6M16o27L88n6o3Q9k5Kj07M64m97J08J89l43
6650a37J4M7K40k11L28l02O0k1J75l10j14J11j04L68j6j52K51k64L84n09O0j77
6672b79K37j2l7J60l98J60N07n01K92j13l4kO0Q3j02ok9j43M5J70l7J27O0m35
6696b27K63k38j02NM34K8l25K63n05N35k58K80M7l37M06J26m78k7K21j75j19J25
6718e8O3N6l05K11K79q2j28k63L83Q2m70K78O6l85M65j09j30j62L05L4j95K30
6740A65K55l90K72j88l22J17J33k20Q4p1L08l96K70J22k14J32R4j56m3J41k72
6761a79j64K17J51p2J34L7o9K60j73m94L03K53m71p1N87J3l47q9K22M3n8j95L91
6784B29m54K84k51L89K2q9N0j63j08J29j9j35J41l31K70K09n94M40R2n10N64j35
$$ plain form
6626 131 -90 104 -1 -56 -61 43 3 178 -9 -75 341 -286 102 46 -17 72 47 49 -58 406 -91 17 206 -137
6650 -137 -123 -76 164 -47 281 -21 39 18 193 -117 -231 -120 -224 144 128 -24 227 -37 347 -162 -102 -279
6672 -279 -42 -54 -91 69 -329 -169 338 -163 129 16 -18 -20 40 123 21 15 -14 -157 -112 58 21 148 208 -227
6696 -227 36 -202 -304 -299 135 163 -162 101 -404 131 -127 153 200 -137 269 395 -83 -110 111 -64 -183 -58
6718 -58 5 61 -244 -33 246 164 36 -227 156 238 -232 46 112 -273 192 83 -47 -209 96 130 -65 165
6740 165 420 30 302 114 -208 -91 42 -178 -94 -165 143 -253 17 139 -75 57 151 -5 -48 93 -179
6761 -179 -343 -126 25 -47 87 124 55 315 142 -352 -49 204 -267 -338 249 262 -85 -174 48 91 33 -162 229
6784 229 -225 59 -192 197 219 130 180 17 -91 38 19 -116 25 -306 -36 173 -421 19 111 -399 165 30
6806C0Jj06q7K52Jm03K48k54K05J76k50K18j70M40l49j6r0N72m72K7K54k6Qk54
6830d5q5M3m1k09J82J59l2L18l67k4J59j88L59p19M48kJ37k13J21L50k79j84n4
6853a66J4M4J28J14o6j43K96k84L34l74J47q1Q6k39K02O0r2j35K66J14m29J51
6875e3l2M5k3K36j68R9j92J0J23o8j9J53j15J2j73J7L68n6l60j63K72K33j88J92
6899A50j23o3q6k65J28M05k97J64oj7j67K75q7q2J86j29j91L75lk31P6K86j23
6922A75K36o28J86j06K60q8j16NqJ19K34m55l3k9L34J06l10Q8J43j53p9l99M44
6945g4R3q5j04K87N3j99p2RJ10j8K78m48k0K80k33j92L37K72r8o0p1M0j72m9J59
6970B3j6P8p8J63l71J04J86l67o8J66K69Lj80j51K97M6l47L78o9j25j77K27k9
$$ plain form
6806 30 31 -75 -162 90 91 -312 -64 -318 -113 63 -187 31 -139 301 -48 -64 -154 418 -54 -27 227 201 209 -45
6830 -45 -130 -87 -128 -337 -155 4 -28 290 -77 -101 58 -130 229 -490 -42 -44 93 -120 1 351 72 -112 -166
6853 -166 -152 -108 20 134 68 -75 221 -63 271 -103 44 -37 49 -190 12 72 -20 -155 111 225 -204 -53
6875 -53 -85 -40 -63 173 5 104 -88 -78 45 -23 -42 111 -4 8 -165 -148 220 164 -196 -359 -87 146 -42 150
6899 150 27 -36 -122 -387 -259 146 -151 13 7 -10 -177 98 11 -71 115 -14 -205 170 167 -64 12 298 175
6922 175 411 -217 -31 -137 123 35 -81 -76 -84 35 269 -186 -219 -248 86 192 -118 -30 113 -40 -119 -518 -74
6945 -74 19 -66 -170 117 170 -29 -101 -92 18 0 278 -170 -190 90 -143 -335 2 274 176 116 45 85 -87 -136 23
6970 23 7 85 7 170 -201 -97 89 -278 -346 -180 89 92 -88 -239 58 104 -243 135 66 -59 -236 -9 -38
6993c8O8r1K1K25l93L79k00%j66M67l42n9n3K18L4j52J92k33M0PK04l42J48K30
7017A64k68J63m0pr9L63l42k16K81j6J34n7k12j26L71j17J87q0o8j28R0L60m87
7040a50K57m45J81K36o8L3l97N21o3J8l3j23J55l14J93L36j81k3j36J55j9L6r5
7063G4k82L75l95K07O2L22j54J9k8j57M4l10K71q9n2j02N4L36k03MK02l59P7r3
7087a77J54n1L62m80K34j38NK36j23j12J36J00j57J76mk59J90R9k59m0K44k48
7109a12K09m32M99o8k85Q0L3J36j86K09Qj13L52j82r3J83l99K73l51L12l06K35
7131BL3K3r9K18k36M59m52Q1m19M56R2m01L56J38m15N4N14m48j01K27K1J03j21
7154H5k24j79j09O32j99k9j94j4j61L42lK86j57n40N89k32R3k28K63k5l91K99
$$ plain form
6993 -38 30 -61 -40 185 -208 171 -29 -29 -195 272 -70 -129 -182 36 70 -82 110 -123 -83 -76 128 -214 -66 164
7017 164 -104 59 19 12 -87 276 -66 -282 -1 -17 117 60 -152 -278 93 -24 163 83 15 -113 -23 337 -150
7040 -150 107 -338 -157 79 11 44 -353 168 105 123 90 -33 122 -192 1 337 156 133 -3 152 133 169 74
7063 74 -208 167 -228 -21 41 363 209 228 200 43 87 -223 48 -41 -93 -195 -141 195 -8 -4 198 -161 -84 -177
7087 -177 -23 -74 288 -192 42 -96 -91 145 22 -90 46 146 -11 165 161 -98 92 191 -68 -108 136 -112
7109 -112 97 -335 164 96 -189 -109 -76 60 -126 83 91 -22 330 148 55 238 -161 112 -239 73 -233 2
7131 2 35 58 -41 177 -59 400 -52 29 -390 66 158 -243 113 251 -164 -110 404 -44 -145 82 103 206 85
7154 85 -139 -318 -427 205 6 -23 -217 -231 -392 -50 -53 233 76 -464 125 -107 -14 -242 21 -4 -395 -96
7176i6N1J26m0J22k71J75j49n6J05L1K58l50L24j01J23n1M5l02N5l3Nm2J90r7
7200B2J54j44j99l2O3r6M91k72j72K15k53K69K50l00k08M42l81K94L6p7J45j26
7222A21k35K4J73k13kQ8j79J71K75l01L73k10J66l03p1m3J53l34J82K76k73Qr
7245a63K44J19m65L59m6L2J47j64k9J43j45j25N6L6K7m87L44K35J86k18N7o9n9
7268A5J58k08J20q5K47m81K21O3K10P0l48nj60Q3j22J10q2L72k70m8J21j66K06
7291B1J48L9Nl03M8R5k9l11LK27J11P3l06L65j60Q1o4j83K9L77j96j29R3o4n4
7316h4o7R8l09K61J57j24K51n0r8N4P1m31J29J79k04J79K08k4m01J94k39K84k14
7339a80P9Q3k05J80q1K93n2n9j63J7K08O8k84q3L13k32K96l00M1j89L20R6P6k51
$$ plain form
7176 -96 -45 81 41 163 -108 67 -82 -138 -33 -2 256 -94 230 129 252 201 246 -56 -1 -34 -29 -71 119 22
7200 22 176 32 -167 -199 -136 -232 259 -13 -185 30 -223 46 296 -4 -212 230 -151 143 179 102 247 121
7222 121 -114 -90 83 -130 -132 -44 -223 -52 223 -78 295 85 251 -52 -123 -166 -13 -347 -165 111 -162 -154 -163
7245 -163 81 200 -265 94 48 80 227 63 34 177 32 -93 -37 -1 26 -461 -117 118 304 86 143 74 15
7268 15 173 -35 85 0 247 -234 -13 50 260 330 -18 -23 -183 -100 -222 -112 -194 178 -92 -140 -19 -185 21
7291 21 169 208 213 -90 -42 53 24 -287 -284 -57 54 127 -179 186 26 107 43 -140 -111 266 70 -59 34 -30 -84
7316 -84 -151 -53 -362 -101 56 -68 183 133 35 89 160 -271 -142 37 -167 12 220 196 -205 -11 -250 34 -180
7339 -180 -101 -18 -223 -43 -124 169 117 58 -105 -88 120 188 -96 -179 134 -98 198 -102 -61 -250 70 166 242 -9
7363iR5j66J7L92o42M59L4j56j77j09L48l4k00L43l14J81j72K24n0j45K46N8l42
7386a19K84p0K89k01k35m4L01k25k5R8j93J78k64L34l53M62k45n0q1J60M5K45
7408B91k23k37K93k2k32P7j69K28J41j93lJ3R2Q7j94K48k49K95k21j81L49l3k2
7431A35J6k1KJ75k80j48J59o6J68Mj9k82J35j38J43j54m0K73l2K86k19N5k6k49
7455a23K41j10l8J91k62K70k24K45j41k18L47l47J94m3o1J80qj51J0j40J12r0
7477a66K37j66M65m67L02j2j73qK84J43k98n0qK34j86k48K82J71l83K6J1J61l86
7500b35M0L74k57j23K49p1J81j55r9L30m13qL45m3j76J09q7l8K65r3q4R3m14K44
7524f6K79Pj2l26K37l21P4m3K32kl7J09k64opK47O9l07J46M8j84J60Kj1n7K23
$$ plain form
7363 -9 86 -80 -63 329 -313 146 180 24 -153 -262 86 52 -148 195 -119 62 -110 114 64 -81 165 223 -119
7386 -119 165 95 384 183 -52 -96 205 -20 -45 53 -140 38 -226 108 -245 217 -28 -78 -159 1 46 291
7408 291 68 -169 124 102 -130 -53 -222 6 147 -46 -49 -36 56 143 -51 197 -52 243 22 -159 190 157 135
7431 135 151 130 132 307 27 -121 38 -28 140 144 125 -157 -22 -160 -17 -171 -211 62 30 316 97 152 126 -123
7455 -123 118 8 -30 161 -101 169 -55 190 49 -169 178 -169 25 -18 -79 101 93 -58 -48 -188 -76 -166
7477 -166 71 -95 370 -97 205 193 20 12 296 439 141 91 83 317 131 -117 165 336 -47 -21 -10 151 -235
7500 -235 -195 179 -78 -201 48 -23 158 3 -96 234 -179 -187 158 115 -61 48 -39 -77 188 95 11 104 -310 -66
7524 -66 213 220 208 -118 119 -202 -128 -171 61 59 22 131 -133 -139 -146 101 170 -137 9 57 -127 33 35 24 -33 190
7550A90j04j28o7K90k66n9K90l29J65k2k%j0R4j5N9p4P9K8k62N1KK95j50Nj42
7576h2j71J22K16k06L10j90J39j85K89j79j05K34l03L06l81L16j01j61Q2P6J1
7597C7K1n6J36o0k01M5J56J39Op3K1k18N4L26k37k60K63M4j4l9J24m74M58o6J35
7622B67J2j31m41K11J00K20k64j06N9K24n1k80M8J54n8L68m4k15j92R1k8r8J20
7645c4j61J40j65K84K80j09l45L3j21KN46p11M37L2l52L27j10K94l80J51J76o3
7667A51j90K64m7j37j41J47N8l05K43K28l04O6l9j4p9J82rK20m33l3K13L04k91
7690E4J45L26p93M34k03m7k77J85L80J04j24J28p08M08J32o1l84L87l87K72J94
7711A65k67Q5L47k97N18l28m15Q1J28J60k84qK72j19p6K45k49o8J96P3j1l84j6
$$ plain form
7550 190 86 -42 -109 181 -85 -144 146 -183 -18 -40 -42 -42 -52 42 27 86 12 91 119 -143 -92 -90 205 55 60 -82
7576 -82 -253 -131 85 -121 189 -1 138 -47 242 63 -42 192 -111 195 -186 130 29 -132 -50 26 37
7597 37 58 2 138 78 -123 -78 78 217 223 150 171 -47 7 333 96 -164 99 143 129 90 214 -260 198 132 267
7622 267 279 148 -293 -82 18 238 -26 -132 -73 151 100 -180 -132 22 -36 332 288 73 -119 -28 -56 -154 -34
7645 -34 -195 -55 -220 64 344 235 -110 -77 -198 -196 350 -361 76 108 -244 83 -27 267 -113 38 214 151
7667 151 -39 225 178 41 -100 47 105 -200 43 271 -33 33 -6 -20 -99 83 74 294 -139 -172 41 345 54
7690 54 199 525 -268 166 -37 -84 -361 -176 204 308 184 312 -396 12 144 83 -301 86 -301 -29 165
7711 165 -102 -17 330 33 551 223 -192 -111 17 177 -107 -115 157 38 -38 207 -42 -110 86 159 148 -236 -252
7734b52PK52k99L61j71J07k66K31j30L85l75%K39n20K13M63j81k69J72k57J83
7755a07r6L54p6j48J12j75q1K30l93L59k1K23q6k82M37l07K43k28K98p45K82K02
7777eJ71k17J59j06K15k16j17J02K96Pk32m55N31j34J80l7m73M61j31M0J47N4
7799B40k06j42r0O7N3k98J93J91K04n03L22k89L89j77K60J86l36j13j00K79l62
7820b32K55Q0j86K23j51K0O7j18K08r6k19K16K5Rl45O07m26r8k4J78Q9j79J18
7843B1l68L03J59n7j67J13j48J28j78M19k20j44n3K42k89L05M7l05J03j95L12
7864B8k09J11K31n51K55kJ77M9l15L63k83k8Q6J28k03k07K36jK43k80m3J9P2L40
7888B16J4P7l21J01j7j53J54j75J62L1j46M46k70K01j36n02k0M07J4K27j40l62
$$ plain form
7734 -252 -245 7 -292 69 -102 5 -261 -30 -160 225 -150 -150 89 -431 -218 245 64 -205 -33 -290 -107
7755 -107 -203 151 75 -73 39 -136 -217 13 -380 -21 -42 181 95 -187 250 -57 186 -42 256 -489 -207 -5
7777 -5 166 -51 108 2 217 1 -116 -14 282 289 57 -398 133 -1 179 142 -331 130 -1 39 186 240
7799 240 34 -108 -198 -131 -78 -376 -183 8 212 -291 31 -258 131 -46 214 400 64 -49 -149 130 -232
7820 -232 23 103 -83 140 -11 9 76 -42 166 70 -149 67 92 101 -244 363 -63 -161 -185 -7 82 -97 21
7843 21 -347 -44 115 58 -109 4 -144 -16 -194 225 5 -139 -192 50 -239 66 113 -192 -89 -284 28
7864 28 -181 -70 161 -390 -135 -137 40 89 -226 137 -146 -174 -88 40 -163 -370 -134 -135 108 -172 -215 -196 -124 216
7888 216 230 307 -14 87 70 -83 71 -104 58 89 -57 389 119 320 184 -318 -338 69 83 310 170 -192
7910a92J24p2J15J20o1l92P14k17j82J22J07m60J57K08K86k42l97Q3M02k51r6
7931a24J65K84j48j25J28j97j2K64l26p3P0N8Q2k89J96L23l28K6J09k09L20k98
7953a04m34Q30j11m5l69M79k93j14M20j17l39J99k19K96j12k85K61K73l33j04
7973b21N03k63M1j58N9K62m50J63j95K40K69l85O7P3J23L2Ol47L49j32k75K28
7995a1L9k07K97k51K86k46j19J2J7N83l96p3M00m09O6J52k81J79J59j25k1N2N0
8018A53J2J8j3k11p7K60n28L13O5j58K52K26m23R0LJ80j74J31m59M12J4q9k47
8041b50L70k9k87KL7P8M0LJ43J62l01J26Kj21o1J96k48N0J01K49k36J49L28m66
8065C7j78k7P6K48j35M0j43l5Q3l6m9K53l0p8m6K4J22j52k07K23j01P6N9K42j46
$$ plain form
7910 -192 -68 -140 -25 95 34 -358 356 139 -43 79 186 -274 -117 91 377 135 -262 -179 223 -28 -124
7931 -124 41 325 177 52 180 -17 -29 235 -91 -164 -94 -36 46 -243 -47 276 -52 -26 83 -126 194 -104
7953 -104 -538 292 181 136 -233 246 -47 -161 259 142 -197 2 -217 79 -33 -318 -57 216 -117 -221
7973 -221 282 19 60 -98 -39 223 -227 -64 -259 -19 250 -135 -68 5 128 160 166 -181 168 36 -239 -11
7995 -11 28 -179 118 -133 153 -93 -212 -200 -183 400 4 -69 331 -78 -12 140 -141 38 197 72 51 103 153
8018 153 165 183 170 -41 -118 142 -386 -73 -8 -166 86 312 -111 -21 -18 162 -12 119 -340 72 86 -3 -250
8041 -250 120 91 -196 -194 -157 -79 -39 -36 107 269 -32 94 96 -25 -86 110 -138 -88 13 262 26 175 503 37
8065 37 -141 -168 -92 156 21 61 -82 -117 -34 -70 -119 134 104 26 -20 4 126 -26 -233 -10 -111 -35 24 266 120
8090A20l51J75o9p8N20k30M0l20k8L22l65L38k19j27L49j50J13J1pl2j25M21k85
8113B3k82L56J01j84k81J28L92M7j25M9n62M66k67K89l00J54L4l05M09K4n7q0
8135B9j99L4K00L5j91K73j75j83m1L39L5k20J67K26m08j81J39Q8R8LJ93k37j54
8158a30K34n48L05J58K49l18n6k10L8J04K44j03j23L69k31J29k19J3nK6J72J4
8180A12p3J87o0j70p2K7l3L22orj66
$$ plain form
8090 120 -231 -56 -125 -203 317 87 127 -193 -221 101 -264 74 -145 -272 77 -73 40 51 44 12 -113 308 23
8113 23 -259 97 198 14 -267 -139 253 300 175 224 -338 128 -139 150 -150 4 38 -267 142 166 109 29
8135 29 -170 -136 64 99 -92 181 6 -177 -218 121 156 -64 103 329 -79 -260 -121 -33 65 68 261 24 -130
8158 -130 104 -444 -139 19 268 -50 -106 -316 -278 -174 70 -33 -156 213 -18 111 -108 -95 -100 -74 98 112
8180 112 39 226 166 -4 -76 -49 -82 240 234 225 59
8191E9
$$ Imaginary data points
##PAGE= N=2
##DATA TABLE= (X++(I..I)), XYDATA
0@%%%%%%%%jQj5J6j6J6k4L2l7M5n3O1p2Q4r5J10j28J46j67J91k16K44k75L09l47
33a84L88m32M80n34N96o62P33q13R00r96J103j221J352j502J676j872K099k370
51a259K693l087L586m236N123o415Q477j2296K1722q5490j63208J28598J18750
64A2958l9596j03490K5706O9284q294n8029J977K3051j3574k3085K0849J8954
76g3289j6112j6060K2058J0217k3923j4582K6155J7637k1443j8932K0287K1884
88f6103j4434k5148O179K4568P636o476K955Q113p069j0457R022J5245q610j5938
102h0517J4034L2451M779k3458o102K0483R093j3852k197J6771M859j1697N403
115b9950K4717M595j9783m099K2063J2041j0612n443R551K834o489Q105J8970
$$ plain form
0 0 0 0 0 0 0 0 0 0 -1 7 -8 8 -8 8 -16 16 -21 24 -29 32 -40 44 -51 59 -69 77 -90 101 -115 129 -146 163 -184
33 -184 204 -228 252 -282 314 -348 385 -428 472 -524 579 -642 710 -792 884 -988 1111 -1259
51 -1259 1434 -1653 1933 -2303 2820 -3595 4882 -7414 14308 -71182 -234390 -105792 12958
64 12958 -26638 -130128 -104422 -35138 -43432 -101461 -99484 -76433 -90007 -113092 -92243 -73289
76 -73289 -89401 -105461 -83403 -73186 -97109 -111691 -85536 -67899 -89342 -108274 -87987 -66103
88 -66103 -80537 -105685 -99506 -74938 -67302 -73778 -70823 -62710 -69779 -80236 -71214 -55969 -64579 -80517
102 -80517 -66483 -34032 -29253 -52711 -58813 -38330 -29237 -43089 -45286 -28515 -23656 -35353 -29950
115 -29950 -5233 -638 -20421 -24520 -2457 9584 -1028 -6471 3080 5914 -575 7530 26500
128B6500N78j3394J752J5420J826j1127J724J2568l01r124N472J6395O77j3132
142C5834j212J2547L668r160j952R133L858n350k491L930J891k870J425N894Q06
157E5951n504m394K444K322k387k305J851K650k69l4j84l156n445L79M364o33
173D5650n818j070O304J854o773n147K513J786n768l145O453L204o533o270K451
188B9691K209m889l420L913J653n085k941M367J044o354m718L385L046m602k718
203A4581L850K697n361m685K077J233k326j501L007J501m241l022K477J379k788
218H878k967K205K838j523k368J739J184k765l638J418K933q16k359J264L423
233I446r57l516j020K256k23k391J036L240k97k998j68L353o51k481m49K210j35
$$ plain form
128 26500 27078 13684 15436 30856 32682 21555 23279 35847 35546 26422 31894 48289 48966 35834
142 35834 34622 47169 50837 41677 39725 48858 52716 47366 44875 48805 50696 47826 49251 55145 55951
157 55951 50447 46053 48497 50819 48432 46127 47978 50628 50359 50325 50141 46985 41540 41919 46283 45650
173 45650 39832 38762 45066 46920 40147 35000 37513 39299 33531 30386 36839 40043 33510 27240 29691
188 29691 31900 27011 23591 27504 29157 24072 21131 25498 26542 20188 15470 18855 21901 17299 14581
203 14581 18431 21128 15767 11082 13159 14392 12066 10565 13572 15073 10832 7810 10287 11666 8878
218 8878 5911 8116 10954 9431 7063 8802 9986 7221 3583 5001 7934 7118 4759 6023 9446
233 9446 8489 4973 3953 6209 5986 3595 4631 7871 7574 4576 4408 7761 7110 4629 4180 6390 6255
250F255k464R38K587l51l379N11L089j8k538M80K076l04k826m82K105N8j587M73
268D623K363K60j568m90Q45p04j988k26J643M67q62M68J640Rj526m30J63n50j245
287B892k22J690N5m91n31R17O42j312m55M39N7j286q28J093L96n06p54J061O33
306C490o92m57M43l39j398o94N72O48p89J11J521N8j446o32O83K1j219j333P90
325f62Q41m58L4P84M21q76n84R36l87j238n97N92J46q37O26J301J78r37q43N24
345a036P75j063p68K62M54M8J19O33K83n69j98L78K6n40k44L57L02o01J62P58
365d62N48n1o15K20R53o36r55k16J005J39k46L85J156L41p01j42N1k84q24Q58
385E24O56k23k20K35J316j29q82J7J58J66l49L73O23r9j074J72Q31Qk53K50N67
$$ plain form
250 6255 3791 4729 7316 6965 3586 4097 7186 7168 4630 5110 7186 6882 4056 3574 5679 5737 4150 4623
268 4623 6986 7246 5678 5188 6033 5329 3341 3115 4758 5225 4363 4831 6471 6480 4954 4524 4687 4137 2892
287 2892 2670 4360 4415 3924 3393 4310 4952 3640 3185 3624 3681 2395 1567 2660 3056 2550 1796 2857 3490
306 3490 2798 2341 2784 2445 1047 353 925 1573 784 895 2416 2474 1028 396 1079 1100 -119 -1452 -662
325 -662 179 -279 -245 539 960 84 -500 436 49 -1189 -1786 -1194 -1048 -1885 -1259 42 220 -717 -1560 -1036
345 -1036 -261 -1324 -2092 -1830 -1376 -1328 -1209 -576 -293 -862 -1060 -682 -656 -1196 -1440 -1083 -781 -1382 -1220 -462
365 -462 86 35 -580 -360 593 -43 -998 -1214 -209 -70 -316 69 1225 1566 865 723 774 490 -334 524
385 524 1180 957 737 972 2288 2159 1277 1294 1452 1618 1269 1642 2265 2166 1092 1264 2095 2103 1850 2100 2667
406B667l7o71j68J54J27n20L61M75L48j7k17J07l22p27k81J083j58l78j65J089
426B750l49n33l62j27K17n92K67M62N28n72n42O7l4k12M4K64K3m74j13M1R6m21
448D28k70K42K08m04J01K72j74l31p80L68J73K07l85m49Q58m01k34M8J74m82m03
469a234Q0N84l58k61L10J97N4q50K50K37J2o40P43j07j5m0l55M61r1l72M57L44
491e94k45m74O82J63m22K7j51O88l38l97l5O63L55l46K8L73m47p4K95K1K2m08
513f14N42J64J66k95k4L07p8k93J38N81N8p84L40m6M66j99l12P00M0l27J67L5
535G32l0m19K22j3L11k63J49O32O1l16m35J35Qk20N8L63L10k05k0j86j04J0m80
558C00L74M22m34M2l44N32m97j33K38O7n20k28M94m5k99m62L91k79j60n9K12j74
$$ plain form
406 2667 2630 1959 1791 1945 2072 1552 1913 2388 2736 2719 2502 2609 2287 1560 1279 2362 2204 1826 1661 2750
426 2750 2401 1868 1506 1379 1596 1004 1271 1733 2261 1689 1147 1214 1180 968 1012 1276 1299 825 712 753 849 428
448 428 158 400 608 204 305 577 403 72 -708 -340 -167 40 -345 -794 64 -337 -571 -523 -349 -831 -1234
469 -1234 -1154 -570 -928 -1189 -879 -682 -628 -1478 -1228 -991 -979 -1619 -876 -983 -998 -1038 -1393 -932 -1023 -1395 -938 -594
491 -594 -839 -1313 -631 -468 -890 -863 -1014 -326 -664 -1061 -1096 -433 -78 -424 -396 -23 -470 -544 -249 -228 -206 -614
513 -614 -72 92 258 -37 -61 246 168 -125 13 594 652 -132 208 162 628 429 117 817 857 530 697 732
535 732 702 283 505 492 803 540 689 1321 1382 1066 631 766 774 554 612 975 1285 1080 1060 874 770 780 300
558 300 674 1096 662 704 360 892 395 262 500 567 47 -181 313 268 -31 -493 -102 -381 -541 -600 -388 -562
580e62M65n74k76k79j44l1j92J86K41j84J66j18L23o99j93k74J10j77k61O21j65
601b017l52O7R2k53m13K77r3L6j68J91j5l29K21j12K00l32k10QL09l11q0P8j6
624c222J27j96K63K86k12l40j6Q8K89m22M15L5kj47N02Q8j85J20r3N23j01m18
646b618oM52J0k40J01K17K0j58K68O9O7k86L57O8M63k1k76J97L07j81J24l8PK71
670h26N8J28N4J63J61j74k2K42L2J41j66j32L88m59K78J30j0L7L07J69o05J20
692A4L36j91M61l63n7J60OJ77Rl22rJ82nj33J6M07l95K36M5k55r6j10M4L97j71
717C83M0j51J78j19l22J16p4Lj46r8N57N4l02Rj76o8L45j11J32j11k59J71K03
740B54k00J5l1N3k18J16J07K4N1j90k03K49j42qj8N0J11j0J0j83L41j97m66L95
$$ plain form
580 -562 -97 -671 -947 -1226 -1370 -1401 -1593 -1407 -1166 -1350 -1184 -1302 -979 -1678 -1871 -2145 -2035 -2212 -2473 -1852 -2017
601 -2017 -2369 -2302 -2210 -2463 -2876 -2599 -2692 -2656 -2824 -2633 -2648 -2977 -2756 -2868 -2668 -3000 -3210 -3202 -2893 -3204 -3284 -3206 -3222
624 -3222 -3095 -3291 -3028 -2742 -2954 -3294 -3310 -3222 -2933 -3355 -2940 -2905 -2907 -3054 -2552 -2464 -2649 -2529 -2622 -2099 -2200 -2618
646 -2618 -2624 -2172 -2162 -2402 -2301 -2084 -2064 -2222 -1954 -1885 -1818 -2104 -1747 -1679 -1216 -1237 -1513 -1316 -1009 -1190 -1066 -1104 -1097 -826
670 -826 -768 -640 -586 -423 -262 -436 -458 -216 -184 -43 -209 -341 47 -412 -134 -4 -14 23 330 499 -106 14
692 14 350 159 620 257 200 360 366 543 552 230 221 403 398 265 281 688 293 529 574 319 223 113 157 554 383
717 383 423 272 450 331 9 125 51 54 -92 -190 367 421 119 128 -48 -116 229 118 250 139 -120 51 254
740 254 54 69 38 91 -127 -11 96 120 171 -19 -222 27 -115 -123 -141 -91 20 10 20 -163 178 -19 -485 -90
764i0O9p4J49j97K45j89j06N1L95m04n0K59J48J63o87N90k28J73j33k9j1k25J69
787a2j79J43J14m2J07J62Nl65lN18k15m89M67j44K4k90M44O6k6k41K3N33n74K01
811B27K5p1r0J00l78J71K75n3j71p0k9K68k77K5N1L66k39k3J78j98jj24R8K60
835C20l19m4K67j66j29M17jK5j97j9P2rr7p1L09N0k48j23J5J05N3p9k11L29j54
860I5J8o5J82K00J22k55p2O0J24l03n1R7K49j93r9K23j34jL16k69k62K83J67r4
884C38nN7j07n9j7J37l3j68M29q1L10n86RL08j55R4l18M18p4J56n38L92j65J21
908D63l54L55j77j03K29k3N3r4J03N7k07R0l47J67o4J08N8j84N1J00m51O43l41
931A32m5r6L66l18p3M93j15k18l1nO4q4J54k1j30ln8N4j05K83k48k47K96k48K76
$$ plain form
764 -90 -21 -95 54 -143 102 -87 -193 -142 253 -151 -201 58 206 369 -318 272 44 217 84 55 44 -181 -12
787 -12 -191 -48 66 24 131 293 298 -67 -70 448 233 -256 211 67 91 -199 245 311 285 44 67 600 26 227
811 227 252 181 91 191 -187 -16 259 206 35 -35 -64 204 -73 -48 3 369 130 107 285 87 86 -38 60 320
835 320 1 -43 224 58 -71 346 345 370 173 154 226 217 120 49 358 408 160 37 52 157 210 131 -80 249 95
860 95 113 48 230 430 552 297 225 285 409 106 55 152 401 208 109 332 198 197 513 244 -18 265 432 338
884 338 333 390 283 224 207 344 311 143 572 491 801 215 224 532 377 471 153 571 497 653 115 507 342 463
908 463 109 464 287 184 413 390 443 349 452 509 302 392 45 212 148 256 314 130 181 281 -170 473 132
931 132 87 -9 357 39 -34 459 344 126 95 90 154 70 224 203 73 70 12 66 -39 244 -4 -251 45 -203 73
956G3p3P1n4j37J18j61P7j21o6q3N14l03k58L13K22n2k5m07L56k69K38j42O2o5
980a72K28k02J57p5J8j29j49K48J76k56N1L75l31rJ74r2J05j09k05K2k41L41J17
1003D2j53p0r2L79j62M17j41k58J87J58k16p5Q1l29K21n6K7n0K13J2o4R4r4j7
1027E4J40p7j94L07k80K86j61j10j36L15k90Q5j01j2N17n12L88m64P6L70k28l
1049c0M6K20j04R2l46o6K34o9K12k64LL44l67J39J65k17q6L03j74j18M0o7o9K74
1073I5r3j09n1M05m74K59qk03M48l82J73k77L95J04j45j66L26o63L32Q6n6r2K08
1096A12j51p8J75m1K65k89K01k41JK34j91Q3l81L97j71J1q7j21L80j52M72n34
1118a06l3K81q6k24L18j27R6M0R4j83j5k3j55J17kk45K69O9k17L93k61PK31l30
$$ plain form
956 73 0 71 17 -120 -2 -163 -86 -207 -273 -356 158 -145 -403 -90 132 80 55 -352 4 -265 -27 -169 -107 -172
980 -172 56 -146 11 -64 -46 -175 -324 -76 100 -156 -105 270 -61 -70 104 12 117 8 -197 -175 -416 -75 42
1003 42 -111 -181 -273 106 -56 361 220 -38 149 307 91 16 97 -232 -11 -67 -40 -90 123 135 71 165 71 54
1027 54 194 117 -77 230 -50 236 75 -35 -171 144 -146 -61 -162 -174 343 -169 219 -245 -169 201 -27 -30
1049 -30 16 236 132 224 -122 -188 46 -23 189 -75 -72 272 -95 44 209 -8 -94 209 35 -83 -43 -110 -179 95
1073 95 2 -107 -158 247 -227 32 24 -179 269 -113 60 -217 178 282 137 -29 297 -366 -34 52 -4 -96 112
1096 112 -39 -117 58 17 282 -7 194 -47 -46 188 -3 80 -301 96 -75 -64 -151 -272 108 -44 428 -106
1118 -106 -139 142 56 -168 150 23 119 159 253 70 55 32 -123 -6 -8 -253 16 85 -132 261 0 7 238 -92
1142i2K65j83l6r8K39k47M92j91p0j3j76J18N4R4M3k75j73M48k18L05m66j2L15
1165A23j15J45K2j59K22j62k48q1K78l41O04j87k19K98o4R1q9q7r1K33p6n6M6
1188H7J78N7n57J43K25k08j95M78q0j7l80J64J16j09J09q5K5O1MK27j88K48j38
1211A65k24K48j30j9p4K83l34j25L76j54J26L81n23J46j40Q6l5J04j0k47P2L18
1233B90j63m34K39K28p9J28j71j23P0P1K15k83l1J7j50K76J85j35j43Q7K7j95
1255g4p8K42Q8k69p3M56j85k24J52p5l9M05n30P06l42m1j53k7J67k12K48l05m1
1278b04j3M7p9N29k33j27l26N63l31J33J55k3q7l04M59j83j46J15mnJ5J52k00
1301i7R9l05N84j97j21l02J98J6K13j44j71k3K98j06K22K2m46K16K90k77k9K0
$$ plain form
1142 -92 173 -10 -46 -144 95 -152 340 149 79 66 -110 8 62 156 199 -76 -249 199 -19 286 -180 -192 123
1165 123 8 153 175 16 238 76 -172 -253 25 -316 288 101 -118 180 116 207 118 31 -60 173 97 41 87
1188 87 265 322 -235 -92 133 -75 -270 208 128 111 -269 -105 11 -98 11 -74 -49 12 16 243 55 303 165
1211 165 -59 189 59 40 -34 249 -85 -210 166 12 138 519 -4 142 2 88 53 157 147 -100 -28 290
1233 290 127 -307 -68 160 81 209 38 -85 -15 56 271 -12 -43 -26 -176 100 285 150 7 94 121 -74
1255 -74 -152 90 178 -91 -164 292 107 -117 35 -40 -79 326 -204 502 160 119 -34 -61 106 -106 142 -163 -204
1278 -204 -217 -170 -249 280 47 -80 -406 157 -174 -41 114 91 4 -300 159 -24 -170 -55 -59 -64 -49 103 -97
1301 -97 2 -303 281 84 -37 -339 -141 -125 88 -56 -227 -250 48 -58 164 186 -260 -44 246 -31 -60 -40
1323d0K8J26j89L95l43P9k60J96j07K02o7k14K90n0j56K26j12k31k81N77J00l11
1345a42R2M7k26K90L1j36j19L79j35k16K25K7l27L38J82l13J80l44J75oK06K5
1367B33k70k2J79j00J6K31j94o2R4j25J13L1j38J30m00M83j73J15K6J43l12j8
1389b0kN24j87n24M12k23J74J69l42K7K68l29J81l46M69l45K56j79j92L63L23
1410D77o55K02j31J49k99O86l55P9k47Q2j23o2L89j26k03j0K78k01q3L63Jj84
1432B7N7M8k3j79m9J07J07j57K9J89J62m63q0K47r9l8l0J27J66k97qJ99k58l0
1456b46l07L48K93j99J8J72m19J47K03q2J9q3M3N4j4J96k74J4j9L7l22J70J84
1479f7l1j01O8k9J16J5j85K58r6R7k08J9L7P7j32K15NL4l61J65J00j87J68r4R6
$$ plain form
1323 -40 -12 114 -75 320 -23 56 -204 -8 -115 87 20 -194 96 46 -110 116 4 -227 -508 69 169 -142
1345 -142 -50 -3 -229 61 92 -44 -163 216 81 -135 90 117 -210 128 310 -3 177 -167 8 2 208 233
1367 233 -37 -59 120 20 36 267 73 11 105 -20 93 124 -14 116 -284 199 26 141 167 310 -2 -20
1389 -20 -22 502 315 -209 203 -20 154 323 -19 8 276 -53 128 -218 251 -94 162 -17 -209 154 477
1410 477 -178 24 -107 42 -257 429 74 153 -94 -12 -135 -197 192 66 -137 -147 131 -70 -153 210 211 27
1432 27 84 132 109 -70 -119 -12 95 -62 -33 156 318 -145 -225 22 -77 -115 -145 -18 148 -149 -157 42 -216 -246
1456 -246 -553 -205 88 -111 -93 79 -340 -193 10 -72 -53 -136 -93 -39 -53 143 -131 -117 -136 -99 -421 -251 -67
1479 -67 -98 -199 -131 -160 -44 -29 -214 44 -52 45 -163 -144 -107 -30 -162 53 58 92 -269 -104 -4 -191 -23 -117 -21
1504b1j9K02K48m22m7K96j84o8N5l8M9j98K90j41k7j88P8M70k06M7k75L57j01
1527A57j15Q6j97J00j83J12M56k85o2R0k23N8k85N63j48j2l05M44Kj26o8n4J5
1550B0N5J31j00j64L11k68J83k0j66Q2K3j36r0Q5O7m4j43M2j24L96J4L2j38m7
1574Aj11k00k0J43K69j82P0j96L26j22r7j47j94L29M0pj53K70m40M18j97J48j18
1597a70K82m40J1N58k58k4K4J55q7l49L26j23p1L1J92l23K52K27j83j45k04K80
1619c9O0J48l85Q9j53K69K0p0l52L07L93n81L06o9J17J8K60k16k14Qj4k57M06
1642E1j42kq0M5J57l58L16r2j01J53J40J1j85lQK30j88l90L10O2j7R6l93O95m40
1667a17l68O28k72K9k15L07j38J04j13O8M36j88l41K27%j65M46l90k26P4R9L28
$$ plain form
1504 -21 -40 162 410 -12 -59 237 53 -15 40 2 51 -147 143 2 -25 -213 -135 335 129 176 -99 258 157
1527 157 42 128 -69 31 -152 -40 416 131 69 159 -64 -6 -291 272 124 112 -193 251 253 127 59 5 20
1550 20 75 206 106 -58 253 -15 168 148 -18 64 87 -49 -139 -54 13 -31 -174 -132 -256 140 154 186 48 1
1574 1 -110 -310 -330 -187 82 -100 -30 -226 100 -22 -119 -266 -460 -131 -91 -98 -251 19 -421 -3 -200 -52 -170
1597 -170 112 -328 -317 241 -17 -41 -17 138 51 -298 28 -95 -166 -135 57 -266 -14 213 30 -115 -319 -39
1619 -39 21 169 -216 -127 -280 -11 9 -61 -413 -106 287 -294 12 -57 60 78 338 122 -92 -84 -98 -355 51
1642 51 -91 -93 -173 -128 29 -329 -13 -105 -206 -53 87 98 -87 -90 -82 148 -40 -430 -120 -58 -75 21 -372 323 -117
1667 -117 -485 143 -129 -100 -315 -8 -146 -42 -155 -87 349 161 -180 47 47 -118 328 -62 -288 -214 -115 213
1689B13m39K51k32M02k70L90k73J63k29m2J2J23j82J05M1M5O9k00K53m08L63k00
1711d5Jk13K81J21m39J47j48L98j84J60k80K50L95o32O8J92k25L06j55l33J60
1732a75L31l45j8L17m16M09j00J44Q7k50P1j23J05k54J50P3j33K47l25K43k19
1753a81L21l58K47Q8l91J71P1J59N5k64R0j31L26l59J83j18O6j53J40k76N14J48
1775C48k28mj07P8M9j2J84l41j21Q0Pk89K10m6J42K10k50P0k57J98J51m01L28
1798aJ45j27N4lj15j33J72n4M34j27l37J90J69o43J29M85l12M7j02J6k1L2k87
1821c89L09J55p4P8Q1n03M14j11Q6J45j78l11K34k27K09o3O9q4j71J40K16j17
1843i2J31j80O8j22O1K31q6j20K57P1l70K11q9r8J9J94j85l2L02j49k31L26O2
$$ plain form
1689 213 -226 25 -207 195 -75 315 42 205 -24 -66 -54 69 -113 -8 33 78 147 -53 200 -208 155 -45
1711 -45 -44 -257 24 145 -294 -147 -295 103 -81 79 -201 49 444 -188 -120 72 -153 153 -2 -335 -175
1732 -175 156 -189 -207 110 -306 103 3 147 234 -16 55 -68 37 -217 -67 6 -127 120 -205 38 -181
1753 -181 140 -218 29 117 -274 -103 -32 127 182 -82 8 -123 203 -156 27 -91 -25 -178 -38 -314 200 348
1775 348 120 116 9 87 136 124 308 -33 -154 -74 -67 -356 -146 -192 -50 160 -90 -20 -277 -79 72 -329 -1
1798 -1 144 17 71 68 -47 -180 -8 -62 372 245 -92 98 267 -376 -247 238 -74 -27 -129 -113 -134 -102 -389
1821 -389 -80 75 1 79 160 -343 71 -40 46 191 13 -298 -64 -291 -82 -145 -76 -160 -331 -191 25 -92
1843 -92 39 -141 -73 -195 -134 97 11 -109 148 219 -151 60 -29 -127 -108 86 -99 -131 171 22 -209 117 179
1866A79l49K29L0m9k25J44J39j10j54M50q23M16j04L57k05j44p2J92l0K18l3K5
1888H1O2R2k76K74k27j91K45l19J07R3J34Q5K6J5p0m59M07l4j43K00J45r9l06
1911a58O1r0L49k87J62o0q3J55J74k46j06RJ61j59q6l4J76j16K96l31K43m71O00
1934A59j03j55J38rJ44m6K32l73n4j88O01k12l08K52M9n4J04j87K57m78K62J19
1956A50k0K28l41j2L53k67r1j11L07k64J99N5r9k7P8QL58q00L08L15o14K79O3
1979E5K59k38k17J14l65N40k10m1p1L56L5k05M3j18J00k10K35L7o5j05m6j1K88
2002A60r9j55q7J65K47N6p7k85q6R6k24K58k6m2L9k5K2J05p3J7J96m85N91M1k77
2027E2K69k95j50j13J9L41j84p6M3Q4lo7N0J46l64L7K90O8m71M64j81L61j34j19
$$ plain form
1866 179 -170 59 89 40 -185 -41 98 -12 -166 284 -539 -123 -227 130 -75 -219 -291 -99 -129 89 56 81
1888 81 143 235 -41 233 6 -185 60 -259 -152 -59 75 160 186 201 131 -328 79 45 -98 102 247 148 -158
1911 -158 -97 -187 162 -125 37 -23 -106 49 223 -23 -129 -120 41 -118 -204 -238 -62 -178 118 -213 30 -441 159
1934 159 56 -99 39 30 174 128 360 -13 -67 -255 346 134 -174 78 127 73 177 -10 247 -231 31 150
1956 150 130 358 17 5 358 91 0 -111 196 -68 131 186 87 60 138 146 504 -296 12 327 -287 -8 55
1979 55 314 76 -141 -27 -392 148 -62 -103 -174 182 217 12 55 -63 37 -173 62 99 34 -71 -117 -128 160
2002 160 61 -94 -181 -16 231 287 210 -75 -161 -65 -289 -31 -57 -99 -60 -85 -63 42 -31 -14 182 -303 288 329 52
2027 52 321 26 -124 -237 -218 123 -61 -137 -94 -10 -13 -80 -30 116 -248 -211 79 147 -324 140 -41 320 186 67
2051F7j37k4J72j41j16J32j89M39L2j69o6K17j86k6N0j38P7J5K44j05l77J72R0
2074C3M0K6L7R3j19O7k78L99m01m8K87j2m16L36n2m8N3k9L69l62K30J1j11j1J0
2099A04j88lQ8k75p5L35J51j54M1m6R1k2k42J55M2k46N83k13k33O0n7L88l05M2
2123B1J04l45J87q3lK72J07l13K0k43J84K32J4l05n7J81P2K65m50J68j00j22L08
2146A14k9n6j35j63K69k96J95L18k16k62k23N04M0l64k4K66J32j94M02m81M44
2167B41k33J24k19J01k63K02J37l49K92m06k10M91J80j9o9l5q0p4M68l75j00J62
2189c4qQM6r8J31J44q8j75M14o56M66l77k3L8J86m9j93K83k73J04J44q9K27%k2
2214A06k29L23j78j40K25n24K84K86j27l8J04p9pM0Kk54J36J77J67k20J21J03
$$ plain form
2051 67 -70 -94 78 -63 -179 -47 -236 203 235 66 0 217 31 5 55 -83 -6 9 253 148 -229 -57 33
2074 33 73 99 136 229 110 177 -101 298 -103 -151 136 124 -292 44 -8 -56 -3 -32 337 -25 205 216 105 94 104
2099 104 -84 -87 1 -274 -349 -14 137 -17 24 -22 69 47 -195 -40 2 -244 339 126 -107 -47 -104 284 -21 21
2123 21 125 -220 -33 -116 -119 153 260 -53 -33 -276 -92 140 154 -151 -208 -27 45 310 -140 28 -72 -194 114
2146 114 85 29 -106 -269 0 -296 -101 217 1 -261 -484 20 60 -304 -328 -62 70 -124 278 -203 241
2167 241 8 132 -87 14 -249 -47 90 -259 33 -373 -583 -92 88 69 0 -35 -115 -189 279 -96 -196 -34
2189 -34 -42 -34 12 -86 45 189 101 -74 340 -316 150 -227 -250 -212 -26 -75 -268 15 -258 -154 -10 -99 128 128 106
2214 106 -123 200 22 -118 107 -417 -133 153 26 -12 92 13 6 46 48 -206 -70 107 274 54 175 278
2236B78j80Q2k68L01k82J4j76L26j15o6J7J74L0J41r5m51L49J26J01K1k54j82
2258a09J37j76K74j85L9J90k03N5j11J8q0J83J93l09J8l4N42m89l49O82l87l05
2280d06M32l8M3m3Q8J36l53K26L8p2M2j15k10L42K7j61K53k70K72j79J51l03J36
2303C6L34j35m23N89o23O9J70Q7j01K18m6m0j63n4k29J31K26j11M9p6j4k07J13
2326b00J86l32L13J06k78J60Q6R9j96K59pj01k04J43j02P1l2J35l23L69k28J81
2348A05J49k87j23N1R0K82k69k06M39m39j08M47M6k35J45N3k3l38K55j22J87L37
2370D36m10j66q1K62k70L4K28R8Q3K34n68N1P5n4J02o3J57j93k23N5Q8j40K71
2393Fj77J69j02J50Q3K67m57J53k00J26J28k48K19l19o7N47k06k01R3k44L46K03
$$ plain form
2236 278 98 180 -88 213 -69 -55 -231 95 -20 -86 -69 105 135 276 181 -270 79 205 306 327 73 -109
2258 -109 28 -148 126 -59 -20 170 -33 22 -89 -71 -151 32 225 -84 -66 -100 442 -47 -396 286 -101 -406
2280 -406 26 -12 31 -12 76 212 -141 85 123 51 93 -22 -232 110 137 -24 229 -41 231 52 203 -100 36
2303 36 370 235 -188 401 -222 -153 17 104 3 221 175 135 -28 -82 -311 -180 46 -65 -16 -92 -106 -313 -200
2326 -200 -14 -346 -33 73 -205 -45 41 140 -56 203 196 95 -109 34 -68 3 -29 106 -217 152 -76 105
2348 105 254 -33 -156 -105 -15 267 -2 -208 231 -208 -316 131 177 -58 87 140 117 -221 34 -88 99 436
2370 436 26 -140 -221 41 -229 -195 33 131 214 448 -120 -69 6 -48 54 -9 148 -45 -268 -213 -125 -265 6
2393 6 -171 -2 -104 46 129 396 -61 92 -108 18 146 -102 117 -202 -269 278 72 -129 -36 -280 66 269
2415B69l95k9N5N6o1j37L04j77J84j64J1j12M3J89J09j58j42J03p1L30j73J85
2437B19j82J90R2m31M6k93J09Q5L00O5m10M89j89j58j35K49o3L61m69K02J47k32
2459hL9N0J20j79J42k38j24p5N09k9l31j59K79K71j96j82L83j27m10L29k15K90
2481A39j09o1j03K89k74J45J6J12j35r5J68k73J84j70J61k3N1j30R5o1r5k2J42
2504d9N6J04p2j86p0K58j9j05K0J60j37k58J36k06M87k39j9J44P1O3J09n34R5
2527a91P1J29j25OK91j82j8j86L10j16L4j20M3l0Lj62N7J81j06J50k18K53k47
2550a73r3J44J60P4o4K6J61k73p6M6Q6j08l15K95K98q3p7K50k96j67nJ59J29P7
2574A75k42J12l21M13J25j70j62k6J33P8R1m98K73m4r3j06L04j90J69j03L15l53
$$ plain form
2415 269 -126 -155 -100 -44 -105 -242 62 -115 69 -95 -84 -196 -153 36 145 -13 -155 -52 -123 207 34 219
2437 219 37 227 319 -112 -66 -359 -250 -165 135 200 -210 279 90 -68 -203 46 -17 344 -125 77 224 -8
2459 -8 31 81 201 22 164 -74 -198 -273 236 207 -124 -283 -4 267 71 -111 272 145 -265 64 -151 139
2481 139 30 -31 -134 155 -119 26 42 154 19 -76 92 -181 3 -167 -6 -29 22 -108 -13 -74 -169 -191 -49
2504 -49 7 111 39 -147 -217 41 22 -83 -63 97 -40 -298 -162 -368 119 -120 -139 5 76 139 248 -286 -191
2527 -191 -120 9 -116 -110 181 -1 -19 -205 105 -11 23 -97 -54 -84 -81 -243 -186 -5 -111 39 -179 74 -173
2550 -173 -266 -122 38 112 48 74 235 -38 -114 -68 18 -90 -405 -110 188 105 28 278 -18 -185 -190 -31 98 175
2574 175 -67 45 -276 137 262 92 -70 -96 37 115 206 -292 -19 -63 -156 -262 42 -148 21 -82 233 -120
2596a20k51L40o7L9k48K54L51j08m08J92Q9j05k89K69k0J10R3l60N9K10Jk25K95
2619A01rK7j51K54k22l98L62J91J4j0m28J55p9K06J42r5k0J75l12L34n6q1k58
2642a58K39J66j19m18K92J71j22R7k15n0J05J61k34r2K86j1l05J53r1L16p2J37
2664B36r0L5j63k09J71j17o3K85j16l0K30m55Q3L39R7l53K22r8J08O8mp6j24J66
2688A42J9K0j63J98l27q5J06L76m64K34m02M14j97M21k58L1m3l49M08m9J45j67
2710A0K31m62J43R4K12N7l3k10K80m35J4k42M04k29J52Q7j00K74m64L83l86K89
2732F9k4Q6j19J01k11K33j77j92L86M6j63L05m68K18Q9K2k27p6R6O6j50J13j65
2755a42Q2K76m70J88J3%K27l69J85Q7k08J79j56J98J56k33L04q8r3l85k6N66r6
$$ plain form
2596 -120 -371 -31 -98 -59 -307 -53 298 190 -218 -26 63 -42 -331 -62 -82 28 121 -239 -180 30 31 -194 101
2619 101 92 119 -32 222 0 -398 -36 155 169 159 -269 -114 -193 13 155 60 40 215 -97 237 181 100 -158
2642 -158 81 247 128 -290 2 173 51 148 -67 -117 -12 149 -85 -177 109 98 -207 -54 -145 171 99 236
2664 236 146 181 18 -191 -20 -137 -200 85 -31 -61 169 -286 -203 136 233 -120 102 4 112 180 176 100 -24 142
2688 142 161 181 18 216 -111 -196 -90 286 -178 56 -346 68 -129 292 34 65 22 -327 81 32 177 10
2710 10 241 -221 -78 16 228 285 252 42 322 -113 -99 -341 63 -166 -14 73 -27 247 -217 166 -220 69
2732 69 45 131 12 113 -98 135 -42 -234 152 198 35 340 -128 90 179 201 -26 -102 -6 60 -90 23 -142
2755 -142 -60 216 -254 -66 -53 -53 174 -195 -10 77 -131 48 -108 90 246 13 317 229 136 -249 -275 291 195
2778A95J8j61m4j0OK63j0l78j00n1N24m93K03R6l55J61J98j80l5L18m6j26j16
2801a23L04k96M07n60J37N63n62K89l17L77j44j41K55k71n6L9J70J4q4k92K29
2822f2J56k44L0J18r1J90k81K14K32p9Q3k11N6l1K12q5j1l97n1L32O0O3kk50j35
2847a84J30J92j75K29j72k49J20N8Q0r4J87J60j01k96L96m06J22n3rLM16l97N9
2870A6K25l17J91k45j22K87q6J67K3k87J57O2J01p1m83L69L00l91J03Q3j22q3
2892a23K29l14L03p8j36K08q4j34L20K6l85K52O3k76K03k76L77m19L14m4j71P1
2914g4L0J60m31L69l75K26OK03p9j01P4rR7K77k67j19L72j46o14L62N7j92j63
2937c37L00nl6ok9l0J60o5n4J30j97K57k96L54k45M66O1l19j91k2l33N47K0k0
$$ plain form
2778 195 213 52 8 -2 4 267 257 -121 -221 -272 252 -241 -38 58 -297 -136 62 -118 -153 165 119 -7 -123
2801 -123 181 -115 292 -268 -131 432 -130 159 -158 219 75 -66 189 -82 -138 -99 71 85 1 -291 -62
2822 -62 94 -150 -120 -2 -93 97 -184 30 262 183 266 55 111 80 292 207 196 -201 -252 80 140 203 201 -49 -184
2847 -184 -54 138 -37 192 20 -229 -109 -51 29 -65 122 282 181 -115 281 -125 -3 -56 -65 -62 354 -43 16
2870 16 241 -76 115 -130 -252 35 -51 116 139 -148 9 71 172 101 -382 -13 287 -104 -1 82 -40 -123
2892 -123 106 -208 95 17 -119 89 5 -129 191 217 -168 84 147 -129 74 -202 175 -244 70 26 -145 -74
2914 -74 -44 116 -315 54 -321 -95 -89 114 35 -66 8 -1 96 373 106 -13 359 213 -401 -39 18 -174 -337
2937 -337 -37 -42 -78 -84 -113 -143 17 -48 -102 28 -169 88 -208 146 -99 367 428 109 -82 -104 -437 110 130 110
2961A10j0Rk96K82J10l31R5k76J78Q5Q0M8m6J14j37K57q9l79J04K84m6j53J8K40
2985B51l52O3J54p8N1j06J19l0R3l58K98j90Q8K15p1k89J32L58l8m97K0J18K6
3008b3P7j34J22K0J67l04J79Q1p7J14k7qj79J54r3k13j53L42k2J18j19R4o6P0
3032A20l02R8Q5J08k03p3j55K89J28j10j01K41j52j8L21m22J08LJ54k41K30m9
3054E9M1j24O4oJ18m25K49K74j46K20n98J99K14R7m14K55r8j93M04q4j68K25k0
3077A43j87M8k98J39K15j3k08J37j42M32k14j54J47j61O4L52l41j20R5l3L08k61
3099e2J02k33K80m2k86j64K65L08j46l86M00p6J44l3l6j28P5Q9nJ0k98j84M42
3122D6K0j39J12j44J43j8J10j59K57k63J59n72K71P0k59N45k43j47K48J9q9J37
$$ plain form
2961 110 100 109 -187 95 205 -126 -31 -307 -129 -44 36 84 38 152 15 272 183 -196 -92 192 146 -7 11 251
2985 251 -101 -38 116 38 89 -17 102 72 165 -193 105 -85 3 218 147 -142 -10 348 310 -187 -167 -49 -23
3008 -23 54 -80 42 62 229 -75 104 185 108 222 195 187 8 162 69 -144 -297 45 23 141 22 116 50 120
3032 120 -182 -84 1 109 -94 -167 -322 -33 95 -15 -116 125 -27 -45 276 -146 -38 -35 119 -122 108 59
3054 59 100 -24 40 34 152 -273 -24 250 104 324 -274 -75 139 236 -178 77 -21 -214 190 106 -62 163 143
3077 143 -44 4 -294 -155 60 47 -161 -24 -166 266 52 -102 45 -116 -52 300 -41 -161 -66 -99 209 -52
3099 -52 50 -183 97 55 -231 -395 -130 178 32 -354 46 -30 114 81 45 -83 -8 81 76 86 -212 -396 46
3122 46 66 -73 39 -105 38 20 130 -29 228 -35 124 -448 -177 -107 -366 179 -64 -211 37 56 -33 104
3144A04l09rL68j54K6j72J57k00M34n48L00j8K24k25L25M6k74l1l1n3j68K24Q3
3167I9K2j81KJ97m2J15l66M64k4j77j0k07P8J47P6k01L46l13J40j91J35k99J93
3190Cj04K98m39M06j22p8J02k05j96O2L12l0p9j38m8N15n05L11k7l18r5L28l8
3213h5l5J04m4L29k24m47K58P9K41l28mL11k11o6L00k92K56J70m75J36K07m20
3235b40K91L02l45l33L29J53j20l8j1J15j9J07l63J54j50J79m3J09j68jM32l85
3257d5O7j81P4P5J40l45J63K39mK4l38K61j12J4P8j89M55n38K76j66K15j71J52
3280A44Jj73q8J75k00R5L82k63J8l41N66j67k30q9Q8J12P3R4k74J12l4K30l19
3303h8K83m4j05k4k82J7L82k43P5K03k02L97l18L6P3O0k18Q3m81M10n1J92k74
$$ plain form
3144 104 -205 -214 154 0 26 -146 11 -189 245 -303 -3 -21 203 -22 303 349 75 44 13 -40 -208 16 99
3167 99 121 -60 -58 139 97 212 -154 310 286 109 99 -108 -30 117 193 -8 338 25 165 -26 109 -190 3
3190 3 -101 197 -242 164 42 -36 66 -139 -335 -273 39 9 -70 -208 -256 259 -246 65 38 -280 -375 -47 -85
3213 -85 -120 -16 -60 269 45 -402 -144 -65 176 -152 -156 155 -56 -122 178 -114 142 312 -163 -27 180 -240
3235 -240 51 353 8 -325 4 157 37 -1 -12 103 84 191 -172 -18 -168 11 -32 77 -91 -92 340 -45
3257 -45 22 -159 -85 -10 130 -215 -52 187 183 207 -131 130 18 32 110 -79 376 -162 114 -52 163 -8 144
3280 144 145 -28 -116 59 -141 -46 336 73 91 -250 316 149 -81 -170 -82 30 103 197 -77 35 1 231 -88
3303 -88 195 151 46 22 -260 -243 139 -104 -29 174 -28 369 51 87 160 220 2 85 -396 14 -37 155 -119
3326a19L29k90J91k76K50L4k74J74k83M30rl15K73O8k44M5o9q6J15K5J09j27j71
3349b20K16J77k20K07o0k47j3K48J85o1l63K39nk18L1L5K18J07l57J42K22k21
3371D2k21o2M68k01j77pK0R7k95J94K52j06J08k10R2q5P5J44k39M60m24M24l89
3394d0J86j66j9J52l09L27j42o4J4K97l25J19j31l53M69J7j02l36N33j93j54M03
3416A83n6J3n1K2o7l07L67k83L81j06k01K4l39K51N27j53l69N8K87k24J79j49
3438a3O7m75N45j81j39J24k4O74o23j09l0L69j61k55K13M7k20K91j06j72j71J51
3460a98K81P0k58q5J25lj74K91K89j38j00k66L42l04k85J72K21K3J06j21J06j42
3482d8O0J37m5p4J82j94j53L83j67k20K13M6K18l78M51m14j06N4J75J45r8j49
$$ plain form
3326 -119 210 -80 111 -165 85 119 -155 19 -264 166 157 -158 115 183 -61 -16 -85 -171 -56 -31 78 -49 -220
3349 -220 -4 173 -47 160 100 -147 -160 88 273 212 -151 88 83 -135 -104 -69 149 256 -101 41 263 42
3371 42 -179 -241 227 26 -151 -158 -138 -41 -336 -142 110 4 112 -98 -6 -91 -16 128 -111 349 -75 349 -40
3394 -40 146 -20 -39 113 -196 131 -11 -75 -61 236 -89 30 -101 -454 15 32 -70 -406 127 -66 -220 183
3416 183 127 140 89 111 44 -263 104 -179 202 96 -105 -81 -420 -169 358 205 -164 -106 181 -43 136 -13
3438 -13 54 -421 124 -57 -196 -72 -96 578 -45 -154 -184 185 24 -231 -18 29 -191 100 -6 -178 -349 -198
3460 -198 83 153 -105 -190 -65 -68 -242 49 338 200 100 -166 176 -128 -413 -241 -20 3 109 -12 94 -48
3482 -48 12 149 104 30 212 18 -135 248 81 -139 74 120 338 -40 411 -3 -109 -55 120 265 167 18
3504A8j36K48J89l47K6J15J83l15j21J17j2R1j30J29q9J92j6l53N02l53L41J31
3526D10o63N25P2k47O5k33l5K39l3j18M18k48p9l85K74K13l61M49m53J93N17m62
3548E8k33R7J66l02M56m7r3k12L61l52K68m3k33lJ1K50k46O1J58k81N0M38j19
3571B10o02P00m34j5M05o6k74J33j53K22l16K37J05j78n7M70j52m74l1N12l31
3592h9RL52m95Q4J29N1j35l2P2q8j54K40j17m0m9J67q3L78j24l7m6J61q1j1j79
3617a17P5K68j64p5l4J3P4J56l26K54P9N4n25J73L2J95k06J40k58K30L7l36J31
3640a30K72n18O19j47M6J3K5q6j43J16k14R9n1%J65J31L5j23j13N5j59J51k5K29
3664B47j60j74M2j56M06k85L68j86L6j07J00L6l15J77k35J07K75o7k83J63P0l7
$$ plain form
3504 18 -118 130 319 -28 -2 113 296 -19 -140 -23 -35 56 -74 55 -34 158 142 -211 291 -62 279 410
3526 410 -253 272 344 97 162 -71 -106 133 100 -18 400 152 73 -312 -38 175 -186 263 -190 3 520 58
3548 58 -175 -78 88 -214 242 195 102 -110 251 -101 167 124 -109 -112 -101 149 -97 -36 122 -159 -109 329 210
3571 210 -392 308 -126 -141 264 198 -76 57 -96 126 -190 47 152 -26 -83 387 235 -239 -270 242 -89
3592 -89 -80 272 -223 -139 -10 41 -94 -126 -54 -142 -296 -56 -173 -213 -262 -95 -178 200 76 39 -7 154 73 62 -117
3617 -117 -42 226 62 -13 -47 -34 40 196 -130 124 203 257 -268 -95 -63 132 -74 66 -192 38 75 -261 -130
3640 -130 142 -376 243 96 142 155 180 94 -49 67 -147 -48 -99 -99 66 197 232 109 -4 51 -108 43 18 247
3664 247 87 -87 -45 -201 205 -80 288 102 138 31 131 167 -148 29 -206 -99 176 109 -174 -11 59 22
3686B2l36L06R1J04l71L49j34j22J41j46J65J45j25n7o8m1m7k4K14j17j56J89
3708a8oOK61k12J30p9j96j86M12n9l49O8L18j73K67o1k44L06k57J75j12k5J12
3731G8J5k96Q9J82lo1k06lK75j45L5J65J77l79Q1j81J61k8RM7J9k83P5L26R1k19
3757B1o7J36K85n14K33l29M01j57J33l60K32j63L6j6j31m6O4L04j39j23J46J11
3779E7r6K35j93J8k94J48Q6m6J38P8Q0k69Q9K93m24J0K81m28O8j18M73j30k20
3802a64K35k11L02l13m1J86q5M2l8n1j00P5J72k90J6M42j06J57m01Q3K41l36j04
3825b89M51o2j26J93M73o07j6J89l73K39j83K07j50j93L17Q8j70j53K6q6K35M4
3847E4N1j26J73J75n74M30j19J73m16p7L09k9k00M99k33K18j88k43J54m2q7J11
$$ plain form
3686 22 -314 -8 83 187 -184 165 31 -91 50 -96 69 214 89 32 -36 -77 -124 -148 66 -51 -207 -18
3708 -18 -24 -18 243 31 161 82 -114 -300 112 53 -296 -228 90 -83 184 123 -121 185 -72 103 -9 -34 78
3731 78 93 -203 -114 68 65 4 -202 -205 70 -75 -40 125 302 -77 4 -177 -16 -44 -35 12 31 -252 -177 149 240 21
3757 21 -46 90 375 -139 94 -235 166 9 142 -218 14 -149 -113 -129 -260 -306 -242 62 -77 -200 -54 57
3779 57 -39 196 3 21 -273 -125 -39 -85 53 131 211 -58 31 324 -100 -90 191 -237 -169 -287 186 56 -164
3802 -164 71 -140 162 -151 -192 -6 -91 -49 -87 -138 -238 -163 9 -281 -265 177 71 228 -173 -90 151 -185 -289
3825 -289 162 100 -26 167 640 33 17 206 -167 72 -111 96 -54 -247 70 158 -12 -165 -139 -225 10 54
3847 54 105 -21 152 327 -247 183 64 237 -179 -256 53 24 -176 323 90 308 120 -123 31 -11 -98 13
3869A3J13J22j26j31p7N1J69l33Q9L32m01J61K65j27k33nk54M22J07k04N5k7J73
3892A54k25N0l49L85J47k39Lj11L19l87L98k44L74n17J92R4l4K70l12L3Nj8k57
3915b69K51oJ61N0j41m39K02J39L68l90J4J41l72M18n9j12Q2oj75P7R5j44J20
3938EJ40l92K71kK70j11j95J88j0J84o49M76p0j04J4N07o62P1O5J07ol6k32K48
3962G7o4k1O3k4l1k52L61n38N91j01j32J56R4k0j53k77J45J10J59k22L88n66K04
3985e3n7Q2J27j22K31m48K54K18n19N70K7k70J41j9j58r9q2J35J92l45J01k2O9
4008d7Q4j75J80J8Nj14J87l17J35M6n6K26j89K21K17o52j3J61J33k3p6K43k38
4031d4R5J6k7k15M13k18O4j00L19m11j83M19l4m39K05J95n7O7k76M25j15j54n2
$$ plain form
3869 13 126 248 122 -9 -86 -35 134 -199 -110 222 -179 -18 247 120 -113 -118 -372 50 157 -47 8 -19 154
3892 154 -71 -21 -370 15 162 -77 -74 -185 134 -253 145 -99 275 -242 -50 44 10 280 -32 1 6 -12 -269
3915 -269 -18 -24 137 187 46 -393 -191 -52 316 -74 -60 81 -291 127 68 -44 38 32 -143 -66 29 -115 5
3938 5 145 -247 24 22 292 181 -14 174 164 348 -301 175 105 1 15 522 -140 -69 -4 103 97 61 -171 77
3962 77 13 -8 55 31 0 -252 109 -429 162 61 -71 85 179 159 6 -271 -126 -16 143 -79 309 -257 -53
3985 -53 -110 -28 99 -23 208 -240 14 232 -287 283 310 40 181 162 4 -95 -177 -42 150 -195 -94 -116 -47
4008 -47 37 -138 42 60 65 -49 138 -179 -44 2 -54 172 -17 204 421 -231 -244 -83 50 27 -49 194 -44
4031 -44 51 67 40 -175 238 20 84 -16 303 -108 -291 128 94 -345 -140 55 -2 65 -211 214 99 -55 -107
4054a07O8k6j4O5pK93m67K31J68k97J36O7n9K15l66J95J02k73J14p4j13P7J20
4077D8j85LM5j5K2J92j77N5jk56J04M18l43J95k7k05M66o10K74K12j35L57q46
4100d09N38k43k23M10pj19M5J5N8l9J6j88P5K30k44J23k49J17K3K47k07J63l00
4123a68K20j00L2N1q8K12J3L1k82L18j55r9kj32K90k90OJ15p4l7q7J66P0J73j52
4148C1J35P2l75K57j89j74K97p8J42K21j88j69j66K32R3k25J4K2j22L45j26M8
$$ plain form
4054 -107 -39 -65 -79 -14 -21 272 -195 36 204 -93 43 110 51 266 -100 95 197 -76 38 -36 -149 -72 48
4077 48 -137 -134 -89 -104 -82 110 -67 -12 -13 -269 -165 253 -90 105 78 -127 339 -271 3 215 80 437 -409
4100 -409 129 -114 -337 73 66 -53 -8 7 65 26 42 -146 -71 159 -85 38 -211 -94 -71 176 -31 132 -168
4123 -168 52 -48 -16 35 -53 159 172 203 -79 239 84 -15 -17 -149 141 -149 -143 -28 -102 -139 -226 -60 10 183 31
4148 31 166 238 -137 120 -69 -243 54 -24 118 339 151 -18 -184 48 141 -84 -70 -48 -170 175 49 97
$$ [...]
8191C
##END NTUPLES=NMR FID
##END=
