##TITLE=1H_SL65(17.08)-Cpart
 CDCl3, 8 sc, 
 28.8.2020
##JCAMPDX= 6.0         $$ Bruker NMR JCAMP-DX V2.0
##DATA TYPE= NMR FID
##DATA CLASS= NTUPLES
##ORIGIN= UXNMR, Bruker Analytische Messtechnik GmbH
##OWNER= root
$$ XWIN-NMR		Version 3.5
$$ Fri Aug 28 10:54:45 2020 Russian Standard Time (UT+4h)  she@DPX200
##.OBSERVE FREQUENCY= 200.1315066352
##.OBSERVE NUCLEUS= ^1H
##.DELAY= (6, 6)
##.ACQUISITION MODE= SIMULTANEOUS
##.ACQUISITION SCHEME= undefined
##.AVERAGES= 8
##.DIGITISER RES= 18
##SPECTROMETER/DATA SYSTEM= spect
##.PULSE SEQUENCE= zg30
##.SOLVENT NAME= CDCl3
##.SHIFT REFERENCE= (INTERNAL, CDCl3, 0, 15.7039)
##AUDIT TRAIL= $$ (NUMBER, WHEN, WHO, WHERE, WHAT)
$$ ##TITLE= Audit trail, XWIN-NMR		Version 3.5
$$ ##JCAMPDX= 5.01
$$ ##ORIGIN= Bruker BioSpin GmbH
$$ ##OWNER= she
$$ F:/spectra/data/she/nmr/H-F/1/audita.txt
$$ ##AUDIT TRAIL=  $$ (NUMBER, WHEN, WHO, WHERE, WHAT)
(   1,<2020-08-28 10:53:17.23 +0400>,<she>,<DPX200>,
      <created by zg, POWCHK disabled, PULCHK disabled
       configuration hash MD5:
       00 E9 B6 7A A2 85 ED C7 34 08 36 98 17 FE 4E 26
       data hash MD5: 16K
       F3 C8 09 5D 6D D1 99 4A 32 ED 8E 84 10 8E 07 3F>)
$$ ##END=
$$ 
$$ hash MD5
$$ 67 79 99 D7 F9 C9 CE D9 F0 86 6B 33 84 8C 4F 7E
##$RELAX= 
##$RELAX= 
##$RELAX= 
##$RELAX= 
##$RELAX= 
##$RELAX= 
$$ Bruker specific parameters
$$ --------------------------
##$DU= <F:/spectra>
##$EXPNO= 1
##$NAME= <H-F>
##$PROCNO= 1
##$TYPE= <nmr>
##$USER= <she>
##$AMP= (0..31)
100 100 100 100 100 100 100 100 100 100 100 100 100 100 100 100 100 100 
100 100 100 100 100 100 100 100 100 100 100 100 100 100 
##$AQSEQ= 0
##$AQ_mod= 1
##$AUNM= <au_zg>
##$AUTOPOS= <>
##$BF1= 200.13
##$BF2= 200.13
##$BF3= 200.13
##$BF4= 200.13
##$BF5= 200.13
##$BF6= 200.13
##$BF7= 200.13
##$BF8= 200.13
##$BYTORDA= 1
##$CFDGTYP= 0
##$CFRGTYP= 5
##$CHEMSTR= <none>
##$CNST= (0..31)
1 1 145 1 1 1 1 1 1 1 1 1 1 1 1 1 1 1 1 1 1 1 1 1 1 1 1 1 1 1 1 1 
##$CPDPRG= <>
##$CPDPRG1= <>
##$CPDPRG2= <>
##$CPDPRG3= <>
##$CPDPRG4= <mlev>
##$CPDPRG5= <mlev>
##$CPDPRG6= <mlev>
##$CPDPRG7= <mlev>
##$CPDPRG8= <mlev>
##$CPDPRGB= <>
##$CPDPRGT= <>
##$D= (0..31)
0 1.2 0 0 0 0 0 0 0 0.06 0 0.03 0 0 0 0 0.0002 0 0 0 0 0 0 0 0 0 0 0 0 
0 0 0 
##$DATE= 1598597596
##$DBL= (0..7)
120 120 120 120 120 120 120 120 
##$DBP= (0..7)
150 150 150 150 150 150 150 150 
##$DBP07= 0
##$DBPNAM0= <>
##$DBPNAM1= <>
##$DBPNAM2= <>
##$DBPNAM3= <>
##$DBPNAM4= <>
##$DBPNAM5= <>
##$DBPNAM6= <>
##$DBPNAM7= <>
##$DBPOAL= (0..7)
0.5 0.5 0.5 0.5 0.5 0.5 0.5 0.5 
##$DBPOFFS= (0..7)
0 0 0 0 0 0 0 0 
##$DE= 6
##$DECBNUC= <off>
##$DECIM= 32
##$DECNUC= <off>
##$DECSTAT= 4
##$DIGMOD= 1
##$DIGTYP= 9
##$DL= (0..7)
0 120 120 120 120 120 120 120 
##$DP= (0..7)
150 150 150 150 150 150 150 150 
##$DP07= 0
##$DPNAME0= <>
##$DPNAME1= <>
##$DPNAME2= <>
##$DPNAME3= <>
##$DPNAME4= <>
##$DPNAME5= <>
##$DPNAME6= <>
##$DPNAME7= <>
##$DPOAL= (0..7)
0.5 0.5 0.5 0.5 0.5 0.5 0.5 0.5 
##$DPOFFS= (0..7)
0 0 0 0 0 0 0 0 
##$DQDMODE= 0
##$DR= 18
##$DS= 0
$$ [...]
##$SUBNAM2= <"">
##$SUBNAM3= <"">
##$SUBNAM4= <"">
##$SUBNAM5= <"">
##$SUBNAM6= <"">
##$SUBNAM7= <"">
##$SUBNAM8= <"">
##$SUBNAM9= <"">
##$SW= 16.880792210976
##$SWIBOX= (0..15)
0 0 2 0 0 0 0 0 0 0 0 0 0 0 0 0 
##$SW_h= 3378.37837837838
##$TD= 16384
##$TD0= 1
##$TE= 0
##$TE2= 300
##$TE3= 300
##$TEG= 300
##$TL= (0..7)
0 120 120 120 120 120 120 120 
##$TP= (0..7)
150 150 150 150 150 150 150 150 
##$TP07= 0
##$TPNAME0= <>
##$TPNAME1= <>
##$TPNAME2= <>
##$TPNAME3= <>
##$TPNAME4= <>
##$TPNAME5= <>
##$TPNAME6= <>
##$TPNAME7= <>
##$TPOAL= (0..7)
0.5 0.5 0.5 0.5 0.5 0.5 0.5 0.5 
##$TPOFFS= (0..7)
0 0 0 0 0 0 0 0 
##$TUNHIN= 0
##$TUNHOUT= 0
##$TUNXOUT= 0
##$USERA1= <user>
##$USERA2= <user>
##$USERA3= <user>
##$USERA4= <user>
##$USERA5= <user>
##$V9= 5
##$VALIST= <valist>
##$VCLIST= <CCCCCCCCCCCCCCC>
##$VD= 0
##$VDLIST= <DDDDDDDDDDDDDDD>
##$VPLIST= <PPPPPPPPPPPPPPP>
##$VTLIST= <TTTTTTTTTTTTTTT>
##$WBST= 1024
##$WBSW= 4
##$XGAIN= (0..3)
0 0 0 0 
##$XL= 0
##$YL= 0
##$YMAX_a= 263498
##$YMIN_a= -195881
##$ZGOPTNS= <>
##$ZL1= 120
##$ZL2= 120
##$ZL3= 120
##$ZL4= 120
##$ABSF1= 10
##$ABSF2= 0
##$ABSG= 5
##$ABSL= 3
##$ALPHA= 0
##$AQORDER= 0
##$ASSFAC= 0
##$ASSFACI= 0
##$ASSFACX= 0
##$ASSWID= 0
##$AUNMP= <proc_1d>
##$AZFE= 0.1
##$AZFW= 0.1
##$BCFW= 1
##$BC_mod= 2
##$BYTORDP= 1
##$COROFFS= 0
##$CY= 11.3945322036743
##$DATMOD= 1
##$DC= 2
##$DFILT= <>
##$DTYPP= 0
##$F1P= 16.9975609425685
##$F2P= -3.02152046262296
##$FCOR= 0.5
##$FTSIZE= 0
##$FT_mod= 4
##$GAMMA= 1
##$GB= 0.15
##$INTBC= 1
##$INTSCL= 1
##$ISEN= 128
##$LB= 0.24
##$LEV0= 0
##$LPBIN= 0
##$MAXI= 10000
##$MC2= 0
##$MEAN= 0
##$ME_mod= 0
##$MI= 1.114404
##$NCOEF= 0
##$NC_proc= 0
##$NLEV= 6
##$NOISF1= 3.799351
##$NOISF2= 2.8
##$NSP= 1
##$NTH_PI= 0
##$NZP= 0
##$OFFSET= 15.70392
##$PC= 1
##$PHC0= -9981.279
##$PHC1= 20.80092
##$PH_mod= 1
##$PKNL= yes
##$PPARMOD= 0
##$PSCAL= 0
##$PSIGN= 0
##$REVERSE= no
##$SF= 200.130013532006
##$SI= 16384
##$SIGF1= 3
##$SIGF2= 2
##$SINO= 400
##$SIOLD= 16384
##$SREGLST= <1H.CDCl3>
##$SSB= 0
##$STSI= 0
##$STSR= 0
##$SW_p= 3612.71676300578
##$SYMM= 0
##$S_DEV= 0
##$TDeff= 0
##$TDoff= 0
##$TI= <>
##$TILT= no
##$TM1= 0
##$TM2= 0
##$TOPLEV= 0
##$USERP1= <user>
##$USERP2= <user>
##$USERP3= <user>
##$USERP4= <user>
##$USERP5= <user>
##$WDW= 1
##$XDIM= 8192
##$YMAX_p= 0
##$YMIN_p= 0
$$ End of Bruker specific parameters
$$ ---------------------------------
##NTUPLES= NMR FID
##VAR_NAME=  TIME,          FID/REAL,        FID/IMAG
##SYMBOL=    X,             R,               I
##VAR_TYPE=  INDEPENDENT,   DEPENDENT,       DEPENDENT
##VAR_FORM=  AFFN,          ASDF,            ASDF
##VAR_DIM=   8192,          8192,            8192
##UNITS=     SECONDS,       ARBITRARY UNITS, ARBITRARY UNITS
##FACTOR=    0.000296,      1,               1
##FIRST=     0,             0,               0
##LAST=      2.424536,      0,               0
##MIN=       0,             -195881,         0
##MAX=       2.424536,      263498,          0
$$ Real data points
##PAGE= N=1
##DATA TABLE= (X++(R..R)), XYDATA
0 0 0 0 0 0 0 0 0 0 0 0 0 0 0 -8 8 -8 8 -8 16 -16 22 -24 30 -32 40 -48 56 -64 75 -86 100 -114 130 -148 168
35 168 -188 214 -238 268 -300 333 -372 413 -459 509 -562 622 -685 756 -832 915 -1009 1112
53 1112 -1224 1351 -1491 1650 -1831 2036 -2276 2555 -2889 3297 -3802 4451 -5318 6528 -8329
68 -8329 11243 -28992 263498 94897 -76165 147632 -32397 -124520 10025 18122 -6492
79 -6492 34826 1072 -30041 -1593 13607 -41940 14503 45386 -55217 13192 137346 25742
91 25742 -42640 -35814 -77471 -28952 22934 17928 68982 39079 -25578 -8129 -10724 -5836 18421
104 18421 15541 29002 -9513 -42938 6801 -4807 -48541 -3869 41898 37068 31112 11514 -27643
117 -27643 -10565 8666 -51694 -30684 42777 -16734 -34746 52518 24141 -43187 5803 28840
129 28840 -32257 -22401 40668 21176 -30316 -40770 -30452 951 9014 -5655 28091 37035 -13025
142 -13025 -8372 14849 -13744 -25435 -15596 -8490 -4415 -4659 27158 40685 -12420 -37237 -8029
155 -8029 19813 22321 10782 22257 7088 -46654 -41452 -8704 2519 27523 39115 28414 8105
168 8105 -17560 -10614 -55 -10568 -6267 1234 11590 16792 -5652 -8522 5061 -10294 -11903
181 -11903 17129 36922 29884 1592 -21309 -38623 -48270 -14333 30715 39704 27482 1151 -16900
194 -16900 -18343 -22414 284 27986 9280 -13579 -13149 -8598 -7974 -12448 -6758 2663 4569 16916
208 16916 25376 14693 -11626 -40558 -32190 -8346 -2299 20577 33192 1505 -19882 -15840 -4927
221 -4927 10594 14064 9712 4453 -8115 -14695 -11458 -4010 -877 -5095 9617 24345 12586 7755
235 7755 6857 -8944 -15408 -8697 2693 7886 363 2668 6239 216 3771 3754 1983 9812 4684
250 4684 3631 10518 -5200 -18333 -11611 -4031 3259 9513 16658 13191 -3777 -2695 2929 -4272
264 -4272 -4621 -8660 -11321 -906 2110 7776 11588 -6150 -16435 -9707 1686 16134 18288 5566
278 5566 -12497 -30047 -26547 -7950 8749 19704 10839 -923 -954 -8477 -7754 4772 -1978 -12638
292 -12638 -4585 5079 4061 1609 828 -12443 -19874 1483 19672 23525 21761 -1158 -26677 -29267
306 -29267 -15771 5434 22386 23215 9340 -7238 -10309 -6829 1543 13418 8732 1393 3116 -3600
320 -3600 -3961 409 -9221 -7158 5500 10956 19771 18755 2384 -12090 -19275 -13976 -2552 9809
334 9809 20780 7592 -9375 -6038 -10630 -5711 13099 9355 4635 5190 -6289 -10932 -11897 -10458
348 -10458 -732 2416 7157 8750 534 1059 -3133 -11320 -3560 -1088 -1614 2040 -4321 -3599 1871 -4845
364 -4845 -3619 1921 269 3436 7029 5381 -4737 -11973 -5327 -5487 -5456 8981 11012 1721 -1344
379 -1344 -3712 1782 8024 2789 -333 -4131 -6485 -363 5094 9048 3751 -5310 -2473 -2179 1581
394 1581 15087 15480 3812 -10992 -18593 -5136 6531 6511 9303 4810 -2778 -3142 -665 4812 2637
409 2637 -3042 296 -4209 -4975 8395 5757 -5708 -11407 -13906 1949 17454 14502 3807 -8785
423 -8785 -15378 -15047 -9123 8302 13428 3304 -790 -9844 -13633 -389 5706 5212 483 -6688 -774
438 -774 4056 -4106 -9036 -7069 -2034 1877 5518 11252 5925 -4799 -8276 -10917 -4437 8345 9044
453 9044 5816 -709 -9501 -4248 3136 1789 2410 6649 9121 2353 -4448 -2807 -3233 -2204 3742 4289
469 4289 6769 7114 -973 -3345 -2732 654 6879 5144 -28 -3358 -3086 4446 2743 -4554 -571 1720
485 1720 946 3892 2754 1419 -1139 -6217 -6703 -1742 6106 5246 -2050 -3742 -7392 -4519 8510 5208
501 5208 -3971 -2953 -6575 -4850 1718 586 2568 2415 -8059 -9483 -1127 5127 6298 2739 -3783
516 -3783 -9221 -5326 3196 2085 1894 1344 -3467 -679 -354 -1936 5103 2795 -4591 -1845 -547 3473
532 3473 7769 536 -4271 -4074 -3446 3990 8814 6967 2798 -4103 -6788 -3681 2177 7847 8733 3592
548 3592 -5161 -6743 329 2194 2439 5245 980 -2449 1048 -1121 -137 2492 -3092 -2773 2173 1537
564 1537 3250 3360 -4251 -7661 -3868 401 4149 6238 702 -4833 -3716 -5787 -5146 5665 3720
579 3720 -2941 1462 -1928 -7163 -919 -50 -2018 1989 2371 699 -779 -3981 -4465 -2431 1577 2896
595 2896 984 1025 -1239 -2771 936 839 1032 1850 -3513 87 5037 -335 1145 804 -5997 -286 6000
612 6000 5710 6320 -316 -5258 -3570 -2150 5241 8033 1451 -1396 -4021 -3469 4805 6616 3524 589
628 589 -4640 -3548 526 3871 5786 -2142 -6709 -1498 -1060 3069 8849 1603 -4513 -4938 -4197 864
644 864 3687 1153 -1899 -6164 -4315 946 2070 3894 782 -6121 -4154 389 -803 1588 1628 -5612
660 -5612 -6356 -1866 -42 3700 5137 18 -3100 -3555 -2500 -2 1266 682 -1762 -1431 883 -985
676 -985 -325 3484 -114 31 3974 133 812 2600 -4560 -3298 1715 -1021 3084 5717 1774 1344
692 1344 1142 344 -794 -887 3871 2092 -864 1988 -2519 -3253 2591 340 2329 7743 2211 -637
708 -637 -2203 -4702 -1860 335 1382 1541 -1843 -129 827 -1547 925 1134 -544 86 -1971 -1378 1181
725 1181 -2638 -4084 -4328 -3469 2741 4870 3355 1166 -4025 -4694 -2868 -1850 1329 1705 -325 -3259
741 -3259 -5503 -188 3816 2792 2723 -1327 -2612 1084 816 -82 -1271 -4037 -2296 -247 1981 5736
757 5736 5267 2104 -1350 -4489 -481 3731 2515 716 -2483 -3460 35 1875 4005 2829 1136 2962
773 2962 251 -987 3118 829 -2769 -2923 -4266 -802 5076 4881 2509 -169 -1520 -590 153 400
789 400 159 -413 -1328 -4076 -2791 -86 -531 2153 2155 -1517 1554 3596 -2589 -4757 -2805 -3578 -3557 774
807 774 2248 -1077 783 3097 -2779 -2753 2160 122 -992 433 -2081 -3636 -1852 -1957 -2915 1624
823 1624 7383 3966 594 1557 -2772 -4036 1090 -113 -1572 1876 982 -190 720 1874 3251 2679
839 2679 933 142 1386 2621 -1 -3186 -3084 -3591 662 6045 4152 4083 3723 -2417 -3213 34 -247
856 -247 1044 1797 -1470 -4924 -1882 3776 1809 -369 2953 949 -1451 1842 1040 -3209 -4467 -4087
872 -4087 -3847 -1645 3068 5183 1755 -375 -2733 -3472 664 1353 -1859 -1225 -2127 -4504 -2367 650
888 650 1212 597 1772 2165 134 735 1471 -2456 -5456 -3927 -1889 1082 2942 2930 2574 412 -688
905 -688 610 1175 1057 1277 262 -2166 -2632 -707 -367 -74 2984 4072 2999 3791 2497 -1388 -2840
922 -2840 -1683 -1501 -1343 1014 2281 1473 836 1009 976 1250 906 907 1421 -418 -2004 -2661 -3692 -3051 -479
941 -479 2580 4911 2908 910 341 -2615 -4009 -1312 -314 -1519 -2044 -709 -345 -1051 648 1738 53
958 53 67 1411 784 27 -2337 -4606 -4115 -3630 -668 3897 4336 2408 1093 -866 -2058 -393 544 35
976 35 -1266 -856 -1495 -1367 1225 2223 778 1555 2900 2656 2051 1244 -1426 -4510 -3841 -737 669 3477
994 3477 4708 1793 507 340 -530 1005 2146 -149 -1115 -1131 -2060 -1690 -159 1090 446 1763 3517
1011 3517 2185 2165 -401 -4125 -3363 -3044 -3085 1650 2040 143 922 104 -1357 -434 771 843 -726 -1107
1029 -1107 -1556 -4013 -2364 -1227 -2116 1204 3482 1671 1933 1122 -1984 -2857 -2598 -1625 -1243 -771 2016
1046 2016 322 -1082 1367 796 365 2244 1092 1312 1201 -1879 -2875 -2542 -2055 599 3058 3890 2913
1063 2913 1902 1243 -1106 -837 627 -672 -7 484 -1563 585 1985 -217 440 1821 1590 2699
1079 2699 2339 528 -1963 -3165 -2493 -2628 172 3214 2413 1902 400 -1890 -467 636 -734 -773 -1341
1096 -1341 -915 -921 -2046 -944 -669 -567 1262 1657 1232 1927 -171 -2823 -4346 -4199 -1071 642 1960
1113 1960 1477 -356 325 254 -1144 -98 979 419 -118 -1343 -1708 -1387 -964 -82 380 1606 3329 3450
1131 3450 1516 -908 -2294 -1532 -1506 -579 1076 1726 2229 717 -779 1078 1101 789 2230 1039 -508
1148 -508 -442 -1085 -1724 -2434 -426 3189 2121 1711 2461 888 -690 -1596 -1917 -497 -317 226 975 -1433
1166 -1433 -767 1277 -750 -697 1291 1455 1334 -231 -2087 -2774 -3816 -1320 -27 -191 2125 2754 -141
1183 -141 -951 -1192 -1150 119 -693 -1472 -538 347 -560 -875 -276 -424 320 2987 2972 60 169 8 -2816
1202 -2816 -3143 -319 1577 1672 1683 1489 345 -102 675 911 76 -80 757 866 -971 -1286 160 110 -252
1221 -252 1320 3153 2566 1126 399 -1249 -2666 -945 600 171 1320 1236 -311 311 -309 -354 990
1238 990 727 -182 -388 -319 -1648 -1777 -1077 -1156 -303 1923 1903 304 268 -437 -2271 -2067 -1040 -301 -120 -71
1258 -71 114 -623 -1288 -208 131 -68 833 769 359 -1013 -2158 -1552 -859 -744 899 1985 1730 923 478
1277 478 -173 -1228 -402 585 -311 461 1000 -541 -124 101 -900 1471 2398 717 1722 1167 -1231 -1511
1295 -1511 -1071 -412 396 1768 2146 688 381 453 -916 26 326 -521 770 279 -944 -178 -749 -1271
1313 -1271 369 580 1210 1629 541 -417 -1986 -1963 -893 -1026 -82 1357 -561 -487 127 -939 -520 488
1331 488 -159 -572 -87 -593 -1237 -1110 -1094 -1065 174 930 838 906 864 -616 -1027 -870 -697 -39 732 318 -1
1352 -1 -207 -230 411 455 528 1023 932 206 40 255 -824 -853 98 391 1225 1617 786 676 8 -713 -75 -223
1374 -223 72 544 264 123 138 -558 234 137 440 748 337 443 -475 -1191 -675 -800 -608 453 535 103 417
1395 417 -310 -760 -400 -756 -332 -22 -71 -146 -752 -763 -604 -770 292 615 372 668 -428 -1081 -1129 -996 -698
1416 -698 410 630 729 180 8 -220 -319 26 105 267 612 580 -460 -31 -576 -298 353 777 1106 1176 706
1437 706 -117 -507 -264 -218 677 1064 204 481 591 -171 -48 537 601 497 571 198 32 -339 -332 -427 -767 515
1459 515 649 398 453 -422 -575 -259 -525 -271 26 81 424 -638 -811 -80 -253 -195 -50 -782 39 -119 -893
1480 -893 -424 -982 -546 99 -351 -401 388 -206 -14 -210 -932 349 -111 74 289 -212 117 220 -648 149
1500 149 -38 170 763 179 -74 551 53 62 -123 -14 799 499 281 763 76 127 232 -214 56 669 542
1521 542 756 65 -213 159 -155 411 156 176 765 108 -675 -563 10 318 421 305 -365 -183 129 -433
1541 -433 -1019 -190 64 -40 144 -256 -664 74 -513 -582 -377 7 404 -369 -403 -658 -563 209 9 -201 291
1562 291 -15 -144 -201 -520 -410 134 3 -3 -128 -45 225 -277 202 494 160 542 0 -324 223 -93 -358
1583 -358 412 375 186 577 237 -137 -90 332 639 390 360 31 -550 -27 -79 -194 632 1010 259 265 -58 -219
1605 -219 -276 -236 -201 -191 -29 -183 -299 -424 -169 368 67 23 -84 -214 -406 -630 -628 -286 -137 -114 82 23 -209
1628 -209 -335 -46 -531 -302 -273 -212 -441 -317 -314 -111 117 166 116 467 159 -268 -204 -114 -276 -43 -114 -150 165
1651 165 287 163 319 492 425 425 126 183 -182 -97 133 -93 419 883 328 174 603 582 329 556 282 -103
1673 -103 -426 -301 -233 -51 375 681 365 471 143 51 91 -252 -337 -81 -111 -204 -692 -417 -19 -32 350 620
1695 620 -28 -99 -67 -1161 -1024 -698 -298 -117 13 -84 93 17 -148 -176 -100 229 -231 -555 -716 -1156 -417 -333
1717 -333 -150 848 837 448 377 -361 -620 -369 -258 13 71 -55 260 -213 206 435 447 581 1066 529 196
1738 196 -238 -650 -438 -154 453 492 889 798 285 186 521 60 -13 278 -250 -551 51 -346 -18 64 111 387
1760 387 540 407 -24 -75 -295 -1023 -458 -654 -859 69 -303 180 394 16 90 70 -507 -277 -399 -569 -281
1781 -281 -463 -495 -370 -55 284 341 542 580 -108 -496 -785 -792 -362 -196 -152 518 425 288 938 -57 -50 775 167
1804 167 324 36 -283 -311 -253 -283 485 689 1048 994 528 445 -289 -535 -565 -336 90 239 178 177 219 96 436
1827 436 227 277 734 -20 -480 -527 -999 -1041 -97 458 872 710 676 216 -519 -462 -684 -617 -70 -62 -636 -188 -381
1850 -381 -406 -193 23 407 600 144 -118 -1012 -915 -776 -1044 -399 588 548 338 343 -237 -316 90 -30 -156 -307
1872 -307 -121 -458 -629 -266 -56 334 1039 731 667 509 63 -467 -459 -671 -236 311 216 419 291 726 421
1893 421 517 187 248 316 338 -122 -677 -185 -99 -209 227 416 638 623 595 -54 -339 -409 -860 -927 -492 -241 43
1916 43 102 420 -187 111 328 45 -247 -10 -379 -1023 -582 -867 -640 -232 419 594 684 310 269 -765 -711
1937 -711 -555 -507 -78 193 -118 136 -13 -596 247 230 416 510 385 -523 -765 -763 -789 -135 319 900 637 944
1959 944 695 -299 -96 -60 -347 273 59 -196 -115 -225 -308 -27 688 770 728 773 130 -644 -339 -710 -746 166
1981 166 274 257 276 393 -6 -122 40 -33 -296 -35 -366 -520 -267 -447 -433 -173 163 331 487 181 -43
2002 -43 -583 -759 -629 -864 -364 -301 -308 8 299 -38 38 191 -70 102 -90 -102 -162 -412 -288 -241 12 551 543
2025 543 595 695 292 -118 -386 -836 -284 159 -189 309 865 434 249 353 438 513 410 280 110 -432 -324
2046 -324 -506 -669 117 627 974 810 694 10 -201 -527 -445 -307 67 431 252 -195 -540 -470 86 356 235
2067 235 499 79 -417 -546 -702 -793 -286 -143 289 240 612 17 -290 -458 -483 -367 217 -179 -160 -267 -541
2088 -541 -280 -132 263 550 721 351 41 -381 -620 -632 -572 -244 416 523 333 435 378 197 497 468 -297
2109 -297 228 173 -45 -315 -356 -262 490 270 350 1015 675 148 69 -417 -637 -180 -135 68 54 97 279 19 133
2132 133 -2 152 136 -119 -83 -359 -343 -577 -200 -294 178 447 451 512 -74 -364 -501 -553 -287 -153 -205 116 -261
2155 -261 -284 -20 -22 66 254 307 387 -486 -274 -526 -637 -298 187 258 657 503 444 63 -271 -66 -137 104 140
2178 140 261 265 7 -363 -199 98 495 641 674 181 98 -452 -540 -364 -294 131 514 547 521 -17 205 115 29
2201 29 -8 176 51 -45 -234 -491 -290 -71 -43 304 899 297 -29 -211 -616 -433 -184 -305 68 65 306 -130
2223 -130 -115 55 -90 44 15 31 2 -326 -535 -545 -502 -236 93 508 387 137 122 -145 -209 -319 -265 71 142
2246 142 220 136 58 442 30 210 321 274 244 342 239 -285 -168 -185 132 428 101 504 607 94 -137 61
2268 61 -19 125 160 201 217 303 75 10 78 61 210 240 354 -131 104 -100 -250 -510 -181 109 155 433 199 -173
2292 -173 -48 -202 13 -87 53 -24 -218 -455 -478 -212 -165 -66 267 218 81 -26 -302 -140 -327 -175 150 272
2314 272 406 106 127 -124 -289 21 -143 123 146 -39 -288 26 -328 -280 145 411 245 397 454 -16 -360
2335 -360 -607 -131 117 185 30 352 115 77 96 42 185 -78 34 364 36 -279 -188 -133 -70 53 363 98
2357 98 246 26 -209 -199 -265 -283 -136 -59 -159 91 -171 -315 -94 -166 -12 249 162 52 -127 -225 -356 -286 -229
2380 -229 208 100 40 103 -241 -6 -277 -96 140 100 136 128 -137 -142 -46 -245 137 198 350 -116 35 44 56 -30 219
2405 219 6 169 409 322 235 -113 8 32 123 141 316 162 334 155 -158 -27 -78 196 96 -22 178 -100
2427 -100 81 -370 -315 -84 -54 155 207 102 -152 -177 -71 -398 -57 98 153 -70 -40 -127 -316 -348 -26 78 299
2450 299 -111 -131 -171 -1 -184 -58 -115 -134 -4 27 -180 -149 -220 -286 22 100 119 34 51 -60 -54 90 247 21 67
2475 67 157 57 74 172 -3 16 333 199 251 138 309 5 -70 256 -420 235 386 416 278 197 -154 -97 -61 -189
2499 -189 126 111 244 187 29 -140 -249 -9 272 62 5 -47 -265 30 32 -39 -157 60 -158 -195 -128 -44 -118 -177
2523 -177 52 -160 -77 -66 -13 -98 -172 5 -96 77 55 -81 323 -43 -155 -241 -61 -88 -345 -78 -133 -123 143
2546 143 -270 57 9 -130 116 259 131 123 -113 -26 118 -47 322 254 388 135 69 30 -150 190 -281 91
2568 91 -34 134 -114 -26 131 -155 87 196 235 -116 23 -54 187 -105 33 -99 -123 34 231 46 43 -92
2590 -92 -46 -30 -140 69 -57 -160 -317 -473 -104 100 -127 69 178 -185 -156 4 -420 -398 -141 -218 251 -152
2612 -152 -51 117 -66 -55 119 233 164 86 18 -25 -176 52 101 -169 204 237 269 387 348 236 8 -135 128
2635 128 -27 -52 27 15 33 -160 214 97 340 267 129 -123 1 -113 -78 -37 58 162 -125 100 -124 162 -31
2658 -31 -200 256 -190 297 -157 -149 -329 -237 55 -123 -268 120 8 -243 -272 -45 -213 -101 -261 -170 -11 158
2680 158 109 47 171 204 -34 10 152 -238 -51 -329 -302 -25 58 261 55 326 387 205 41 142 -189 -159 -14
2703 -14 -48 177 312 196 248 34 214 214 58 25 104 -28 -3 -11 61 75 64 362 365 145 140 169 -283 -12 -76 -215
2729 -215 88 -268 56 -102 148 240 51 161 50 -337 -224 -176 -202 -99 -185 -355 -33 -25 -9 133 193 -2 -204
2752 -204 -152 -327 -114 -160 -13 -58 29 140 -162 153 298 -172 26 -115 -131 -194 -140 40 -48 -339 -38 98 174
2775 174 247 393 94 -60 -16 75 -138 -59 194 33 12 -207 191 367 70 -43 -21 -162 258 -184 -61 -162
2797 -162 38 26 377 333 254 295 -14 -8 -281 68 -122 -236 -10 -110 -15 239 -81 -84 85 -219 -97 -24 -226
2820 -226 -148 -159 -219 -220 -134 95 -30 25 194 182 131 87 -182 -300 -28 -278 259 220 105 214 225 299 108 137 7
2845 7 -41 -115 -140 50 -16 41 26 137 238 466 265 270 -51 24 -173 -79 -93 66 117 -122 64 79 321 370 -45
2870 -45 -221 -49 125 -157 -115 -208 -163 128 291 -140 214 290 136 -30 -97 81 -66 -213 -213 -183 -256 -54 -137 -196
2894 -196 -55 61 -30 -28 -414 -125 -195 -115 25 -50 75 -7 68 -133 -126 120 77 -172 -43 -82 -49 36 -56 -24 224
2919 224 126 262 305 281 43 -77 -121 -115 -57 11 -5 -9 199 58 131 -18 115 180 -222 -54 -137 -80 -1 -66 -128 104
2945 104 -79 89 355 207 -89 37 -117 -392 -124 26 130 -68 -137 -206 -83 99 167 199 -118 -36 -22 56
2967 56 -179 -156 -117 -178 -18 128 113 202 123 -111 50 -225 -45 -32 -60 -105 -200 235 220 12 -9 229 -51 -3 240
2992 240 -72 22 -13 -83 35 104 121 203 202 42 66 -71 123 130 101 -84 -170 -140 -84 150 271 306 0 366 187
3017 187 173 -410 -194 143 101 95 -55 184 6 109 181 25 212 -60 118 -70 -10 -101 -237 -262 50 -48 161
3040 161 272 -10 31 -114 -224 -37 -136 -192 -184 1 -108 -190 115 16 48 251 -64 -49 -64 -52 -254 -202 -184 -44
3064 -44 178 164 177 323 176 -13 -76 205 96 -89 283 227 -67 -77 116 58 203 324 236 135 50 -315 -101
3087 -101 -186 -118 -117 356 237 -37 294 133 115 -18 274 98 -146 -44 -137 -224 -197 -248 43 201 161 42 162
3110 162 113 -228 -397 -40 -100 110 -108 123 74 -9 -267 -162 158 32 -205 212 -2 -112 -184 -23 9 -4
3132 -4 200 256 -49 139 -143 -298 -111 -131 -156 214 251 -46 5 93 110 259 495 161 22 -26 -104 -160 -126 44
3156 44 70 84 445 205 -13 151 66 98 23 2 -111 177 110 107 148 -237 35 191 43 -10 60 40 -164 -242 -288
3181 -288 -67 -78 32 272 227 46 46 -37 -38 -155 75 -3 -180 -13 -293 -15 -167 -58 16 -108 61 29 -183
3204 -183 -131 -153 -68 -184 -276 -115 29 183 46 16 1 -30 65 8 -50 -19 10 -196 49 5 126 370 373 -45 162
3229 162 63 -101 -246 -94 -182 152 -5 201 -160 264 -166 -82 126 193 217 189 110 -113 -161 -166 -64 286 348 22
3253 22 102 26 -221 -3 -376 -180 -61 -17 195 48 -100 -17 -84 -248 -128 162 1 -65 -188 -145 -67 -202 -75
3276 -75 -222 306 303 86 129 -125 -85 21 -130 -290 36 -96 -80 -149 163 24 449 273 -4 7 181 -216 -182
3299 -182 109 -127 -138 182 256 6 -60 -31 -111 -69 95 50 285 70 -154 -96 133 -209 -107 192 -37 244 -222
3322 -222 24 -93 -102 35 -36 111 -260 425 373 76 102 -48 54 -65 232 -46 -271 -172 -354 -352 -43 -320 -161
3345 -161 -72 33 28 -195 -151 69 -92 -218 39 61 133 53 25 -41 -120 90 128 55 -6 42 36 -60 73 139 34 98
3371 98 110 85 -154 -222 -1 -218 102 48 -48 168 169 -192 -129 45 -11 52 44 79 -37 124 4 -190 233 -21 29
3396 29 67 -74 37 229 -111 -10 -11 -92 -166 205 224 -67 -8 -287 143 -179 -108 -109 -57 24 -218 -71 -10 -3 65 43
3422 43 -182 75 103 -106 -154 137 -146 82 -24 -141 -114 64 25 -24 27 -27 -147 -108 -14 140 -165 -41 -37 16
3446 16 10 -67 53 -120 288 -121 -61 88 64 -206 -114 -164 85 22 -147 59 46 195 125 31 166 53 -29 -7 -82
3471 -82 -118 147 5 289 13 -80 -155 -218 51 -69 239 -97 11 -141 6 78 -197 -80 77 -92 47 -249
3493 -249 -87 -160 -206 -69 243 255 -193 23 141 -134 -95 -37 -18 -138 139 31 -36 22 -289 2 297 -43 -185
3516 -185 70 47 -58 100 -8 -6 -121 174 178 -37 70 69 104 41 73 -138 146 113 31 -106 159 63 89 265 83
3541 83 99 -65 -95 -12 143 -182 174 12 87 -58 132 71 -50 69 -40 -22 183 161 -49 -11 -7 126 260 28
3565 28 -13 21 -282 119 -353 -169 210 -37 -173 47 101 -172 -215 30 -52 17 -15 215 41 -288 37 49 -103
3588 -103 -203 -158 -30 -114 -35 59 36 -24 354 46 -130 122 -168 -140 77 166 -167 193 278 86 -207 33 102
3611 102 47 -68 109 -100 43 51 125 110 99 126 -157 -35 -42 -103 198 -144 -222 -108 -98 -39 105 303 -255 44
3635 44 -185 -280 -58 -79 -195 175 -51 0 324 -103 107 -81 126 -275 -85 -51 -64 8 -54 -267 101 -138 -175
3658 -175 94 169 -75 -157 -98 45 -173 69 10 264 124 -111 65 -72 40 80 -209 238 -125 206 -11 -183
3680 -183 -12 -169 -115 294 -39 33 -173 -4 151 -24 10 173 31 -67 226 -43 -29 311 -233 -26 260 18
3702 18 33 -134 -137 115 8 114 74 72 -184 -24 34 75 143 -323 -67 21 -196 -177 -91 174 34 113 1 179 29
3727 29 19 2 114 -51 -81 -309 -133 -143 119 -103 110 30 -92 8 153 -75 153 25 -72 -27 -143 -37 33
3750 33 27 52 28 -50 87 9 83 147 136 -34 -3 38 34 154 25 -3 -116 57 -106 -66 26 144 126 53 14 -75 177
3777 177 199 27 110 -115 51 -38 -78 -223 -9 -39 1 -112 14 98 -146 13 -237 -49 -71 39 -146 -130 -127 -96
3801 -96 13 -18 204 -66 220 7 83 -75 -1 -64 -88 -93 19 -189 63 127 190 -1 82 -139 5 18 -161 13
3825 13 -49 87 47 65 159 198 21 182 118 -168 -288 51 -42 45 77 -50 -75 301 41 41 26 -145 41 100 -207
3850 -207 42 -65 -78 129 -17 -154 -187 128 110 143 -131 -18 38 -136 -338 -17 -160 -189 -157 4 129 -26
3872 -26 -204 -203 184 -8 87 -53 -258 257 129 9 -57 29 77 -166 -66 120 186 27 -82 136 68 16 66 38
3896 38 -13 113 150 360 -2 19 68 -58 -47 -109 -24 54 -16 264 -33 179 81 175 42 30 -89 133 -87 -108 -14
3921 -14 -94 -17 -72 -21 45 -192 -28 85 -72 -42 2 51 -286 4 -112 263 4 -53 5 -132 95 -124 -28 69
3945 69 21 -51 -11 36 151 290 -289 -12 -28 -7 -181 -63 -115 -32 176 110 92 97 390 -94 -105 21 92 -13 72
3970 72 -122 -11 162 156 -180 259 -93 -21 57 219 247 -224 -284 -258 38 222 141 133 51 58 134 -29 -89 14 193
3995 193 -158 -26 35 264 -59 -8 142 -51 219 129 40 20 18 -128 86 -88 -192 118 115 146 129 -65 165 107
4019 107 -107 3 -168 -106 5 77 -172 57 -116 -71 108 -105 22 189 -15 16 129 -9 18 -178 63 -104
4041 -104 -36 113 112 -7 -73 53 -56 102 -8 144 9 -246 128 71 10 -153 -170 201 -134 -124 74 -64 57
4064 57 185 33 -371 -284 -66 -98 -91 136 221 73 70 -45 -95 84 -130 43 -21 148 185 -50 -87 -177 44 -197
4088 -197 -3 164 25 78 -219 -113 -19 -70 -53 131 109 -39 319 26 -158 211 89 135 -16 192 5 -148
4110 -148 -104 -43 76 56 -168 99 138 -266 9 -124 204 135 64 -116 155 182 -82 140 -111 -117 -225 -274 66
4133 66 -10 198 210 -87 53 -74 194 -57 186 -208 -80 160 -63 50 -97 -95 -38 -28 -35 207 -137 226 -137
4156 -137 39 -71 -104 74 18 37 -4 -64 0 -100 -101 -153 60 32 -56 -87 109 129 67 193 -70 105 -97 -14 -157
4181 -157 -121 66 -98 49 56 44 -169 -204 -80 97 212 -39 -101 -262 -4 -18 85 -3 -76 -24 43 125 -140 -126
4205 -126 100 165 13 -99 -26 111 101 -66 16 5 -128 133 -46 163 -204 235 -2 -128 -107 232 43 -178
4227 -178 211 38 45 133 97 -40 109 -101 -125 32 16 88 -133 -84 -25 56 -8 24 -88 -251 -108 -101 142 -153 -16
4252 -16 30 123 -170 48 -9 314 183 172 6 -136 122 -100 194 -28 20 139 -93 79 -9 -69 -184 -359 -93
4275 -93 130 60 182 86 -28 13 31 -197 -5 20 -148 89 -4 -133 -209 7 1 29 42 60 -131 130 -77 32
4299 32 -193 -115 -225 -33 84 -165 -9 -160 -6 -72 -247 55 233 -29 -155 -129 19 -68 122 -37 -230 -34
4321 -34 -157 -64 -2 19 -133 -273 203 -38 23 105 -167 100 144 -124 -91 -29 22 188 -8 170 -17 -68 5 -48
4345 -48 -14 96 -188 236 -71 79 63 101 -28 46 49 -126 -157 -28 268 -147 91 154 161 -4 -63 124 216 -19
4369 -19 42 -167 -13 -231 105 67 107 163 -43 -100 18 -20 -85 -124 -23 -23 -123 237 10 113 -100 143 -235 -3
4393 -3 88 92 113 165 -81 155 106 26 3 -205 -142 -71 82 235 7 -56 94 -82 -22 -196 -55 36 -14 105 84 184
4419 184 -143 37 40 -249 10 14 265 -96 -15 -32 122 -83 -258 62 129 -76 3 -10 44 199 -39 -119 -251 36
4443 36 11 63 -82 167 46 -92 -148 -157 135 -191 19 -54 141 -15 -83 33 -29 -195 215 52 81 -185 -140 42
4467 42 -68 -146 34 143 47 -39 -28 209 69 29 142 38 -61 287 -79 -124 -61 27 123 -112 52 82 41 18 -77
4492 -77 166 136 113 47 35 53 -51 -30 178 85 -234 87 -74 -167 -20 -128 36 212 -108 92 -20 38 143
4515 143 -23 248 10 12 -177 -152 79 3 -29 -178 -155 -160 -118 -29 152 130 -163 83 41 -157 -239 -14 33 -71 313
4540 313 -59 149 -138 138 -62 -113 -13 -55 41 -229 78 -58 152 35 -260 -131 307 329 -78 67 -34
4561 -34 138 -62 42 -200 -28 90 206 -32 0 229 -5 28 -61 -4 -67 -48 89 19 56 70 -56 -66 -15 -187
4585 -187 97 110 -2 168 178 145 -71 55 -206 -191 70 -131 -1 10 -156 -42 -116 36 -58 140 -51 96
4607 96 -116 198 -275 14 184 15 -162 59 -233 195 153 -40 172 -244 -97 -334 17 -273 150 52 40
4628 40 -127 -71 237 104 -24 40 108 -180 131 -116 74 45 -96 51 -29 -127 51 212 346 -353 213 166 6
4651 6 179 -41 69 43 -91 -199 27 -153 169 -282 139 88 271 -97 37 137 120 19 -133 42 -32 201
4673 201 -1 -256 -9 67 70 58 -106 152 207 83 -86 6 8 -94 -104 -38 140 -65 -38 -237 -7 40 30 191
4697 191 -149 -113 20 167 81 -128 33 89 64 22 -182 -144 -86 -199 190 -59 -87 -49 120 152 117 134 63 -38
4721 -38 57 17 307 4 153 79 -270 -34 154 -228 -126 105 214 -144 30 104 -41 16 -116 13 66 -5 49
4744 49 -13 -54 104 -191 358 71 -185 -144 -54 -314 -128 62 -95 -5 112 -111 -4 -233 -248 -238 160 56 103
4767 103 201 -54 105 101 83 -87 -170 116 101 163 -14 151 -118 -40 2 -268 -176 104 -120 24 50 -46 151 -231
4791 -231 67 19 -68 66 -84 17 85 -116 7 11 32 117 -123 -225 97 -46 -59 48 15 96 358 -20 -80 162
4815 162 55 -26 58 83 128 215 -34 87 -62 24 300 -137 -76 13 -79 -52 -172 3 -38 42 178 -148 24 227
4839 227 -25 -10 180 -38 -163 -12 -78 72 -182 51 189 74 152 137 -217 88 -59 -166 33 -143 -114 -6
4861 -6 190 363 92 51 20 102 -10 27 12 91 -26 -137 -170 156 111 104 62 225 -63 39 126 5 162 365 41
4886 41 145 130 175 -25 44 -98 106 -144 160 79 -112 199 -51 74 48 -1 -79 -24 -351 -64 75 64 226
4909 226 -178 -19 23 19 138 188 114 154 96 -157 -135 -254 97 -48 -64 206 260 -65 37 -87 48 49 59 -71
4933 -71 -115 285 21 87 -166 107 93 19 -122 -85 -179 -128 224 109 47 2 124 123 -50 -21 57 -186 -166 168 -129
4958 -129 -108 -21 -111 70 -105 76 131 -1 50 -67 -19 231 197 -56 -169 -187 25 -7 -94 38 111 -67 8 142
4982 142 133 -75 72 42 -84 -177 -32 -30 188 178 39 -158 65 -119 -50 -125 -22 78 148 408 -111 -21 -277 -54
5006 -54 67 -23 112 176 34 -1 23 -166 0 111 4 211 45 -22 138 -7 -154 -219 -44 39 88 -12 161
5029 161 26 -60 64 65 81 124 73 50 10 -140 -226 -41 54 25 0 104 -172 -56 139 -115 -82 162 -17 -211
5053 -211 -362 -109 9 -100 -9 14 -12 28 -77 127 -55 25 36 -102 127 139 -10 94 183 -248 -47 -67 -316
5076 -316 -241 82 -156 -40 92 -60 228 152 -36 -77 -56 34 83 -69 -46 -135 -133 -75 -98 -25 -52 -81 63 97 -11
5101 -11 -11 137 199 36 -53 -44 -81 -192 21 -74 93 -63 -141 35 169 -26 -11 -50 -109 -68 29 208 139 111 -63 27
5127 27 193 -57 -112 168 55 -112 -15 -114 -71 130 281 -191 -209 -133 12 -109 -238 -80 41 83 -256 -63 79
5150 79 57 11 164 31 -226 180 -88 88 -165 78 63 -120 -72 6 243 -69 -107 33 -87 -23 -18 -118 215
5173 215 -147 24 10 -70 142 151 180 -120 -24 90 44 68 209 54 263 -140 -182 233 230 -137 87 -24 46 -232
5197 -232 196 88 61 126 -40 40 -27 -248 214 219 85 -114 -304 103 -107 30 275 111 -136 7 57 -40 198
5220 198 -59 -15 16 41 146 61 36 28 -93 -62 -217 45 164 -247 -21 -32 43 -9 -84 98 -129 225 56 -76
5244 -76 48 -32 214 137 282 206 -14 140 24 -132 152 72 -194 2 96 200 228 18 -33 -44 -87 -90 12 74
5268 74 50 -122 -63 68 -19 -51 34 260 214 -201 109 -34 14 47 -32 -231 314 42 125 -254 -1 -129 -136 111
5292 111 -190 -16 42 74 -22 86 -28 144 28 -138 94 89 -116 76 -240 46 -146 53 -92 210 197 43
5314 43 57 -289 -83 -147 -75 169 10 -46 -236 148 -123 -201 -39 28 47 6 -157 191 90 -91 38 146 76
5337 76 45 10 37 108 -92 -17 34 135 5 119 -18 -92 -202 7 259 156 -52 78 -4 -145 -43 12 4 44
5361 44 23 74 84 6 182 -83 28 -2 -18 -65 13 50 81 79 -44 42 187 -23 253 17 -30 102 101 -64 246 -173
5387 -173 -146 -95 -4 -46 -141 54 172 151 -77 46 -92 -20 -147 216 148 -81 -92 67 -138 -88 -25 23 -10 -78 -294
5412 -294 234 -96 43 90 -21 4 147 74 263 235 -61 78 153 181 153 -88 -106 183 -183 -79 -91 -118 -35 -28
5436 -28 56 39 149 61 -1 -112 240 -85 26 50 -161 -98 -158 16 254 83 -269 4 -29 44 170 -147 -166 121
5460 121 -87 125 -46 100 -97 -176 -54 154 129 102 -172 -58 164 -108 168 133 -11 26 -83 35 67 -26
5482 -26 -92 -110 -27 29 -164 -56 -34 -38 -61 -37 -25 -190 114 -62 -62 78 98 35 -142 -136 45 -79 -63 93 136 -81
5508 -81 -318 152 -74 96 -144 76 210 -186 -47 -161 -103 -27 -4 -21 -151 -75 20 288 29 -48 -219 145 175
5531 175 -37 22 122 5 15 66 87 -150 139 -30 -146 -202 79 -79 1 1 69 -77 91 -14 -66 108 -4
5554 -4 148 -97 77 109 -63 59 217 8 119 -205 -13 -81 75 76 64 -31 -75 -19 12 124 -240 -55 37 -23
5578 -23 -63 -30 -66 39 189 90 6 -127 -103 70 -71 80 -107 -59 89 -153 -54 5 -222 -39 -55 109 -14 104
5602 104 -78 81 135 61 -26 22 307 1 -127 -13 -138 49 -62 -44 107 69 -108 125 2 24 20 -55 -87 165
5626 165 -223 265 -96 -42 -76 -67 85 -6 116 -40 -24 11 187 -160 -239 -160 129 65 -185 -205 -15 -75 -131 115
5650 115 52 117 -67 33 -94 -336 -157 51 61 -62 -24 56 -390 48 -4 53 -129 -158 -86 -40 -96 98 109 6
5674 6 -139 -73 79 116 76 -41 -133 -7 -4 -3 -16 -129 103 333 193 7 3 -142 -25 -237 -18 12 -226 302 99
5699 99 -54 -89 275 205 -85 -19 -129 -6 89 122 -116 -32 15 116 86 -118 -57 -28 12 91 -74 -54 32 -146 115
5724 115 85 -18 -76 188 153 -55 50 -143 -46 23 -29 134 -14 -112 -128 -69 33 153 -93 -26 32 -6 166 100
5748 100 381 -44 137 -113 -19 0 2 -98 78 -114 -138 4 -182 -189 -117 -6 122 145 77 63 -22 99 -121 -135
5772 -135 36 -68 -56 53 139 -44 -68 -50 -61 -148 26 266 46 0 -78 47 -153 -23 -199 -74 173 13 62
5795 62 62 186 -123 58 -28 75 202 -293 -118 -99 12 21 -160 -11 122 106 59 26 -157 -42 100 116 5 133
5819 133 -66 148 10 -3 -25 -140 -42 82 49 -14 166 22 -181 -75 221 67 106 32 14 -137 -41 -14 -6 111
5843 111 -52 74 -87 129 122 23 453 9 94 -33 22 28 -151 -153 -368 64 -130 236 -58 -29 39 -154 165 91
5867 91 -6 77 80 -7 -116 -143 -125 -99 27 -11 -4 -175 -107 28 -88 -55 -15 -24 -116 -125 184 -81 -23 124 -81 -65 -195
5894 -195 93 -172 -73 -31 165 169 -189 -133 187 113 -21 -136 43 40 -132 29 38 -62 91 4 -85 -18 -90 175 97
5919 97 -123 205 71 -21 -109 -35 12 -46 -213 237 -49 -80 -63 -173 14 -45 57 542 7 34 -53 26 -152 232
5943 232 -99 12 67 53 169 14 -54 -12 60 57 -164 -65 37 -32 136 255 55 -3 156 -176 146 63 89 -123
5967 -123 -34 79 -62 -167 -120 8 -231 -155 -92 99 -147 -20 35 112 -10 45 142 158 -70 -166 156 128 46 -115
5991 -115 -83 9 -61 153 53 214 -7 118 -143 -29 -161 198 -69 -178 263 232 8 140 -206 -52 -73 14
6013 14 -6 -124 -129 -71 264 93 43 204 34 23 83 -137 -23 -75 -43 -8 -39 -210 77 81 -118 -199 -301 176 -149
6038 -149 10 30 -45 153 -30 38 -169 -127 154 86 -105 6 -139 127 -126 -163 -55 -186 -94 -4 -123 -86 -183
6061 -183 -52 -326 105 -202 -155 -41 97 80 -105 211 17 141 -20 -11 -133 -130 -121 -147 69 144 -140 -254 141
6084 141 226 40 60 -87 -103 127 44 -17 -89 110 12 118 127 72 97 -75 -97 -217 -61 -75 -12 56 166 357 -195
6109 -195 239 217 157 -1 176 -70 45 -41 23 70 -22 -9 36 -143 -195 -445 42 79 -92 -29 195 62 84 -155
6133 -155 -248 41 -163 57 -27 50 104 225 -14 3 307 -42 -37 -11 122 261 5 344 295 97 44 24 16 54 160
6158 160 243 -41 21 -117 90 24 218 40 150 14 63 -89 -10 56 -196 -159 121 38 -182 -80 -190 112 41
6181 41 -274 -153 37 28 -11 188 27 -11 45 -158 35 27 -54 93 -26 -97 103 -93 94 -33 -16 -231 -45 -10
6205 -10 -182 -97 142 259 97 -100 237 -115 -288 -214 -107 -5 170 -202 -19 46 -149 -34 24 46 137 -104
6227 -104 100 -58 35 236 326 -166 -83 61 47 -120 20 65 65 -358 -199 69 88 -119 4 71 69 35 -11 -205
6251 -205 68 -64 -37 135 -31 127 -157 89 38 -126 -20 -55 -15 313 -169 -105 -73 94 160 0 158 -108
6273 -108 115 59 -274 -284 78 0 -98 -201 -163 -60 -27 -51 -40 -41 170 185 -25 12 -167 -23 -196 332 95 -133
6297 -133 -97 -10 -25 -36 -118 -103 -69 48 -94 262 -82 15 -31 -119 108 -304 30 75 -41 -47 105 -76 73 -145
6321 -145 14 -136 -9 45 134 24 -69 -39 38 48 -82 -45 172 39 -73 -360 69 47 12 139 -145 73 85
6344 85 29 166 301 63 -75 -118 -117 91 -129 -52 -50 11 211 19 145 -71 266 71 -27 -54 -174 -143 92 151
6368 151 0 -160 14 81 -216 41 -104 40 -19 -37 102 179 153 138 -76 188 223 -119 -1 2 54 152 185 36
6392 36 10 170 42 -9 -403 -5 190 39 -222 -9 -20 -89 -200 12 70 -24 -96 7 -298 34 -254 -91 40
6415 40 65 -103 55 248 -160 -101 132 -70 -218 115 22 -168 -127 251 131 -35 162 -49 163 -48 102 -90
6437 -90 -79 -9 -91 95 -77 -157 96 4 -90 -54 32 -44 -21 -224 -197 149 73 -66 208 -33 115 0 282 -40
6461 -40 88 78 -102 113 111 -129 -46 94 -35 -156 67 43 52 114 30 7 134 76 -206 -19 131 51 42 -31 -8 -44
6487 -44 -41 -254 -149 -95 -2 -149 77 -56 -219 -47 103 41 124 1 69 -172 -38 163 46 -54 47 -7 211
6510 211 181 -56 131 -69 157 108 125 -25 73 179 -11 39 -25 -23 -210 -108 238 -14 27 71 -184 62 -35 6
6534 6 205 25 61 47 -113 131 -146 -99 56 37 -69 -81 -114 -18 -5 -45 46 -2 -7 -37 76 -33 120 154 -37 74
6560 74 -31 -135 -26 69 173 16 47 94 -41 -54 127 -67 59 7 -151 -38 39 91 -19 -70 -101 202 126 -38
6584 -38 198 71 -74 -40 154 -73 -53 -156 -209 -145 74 195 -245 113 45 -46 -29 -125 -79 141 140 -72 -82 59
6608 59 11 0 -44 16 155 220 44 -97 41 -1 -23 -113 -33 -210 72 225 82 110 44 11 -157 -64 -5 -161 119
6633 119 82 63 12 278 7 147 -225 -10 -124 -124 -299 -187 -14 -27 -274 -108 216 -74 47 50 -37 0 -226
6656 -226 -174 244 -49 -159 36 174 0 257 13 45 18 88 -102 -139 29 -34 136 -166 -74 195 103 -161 86
6679 86 4 -47 -81 -54 45 -9 15 49 24 -158 -20 -2 -196 90 -72 79 -51 -69 -42 -35 25 84 86 50 -136 -61 75
6706 75 165 -98 32 -51 140 -332 -44 103 15 195 -211 242 -109 -70 106 71 12 53 -61 -24 -127 60 5
6729 5 -163 -217 76 -79 78 188 -58 -38 -87 -45 12 53 40 55 -97 202 109 182 282 -309 35 -186 -71 -112
6753 -112 186 -177 102 -68 -195 -24 79 124 -16 -16 -146 49 -38 123 71 -65 22 -136 -164 233 -29 62 -120
6776 -120 180 97 79 135 -150 114 111 -326 295 -174 39 -175 -181 12 37 173 -51 -18 -318 -156 -37 19 174
6799 174 261 -97 21 157 100 69 -11 251 -190 234 -74 -34 258 63 -57 -78 4 -17 110 -53 55 -208 -111
6822 -111 -4 53 93 178 -36 113 -6 -14 32 -138 24 -29 -22 88 -115 16 -55 -107 77 -7 49 -159 58 97 -188
6847 -188 98 35 -172 -35 -185 49 20 198 -9 2 -72 247 -242 54 -224 -65 -194 -275 -140 -270 186 48
6869 48 -245 -273 6 -126 -88 -104 190 -140 -193 181 263 -34 121 -14 -110 -30 61 -69 -233 203 -45 251 153
6892 153 272 99 -29 -75 -216 -21 52 222 73 75 199 39 33 102 39 -53 96 1 -34 -67 -97 273 -78 -147 55
6917 55 -345 -244 -227 84 121 98 -3 -82 -267 15 221 227 228 -184 -44 -125 -189 -245 -246 62 39 214 159 -33 157
6942 157 40 -36 -290 -42 -171 -1 -128 -22 -153 24 56 75 140 166 22 -214 -3 -20 -164 -148 153 69 16
6965 16 157 -31 144 82 55 31 -307 -171 11 -152 -60 58 -36 -111 -41 -43 180 111 -93 57 18 118 71 111 -6
6990 -6 260 88 69 -129 -43 -137 200 114 -24 -59 -59 -54 -17 291 159 -85 72 4 226 243 261 -42 -109 3 28 19
7016 19 -20 133 82 190 41 -31 14 9 -273 31 -107 102 34 108 -131 88 -15 -167 7 30 7 -21 -138 65
7040 65 -90 59 -114 12 243 151 74 -152 -141 43 -100 40 21 122 -198 101 165 101 -156 -68 -5 -161 107
7063 107 -295 -141 -275 434 -209 70 1 91 -128 -195 -78 117 -123 -97 36 55 9 179 165 -118 58 40 172
7086 172 21 36 217 278 -96 174 -225 131 -25 -76 -74 21 -116 -157 9 8 54 54 -12 46 93 -153 218 79 -242
7111 -242 41 124 77 -126 -25 -228 222 -8 -57 -111 -100 -59 12 118 36 21 210 -22 183 -97 -40 177 136 13
7135 13 56 126 -7 184 141 -161 -35 -149 -217 30 -6 -102 -117 0 -98 83 90 -66 -60 141 -158 64 -41 -6 76
7160 76 44 43 35 129 -126 98 -67 -64 92 -85 -66 -160 -5 -4 -39 28 -165 38 -52 54 -123 -110 102 -56 -52 -263
7186 -263 -8 -146 -197 22 206 145 -182 66 219 166 -10 -4 -122 -5 -27 -160 83 -49 106 163 -191 184
7208 184 -46 174 -77 94 206 89 -247 121 50 -45 -72 81 -24 -354 52 136 114 88 230 59 -234 4
7230 4 118 143 61 -36 -20 149 214 153 131 181 38 2 33 -74 -15 -138 54 147 -23 107 -17 27 -83 -32 34 -57
7256 -57 -28 126 -126 7 171 -10 -19 110 77 15 15 -205 222 62 178 -35 89 -99 -111 36 -168 162 -6
7279 -6 43 -33 -28 234 0 -77 70 7 -48 114 220 -126 -152 -49 102 -138 -113 19 -120 241 114 95 79 61 137
7304 137 -26 73 -112 -217 88 69 71 48 -19 43 -54 -40 -17 -134 236 -93 109 34 131 35 22 -165 77 -113 -112
7329 -112 -22 153 51 -97 62 -191 -88 190 -81 1 9 117 81 21 -174 -1 97 -128 -58 -132 -43 -17 123 9
7353 9 -27 70 -48 -62 -57 -209 213 -180 -11 21 70 -4 68 47 261 -2 -110 27 -14 71 -215 -203 146 -64 -38
7378 -38 -36 -41 137 115 2 -238 -55 -36 -65 -58 -188 -159 -14 5 177 -87 -265 -82 131 120 -118 -184 35 146 -33
7403 -33 100 -328 -197 -83 -260 -318 206 119 40 62 -213 -151 -128 15 169 -84 -194 124 125 16 119 38 54 -45
7427 -45 6 7 -59 80 115 162 -107 -122 204 -100 -61 4 124 28 21 -71 54 141 13 -105 39 109 5 -56 -101 -99 21
7454 21 -58 82 -27 86 -266 -164 60 21 55 -85 255 -107 34 -11 -56 132 -73 -15 419 -62 -35 102 -147
7477 -147 24 -302 -82 119 30 -224 -43 21 -222 142 21 -4 72 -103 1 -74 -178 -228 178 -327 135 -157
7499 -157 276 179 -206 172 -182 -37 -19 18 -146 -24 26 -51 -37 7 266 -13 99 149 40 -118 -170 131 170
7522 170 188 112 38 29 106 -36 52 -119 -59 178 227 -135 -62 255 -78 147 -50 -10 -47 -206 45 -39 72 -319
7546 -319 -67 -37 60 80 20 -121 -142 37 102 -132 81 124 0 34 3 253 209 200 -204 191 149 43 15 67 171
7571 171 -80 190 35 7 -42 207 199 -49 26 -109 103 29 76 -25 -2 -170 102 -29 -36 -136 -81 -16 49 221
7595 221 -114 60 -99 232 -80 -160 -122 -111 -89 -50 -50 23 99 -284 -28 28 -153 17 -96 -98 109 187 -6 -2 -122
7620 -122 -254 61 138 82 99 -71 -119 -90 1 10 -125 -67 132 -42 -118 -102 9 -27 70 -19 96 160 96 195 145 22
7646 22 146 -128 -71 109 -177 115 0 -163 -19 210 -110 13 37 -110 -96 105 -201 -87 -80 -36 -103 250 -87
7669 -87 -147 189 8 115 -52 92 -132 167 -155 31 47 -45 -16 -38 -140 42 79 -55 50 90 41 103 -91
7692 -91 10 -67 -5 220 88 4 200 0 -275 16 58 -19 23 22 128 -99 -120 133 -135 101 145 219 20 79
7716 79 -52 -81 -302 -61 -38 79 51 -141 -156 128 -21 -40 127 49 22 4 -71 -35 -182 113 -59 41 -35 -227
7740 -227 50 -108 -140 -157 20 13 123 -90 -48 -24 13 -223 -188 -186 -98 -54 -95 -9 73 -69 92 47 -204 -61 74
7765 74 146 -100 6 139 187 82 -345 267 44 82 6 170 -26 162 19 -116 -56 -95 -68 61 127 -26 -173
7788 -173 -16 11 -39 -93 -154 159 161 -23 1 -131 -223 124 -180 -152 -165 39 49 101 179 -303 175 -104 -47 -182 -147
7813 -147 25 120 -153 -320 95 184 200 192 -298 39 296 109 128 -78 -32 107 70 8 -6 -89 -150 79 -175 -106
7837 -106 -128 52 -176 -72 -8 95 15 -49 37 -92 44 96 -55 89 -108 -4 -101 -334 114 -34 101 -99
7859 -99 41 -152 44 96 -19 -47 64 181 135 -204 -163 -81 -54 -149 -46 -25 -21 390 13 -23 27 63 239 73 279
7884 279 -70 45 -121 -19 -86 129 -112 73 81 167 -123 -26 -92 23 159 -45 13 62 84 -93 2 -21 -36 -28 155
7909 155 117 -128 28 -64 -98 -148 7 -44 -33 196 -8 -88 101 -116 8 -57 -54 12 -92 -46 174 -68 -1 -191
7933 -191 -179 -74 -95 31 94 81 -110 -36 -4 -47 75 -9 61 -21 -91 -86 -154 -1 -219 -27 -62 -134 -126 -162 -31 195
7959 195 -34 -14 -218 -51 5 -92 -153 220 -33 -36 102 186 -220 97 49 -348 70 -156 83 48 -96 -120 168
7982 168 100 372 -53 116 131 -89 -154 125 -52 -59 338 69 -15 95 76 -254 135 81 60 167 -26 63 -11 59
8006 59 -11 64 -144 99 265 195 -44 117 39 189 -84 10 47 -43 -125 -250 -133 -47 83 83 -202 -18 -178 -33
8030 -33 46 50 -54 174 168 103 28 89 160 18 -174 5 -238 66 -97 -335 5 -50 -88 -63 -54 60 -307 -5 36
8055 36 -125 -116 -197 -33 -24 95 37 -158 -217 124 -37 16 285 135 -9 20 228 106 -222 -59 -262 152 -36
8078 -36 21 -211 70 -46 -220 185 -217 -102 -91 -156 -55 -143 -118 -46 -92 -101 -54 44 -259 -183 204 -114 -66 109 234
8103 234 -1 -84 190 -12 58 -50 -5 -38 -25 12 151 108 -10 -46 -139 -101 186 -230 -3 34 9 166 -174 -99
8127 -99 -20 -1 -157 51 -101 164 103 -63 47 -145 54 -68 -111 -2 84 221 -94 -2 -34 81 39 -268 8
8150 8 32 -65 -374 126 65 -214 185 -205 -96 -142 134 43 257 -57 33 -105 -214 396 -22 98 154 163 -137 171
8174 171 62 253 165 21 -50 -223 101 161 -130 49 -82 78 -15 -139 -67 9 20
8191B0
$$ Imaginary data points
##PAGE= N=2
##DATA TABLE= (X++(I..I)), XYDATA
0 0 0 0 0 0 0 0 0 0 0 0 -8 8 -8 8 -16 16 -24 24 -32 40 -48 56 -64 80 -91 105 -123 144 -164 189 -216 247
32 247 -280 316 -356 403 -451 505 -564 629 -700 775 -861 952 -1055 1163 -1283 1414 -1558
49 -1558 1717 -1891 2082 -2298 2534 -2802 3103 -3448 3842 -4302 4847 -5503 6313 -7335 8676
64 8676 -10517 13212 -17534 25580 -45537 198096 211467 -195881 63767 -12307 -152698 18482
76 18482 78128 -10617 25589 -536 -28665 -5888 30749 -16539 7583 56978 -21065 -12619
88 -12619 108373 -5661 -111164 -46518 -32120 2451 72696 37716 38282 17342 -56935 -31494
100 -31494 1337 -5819 18416 7389 -927 -18661 -49076 642 18152 -27532 10441 55979
112 55979 26752 -6030 -20576 -43729 -28506 7922 -26807 -24830 52609 13292 -36444 41208
124 41208 31544 -51859 -11575 33694 -22290 -27146 35842 16865 -43408 -35181 -1532 25583 32725
137 32725 8097 17358 27295 -22997 -28487 8882 -9685 -24314 171 11118 14511 12849 23288
150 23288 28217 -19882 -40732 4609 31874 21297 -1978 -4931 -8567 -43796 -28211 25734 32894
163 32894 33159 30429 2165 -18922 -31799 -19296 3764 -3115 -2619 9091 10194 9389 -9260 -15994
177 -15994 4432 -743 -6186 18290 25460 2110 -28416 -41212 -31981 -17917 17428 52271 36607
190 36607 1701 -23409 -33048 -18249 -6978 8345 27477 3832 -24859 -15455 -1684 1410 743
203 743 4652 14234 11949 11519 11046 -7196 -27357 -36333 -15346 20576 24236 24158 25818 -8364 -28651
218 -28651 -9046 8535 17600 14106 1289 -5414 -12428 -12373 -1779 7482 11167 7150 12937 21976
232 21976 4341 -9814 -6106 -14075 -15048 -349 10229 11573 2129 -645 4901 -746 -936 2873
246 2873 -1775 2681 275 -7119 -1351 -9758 -19830 -4920 7624 10911 11183 8353 1524 -13903
260 -13903 -13893 -1731 -6961 -8434 -4882 -5528 4840 8590 4447 4553 -9540 -16764 -1880 10211 14900
275 14900 7804 -10335 -22599 -24706 -9515 15018 24323 21507 5897 -10610 -7677 -6233 -5618 6488
289 6488 3360 -7794 783 11358 7071 -273 -1506 -5814 -7394 13239 27444 15040 914 -17602
303 -17602 -32180 -17431 7794 24713 28971 15230 -4785 -17350 -12914 -317 6793 12266 5707
316 5707 -6737 -4419 -4916 -6841 1347 -2163 -1827 12175 13075 8996 2528 -14997 -23145 -17251 -4174
331 -4174 10425 15096 13880 -1095 -19345 -10634 -2531 -983 13790 8674 -6245 -4665 -11029 -13650
345 -13650 -5395 -831 7956 9906 6710 5158 -4196 -6307 -4085 -9490 -1752 5749 1165 3068 -631
360 -631 -2691 4937 861 -1452 5896 4005 2763 4490 -29 -7198 -10606 -597 5581 2779 11693
375 11693 12440 -2183 -4796 -1988 1790 7003 355 -4692 -3930 -3671 3519 7856 6356 429 -7735
390 -7735 -3155 3084 3571 10486 6614 -9424 -17969 -15367 1644 14757 8053 3016 -658 -8536 -5718
405 -5718 -915 1722 607 -6256 -2962 -1722 -4515 5610 3968 -10123 -9765 -4371 8140 18187
419 18187 6209 -9542 -16387 -15401 -4937 3546 14670 15094 -1974 -8354 -8376 -8414 5895 12091 3802
434 3802 -1163 -6052 -1552 5038 -2259 -6068 199 6260 8779 7658 6951 530 -9805 -8431 -3084
449 -3084 3903 13854 10052 197 -4402 -8636 -1371 8454 5349 2647 4362 3529 -2734 -8580 -4080
464 -4080 658 1063 5675 5177 2559 1602 -5019 -6699 -1510 1220 4903 1561 -5208 -5402 -3303 2643
480 2643 2623 -5732 -2089 2895 -57 649 -583 -3837 -4505 -6171 -4177 1978 6209 3208 -5178 -6310
496 -6310 -3618 -1100 8682 5246 -8020 -5539 -2563 -1920 5227 3495 486 949 -6138 -5849 5036
511 5036 8948 5123 -837 -5652 -6628 -795 7972 5895 1152 1243 -2288 -616 3210 634 4294 3805
527 3805 -5055 -1435 3447 3697 5530 -1403 -6349 -1763 1375 6229 8505 1959 -3661 -7039 -6183 388
543 388 5795 7298 4110 -2978 -8732 -7009 1754 4974 1277 1380 -1241 -5294 -1268 -847 -1954 1166
559 1166 -2617 -3650 2262 1541 -196 -271 -6049 -7402 -541 4852 4673 3098 -2059 -7503 -4050 -1250
575 -1250 -1006 6604 5624 -4296 -1274 339 -5497 683 4539 357 2766 2879 -657 -1516 -2615 -1574
591 -1574 1981 4667 4605 1077 -100 -115 -1561 1805 3210 666 1716 -1020 -453 5471 37 -1805
607 -1805 1606 -3258 921 7923 3698 742 -3828 -7820 -2047 1658 5188 6155 -2449 -5924 -3419
622 -3419 -1711 5081 5622 -1564 -4426 -6105 -3535 2352 3174 1967 -4133 -8148 -567 2911 2138 5094
638 5094 -2051 -9170 -5092 -1408 2293 4229 -589 -3733 -4702 -1740 4063 3798 1516 -988 -6039 -3368
654 -3368 3375 1733 426 1247 -3837 -4328 3234 5014 4566 3990 -1600 -4270 -1649 115 2393 3298
670 3298 1642 -665 -342 2217 1732 828 3632 1618 -835 2955 660 -1736 1478 -3058 -2613 4777
686 4777 2336 2569 4905 -201 -2158 -574 -1575 -1041 -916 2249 1656 -3099 -763 -1473 -3486 3099
702 3099 2435 -260 4025 -1090 -6564 -4434 -4256 -881 2132 1143 1238 -1885 -1456 1190 -1470 -562 859
719 859 -2008 -1317 -1733 -1754 919 -1661 -3203 -333 1055 5182 5460 445 -2213 -5160 -4569 27 1387
736 1387 2947 2443 -502 -1811 -1530 2668 6472 2847 378 -1778 -3054 1342 1949 -1059 -583 -1522
752 -1522 491 3772 4240 4963 2698 -2230 -3976 -3905 270 4766 1814 -1409 -2947 -2476 1949 3285
768 3285 2987 1409 -1796 -815 -1455 -3240 332 -249 -4484 -2984 -1177 1463 5908 3277 -1706 -3573
784 -3573 -3624 -1467 -464 -470 -906 -1644 -1689 -2632 -1360 2257 2054 1841 2033 -1980 -1017 1464 -3752 -5463 -1068
803 -1068 430 258 3329 4508 268 -214 2656 -1637 -3064 2935 1678 -1945 259 -611 -1982 798
819 798 2346 1603 3937 6991 2408 -3321 -1670 -2445 -3586 2436 2746 -566 2415 2423 8 1002 2004
836 2004 2011 804 -1358 -1484 -499 463 -1603 -4301 -1815 194 3014 6746 2558 -1275 -1488 -5191 -5268
853 -5268 5 339 -398 430 -2065 -4006 -514 4669 2345 -2309 316 52 -3674 -885 -293 -4469
869 -4469 -4345 -1484 470 2323 4859 4721 -573 -3794 -2848 -2847 1124 2374 -1896 -1690 -149 -1705 819
886 819 4133 3610 1352 1443 1539 -458 -1164 62 -2327 -3854 -39 2988 4362 4752 2751 738 -548
903 -548 -1479 151 1018 261 27 -893 -2010 -1514 1148 2324 1702 3272 3342 590 -474 -1273 -4266 -4361
921 -4361 -1163 166 163 1813 2417 736 -350 -41 -276 -533 -832 -1113 -1107 -2382 -3362 -2426 -1620 -217 2583
940 2583 3962 3556 237 -3041 -2702 -3735 -3542 -497 1216 -287 -744 823 1594 678 938 2020 -212
957 -212 -587 747 -255 -1640 -2197 -3290 -956 1675 3488 6112 4365 422 -1530 -2116 -2058 -69 1212
974 1212 474 -733 -174 677 1005 2430 3142 903 387 1678 382 -832 -1687 -3322 -4047 -1323 2657
991 2657 3449 3703 3406 -693 -2799 -1200 -1247 -530 422 -1597 -2700 -1273 -1229 -405 823 1942 1051 814
1009 814 1465 -476 -2336 -3189 -5307 -2985 1 -184 3280 3568 -371 -466 4 -1488 -456 896 164
1026 164 -1455 -2008 -1252 -2039 -434 2481 1502 2800 4705 778 -639 -677 -3309 -2786 -538 1030 1660
1043 1660 1550 2864 1723 -500 1264 1635 -48 1583 753 -818 -435 -2429 -2390 182 977 3212 4369
1060 4369 3003 953 -1062 -1494 -2621 -2181 278 -92 -182 1155 -860 -18 2159 -235 -515 1140 166
1077 166 153 -582 -2643 -3847 -3551 -1087 464 1961 3995 1412 -964 -1413 -3255 -1656 311 -1031
1093 -1031 -1185 -786 -723 -138 -682 138 1320 872 1635 1580 -248 -340 -1876 -3622 -3095 -1048 2329 3614
1111 3614 2874 1269 -533 -360 513 -716 -15 1243 62 -976 -1263 -918 556 1109 1841 2209 2081
1128 2081 2555 1247 -1315 -2844 -3009 -743 489 788 2174 1868 1256 -6 -1416 -82 1179 -189
1144 -189 216 -291 -2562 -1740 -1070 -1297 -366 1078 3524 2158 -993 -101 -1382 -3068 -2274 -1540 -117
1161 -117 656 196 797 -450 -952 1029 29 -1136 1064 774 -699 -1720 -2722 -2194 -800 568 2762
1178 2762 1486 1984 2053 -1390 -1908 -907 -658 493 258 -466 407 1245 628 -85 816 1399 1384 2458 1673
1197 1673 -1583 -1724 -709 -2041 -1715 2199 3698 2352 1019 235 -571 -874 104 710 -90 -473 -81
1214 -81 90 -1222 -1237 868 1345 608 1200 2033 560 -1675 -2324 -2677 -2599 -266 1720 706 747 517 -1020
1233 -1020 -898 -366 -810 386 359 -1308 -1236 -935 -1498 -1245 108 703 690 1949 1396 -1046 -1294 -1322 -2218
1252 -2218 -1325 308 960 784 590 590 208 -524 629 1177 642 566 332 -486 -1169 -1431 -259 1261 1179 2250
1272 2250 2649 879 -322 -611 -300 -878 -119 1303 496 519 1237 -317 -207 1071 -254 1205 2101 -299
1290 -299 -265 -502 -2559 -2046 -56 637 948 1424 1264 -495 -932 -608 -1088 -695 438 -596 -145 -142 -1562
1309 -1562 -528 -87 -977 579 1010 390 487 -963 -2075 -1981 -1538 50 431 823 1539 -173 -891 298
1327 298 -532 -502 799 227 -593 -178 24 -842 -492 384 600 1224 1719 994 300 61 -1008 -1048 -73 288
1347 288 924 1265 715 115 199 82 340 384 541 455 157 -330 -952 -237 -619 -133 1043 1048 861 803 -63 -740
1369 -740 -1108 -1148 -154 82 -283 360 -55 -632 -373 -497 -136 164 200 157 -718 -1011 -936 -1395 -612 90 14 876
1391 876 993 -365 -193 -468 -1073 -457 -116 -186 86 17 -20 -419 -461 148 -2 1124 1471 248 -68 -278
1411 -278 -1067 -358 282 400 1137 1065 627 171 -46 -132 -86 411 339 395 408 190 -479 -78 174 230 975 912 653
1434 653 425 -16 -891 -856 -224 118 618 708 -175 -603 18 -544 -675 496 368 -61 59 -501 -510 -517 -634 -354
1456 -354 -425 522 866 -525 -450 -716 -885 -32 -377 -320 211 -293 -315 -530 -621 206 181 16 621 -281 -202 146
1478 146 -360 -254 -141 -81 979 343 60 542 51 -86 144 -302 636 657 169 439 192 224 623 -158 216
1499 216 813 212 534 157 -281 492 281 16 265 -140 688 494 -328 313 58 -227 70 -102 -91 273
1519 273 233 78 -483 -646 12 -171 363 19 -450 208 -427 -999 -543 -33 -28 62 -150 -304 -622 -198 -443
1540 -443 -734 158 219 -22 -39 -456 -413 93 -54 -262 -278 343 530 -372 -518 -12 -141 456 548 -22 261 278
1562 278 -323 -48 -332 -51 946 308 217 188 120 491 117 88 622 119 452 -18 -715 113 327 -6 486
1583 486 798 46 197 241 -445 -382 143 80 -461 -195 -27 -531 -222 175 -255 352 517 -456 -420 -362 -705 -336
1605 -336 -8 -221 13 150 -128 -143 -314 71 -155 -344 -251 -358 -720 -615 -208 -312 191 580 212 208 -152
1626 -152 -6 -108 -178 -127 -25 125 -14 35 -146 135 610 716 664 153 92 97 -325 101 192 130 306 372 247
1649 247 480 503 565 613 239 74 -269 -282 -354 -290 -227 365 176 237 654 72 -140 260 89 -118 -451 -253 -662
1672 -662 -418 -139 46 -25 199 350 -418 -170 -234 -640 -502 -535 -366 38 -401 -260 -126 -183 409 35 191
1693 191 428 -400 -742 -670 -869 -496 146 135 387 240 -302 212 197 96 -114 70 388 -244 -183 -453 -417 543
1715 543 688 627 1134 929 89 88 -221 -547 -43 341 529 428 226 155 179 84 649 528 376 345 -270 -732
1737 -732 -605 -464 -468 260 856 559 368 451 -565 -595 -72 -494 -518 -350 -307 -439 31 -399 -208 466 505 -12
1759 -12 129 -210 -643 -627 -295 -701 -370 36 29 412 265 483 366 -274 -232 -36 -516 -288 143 -121 168 168
1781 168 91 525 701 359 389 418 190 -539 -770 -293 -467 238 588 648 859 700 220 351 -236 -320 230 -103
1803 -103 -129 12 -372 8 283 75 903 933 773 542 -149 -678 -864 -691 -461 -264 234 792 202 24 -297
1824 -297 -502 377 -5 -379 -76 -692 -1163 -781 -754 -406 406 733 531 420 -522 -445 -982 -689 -406 -332 205
1845 205 309 -96 -79 101 -31 368 370 533 448 -334 -620 -1051 -679 69 246 836 1087 740 393 522 -504
1866 -504 -152 78 -44 -482 -143 139 91 -91 204 649 549 1109 751 -83 -210 -599 -618 -696 -300 76 735
1887 735 329 136 392 232 -45 -245 -218 -492 -712 -389 -322 -756 -311 361 184 150 682 272 -176 -337 -805
1908 -805 -870 -577 -733 -390 269 456 117 370 273 -339 -264 32 -194 -588 -39 -311 -710 -88 -90 331 700 967
1930 967 558 66 -12 -426 -670 -759 -116 130 746 663 203 115 321 -37 314 378 -28 213 -210 -824 -635 -152
1952 -152 171 475 942 1179 508 123 -365 -547 -436 -360 -393 -114 264 32 -202 79 -345 669 719 367 11
1973 11 -192 -786 -1400 -829 -470 -134 446 834 309 -91 243 -387 -509 -524 -63 -298 -373 -95 -483 -258 185
1994 185 258 345 658 377 39 -307 -445 -608 -338 -114 81 424 795 352 602 601 175 48 88 -86 -102 48
2016 48 -125 -339 -63 383 498 570 816 388 568 352 -317 -621 -374 -454 119 420 217 471 509 -73 -157 54
2038 54 135 -59 -97 -90 -394 -566 -657 -470 -116 540 640 709 133 -330 -638 -925 -571 -263 -200 -79 -3 -150 -375
2061 -375 -162 -188 259 556 -55 -73 -433 -784 -869 -479 89 398 918 679 335 22 -155 -525 -479 -186 93
2082 93 113 140 -275 48 -118 82 579 663 1039 440 199 -283 -633 -363 -144 393 452 552 622 269 61 169
2104 169 -90 -215 240 -224 12 138 -608 -199 -13 2 330 882 147 174 -203 -675 -855 -667 -387 -25 332
2125 332 403 -154 168 92 -128 -350 -143 -340 -196 -67 -553 -430 -450 -182 191 480 568 294 226 -39 -622 -715
2147 -715 -376 -105 91 366 276 427 131 110 -20 104 197 424 437 -79 -246 -285 -329 -66 118 710 780 686 358
2170 358 120 -493 -283 -352 137 230 142 281 -34 13 41 221 375 279 480 210 -324 -425 -511 -350 -37 314
2192 314 473 4 559 -107 -228 -511 -486 -492 38 -103 -132 -507 -481 -438 95 116 79 381 -11 -287 -428 -489 -706
2215 -706 -203 110 54 234 255 154 -36 -146 164 -103 113 30 163 -111 -328 -71 59 231 546 524 238
2236 238 341 -63 98 -258 -442 19 52 250 501 305 232 246 29 70 102 -6 181 115 -199 -419 -352 -29
2258 -29 457 100 123 337 -100 -143 -177 -389 -423 6 -16 29 69 -35 -274 -200 -86 -58 103 54 -85 -88 -419 -468 -356
2283 -356 -268 -233 72 422 145 -182 -257 -335 -273 -359 -145 138 56 -80 -128 -119 -105 100 339 123 259 116 61 11
2307 11 -421 -107 245 358 657 474 190 327 -92 -25 68 343 132 181 85 -100 -316 -6 -62 145 245 555
2329 555 207 -129 -184 -522 -282 59 -54 217 160 126 95 -171 -167 -23 -125 20 -186 -117 100 -583 -580 67 -12
2352 -12 -136 130 93 -102 -207 -151 -294 -171 99 -7 -171 144 -125 -97 -111 -37 116 -118 38 -12 4 9 -380
2375 -380 -51 -264 -91 374 167 100 179 12 -48 -105 -90 36 -45 78 -11 136 36 124 -97 62 296 435 414
2398 414 43 -176 -178 127 -68 67 310 388 356 73 10 52 -182 -13 131 -58 254 -102 -340 -298 -114 33
2420 33 275 -217 287 214 -192 -200 -230 -228 -261 -22 143 -89 -205 -144 11 -376 -16 -263 -38 67 -158 -189 -223 -1
2444 -1 -204 169 -204 167 374 279 -283 -85 -40 60 182 172 -24 214 325 22 -189 122 74 77 237 106 17
2467 17 122 207 -146 162 259 128 139 340 -325 -208 176 -143 41 207 199 261 163 137 -163 -51 -65 89 -102
2490 -102 139 127 -60 -201 -391 -131 -41 -59 0 -50 -291 -188 -566 53 -236 90 -111 96 -144 36 -191 -326
2512 -326 -156 235 -163 -29 -76 236 -7 189 -253 -424 94 -51 142 51 282 -150 -54 71 -13 210 182 -119
2534 -119 66 226 186 -7 -113 -3 222 148 -257 -164 331 -91 -93 395 65 59 386 89 -246 -164 -93 105 26
2557 26 323 -48 26 -50 -25 -24 -216 38 -130 -74 -161 -16 -34 -76 -319 -126 82 16 61 -145 -201 -223 -225 -135 -86 -273
2583 -273 130 -127 -318 -37 -21 -209 -244 -112 103 -33 187 -428 92 -172 38 332 -18 187 180 210 -14 -20
2605 -20 -117 35 -57 -74 173 189 -28 263 86 170 460 105 107 104 -207 -20 25 -122 278 36 10 223 276 -85
2629 -85 -8 -178 -262 -282 -244 -210 -57 205 -56 -21 172 -60 133 -224 12 -158 -225 -240 -515 -146 11 16 -115 242
2653 242 95 5 -210 -298 -28 -486 -365 -183 -45 -109 -157 13 98 152 3 -75 68 -42 -66 -248 -330 -273 257
2676 257 158 129 174 197 315 92 58 13 113 172 -27 214 302 323 36 -3 368 174 219 272 -81 -77 -86 -18 -268 -7
2702 -7 77 12 187 102 250 107 63 60 45 -74 39 42 -119 -42 100 53 123 112 73 21 35 -137 -111 -48 -113 76 -14
2729 -14 -10 195 261 -175 -122 60 91 -170 -155 -536 -444 -125 31 216 98 101 34 106 146 67 187 -48 -37 -50 149
2754 149 72 231 93 491 165 86 106 132 -182 -157 -101 -118 33 -24 144 37 231 40 192 167 17 -162 -208
2777 -208 -90 106 -32 -16 -7 13 376 273 -181 69 155 -111 -205 -227 -47 -100 -219 -91 -161 54 105 228 173 -195
2801 -195 35 -60 26 -240 -186 10 -81 49 291 74 20 -176 -5 231 -18 162 38 -245 -302 -52 91 263
2823 263 170 -94 -20 185 138 84 -130 -286 -141 -213 -24 144 159 321 19 394 47 231 82 -60 -131 116
2845 116 57 -68 -63 -122 -66 178 -66 351 234 -135 -186 -158 16 -229 -111 48 99 -56 78 -120 41 354 118
2868 118 148 -74 -417 -269 -195 -384 -70 58 135 103 166 -151 -361 -288 -252 -295 -62 -203 -260 -88 -157 -280 -31
2891 -31 79 150 127 -10 19 -70 -70 101 -116 58 128 198 121 63 -80 -214 176 -46 282 132 -7 -46 130 207
2915 207 212 80 388 181 239 86 -52 27 -114 52 -239 -21 221 193 225 248 30 -52 149 -96 77 28 -453
2938 -453 -260 -121 -256 -16 -163 71 200 320 196 -192 -422 -274 -152 -253 -40 -134 123 82 -81 5 7 31
2960 31 -46 199 -204 -72 -47 -159 -56 234 -63 184 179 32 198 -3 78 -221 -309 1 117 190 173 -9 453
2983 453 214 418 280 13 229 -86 -92 9 97 -26 377 7 326 169 236 19 19 -50 109 -269 0 36 -18
3006 -18 18 85 28 155 181 -130 70 84 -40 28 -174 -141 -228 -85 143 -9 -38 20 -10 -155 -11 -45 -378 -96
3030 -96 -94 -25 -248 -58 -192 141 60 239 129 55 -287 -133 -328 -154 -116 -36 325 -109 24 49 116 222 141 121
3054 121 1 -187 183 44 331 -87 49 157 -26 192 180 51 -34 -238 -142 -125 -144 67 47 83 84 148 146 93
3078 93 250 248 198 -220 -193 -308 -144 89 -118 -121 17 163 85 -1 -4 -93 -207 -83 78 -69 -236 -63 -217 -70
3102 -70 -47 -16 -1 63 -25 -171 93 -230 -381 -121 -54 223 60 16 -19 -88 -164 -203 -20 -33 145 -81 98 -135
3126 -135 24 -46 117 359 145 178 138 44 3 -49 -160 59 178 153 154 -73 108 -27 -78 61 49 31 4 -45 111
3151 111 -30 -159 -418 35 98 33 202 69 -194 -91 -295 -145 110 6 -89 -338 26 -104 -74 95 106 79
3173 79 43 -25 -189 -192 78 -197 -192 -124 40 25 226 72 -157 -82 -328 -149 61 11 93 90 -94 -219 -116 222 281
3198 281 106 -16 127 46 -143 -91 -205 -178 191 398 138 -9 35 -11 -88 -107 -59 -23 149 75 104 -48 22 -194
3222 -194 108 -56 197 215 21 28 -34 -151 -68 21 133 333 9 -128 -170 -89 84 -65 110 146 48 4 -52 -199
3246 -199 -140 161 20 129 82 -20 -131 57 -185 -137 -104 46 90 -70 81 -100 95 68 193 -139 -31 -102
3268 -102 -102 -10 -332 -376 147 32 72 259 -23 -59 -137 -111 -46 206 165 -67 68 77 102 -262 115 -38 148 141 -31
3293 -31 153 69 -6 -175 12 120 234 333 100 171 -147 -27 -31 49 196 164 -195 183 -19 -216 -99 0 -98 66
3317 66 50 -65 -88 -160 -108 72 -109 -221 -39 -151 46 -216 -128 -116 -307 58 100 2 83 -190 -147 -141 -142 -135 12 -57
3343 -57 154 81 61 6 112 -144 142 148 -92 186 5 -29 -147 -144 174 -60 -72 32 -80 -71 -205 -163 -158 38 54
3368 54 365 79 160 -22 55 38 93 61 68 219 231 219 -212 -167 127 -164 3 86 -22 -31 -177 17 -166 -165 -179 52
3394 52 74 79 -112 25 117 -24 -24 -368 -65 -109 -43 -362 -13 -154 -163 -103 -6 -101 290 -142 84 -141 -103 -99 148 -60
3420 -60 -42 29 57 73 -70 25 -50 -43 4 140 -1 -26 -375 267 -27 0 24 -107 154 -194 188 -61 213 188 88
3445 88 -57 231 -45 -96 25 -41 130 104 151 110 12 -90 44 -114 48 -109 199 -267 162 24 292 -34
3467 -34 -8 -265 -92 -72 72 147 106 -25 -82 42 -95 143 -174 14 -138 -118 -63 -275 -9 207 -81 37 -131
3490 -131 -186 -174 -227 145 -47 96 -39 36 49 50 -20 -193 -171 198 -86 -103 140 -182 292 -90 -65 -172 94 191
3514 191 151 14 100 296 -105 25 254 -175 217 -71 90 -129 -34 -57 -36 87 -176 224 56 -154 27 31
3536 31 -155 260 282 -68 -253 -187 -133 4 -11 -137 103 -242 22 -28 -67 -73 -158 70 -203 -79 -112 -200 -51 -136
3560 -136 -252 105 196 -16 165 -114 -185 -223 -73 -217 -26 149 34 112 -80 -38 -1 20 -94 223 191 17 -90
3583 -90 15 198 -195 -1 3 193 115 59 44 -140 -162 188 9 143 375 78 208 144 -56 96 61 242 -25
3606 -25 -225 169 184 47 -82 -64 -4 -63 -43 104 102 11 -57 -83 -29 -294 30 -75 -47 -84 -85 -85 -191 -84 -91 23 53
3633 53 -342 -401 -58 -142 205 -4 -70 102 -168 67 305 -113 -170 -288 -43 -58 -27 96 5 22 240 85 273
3656 273 157 199 6 -82 -51 -80 142 13 -5 449 155 217 63 163 228 32 -103 -118 -77 -69 22 78 70 73 -25 -35
3682 -35 282 178 -229 -73 197 -213 118 -26 -15 20 167 -137 -43 -37 -211 -149 44 12 95 -127 -62 -227 98
3705 98 -167 -85 -35 223 218 -118 -277 -100 -111 -93 -59 -22 -26 -142 54 115 272 61 197 29 118 -23 -57 -111 -212
3730 -212 -57 -192 -116 204 56 154 -11 122 254 82 -12 31 -22 -148 -75 -22 85 195 105 -122 -48 -117 -188 98
3754 98 -19 -13 41 -82 -60 -46 97 4 274 -19 6 -282 -93 168 -252 -379 -125 -131 -84 90 223 15 71 -84
3778 -84 -28 134 -220 -2 -75 -121 -101 7 2 347 95 -46 -67 -103 -388 237 177 -411 0 -53 54 68 204 128
3802 128 193 -108 161 -57 -163 46 -167 99 -206 27 -19 425 49 283 95 122 195 -29 -154 76 156 -108
3824 -108 23 109 321 -9 145 -4 61 40 -211 -6 -175 -58 -54 58 -11 32 67 7 -144 -67 2 -117 13 -216
3848 -216 -110 183 61 -169 -42 -373 -36 181 -122 266 -106 -31 -65 -35 140 61 97 79 21 -191 32 107 76
3871 76 -18 -5 51 175 54 99 238 25 -40 127 58 -110 77 -3 -177 244 131 -327 189 1 -182 -47 173
3894 173 5 147 -107 -17 -125 98 -23 -156 257 38 -56 73 256 228 -2 -122 27 -65 -193 80 98 34
3916 34 16 74 34 73 232 -290 83 -132 -57 -66 -168 206 112 316 80 -196 213 181 142 147 -96 -207 -228 -221 -119
3941 -119 67 194 -29 261 37 -136 -148 59 117 -41 -15 97 -119 -35 -15 36 -133 202 -130 253 45 -125
3963 -125 362 -49 8 27 40 36 83 -174 258 -58 258 -107 -3 -135 -134 148 -38 -125 65 77 118 21 84 100 99
3988 99 -17 117 17 72 -46 -55 174 -88 -100 111 -124 125 126 33 178 20 173 51 19 -95 -89 -15 53 82 166
4013 166 -186 -164 84 -156 -6 38 -9 58 239 -9 269 -61 245 268 58 59 -303 -12 16 163 7 103 10
4036 10 120 -78 -76 39 183 43 179 77 -88 384 285 -166 -349 -123 -59 46 65 -44 256 184 -211 18
4058 18 -301 -67 44 149 138 23 31 13 106 -228 -80 156 6 196 -164 26 -304 -117 -47 -205 -106 -162 -131
4081 -131 206 126 -139 -63 -116 59 54 28 375 -38 123 -15 -144 261 -182 -152 32 66 -29 -220 -28 97 157
4104 157 -1 -65 137 -2 -62 137 66 83 -137 30 12 75 37 28 -20 -9 72 -65 91 -71 -108 -78 -84 85 -23
4129 -23 -46 -111 64 38 -4 3 -192 67 -133 75 -181 -129 38 -73 -20 0 -95 -198 -27 -66 82 -17 -114 11 -80
4154 -80 166 16 -95 -199 -84 -18 4 -92 -95 -32 27 -98 65 32 73 41 90 72 334 -94 11 -13 -29 192 106
4179 106 46 119 -196 228 170 29 -17 -85 29 -297 -6 164 7 146 206 331 343 -86 136 -44 96 36 177
4202 177 109 -40 90 148 96 -35 -89 5 30 -38 -60 -53 51 -264 14 -196 22 133 -94 285 -184 161 -273
4225 -273 134 199 45 -144 -29 95 15 27 -131 2 -75 -32 -192 84 -51 -52 204 19 58 -108 57 130 -164
4248 -164 15 -110 -118 31 -82 101 7 -35 314 -35 -106 67 29 -5 35 116 -69 152 -20 2 17 5 41 33 54
4273 54 141 82 139 79 -1 -29 62 -149 62 -35 -105 319 160 -59 161 -112 13 -21 -135 64 -88 174 240 96
4297 96 -140 -202 77 35 -113 -131 187 17 171 12 62 91 -83 -20 -143 -120 -54 0 -166 -48 -68 -47 -124 -133 -148
4322 -148 -195 99 -74 28 52 16 -127 -88 83 155 -6 22 -75 56 187 184 -49 143 115 5 -47 101 115 46
4346 46 -32 -110 78 38 86 137 -150 103 150 39 -57 -28 -52 153 219 170 -155 -88 110 -174 -17 -9 -43 -111 -9 -55
4372 -55 -174 -131 -10 -162 -105 119 -122 -125 119 -154 -31 -15 -26 -35 127 17 -58 114 -132 19 48 -11 61 83 -2
4397 -2 19 56 -9 91 72 23 173 37 31 252 -47 103 -18 93 -101 34 -179 -171 125 -63 -126 -64 -193 16
4421 16 -110 142 -12 171 12 -172 152 -56 86 17 151 -102 -112 -6 255 -41 103 -73 50 79 249
4442 249 40 -77 -140 -67 -188 119 -8 -178 -158 17 44 42 -68 -40 103 -139 36 4 63 -8 48 -168 175 136
4466 136 -97 -44 84 40 -32 74 -90 153 137 -38 92 4 -74 -14 140 -183 248 -152 41 105 -46 -28 -99
4489 -99 -176 3 16 229 -172 -125 -9 4 -102 -78 44 8 81 -193 17 -73 27 -22 93 39 193 -184 65 76
4513 76 38 78 -78 -58 195 -55 5 261 50 -14 -137 -29 -181 50 253 -425 -120 165 -116 40 -27 77
4535 77 -113 278 22 -111 283 -138 313 39 143 109 13 96 -94 -72 -3 -148 82 118 38 25 39 121 -61 40
4559 40 -195 99 26 124 110 235 218 -42 -150 -22 -23 -132 -188 93 -232 -229 45 238 -95 48 5 58 78 -30
4583 -30 -52 -155 65 46 -20 -59 -259 -210 -221 -33 16 121 27 -66 -151 167 33 -65 171 61 -63 -84 128 75 -219
4608 -219 -262 -114 92 25 72 108 -11 -19 64 -117 -39 98 35 -60 76 -21 27 -142 -23 60 47 145 -161 131 4
4633 4 79 -34 -66 -183 -82 58 32 -88 175 -177 141 103 -163 33 -161 101 147 162 167 -349 -91 116 89 -64
4657 -64 -94 46 -71 172 -173 -60 44 -63 -121 -34 150 -54 -68 147 -254 36 6 -32 170 82 -47 -80 -119
4680 -119 31 35 -146 -57 41 51 347 -56 146 113 -10 -194 225 57 19 -28 -278 128 122 0 -389 67 -34
4703 -34 89 -99 -29 -157 -115 -129 -117 -121 -166 -229 -133 107 -56 44 -100 29 57 169 -207 263 81 17 352 -12
4727 -12 44 199 157 53 -40 -25 200 154 -164 333 -60 -131 -1 -16 62 49 -216 95 62 -110 -119 -107 -2 -4 42 -124
4753 -124 96 229 113 71 -112 -151 -208 -144 272 81 166 175 21 -117 167 12 163 92 -13 -209 54 71 -43
4776 -43 11 -41 44 7 17 -11 -23 26 59 118 -7 111 -85 -37 239 244 -236 -126 -54 68 -32 -89 242 -11 89
4801 89 80 155 10 86 -12 104 194 254 11 209 -167 8 100 177 -104 135 31 -204 436 147 55 -41 -159 -55
4825 -55 -34 -63 92 -70 -114 220 203 234 -153 -45 -16 105 12 -133 -232 -98 181 -37 -74 200 271 237 -150 -95
4849 -95 263 -121 -195 67 134 121 6 -197 -92 9 -118 153 -9 69 -25 -68 -64 -9 30 37 106 -42 110 141 111
4874 111 -53 170 35 85 -45 -103 157 279 276 250 211 -4 201 -79 10 254 59 38 105 -18 -153 106 61
4897 61 157 -192 20 125 5 -53 138 8 84 127 -162 3 -71 -16 -41 73 112 -127 62 136 30 -438 -7
4920 -7 -79 -107 69 -83 106 14 -65 108 0 35 91 -174 25 218 184 88 59 117 -19 -15 -16 112 186 160 -35 92
4946 92 -20 97 293 -53 142 -78 39 21 75 27 186 -108 -81 -27 -1 -96 -58 8 79 71 -86 -248 -1 37 -187
4971 -187 11 116 -123 -143 -91 -42 -160 -186 87 -8 70 -37 -103 32 95 -302 354 115 26 51 -141 86 -51
4994 -51 90 -20 -10 82 15 84 21 4 0 234 -108 -27 116 112 26 -42 44 60 -58 110 17 -159 -10 80 12 -77 19
5021 19 1 -3 -207 196 -194 -80 85 -19 -196 -80 119 -67 119 94 -73 -47 -205 -212 119 -64 -301 27 -84
5044 -84 -203 64 -134 85 177 -41 3 -55 103 -14 -90 161 253 -202 -12 191 -204 8 26 328 -88 -127 -115
5067 -115 -15 61 -62 -105 -241 -49 -237 63 26 -135 -63 -120 -122 -64 -46 43 190 -70 173 -14 -28 -63 107 -69
5091 -69 62 157 -70 22 45 2 -92 -118 53 -74 103 -2 -105 29 79 33 -180 -161 27 -50 24 -40 -65 -241 62
5116 62 111 -102 262 -28 60 56 88 163 7 -345 46 30 -78 -24 -11 61 0 108 179 39 -12 -89 -7 -77 -155 164
5142 164 -8 -59 139 54 85 243 -101 -34 83 -46 129 189 -22 22 277 -8 -81 103 -26 95 264 89
5164 89 24 -80 23 8 13 56 160 40 38 -190 -93 66 -76 -113 -121 -139 -63 -66 89 33 -21 -296 -70 -97 187 -163
5190 -163 -158 -25 168 -137 90 -24 -209 229 42 17 -137 -79 -59 -4 66 131 234 -39 56 125 -62 -176 31
5213 31 51 -115 26 232 -77 -106 129 100 169 102 52 169 91 -213 15 38 -42 1 -28 125 35 -52 -179 -101 -13
5238 -13 -62 48 -64 -153 185 -9 76 34 38 0 38 75 164 14 132 -9 -19 278 -115 -46 30 67 -24 -13 -160 122
5264 122 -106 -42 82 -171 12 54 -48 -25 10 123 41 -130 78 6 160 49 1 -172 134 128 -165 -1 -116
5287 -116 -118 70 -16 9 152 -8 -185 61 23 -2 -34 -9 -224 159 280 -11 77 -69 220 298 -34 29 47 -3
5311 -3 -255 -234 26 49 13 125 -225 -125 159 121 10 -4 -254 166 -79 55 69 110 -156 -53 157 -144 175
5334 175 111 -110 27 -145 38 -65 131 18 -167 142 182 152 49 -141 249 -85 47 119 50 157 147 146 23
5357 23 -70 -32 12 134 -11 -101 -108 -168 51 -22 34 -128 5 -24 148 -198 113 -139 81 92 129 61 -239 142 41
5382 41 87 102 175 64 -135 -33 -36 -141 -172 76 -89 75 178 -130 -124 98 89 -156 -110 -127 -61 106 -41 -6 185
5407 185 13 -218 29 95 157 191 46 -38 -87 -144 -145 -97 16 6 183 102 49 -218 -105 -201 -162 17 1 -86 -53 61
5433 61 -135 -69 25 149 139 -103 81 246 87 121 139 107 -43 50 113 -98 -50 131 -139 -25 -122 20 -239 -338
5457 -338 -11 46 -64 25 -285 63 -11 -202 233 147 214 -26 131 -49 -162 -73 -156 259 -57 -11 -74 34 72
5480 72 61 -15 131 -119 86 -30 43 -9 -149 217 -251 -45 -19 -161 70 30 46 95 38 108 -64 40 57 42
5504 42 205 57 -99 12 64 61 29 88 -47 -57 -78 -25 -193 124 13 30 -95 -8 -7 97 -149 -134 14 103 229
5529 229 141 -19 26 -28 146 284 85 172 -131 26 -123 -106 -66 185 -89 -32 -194 29 -89 -82 -69 -91 37 -66
5553 -66 -213 20 26 176 -51 -41 160 -11 -71 -12 89 -12 70 252 73 90 -260 102 119 -50 -88 1 -142 2
5577 2 -38 -5 3 -43 -51 54 61 -16 -50 -73 20 -79 -24 -95 -175 4 109 85 238 -111 89 102 -13 -33 -78 -130 -211 201
5605 201 -213 -219 -58 78 188 133 -32 60 -7 -81 30 -50 47 97 -89 87 21 -128 118 96 -9 242 -152 67
5629 67 133 -143 61 14 -61 60 53 -46 33 71 -241 -132 -169 -263 -207 123 126 129 -64 -33 -36 -32 -94 -297 234 16 74 -50
5657 -50 6 33 -114 -60 196 107 -115 56 148 51 -144 51 -70 -1 91 -30 -6 -10 -156 -183 327 -166 136 -41
5681 -41 -246 247 -39 44 -30 77 26 -123 -94 -44 -20 -141 299 91 27 -48 -7 117 83 -56 66 217 120 2
5705 2 -189 -84 107 -14 75 20 164 -133 113 -17 -235 -60 8 15 -36 196 88 37 145 -151 -154 67 -115 -28
5729 -28 -46 123 -103 -109 54 208 -129 -89 38 31 19 142 -48 -168 135 -227 -16 190 179 211 -108 -27 -142 -84
5753 -84 -99 -267 -129 -41 122 -204 263 -48 124 -131 13 166 -157 1 109 -30 34 -22 83 68 -81 -186
5775 -186 -48 -190 160 -150 -67 213 -83 14 26 55 -225 -124 130 5 127 10 144 84 -141 -27 130 76
5797 76 227 58 -22 50 1 -74 -211 65 108 -126 -124 17 -154 -132 29 126 53 -73 96 -73 -78 162 186 -19 4
5822 4 -129 234 34 -206 5 55 -61 3 -161 -132 76 -199 -140 48 50 -129 -128 25 -82 234 95 111 -140 -112
5846 -112 -72 -6 -93 -28 149 -91 60 -45 268 -77 -156 -193 -17 -182 63 133 99 -104 26 8 41 -41 4 -138
5870 -138 52 -157 -49 8 78 -23 -96 86 -160 97 -123 87 -27 119 -172 127 42 138 -151 0 -190 88
5892 88 -156 -234 -156 -213 349 38 62 14 402 129 -16 -72 -104 -125 -182 112 -178 122 92 -148 -61 -40 83 -325
5916 -325 -164 60 62 -73 -15 96 133 228 213 -312 -80 -126 53 -93 -53 -387 -99 -337 208 -21 -23 188 90 56
5940 56 -30 76 16 -135 33 -97 155 179 -44 -188 109 13 -41 -169 -297 -145 -140 -65 -126 65 -30 -40 -6 31 42
5965 42 -170 245 -22 -212 145 -131 7 34 179 96 17 -51 -1 97 -31 -81 -37 -41 158 -83 -72 -11 80 -72 7
5990 7 62 6 142 -117 34 -111 54 232 151 -84 81 301 -143 45 -21 27 -12 -5 -17 -252 145 -50 -109 26
6014 26 33 55 40 -169 7 15 -246 -115 -106 -74 41 19 -100 116 34 169 -202 -57 363 22 29 -122 79 150 -4
6039 -4 176 -228 -156 26 -76 -39 33 -134 -3 108 32 161 -201 211 2 349 -103 -106 -48 -141 90 41 -101 59
6063 59 -275 -125 -58 -19 85 -45 286 -241 -11 -104 92 290 -15 79 59 -170 -8 84 31 240 290 -126 -120 -106
6087 -106 -17 128 213 54 -175 166 -29 16 -68 -125 -21 66 -59 -75 35 -223 -75 277 -190 4 -306 94
6109 94 -285 -118 3 -125 -208 122 -53 -27 -188 -108 192 -181 -43 299 -154 40 33 -107 14 41 -108 111
6131 111 -205 -15 -340 68 -123 30 -227 -15 116 341 115 -178 169 -113 103 -71 -186 -48 155 -59
6151 -59 -39 -36 148 95 140 -146 151 114 -201 160 -31 12 -206 -21 -44 114 -189 123 64 -177 39 -148 -195 -139
6175 -139 -231 184 148 20 171 85 -135 -104 -61 10 -152 -135 66 -196 -121 -115 -6 -204 153 182 33 -206 -66 -93
6199 -93 125 19 24 -41 -70 -248 -175 103 -30 32 11 174 77 79 168 -145 242 16 -293 -5 -128 458 -233 -93
6223 -93 215 -121 67 216 -156 88 -158 -47 80 157 -35 30 -280 -189 28 48 20 -250 -36 -13 121 -137
6245 -137 249 -18 70 231 -34 -171 -92 -58 68 260 -225 167 -3 47 3 28 -125 -19 38 -116 143 53 -18
6268 -18 -87 29 171 77 19 -16 -155 95 -143 168 49 68 -35 7 -171 -76 120 -139 115 -141 -223 -30 33
6291 33 275 104 -125 -37 56 62 62 107 -62 226 -131 -12 -213 -115 -156 -55 133 -31 -48 242 -45 -156 -130 -183
6315 -183 21 -97 -201 280 16 145 -10 -124 -51 -94 -39 20 -255 51 0 -187 483 -128 -173 95 63 141 72
6338 72 71 171 -112 -2 45 -77 89 7 -98 50 -90 18 37 -81 29 -28 212 109 -45 -57 1 36 -59 156
6362 156 23 175 24 -96 163 -254 18 281 33 -209 3 15 367 46 149 80 -90 252 -17 119 136
6383 136 85 -7 -168 247 146 -6 -173 -7 -152 -125 291 -150 -19 -68 -200 -28 167 -99 31 68 -127 -103
6405 -103 -189 424 -7 -92 1 154 -179 176 -78 -122 191 19 12 73 81 8 -14 90 -33 -172 -217 -225 -27 -51 70
6430 70 -234 -13 107 -106 -54 24 -234 44 101 212 -19 172 169 28 -25 -246 -56 -55 -3 92 -21 -52 -69 -143 47
6455 47 -42 208 194 57 -143 115 1 -143 140 305 122 -202 -270 -4 76 116 -25 -16 38 33 212 -103 -153 155
6479 155 -46 -201 5 14 -4 44 -42 133 -1 53 95 -21 245 -6 154 -101 119 -51 -37 80 179 81 124 -45
6503 -45 -51 62 35 68 45 -20 105 -130 -103 -93 -67 132 242 -2 -104 -161 102 -14 55 -22 -41 -197 -45 65 74
6528 74 -101 -62 164 251 3 -106 103 -71 77 82 35 -16 38 155 15 -8 -173 8 70 112 -39 5 87 -127
6552 -127 -6 16 -3 -110 -23 -163 -154 272 -80 -51 116 20 2 129 -154 -54 153 -2 355 -268 -147 262 -81
6575 -81 -46 82 69 -279 33 -37 78 -28 -197 114 -99 81 -60 22 -57 -178 2 29 78 230 -110 87 -92
6598 -92 -172 -82 -117 59 18 -175 -8 -247 -59 25 204 -18 239 -69 -222 60 126 -179 -240 37 -164 8 144
6621 144 -112 79 81 -68 166 141 -36 -90 -79 154 -66 247 -65 24 -32 176 138 -5 10 -25 262 175 -106 -115
6645 -115 -43 34 -50 -96 87 -10 21 -29 -62 64 17 -210 171 64 -125 3 -130 31 -124 -81 179 46 -18 72
6669 72 263 -63 55 113 43 -69 154 0 55 -31 -21 -274 8 24 -18 16 17 37 -107 -35 16 72 -44 -24 -59 160
6695 160 115 -77 163 -81 -228 -120 -52 -53 -44 -163 -149 104 103 -4 -297 129 48 -234 149 -63 -76 -83 119 -23
6719 -23 116 23 99 188 25 56 -20 102 59 322 126 -83 61 114 -129 -135 -22 -137 236 55 180 -144 182
6742 182 165 12 23 -20 -87 16 -73 1 -4 -115 115 -14 13 76 66 -132 58 -146 50 -14 -31 204 7 97 47
6767 47 88 119 -25 -189 -93 -17 147 -78 -240 167 -69 6 -146 48 120 -38 -178 109 -140 -26 121 295
6789 295 19 -235 -200 223 186 -37 -47 2 113 -136 85 -80 -56 9 -227 -92 81 109 80 46 19 128 -165
6812 -165 -206 64 33 6 -187 153 37 276 47 -51 198 15 148 -215 67 146 -31 92 -81 177 108 224
6834 224 112 -43 -33 77 70 129 -121 140 3 28 -104 200 -240 44 -47 41 31 -29 -115 -66 28 -149 230 368
6858 368 200 -215 -159 117 -174 -58 -106 25 -61 111 192 -34 52 15 92 225 -300 -23 130 164 150 -186 181
6881 181 64 68 169 154 85 -47 28 19 -139 -116 -15 -37 -129 70 107 -16 -19 116 132 97 -227 95 45 95 -64 46
6907 46 44 77 12 -50 -77 -190 108 8 -26 -60 333 -70 61 94 -70 -53 109 158 -194 -82 181 77 107 139 21
6932 21 -121 -142 3 3 -65 -116 57 -49 397 -38 51 37 23 -145 -42 -86 -219 76 91 -146 268 -157 -83 -120
6956 -120 194 26 -37 22 -105 -20 -29 -13 189 60 91 -35 -127 169 21 -74 -11 -160 -101 -102 -215 -224 131 -75 -217
6981 -217 95 -136 -150 5 -1 65 -279 70 65 22 49 -115 6 -125 218 -17 80 107 -121 176 103 5 -8 109
7005 109 13 -82 -68 -24 49 -41 -169 -42 53 -90 92 83 -129 34 -63 37 -26 305 -225 98 119 -107 164 16
7029 16 39 7 -81 -315 -42 5 61 -111 224 52 -27 -261 -116 29 54 11 -42 119 63 -155 22 217 120 345
7053 345 -105 -19 -10 184 -128 -200 74 69 128 -32 17 -166 153 -19 79 -167 145 19 -125 23 -52 21 181 40
7077 40 91 -117 184 -100 -216 -90 -133 -52 -37 26 202 -55 104 -3 128 45 244 -84 20 -37 -10 95 -65
7100 -65 -55 61 156 -160 -163 -6 -159 -184 -18 -191 -222 11 -55 -282 -101 -17 87 -152 137 -183 158 133 -88
7123 -88 -81 -262 -87 103 -75 253 -249 26 284 92 -20 0 100 54 -170 28 -147 142 10 213 -12 76
7145 76 312 106 111 60 4 -9 -288 191 142 -21 -202 -366 136 -3 -309 51 -97 -58 -2 175 -75 -72 -43 -174
7169 -174 -130 -90 149 204 21 -43 -57 40 -79 59 -217 -56 116 -185 260 -73 -167 68 161 179 66 -93 114
7192 114 -95 57 11 38 -58 -15 -118 93 16 44 46 -11 -117 -68 -62 34 21 -2 73 162 -79 -148 -7 -156 -54 196
7218 196 -8 -1 -148 -218 292 12 -74 125 -102 -117 -115 -102 -39 -99 -229 195 -102 -146 14 -74 -72 80 113 35 -55 24
7244 24 214 -93 3 -178 -25 40 103 -86 91 -178 -63 17 4 -9 -36 -142 0 -36 49 68 43 -101 -84 167
7268 167 37 -74 -41 -99 -9 -77 251 80 378 -212 -112 70 -77 86 269 23 -58 -211 -123 47 -6 -73 -71
7291 -71 -73 100 -158 -89 39 30 -227 202 161 163 -212 -72 73 40 -5 -7 40 8 111 -177 75 -25 -87 -143 23 -166
7317 -166 -77 25 -236 171 -75 61 29 -191 70 -76 -69 21 30 -61 87 69 -212 122 -62 4 171 -122 -125 58
7341 58 8 -196 114 -11 -107 9 -75 -46 168 91 -58 74 -117 -254 -135 214 136 28 40 -104 0 -89 -31
7364 -31 23 -122 -203 -80 -246 -33 -263 89 126 -75 138 5 -112 114 24 157 55 -83 -169 20 102 291
7386 291 -83 179 64 -281 3 -48 98 147 154 -5 168 52 -68 -116 150 54 59 124 -148 -116 202 180 -104 76
7410 76 -127 324 -40 -167 8 275 7 88 154 -136 150 -116 162 -238 14 -26 -39 -6 224 -34 -153 -101
7432 -101 130 -145 -37 4 -93 141 -149 46 -175 -126 -125 68 -51 -48 -142 -13 103 119 81 -158 27 45 43 -36 -142
7457 -142 22 154 173 96 336 12 -108 104 -150 -176 11 232 -167 51 11 -16 -100 65 -160 0 167 295
7479 295 123 127 -65 142 98 94 -8 15 -171 67 258 -66 64 25 247 54 -2 68 -90 206 58 87 -46
7502 -46 64 -3 220 117 -37 62 -141 52 -155 -39 13 106 9 -219 -132 -9 -175 65 -144 24 -78 -41 -61
7525 -61 44 22 124 63 -192 -54 35 215 119 18 155 -5 20 90 88 67 -79 -103 133 167 -27 89 -166 59
7549 59 72 -105 -166 -38 28 24 117 -155 -96 -90 -91 63 10 -16 -77 177 132 -101 -173 -23 68 15 -85 -1 273 100 -45
7576 -45 -44 -40 -33 30 -186 95 114 -15 -8 44 -104 68 -197 -114 -31 5 -228 -55 58 267 -164 -231 -90 -112 87 -72
7602 -72 176 -62 91 -60 155 -49 151 181 71 99 -42 -227 18 -31 9 63 -74 86 -159 -228 28 225
7624 225 22 15 60 -9 -30 24 162 -25 133 -59 -82 282 -129 140 65 -102 -134 -63 27 164 0 130 40 -26
7648 -26 -57 33 -182 -36 -78 118 4 -120 31 -132 130 29 202 -176 130 54 -139 23 0 32 -101 47
7670 47 -114 -121 -136 -76 -202 94 -58 -158 254 -153 123 76 -76 118 -23 26 -54 28 -24 -54 241 284 297 97
7694 97 -114 -90 -210 -60 17 30 73 32 -106 69 -37 150 234 -251 -320 285 150 7 181 -124 -16 148 146
7717 146 137 61 141 144 -43 77 207 242 19 39 157 122 274 -156 187 -178 -211 -147 21 -276 55 204 -134 47
7741 47 6 -106 83 113 170 52 -43 212 -119 15 -162 -87 -101 181 249 144 -45 139 17 -126 -41 3 -143
7764 -143 238 269 241 64 -103 123 -19 172 -65 93 -145 13 14 4 35 218 -83 -33 -216 371 214 0
7786 0 -112 33 -169 115 -58 -72 38 -43 -255 119 -281 166 310 -15 141 87 60 -115 -171 -187 -40 80 151
7809 151 -25 117 22 -72 111 3 -147 152 46 12 -95 46 -36 0 107 -87 68 85 33 65 77 -8 -35 185
7833 185 45 184 -12 -6 155 -322 -27 133 -57 -145 17 -159 -87 -58 136 58 -88 77 -32 -164 -32 -50
7855 -50 66 150 -46 -51 254 23 -258 -113 -191 -180 45 -159 140 -6 -133 9 -75 -143 -162 87 -71 129 58
7878 58 -171 188 63 -89 -307 -27 131 196 53 106 -31 35 5 -184 127 -76 -101 -20 -17 -33 -19 -110 -51 -101 62
7903 62 129 6 -7 166 -39 268 125 191 151 -45 131 42 167 -106 -51 54 -252 -13 34 41 162 67 20 -147
7927 -147 209 -62 65 47 -190 3 -25 -85 -163 -35 48 -214 57 -9 -19 155 -14 53 -40 -111 65 -67 -151 -172
7951 -172 84 102 221 92 152 -89 -143 57 -166 24 95 90 35 27 70 159 -88 93 271 -46 -106 256 -91 -62
7975 -62 180 155 -55 9 -31 101 -119 26 32 65 257 30 -16 -224 176 -250 -21 63 -115 237 -154 -281 -253
7998 -253 -102 -100 128 2 34 48 11 -31 156 165 138 -177 11 -47 -176 -249 -116 -55 -119 225 -151 -47 -84 106 -37
8023 -37 169 -11 -138 71 -53 221 -141 -21 -98 50 54 138 101 -17 -218 -135 -76 153 172 201 -184 13 156
8046 156 155 -142 55 110 16 -127 146 73 119 65 197 220 -38 78 45 -2 -125 111 -53 -10 -6 4 -57 146 180
8071 180 27 -118 67 188 99 135 -13 -41 87 77 34 5 -165 -267 -260 141 -312 23 8 60 -49 24 55 -2
8095 -2 90 -73 51 36 221 25 -112 -27 113 -10 -9 31 128 2 -132 -275 -65 -127 -2 53 -55 211 -20 132
8119 132 191 55 39 -80 85 -93 -88 165 214 129 -75 -108 -21 92 114 5 -200 170 307 16 12 38 123 78 201
8144 201 58 47 -28 -14 -3 109 39 104 -34 -106 12 133 -46 -14 -137 21 223 122 104 98 362 -164 -82 -27
8168 -27 53 -50 -161 52 -159 167 53 -80 -104 202 -201 -32 6 -109 84 -129 -206 -7 -128 -37 199 378
8190 378 -64
8191f4
##END NTUPLES=NMR FID
##END=
