##TITLE=1H_SL64-SPh(1)-f3-6
 CDCl3, 8 sc, 
 11.1.2019
##JCAMPDX= 6.0         $$ Bruker NMR JCAMP-DX V2.0
##DATA TYPE= NMR FID
##DATA CLASS= NTUPLES
##ORIGIN= UXNMR, Bruker Analytische Messtechnik GmbH
##OWNER= root
$$ XWIN-NMR		Version 3.5
$$ Fri Jan 11 13:58:16 2019 Russian Standard Time (UT+4h)  she@DPX200
##.OBSERVE FREQUENCY= 200.1313
##.OBSERVE NUCLEUS= ^1H
##.DELAY= (6, 6)
##.ACQUISITION MODE= SIMULTANEOUS
##.ACQUISITION SCHEME= undefined
##.AVERAGES= 8
##.DIGITISER RES= 18
##SPECTROMETER/DATA SYSTEM= spect
##.PULSE SEQUENCE= zg30
##.SOLVENT NAME= CDCl3
##.SHIFT REFERENCE= (INTERNAL, CDCl3, 0, 15.7039)
##AUDIT TRAIL= $$ (NUMBER, WHEN, WHO, WHERE, WHAT)
$$ ##TITLE= Audit trail, XWIN-NMR		Version 3.5
$$ ##JCAMPDX= 5.01
$$ ##ORIGIN= Bruker BioSpin GmbH
$$ ##OWNER= she
$$ F:/spectra/data/she/nmr/H-F/1/audita.txt
$$ ##AUDIT TRAIL=  $$ (NUMBER, WHEN, WHO, WHERE, WHAT)
(   1,<2019-01-11 13:56:48.96 +0400>,<she>,<DPX200>,
      <created by zg, POWCHK disabled, PULCHK disabled
       configuration hash MD5:
       00 E9 B6 7A A2 85 ED C7 34 08 36 98 17 FE 4E 26
       data hash MD5: 16K
       AC 68 D0 6D F5 67 D7 6C E3 15 21 DA 2F 5F 2B E7>)
$$ ##END=
$$ 
$$ hash MD5
$$ BD DD 7A 99 D5 C1 4A AF 14 1C 8B 24 0E 93 AE 21
##$RELAX= 
##$RELAX= 
##$RELAX= 
##$RELAX= 
##$RELAX= 
##$RELAX= 
$$ Bruker specific parameters
$$ --------------------------
##$DU= <F:/spectra>
##$EXPNO= 1
##$NAME= <H-F>
##$PROCNO= 1
##$TYPE= <nmr>
##$USER= <she>
##$AMP= (0..31)
100 100 100 100 100 100 100 100 100 100 100 100 100 100 100 100 100 100 
100 100 100 100 100 100 100 100 100 100 100 100 100 100 
##$AQSEQ= 0
##$AQ_mod= 1
##$AUNM= <au_zg>
##$AUTOPOS= <>
##$BF1= 200.13
##$BF2= 200.13
##$BF3= 200.13
##$BF4= 200.13
##$BF5= 200.13
##$BF6= 200.13
##$BF7= 200.13
##$BF8= 200.13
##$BYTORDA= 1
##$CFDGTYP= 0
##$CFRGTYP= 5
##$CHEMSTR= <none>
##$CNST= (0..31)
1 1 145 1 1 1 1 1 1 1 1 1 1 1 1 1 1 1 1 1 1 1 1 1 1 1 1 1 1 1 1 1 
##$CPDPRG= <>
##$CPDPRG1= <>
##$CPDPRG2= <>
##$CPDPRG3= <>
##$CPDPRG4= <mlev>
##$CPDPRG5= <mlev>
##$CPDPRG6= <mlev>
##$CPDPRG7= <mlev>
##$CPDPRG8= <mlev>
##$CPDPRGB= <>
##$CPDPRGT= <>
##$D= (0..31)
0 1.2 0 0 0 0 0 0 0 0 0 0.03 0 0 0 0 0 0 0 0 0 0 0 0 0 0 0 0 0 0 0 0 
##$DATE= 1547200608
##$DBL= (0..7)
120 120 120 120 120 120 120 120 
##$DBP= (0..7)
150 150 150 150 150 150 150 150 
##$DBP07= 0
##$DBPNAM0= <>
##$DBPNAM1= <>
##$DBPNAM2= <>
##$DBPNAM3= <>
##$DBPNAM4= <>
##$DBPNAM5= <>
##$DBPNAM6= <>
##$DBPNAM7= <>
##$DBPOAL= (0..7)
0.5 0.5 0.5 0.5 0.5 0.5 0.5 0.5 
##$DBPOFFS= (0..7)
0 0 0 0 0 0 0 0 
##$DE= 6
##$DECBNUC= <off>
##$DECIM= 24
##$DECNUC= <off>
##$DECSTAT= 4
##$DIGMOD= 1
##$DIGTYP= 9
##$DL= (0..7)
0 120 120 120 120 120 120 120 
##$DP= (0..7)
150 150 150 150 150 150 150 150 
##$DP07= 0
##$DPNAME0= <>
##$DPNAME1= <>
##$DPNAME2= <>
##$DPNAME3= <>
##$DPNAME4= <>
##$DPNAME5= <>
##$DPNAME6= <>
##$DPNAME7= <>
##$DPOAL= (0..7)
0.5 0.5 0.5 0.5 0.5 0.5 0.5 0.5 
##$DPOFFS= (0..7)
0 0 0 0 0 0 0 0 
##$DQDMODE= 0
##$DR= 18
##$DS= 0
##$DSLIST= <SSSSSSSSSSSSSSS>
$$ [...]
##$SUBNAM2= <"">
##$SUBNAM3= <"">
##$SUBNAM4= <"">
##$SUBNAM5= <"">
##$SUBNAM6= <"">
##$SUBNAM7= <"">
##$SUBNAM8= <"">
##$SUBNAM9= <"">
##$SW= 24.933730806125
##$SWIBOX= (0..15)
0 0 2 0 0 0 0 0 0 0 0 0 0 0 0 0 
##$SW_h= 4990.01996007984
##$TD= 16384
##$TD0= 1
##$TE= 0
##$TE2= 300
##$TE3= 300
##$TEG= 300
##$TL= (0..7)
0 120 120 120 120 120 120 120 
##$TP= (0..7)
150 150 150 150 150 150 150 150 
##$TP07= 0
##$TPNAME0= <>
##$TPNAME1= <>
##$TPNAME2= <>
##$TPNAME3= <>
##$TPNAME4= <>
##$TPNAME5= <>
##$TPNAME6= <>
##$TPNAME7= <>
##$TPOAL= (0..7)
0.5 0.5 0.5 0.5 0.5 0.5 0.5 0.5 
##$TPOFFS= (0..7)
0 0 0 0 0 0 0 0 
##$TUNHIN= 0
##$TUNHOUT= 0
##$TUNXOUT= 0
##$USERA1= <user>
##$USERA2= <user>
##$USERA3= <user>
##$USERA4= <user>
##$USERA5= <user>
##$V9= 5
##$VALIST= <valist>
##$VCLIST= <CCCCCCCCCCCCCCC>
##$VD= 0
##$VDLIST= <DDDDDDDDDDDDDDD>
##$VPLIST= <PPPPPPPPPPPPPPP>
##$VTLIST= <TTTTTTTTTTTTTTT>
##$WBST= 1024
##$WBSW= 4
##$XGAIN= (0..3)
0 0 0 0 
##$XL= 0
##$YL= 0
##$YMAX_a= 236589
##$YMIN_a= -339207
##$ZGOPTNS= <>
##$ZL1= 120
##$ZL2= 120
##$ZL3= 120
##$ZL4= 120
##$ABSF1= 10
##$ABSF2= 0
##$ABSG= 5
##$ABSL= 3
##$ALPHA= 0
##$AQORDER= 0
##$ASSFAC= 0
##$ASSFACI= 0
##$ASSFACX= 0
##$ASSWID= 0
##$AUNMP= <proc_1d>
##$AZFE= 0.1
##$AZFW= 0.1
##$BCFW= 1
##$BC_mod= 2
##$BYTORDP= 1
##$COROFFS= 0
##$CY= 11.3945322036743
##$DATMOD= 1
##$DC= 2
##$DFILT= <>
##$DTYPP= 0
##$F1P= 18.9103706918063
##$F2P= -1.10871071338519
##$FCOR= 0.5
##$FTSIZE= 0
##$FT_mod= 4
##$GAMMA= 1
##$GB= 0.15
##$INTBC= 1
##$INTSCL= 1
##$ISEN= 128
##$LB= 0.24
##$LEV0= 0
##$LPBIN= 0
##$MAXI= 10000
##$MC2= 0
##$MEAN= 0
##$ME_mod= 0
##$MI= 1.114404
##$NCOEF= 0
##$NC_proc= 0
##$NLEV= 6
##$NOISF1= 3.799351
##$NOISF2= 2.8
##$NSP= 1
##$NTH_PI= 0
##$NZP= 0
##$OFFSET= 15.70392
##$PC= 1
##$PHC0= -8854.036
##$PHC1= 17.00006
##$PH_mod= 1
##$PKNL= yes
##$PPARMOD= 0
##$PSCAL= 0
##$PSIGN= 0
##$REVERSE= no
##$SF= 200.130013532006
##$SI= 16384
##$SIGF1= 3
##$SIGF2= 2
##$SINO= 400
##$SIOLD= 16384
##$SREGLST= <1H.CDCl3>
##$SSB= 0
##$STSI= 0
##$STSR= 0
##$SW_p= 3612.71676300578
##$SYMM= 0
##$S_DEV= 0
##$TDeff= 0
##$TDoff= 0
##$TI= <>
##$TILT= no
##$TM1= 0
##$TM2= 0
##$TOPLEV= 0
##$USERP1= <user>
##$USERP2= <user>
##$USERP3= <user>
##$USERP4= <user>
##$USERP5= <user>
##$WDW= 1
##$XDIM= 8192
##$YMAX_p= 0
##$YMIN_p= 0
$$ End of Bruker specific parameters
$$ ---------------------------------
##NTUPLES= NMR FID
##VAR_NAME=  TIME,          FID/REAL,        FID/IMAG
##SYMBOL=    X,             R,               I
##VAR_TYPE=  INDEPENDENT,   DEPENDENT,       DEPENDENT
##VAR_FORM=  AFFN,          ASDF,            ASDF
##VAR_DIM=   8192,          8192,            8192
##UNITS=     SECONDS,       ARBITRARY UNITS, ARBITRARY UNITS
##FACTOR=    0.0002004,     1,               1
##FIRST=     0,             0,               0
##LAST=      1.6414764,     0,               0
##MIN=       0,             -339207,         0
##MAX=       1.6414764,     236589,          0
$$ Real data points
##PAGE= N=1
##DATA TABLE= (X++(R..R)), XYDATA
$$ [...]
1984a82M49J183n9j443j041N09J310n8q97j139N41M93m48j101M65J415N90j079
2002d92o34K34J341J43p47m36R75J884l48j879p61M49J960K20j308j000M63Q21
2020H85r63j257K99J253k57n81p95O63M69J54j302m30J883J343j89j530o18Q35
2038a38J254q1p86L0J104J56p12j293l65J236M94q85o97M89M86p48j054l35J170
2057f75J114n75q82N1R41L68m76r28J29K139N95n70j339n66J063M68n53j78L27
2076D53N56m22r64n21O32P38p81m25K00N98K41j147n53j04J697P60p38q17j25
2095g22Q14K71o10k22N57J085j6j014m38K41P37mo29j3P91M41j521q19J48J034
2115A11N76q03q33K58J024J87j194q81M13J695K19p80j013P49N10j00k55J80P05
$$ plain form
1984 -182 267 1450 1391 -52 -1093 -584 726 668 -229 -1368 -827 -334 -782 -1883 -1418 -3 587 -492
2002 -492 -1126 -892 449 592 -155 -591 384 2268 1920 41 -720 -271 1689 1909 601 -399 64 885
2020 885 -78 -1335 -1036 217 -40 -621 -1416 -753 -284 -130 -1432 -1862 21 1364 1175 -355 -973 -138
2038 -138 1116 1035 249 279 1383 1539 827 -466 -831 405 899 14 -683 -194 292 -456 -1510 -1845 -675
2057 -675 439 -136 -1018 -967 -26 342 -134 -1062 -933 1206 1801 1231 -108 -674 389 857 304 126 453
2076 453 1009 587 -377 -898 -266 472 -309 -734 -534 64 305 -842 -1395 -1499 198 958 220 -597 -722
2095 -722 92 363 -247 -469 88 1173 1157 143 -295 -54 683 679 50 37 828 1269 -252 -1071 -923 111
2115 111 687 -116 -949 -691 333 520 -674 -1555 -1142 553 772 -8 -1021 -272 238 138 -117 63 768
2134G68M73m79q11J40P72M70q98o72L0R04K88j597j130J016J186J50r48o34L91
2153e81N03j31j000J68J071P56j17j070K50R81n56l06j32R04J106p38j335o26
2171h53P14J033j81j115n10J017N27l51j327n81Q47Q06j96n09L96J76K06n93m94
2190i88J396O24j0j067l34Q76N17m50q70j96J108Q23o71j203q45J095N44k69p89
2209g09N82K27Rq10m66N96O87J95q09K25K54M38p86l46L96R15O26n72o28l55P18
2230C87N61r01m45J26R54J73p74m65m03N94j84n8p4K88M80o93n23j45J058R69
2250I25p70q06j04J232M4l71q41P07J220K20j125o85R8R77j56p66j30O04O32m40
2270D65j274o8Q98j31l22m49O64O83k14j125m68M69J286L48m83o37K68O82M7p15
$$ plain form
2134 768 1241 762 -49 91 863 1333 435 -237 -207 697 985 -612 -1742 -726 460 610 -338 -972 -581
2153 -581 -78 -209 -1209 -1041 30 786 669 -401 -151 830 274 -32 -164 740 1846 1108 -227 -853
2171 -853 -139 894 713 -402 -912 105 632 281 -1046 -1627 -780 26 -170 -679 -283 -107 99 -494 -988
2190 -988 408 1032 1022 -45 -379 497 1014 564 -306 -502 606 1429 758 -445 -1290 -195 349 80 -709
2209 -709 -127 100 109 -701 -1167 -571 116 311 -498 -273 -19 419 -367 -713 -317 598 1224 652 24 -331 387
2230 387 948 47 -398 -272 682 855 81 -384 -787 -193 -377 -435 -509 -221 259 -434 -957 -1102 -44 925
2250 925 155 -651 -755 477 521 150 -691 16 1236 1456 331 -354 -256 721 565 -201 -331 273 905 465
2270 465 -809 -877 21 -110 -432 -881 -217 466 252 -873 -1341 -872 414 762 279 -358 -90 592 639 -76
2290g6J6O30J15R7r75k8O75K4p75O7J01Q41p8j317l48J48Q30K07n75n19M62J000
2312E22l45q97j42J273N11L16r31k76M35K31k60m54m6P46M54j215k87N08K86m73
2332d4p32J90R17M70o85j200k43P52J056n43p45K76N72M57m27o00P17M68K08n01
2352C63j31K66P4m82l39p6O99K49k01p98m87Q05L62n16o19K92N17L21q38n59K89
2373h09R31K91j16j15r9K97Rp25K25N08Q70l82q00lO62j00r22k27L1O98P50r39
2395C5j036K47O30P7o03j12O19j20K17l95m79R16M49j79k36N7N18J25o31k66L57
2416A90J148m90n87m08J76L33j29n19o35J013M67l80r10l28N26L69k13KK3N76
2436B24P5n92j27K27N45L1k43p8O19M6M9q50n74Q03O49p5o79o60N39n4q3j10j06
$$ plain form
2290 -76 -60 570 685 782 -193 -221 454 478 -297 -230 -129 712 634 -683 -1031 -883 -53 154 -421 -940 -478 522
2312 522 177 -720 -862 411 922 1238 307 31 466 697 437 -17 -63 683 1137 -78 -365 143 429 -44
2332 -44 -776 -586 331 801 116 -1084 -1327 -575 481 -62 -807 -531 41 498 71 -529 188 656 864 363
2352 363 232 498 572 90 -249 -325 374 623 422 -376 -863 -58 304 -212 -831 -539 -22 299 -539 -1098 -809
2373 -809 122 413 297 182 83 380 389 -336 -111 397 1267 885 85 82 744 644 -278 -505 -474 224 974 35
2395 35 -1001 -754 -124 -47 -650 -762 -143 -263 -46 -441 -920 -4 445 266 30 87 605 730 99 -167 190
2416 190 1338 848 261 -147 29 362 233 -286 -921 92 559 179 -731 -1059 -533 -164 -377 -375 -352 224
2436 224 299 -293 -420 -193 352 383 140 62 681 727 776 -74 -648 155 804 729 50 -610 -71 -125 -208 -318 -424
2459d24N14K99l46r28P5Q64K26n57l53R52M79l36q15k57Q02P13o66m66N76N27
2479H79Q0m36p88k08R29K15o30m49k3L19N4m94j78L49L70K2p57j51P37O10m77
2500b7o05M67P13N01p04q02K86R05L95n62n10J55J82j14l26P2L0j75J60o11L98
2521a72l32N1l18o4J79J075R6n76p60M56O62K44l90l73P96M25j18o39m93P62N10
2542A021n24o8l61N9L4o08l17J25L87M68m77o02K21J74L66n26K41N43M03q3l67
2563A09k43j0Q79j10j28pL5L24l21o72k44P15K00j72o77J01K87l72l59l64P44
2584b85N11K46j153L7M37M92l2o92R3N30O01m05l50j87L50K92ml49j92N60l54
2605A46n94p3L85M52O6p64L3L57L58p98k52j86P02N96l98p01J94P42L8m26QN75
$$ plain form
2459 -424 90 389 43 -885 -810 54 280 -277 -630 322 801 465 -350 -607 195 908 242 -224 352 879
2479 879 959 523 -265 -473 456 671 41 -408 -431 -112 -58 -552 -730 -381 -11 11 -746 -897 -160 450 -27
2500 -27 -632 -165 548 1049 345 -457 -171 734 1129 567 57 212 394 280 -46 26 56 -119 41 -570 -172
2521 -172 -504 -453 -771 -835 -656 419 515 -61 -821 -365 297 541 151 -222 574 999 881 242 -251 511 1021
2542 1021 497 429 68 127 161 -447 -764 -639 -252 216 -261 -863 -642 -468 -102 -628 -387 156 559 476 109
2563 109 -134 -144 735 625 497 490 525 849 528 -144 -388 327 527 355 -322 -221 66 -306 -665 -1029 -285
2584 -285 226 472 -681 -644 -207 285 253 -439 -346 184 785 380 30 -157 193 485 481 132 -60 500 146
2605 146 -448 -521 -136 316 382 -382 -349 8 366 -432 -684 -870 -168 428 30 -671 -477 265 303 -123 -115 460
2627D60K07o6o44n18M68Q34k61o06J11O17j97o88k77J29M38O54o84o96K97K68
2647a54n5l06l15K67N48K98o05n5K54K86r6l02K58P25L90p52j63l80P08R8k35
2668D14m71J67J57J20r52k81L86M63R4l14l37j30O81o24K61l53N59M69M2m68N74
2689D57J19j37j31m11N62J98K92p76p49O83L05m54k75k84N06N9mo30O5N63K60
2710B18l40j66R2L09k43j87P6K34N07J98m54k91Q29j81k72n25L98L92p0m40n02
2731d18RL13J89k65n59L73P78n76n05J31o1Q54k31l72J71M03J4J50m75k19O50
2752C54L72k10l55q3L29J26n17J13J3M5k04j56m86R2K97N4j34j6L39Q0k53k09
2774d09kO21M33m03m83R7L74L32l66m52K97M02M91p40k9r9L17m50j39J39K30L2
$$ plain form
2627 460 667 601 -43 -561 -93 741 480 -126 -15 602 405 -283 -560 -431 7 661 -23 -719 -422 -154
2647 -154 -209 -515 -830 -563 -15 283 -322 -377 -123 163 67 -235 23 748 1138 386 223 -157 551 649 414
2668 414 -57 110 267 387 -565 -846 -460 3 97 -217 -554 -684 -3 -627 -366 -719 -160 309 351 -117 457
2689 457 576 439 308 -103 459 657 949 173 -576 107 412 -42 -317 -601 -95 -36 -40 -670 -605 -42 218
2710 218 -122 -288 -196 113 -130 -317 -241 -7 500 698 244 -47 782 601 329 -196 202 594 524 84 -418
2731 -418 -409 -96 93 -172 -731 -358 420 -156 -661 -530 -591 263 32 -340 -169 234 248 398 -77 -296 354
2752 354 726 516 161 78 407 533 16 129 142 187 -17 -173 -659 -567 -270 -216 -350 -366 -27 53 -200 -409
2774 -409 -411 210 643 240 -243 -146 228 560 194 -258 39 441 932 192 163 64 381 -69 -208 -69 161 193
2796A93n00l86J43L47J52j68k79O51j48L98q50m20P58N08l8k31k01M73K44k90
2816C56k47k61K37L01n4k46m1L60k78l98j66L34L49m90l02l50N74L3j5P3j29O75
2838C15j42r7J06m04M94P8J2k79L32p4j5l03j33K42O69k03q04k01K34K43n5m44
2860d29l46O21L15n71k9j88L87M12Q7l25k78M13J17R8k26j09M48pL0l39L33Q5
2882D99n09j83Q1M16o1j20m79j32J54J46K0j57K7N05n8n09j13L02O0K16qJ76J26
2905C99J31l0q58M36j24O50l12q5k00M20k01j82l40L2M32J74p25k07Q4J78M31
2926A03o08M06j09K76R4m16K38J64L07k98m84L93M69k3m24l77K80L80K60k41m26
2947c6r6L57j04l00k88L29L43o00K38l41J77L20l96J08K45L45N7l87o41K74L60
$$ plain form
2796 193 -307 -693 -550 -203 -51 -219 -498 153 5 403 -447 -867 -109 399 361 130 -71 402 646 356
2816 356 109 -152 85 386 332 86 45 405 127 -271 -437 -103 246 -244 -546 -896 -322 -289 -304 -231 -360 315
2838 315 173 76 182 -222 272 350 362 83 415 341 326 23 -110 132 801 598 -206 -407 -173 70 15 -429
2860 -429 -775 -154 161 -410 -439 -627 -240 172 259 -66 -344 69 186 284 58 -51 397 390 420 81 414 499
2882 499 -10 -193 -112 304 243 123 -356 -488 -334 -188 -168 -325 -298 207 149 -360 -473 -171 -111 105 97 273 399
2905 399 530 500 -358 78 -46 604 292 207 7 427 226 44 -296 -264 168 342 -383 -590 -506 -328 103
2926 103 -505 -99 -208 68 162 -254 -16 148 455 157 -327 66 535 512 88 -289 -9 371 631 390 -36
2947 -36 -132 225 121 -179 -467 -138 205 -395 -157 -498 -321 -1 -397 -289 -44 301 358 -29 -670 -396 -36
2968c6L90l62j98M98K22m2m85j55M00J97k19j15k78Q7J77j86j26R1J31J61k64
2989a12k83L8L85N5m25J63L81K55l29k84k72L22N61R0k49j71j27L02n4m30J21
3010f3N8K75p2n78K48J56k70j67j90O86J17r8j73m93M97L77k27r5j10K14L97m55
3032C4j47P6J51M47m10L86l24o0K0o19K91J07J99l29j46l4K47J57m01k21Q8N04
3054A6O75n88o14K77N25J06j22K5Q5J76l0m40M7O6q6k81J23J4J91p1p09j27L87
3077c55N00j56R2m69K99K45j22k92k4J51L43j04j20j29M18J58n11L93J60p6q4
3098C17l05l55j42N37M17o63k93N35M26k89l32o10L91L59K35k50l45K76j02J00
3118i3J13l4J87l52K73r8N0N02n24J59k1M21m2l08l92j74M08N8J19m44l0K01j8
$$ plain form
2968 -36 354 -8 -206 292 514 472 -13 -168 232 429 210 95 -183 -96 81 -105 -231 -140 -9 152 -112
2989 -112 -395 -357 28 83 -342 -179 202 457 128 -156 -428 -106 455 545 296 125 -2 300 246 -184 -63
3010 -63 -5 270 198 -380 -132 24 -246 -413 -603 83 200 102 -71 -564 -67 310 83 -12 -122 92 489 34
3032 34 -113 -37 114 561 151 537 213 153 173 -446 -155 -48 151 -178 -324 -358 -111 46 -355 -576 -488 16
3054 16 691 103 -511 -234 291 397 275 300 385 561 531 91 138 204 118 -163 -40 -26 165 94 -615 -742 -355
3077 -355 145 -11 81 -388 -89 156 34 -258 -282 -131 212 108 -12 -141 277 435 -76 317 477 401 317
3098 317 12 -343 -485 52 469 -194 -487 48 474 185 -147 -757 -366 -7 228 -22 -367 -91 -193 -93
3118 -93 20 -14 173 -179 94 -4 46 548 24 183 162 583 541 233 -159 -333 75 133 252 -192 -222 -21 -39
3141c9J95l00r2n4M26j2l14K09R4l36K16J67l7J96J56o22K70J26K61l54n0q3L1
3164E4M79n39m97L66J47Q2L68j037N59k6k92k76M77r1M17r0k22k97M88K94n01
3185a37K33o7J54M85k42l06k85N52k95mj53N1m5K94m02k43M19m05M44l68RM43
3207A32l43o2P9oJ64M43l79k43N98Q7m04k8K83k26J01j01m9j37n1J14K0k65N2
3230b21M84k05k45j69j7M97l24j49J1L94rj45j28K19K0R1K24p6k87j1l5K61j22
3253E8K4J05J5j65l3J15j05l3j46J74L0J24l10o94K59L38L75j94k10J99j2K4o4
3276a26m6O0O06j41P4l97J41m8q9k43J70L23l3k8m13k94K45L88k44k01j1L16j20
3299a11K55k89n9r3N70l98J6Q1J04j01j44J29L12N0l56j78J72K86k1j24j52L78
$$ plain form
3141 -39 156 -144 -236 -290 136 124 -190 19 113 -223 -7 160 123 319 475 -147 123 249 510 156 106 23 54
3164 54 533 -6 -503 -137 10 92 460 -577 -18 -44 -336 -612 -135 -226 191 101 -121 -418 70 364 -137
3185 -137 96 29 183 668 426 120 -165 387 92 88 -65 -14 -59 235 -167 -410 9 -396 48 -320 -311 132
3207 132 -211 -273 -194 -200 -36 407 28 -215 383 470 66 38 321 95 196 95 46 -91 -142 -28 -8 -273 -221
3230 -221 263 58 -187 -356 -373 124 -200 -349 -338 56 47 -98 -226 -7 13 104 328 252 -35 -46 -81 180 58
3253 58 82 187 202 37 4 119 14 -19 -165 9 39 163 -147 -841 -582 -244 131 -63 -273 -74 -86 -62 -126
3276 -126 -172 -112 494 353 427 30 171 123 34 -209 -39 284 251 223 -190 -484 -239 149 -95 -296 -307 9 -111
3299 -111 144 -145 -204 -297 273 -125 -109 -28 76 -25 -169 -40 272 322 -34 -212 -40 246 225 101 -51 327
3321C27m45O00n59o08N58L20k68J06j31j93L11M8k45j0J10L1K53k62j6J38K14
3342B79m38L0L72q5J21k51O4l06L49l1k30k90K95K22r5j81l01J74K62LQ1k43L75
3365A76j52j70j17K90M6j42J14l20K92J50%o8m05K50M41r1m52k37L44%Q6j83j51
3388b99L58j74J41k45j62K69q4J77m0J34K11n2j20k83K65N56m3n05n7N2N14j96
3410D17m81J1J33l9K33m19j64J97j13or5M40p5M8k59r3K18N5Q0j56K17k9K62j05
3434B77m51J98K87M4n61L56N0k49L56j83l14L23k69kr5L18m06L1%K42j60J98K1
3457A1J02l37K13K28jk73R3K76r6J58m34J69r0Q4L29m33J50n1K11m8q75N27J50
3480F3Qj9j97J72j06k58L18j65O6J66J24j44o7j0K45k7j23q2qM37j07m16k13L42
$$ plain form
3321 327 -118 482 -77 -685 -127 193 -75 31 -100 -293 18 66 -179 -189 -79 -48 205 -57 -73 65 279
3342 279 -159 -129 243 158 279 28 92 -214 135 104 -126 -416 -121 101 6 -175 -476 -302 -40 -37 44 -199 176
3365 176 24 -146 -263 27 73 -69 45 -275 17 167 167 99 -306 -56 385 294 -158 -395 -51 -51 35 -148 -299
3388 -299 59 -115 26 -219 -381 -112 -196 -19 -59 75 286 234 114 -169 96 652 609 104 47 99 613 417
3410 417 -64 -53 80 41 274 -145 -309 -112 -225 -231 -326 114 39 87 -172 -265 -47 8 88 -68 149 120 382 277
3434 277 -174 24 311 355 -206 150 200 -49 307 124 -190 133 -136 -138 -233 85 -321 -290 -290 -48 -208 -10 11
3457 11 113 -224 -11 217 216 -57 36 312 216 374 -60 109 19 103 432 -1 149 98 309 261 -614 -87 63
3480 63 71 52 -145 27 -79 -337 -19 -184 -118 48 172 28 -39 -49 196 169 46 -36 -44 393 286 -130 -343 -1
3504aj31N2k6J59j25j22J2m5K75j62o1n0j45K66J17l60K80k28J52J98M0k86J67
3527b4K05M7j64j47N2K7K3J9mK7K30l13j58M5J38j7j25j5J22k46n2L46K7qJ2l52
3553c05K59K68l9j42P9j82O7K39J11j42k14NN5K11j35j65k79K6O2J73o2k04r2
3576d06L26L7l70O11k59K23K07o51K38M2L23k51Q4j23lJ90m20M41r2lN4p8m70
3599c50M9L81r2j79LK77J70m53J86p6k11J32K95k8j25J89k95N9j39M25kj14J63
3622B65l17M2L09k14k7j10L11j92j29K38k33rK66j39l09L34j58o1K67j04k47K86
3644F9O8n3j19Q9m1k5q1JL02j27k02P9J4K03J5m39K4K04n9L99k72j8J22l74P9
3669a42o3j87O84k92j76j9k74Q52m12J24M1j40J66qj34q1P3K1M52n35J28l5J5
$$ plain form
3504 -1 -132 -80 -106 53 -72 -194 -182 -227 48 -114 -175 -225 -370 -104 13 -347 -67 -295 -143 55 95 -191 -24
3527 -24 181 228 64 -83 -31 -4 19 38 34 61 291 -22 -180 -135 3 -14 -139 -154 -32 -278 -330 16 43 35 47 -305
3553 -305 -46 222 183 41 120 -62 5 244 355 213 -1 4 59 270 135 -30 -309 -283 -221 -48 -110 -314 -406
3576 -406 -80 -43 -413 198 -61 162 369 -282 -44 -2 321 70 154 31 28 218 -202 239 147 144 198 120 -350
3599 -350 -301 80 -12 -191 -188 89 259 -194 -8 -84 -295 -163 132 104 -21 168 -127 -68 -207 218 216 102 265
3622 265 -52 -10 299 85 58 -52 259 67 -62 176 -57 -66 200 61 -248 86 -72 -133 134 30 -217 69
3644 69 137 84 -35 54 13 -12 -93 -92 210 83 -119 -40 -26 177 192 -247 -223 -19 -78 321 49 31 153 -221 -142
3669 -142 -205 -392 292 0 -176 -195 -469 383 -29 95 136 -4 162 154 20 -61 12 33 485 -50 78 43 58
3692E8J15m2o3k12K93k98J26P2p7j46j82M09Q5j57k6r2K30K35l11j12K02j72K85
3715B20k58K06l63L11PJ78m16J34O2m18K03j34K85j83R8J27l40N0K80j73J02O1
3737C9k48N74k97M27l49j55K06j92J49k49L65m5l74O8j9K55j19m6j93Q9K18Qk68
3760a56l27J63M1R9N9KK32j19K8j09O5j44j34O92o89K72K97L43l16j81J37j16
3782A39q6K01k58o1J60K22k60n5k14jR8P3j72K59n5K56l84LJ53J65j61O4K25p6
3806B35J91j92n03L54r9K01j63K7N4J29k94J75m19N1J86J23q5Q4j52j08K41j21
3828h5K05L7l26K02o7J90J25k21p2n9J74J73l8J87m85K43j30kP8jR5k52j62K55
3852F4j66m1O0j87J33n4K15Jn05K86M12R2l41%J21k28L61k22j86K13K37N5m36
$$ plain form
3692 58 173 131 68 -144 149 -149 -23 49 -28 -174 -356 53 138 -19 -45 -137 93 328 17 -95 107 -65 220
3715 220 -38 168 -195 116 123 301 -115 19 81 -337 -134 -268 17 -166 -68 59 -281 -231 49 -124 -22 39
3737 39 -209 365 68 495 146 -9 197 5 154 -95 270 225 -149 -81 -100 155 36 -10 -203 -114 104 112 -156
3760 -156 -483 -320 -279 -180 -121 -119 113 -6 22 -87 -22 -166 -300 392 -297 -25 272 615 299 118 255 139
3782 139 53 254 -4 -65 95 317 57 2 -212 -213 -115 -42 -214 45 -10 246 -138 -135 18 183 22 86 311 235
3806 235 426 234 -269 85 -14 187 24 51 105 234 -60 115 -304 -253 -67 56 -29 55 -97 -205 36 -85
3828 -85 120 157 -169 33 -34 156 281 60 -12 -71 103 276 238 425 -60 183 53 51 129 128 223 -29 -191 64
3852 64 -102 -143 -83 -270 -137 -191 24 25 -480 -194 218 310 -31 -31 90 -138 223 1 -185 28 265 320 -116
3875a16O8k3R5j08J78l12O7J31j61O3j49J37K37k06j42J02M36l64K5R4p6j23K70
3898A23O8k39j14K09K62k63q5J58Q2k73p2o7J79k6p9K72j02J24l6j99j91p6K68
3921g7J1j03L64j27j15K83m10J31m2L33m6j24j06k5J52j7pk06J18Q2l84L62l21
3944b74K14r4K3k42L78q7K04j21N3J55MM9k3J31n03L10n8l04J48J77j13J6r0J82
3968A35q8n1j78J72o4j1K25k08j45o2J67K10j41M7P2l19J46j87J32Q2K58M5m33
3991a96K18q6L40k39j35K17J5N5k79N9J52k50M0R8j11J56l17j9p4J47J44p1K7
4014a09j5j01L93J26m46J06J50j97J54J2j44M1M3J80j62J17j62J20K9j94l9Q5
4036a3j64m8K37r9l7K91l36L40m66M7M43j69L78k26k15L7r6J97n0L1K61l54K68
$$ plain form
3875 -116 -48 -71 24 -84 94 -218 -151 -20 -181 -118 -267 -130 107 -99 -241 -139 297 -67 -42 52 -24 -147 123
3898 123 191 -48 -162 47 309 46 -39 119 201 -72 -144 -211 -32 -58 -137 135 33 157 121 -78 -269 -345 -77
3921 -77 -66 -169 195 68 -47 236 -174 -43 -85 248 202 78 -28 -53 99 82 75 -131 -13 69 -315 47 -274
3944 -274 -60 -154 -131 -373 5 -82 122 1 54 209 213 262 239 370 -133 177 119 -185 -37 140 27 43 -47 135
3968 135 47 -4 -182 -10 -74 -85 140 -68 -213 -275 -108 102 -39 8 80 -239 -93 -280 -148 -66 192 237 -196
3991 -196 22 -64 276 37 -98 119 134 189 -90 -31 121 -129 -89 9 -102 54 -263 -282 -356 -209 -65 -136 -109
4014 -109 -124 -225 168 294 -152 -46 104 -93 61 73 -71 -30 13 193 31 148 -14 106 135 -59 -98 -13
4036 -13 -177 -225 12 -87 -124 167 -169 171 -295 -248 195 26 404 178 -37 0 -96 101 51 82 343 -11 257
4059B57l39j69K65n1K2J60j18q3o0k22K80j22k29L51j92j15J16P7J41l0J28J8
4081H5J87k49l0Q7n9J81k41J75j47K6J42j43K33j69o1j87q1K99j75M1J02j06J7
4104g3J83k45k7K40J34n8j13j52K48J81l75m2N26m05J47l46L39j09m0O7k59L68
4126A89l32J38k60J91K05J56k35m1j50O8K84k01k98K6K09p1L79k25k48J96K32
4147B12j52j06L54j62J9k01K06k09K13p9m16K34L90l69K16m19R3L42l53K98k62
4168a51R9L4R5j82n0M41K9j79R4k58J05j58K22p6M7k62K12J75l48k40M04j20J08
4191D1r4K30O0l96N2j66J68K6N5j00J44l0K05jk29R9J5q8Q6J39j18M8O9j95L5
4216E5k48N2K18l85K61j6m5J26P6k60L2j04l4J85M2l1K32j57K49j69k6j00j03
$$ plain form
4059 257 -82 -251 14 -37 -15 145 27 -56 -116 -338 -58 -180 -409 -58 -250 -365 -249 -172 -31 -61 67 85
4081 85 272 23 -7 80 21 202 -39 136 -11 15 157 14 247 78 17 -170 -251 48 -127 -86 16 -90 -73
4104 -73 110 -135 -162 78 212 154 41 -111 137 318 -57 -99 427 22 169 -177 162 53 13 80 -179 189
4126 189 -143 -5 -265 -74 131 287 52 11 -139 -71 213 12 -286 -260 -51 -122 257 32 -216 -20 212
4147 212 60 -46 308 146 165 -36 170 -39 174 95 -321 -87 303 -66 150 -269 -176 166 -187 111 -151
4168 -151 -52 -18 77 -105 -155 286 315 136 230 -28 77 -81 141 65 112 -150 62 237 -111 -351 53 -67 41
4191 41 -53 177 237 -159 -107 -273 -105 -79 -24 -124 20 -10 195 194 -35 64 79 -9 77 216 98 146 215 20 55
4216 55 -193 -141 77 -308 -47 -63 -108 18 94 -166 -134 -238 -272 -87 -45 -76 156 -1 248 79 53 -47 -150
4239a50J51k14K92j52P8o7j17K69J84o0m1l18Jm34O73k75Q7j52M32j79j04L7j12
4262a71J47O3J0k2K57k27l75J94L44J7j30n0j12J65r8m28K47J85N1p3J05m83L60
4285b4r9j77O5L4M21j51o6J36n22L87k5k57M39j85L21k14k31K95k52n2L46k29
4307d0m1k6K01o4l7k16QL6Q2L36k55o2k26J28L69j76J0K15ql35M5m0J27Q4k06
4332i1L06n15L92k38J03L74l89j28L40j93m6O8J4m31L38K9J83l17K80j88K7j76
4354b58K93J27k12L9Q3K07k17k92L77q5qj38K33j55o2j37J15J11k62K60p2p5q2
4377b10j25M37k00J99j36p8J85K0l7J2k3J88k11j95N62L1j80j72K34k68m1J0p7
4400g5K70k42l18N06%k1j57K23l11K33L2j43J17j48K01j42J23n5J86j11J12m61
$$ plain form
4239 -150 1 -213 79 -73 5 -62 -179 90 274 214 173 -145 -144 -578 95 -180 -93 -245 187 8 -96 -59 -171
4262 -171 -24 39 49 27 284 57 -318 -124 220 237 107 57 -55 110 12 -416 -169 16 67 -6 99 -384 -24
4285 -24 -123 -300 -235 -201 220 69 3 139 -383 4 -21 -278 161 -24 297 83 -148 147 -105 -157 189 -40
4307 -40 -81 -107 94 30 -7 -223 -215 -179 -97 239 -16 -78 -304 -176 193 17 27 242 234 -101 -56 -96 31 115 -91
4332 -91 215 -300 92 -146 -43 331 -58 -186 154 -39 -85 -17 -3 -434 -96 -67 116 -201 79 -109 -82 -258
4354 -258 35 162 -50 -11 72 279 62 -230 147 62 54 -84 149 -6 -68 -205 -90 21 -241 19 -53 -128 -210
4377 -210 -335 102 -98 101 -35 -113 72 92 55 67 44 232 21 -174 388 419 239 67 301 33 -8 2 -75
4400 -75 195 -47 -365 141 141 120 -37 186 -125 108 140 -3 114 -34 167 25 148 93 279 168 280 -181
4422a81J33R1J61k28nL93k70K20l06p8L6M3q9L37m27Q0J22j10M0j95m5N64l09
4445b3N4J6j28l1j69K62J87q0r0L1q1J74M4l51L27k12K53p3j19j25j47K52l06
4468c35K08J77J06k73o3J77j79M06j55j54m0J48kJ1R5N7j81K06p2j50o2N7j96
4491b14M21j49j89L74m64J78L5l3q3o8J54k72K57N7on0k3J2o6k3j32M47j51M29
4515D41l66kj05j08K31l22J68L65M7p8l5o47N45j71O1o3j27K20r1o0K49l2n31
4538d11J03L76k21J60j48L13k00k00L40j72j4p6j2L3mL20j04J29j03l05J75J19
4560I8m74R1M20q2j89K69k09J08J35j88n4k15K88L04k40p5K11k3q0J29l17L0j11
4583a74K88n0P8j93n1K82k22j2M04l85p9P3L1j30L04j47J35l56J77R4k84K8J26
$$ plain form
4422 -181 -48 43 204 -24 -29 364 94 314 8 -70 -34 9 -80 257 -170 -90 32 -78 -38 -233 -278 286 -23
4445 -23 31 47 -81 -112 -281 -19 168 88 -2 29 -52 122 166 -185 142 -70 183 110 -9 -134 -281 -29 -335
4468 -335 -127 50 156 -117 -180 -3 -182 224 69 -85 -125 23 21 32 127 184 3 209 137 -13 -75 -18 -214
4491 -214 207 58 -131 243 -221 -43 -8 -41 -124 -192 -38 -310 -53 4 -2 -52 -75 -63 -129 -152 -284 163 12 441
4515 441 75 73 -32 -140 91 -231 -63 302 349 271 236 -411 134 -37 24 -39 -166 54 -37 -97 152 120 -411
4538 -411 -308 68 -153 7 -141 172 -28 -228 112 -60 -74 -150 -162 -129 -133 187 83 212 109 -196 -21 98
4560 98 -376 -285 135 53 -136 133 -76 32 167 -21 -75 -290 -2 302 62 -13 198 175 95 224 -93 -63 -174
4583 -174 114 64 142 -51 -102 180 -42 -54 350 -35 -114 -41 -10 -140 164 17 152 -204 -27 67 -217 -189 -63
4606f3J56Q2k01q2O2oL01p0J12q5j03j39K69j40Q0j65j41L5L6k95N10k53n6L6
4630a20K61j84j29l8N43j36m42L61k49PK61j10P5k6k83K44j0J78k83J1J48k90
4652b11L74J1O0l29J43J61k99L5k4O7m1r6L34k77K51k40L2J9k51K19k04J99J23
4675E6K0J80k26k32N2k3N9L35l51L27l31J89j23o8r7K50O8l35L61j83O0l91lL00
4699a06R5k04R6O0K23l02J61Q8k87j06L86l3J88l48N5j40J85j75J79j77K73l30
4721b19J72q3j81L41r2QM1k7j08o7L07j95L02K37m69L86k51j56K81l61L40j57
4743D9k7l0j01Lr7K37P5k14P8J23o8m2k50J71l2K06j2j49J5j00J88m8P0n6K76
4768B65k71j62K82r5j61N36m37Q0j13M18l71k53M45m77J12L59l7l76L50m21M01
$$ plain form
4606 -63 93 175 -26 -108 -46 -52 249 179 291 206 103 -36 233 93 173 8 -133 -98 -62 -357 153 -100 -156 -120
4630 -120 141 -43 -172 -210 333 197 -245 116 -133 -126 135 25 100 74 -209 35 25 203 -80 -69 79 -211
4652 -211 163 174 234 -95 48 209 -90 -55 -79 -12 -53 -149 185 -92 159 -81 -49 -30 -281 -62 -266 -67 56
4675 56 76 256 30 -202 -150 -173 -114 221 -130 197 -134 55 -68 -136 -233 17 85 -250 111 -72 -12 -403 -406 -106
4699 -106 -11 -215 -119 -59 164 -138 23 111 -176 -282 104 71 259 -89 -34 -174 11 -164 15 -162 111 -219
4721 -219 -47 -130 -311 30 -62 -54 -13 -40 -148 -215 92 -103 199 436 -33 353 102 -54 227 -134 206 49
4743 49 22 -8 -109 -106 -203 34 109 -105 -27 96 28 -14 -264 -93 -125 81 69 -80 -65 -165 23 -25 45 -11 265
4768 265 -6 -168 114 19 -142 394 -43 37 -76 342 -29 -282 163 -314 -202 157 120 -256 94 -327 74
4789G4k67P4q4K26Q2r1J06j32l6K26l5o4j99J08l04P62k86k27J31k81J81n9M3
4812e2K74l06J46l53K94j9N1m98M49K6q9L9l90M58N6n3o4j39L00%j50p3Lj07M09
4837B12o0p3k62L65K5j43l6J21l27J59j12j51L13j35L06l90L03k30K72j16j9R2
4859A14J06j02rl04J99J92j29J41mq4j57mlL33pl92Q6M3j54j36K12J72k08n0K31
4884H6J51j95k0r3p8K04q8J4k28L84p2j75j07O5K30P9n2o0J34m20L77l26j19L06
4908cj44J82J60N4m37K85j84M36k60l2j60j10M47k49j87K41M6J1k37j37J97K44
4930A63k78K06Q5j89K2j96K45m02K28J54j35O4k41J07J51k13L37l05K17n4K33
4951A99j7l50K22k82L12m21O36j29o6j2j2j58K79n08j4K68J61j10J71j13k13j48
$$ plain form
4789 74 -193 -119 -203 23 105 14 120 -12 -48 178 143 79 -120 -12 -316 446 160 -67 64 -217 -36 -95 -52
4812 -52 222 -84 62 -291 3 -16 35 -463 -14 12 -77 -38 -428 30 86 33 -31 -170 130 130 -20 -93 -90 -197 212
4837 212 152 79 -183 182 207 64 28 149 -178 -19 -131 -282 31 -104 202 -188 115 -115 157 41 22 114
4859 114 220 118 109 -195 4 196 67 208 204 120 -37 -41 -44 289 282 -110 -24 19 -135 -271 -59 113 -95 -145 86
4884 86 237 42 22 -71 -149 55 -33 -19 -247 137 65 -110 -217 -152 78 157 105 45 179 -241 136 -190 -309 -3
4908 -3 -147 35 195 249 -188 97 -87 349 89 57 -103 -213 234 -15 -202 39 85 96 -141 -278 -81 163
4930 163 -115 91 176 -13 9 -187 58 -344 -116 38 -97 -33 -274 -167 -16 -229 108 -197 20 -34 199
4951 199 182 -168 54 -228 84 -337 299 170 104 92 80 -78 201 -307 -321 -53 108 -2 169 56 -157 -305
4973c05K91l8J74q2o4k7Q1l8K3m4j21J88j66L87J6k88J9j71P6J41P6j87J72l27
4997b14J13J67j64k37M56n0k8J21l67K31n0R4L9j43n8J2J17m1R3M1l87N10j96
5020E9j31L2M8L8k81J17J40M6j4L3j28j41O0o4k32K80P1O1R2m16P6L75l83J29
5044a33J42K55j52J34m04L73j96L15n42K32k2j04J62k50M7j18J77J64J34k27K75
5065B62n35L60K8k3j33J75j50K39k89l0J17l8J16j09qj47J28p3r2K01O3l6j45
5088a19l6L08k24J7o5j11J62J00J33j45j9l27L93j47j7K60r7k7R3q4J04j44J1
5111A9l7M69l73ok51J67l5J47M2J43j14r4J8j37J28k95K20j81J99J41j97J00r1
5134a8J88l36k27N57J59k99l07M43l61K80j66O7O6K5m8k61L12k88R5O0q0n3L56
$$ plain form
4973 -305 -14 -52 122 40 -24 -51 30 -8 15 -29 -150 38 -128 259 275 -13 6 -165 -89 52 128 -59 113 -214
4997 -214 -101 66 -98 -335 121 71 43 164 -203 28 -22 72 111 -32 -90 -78 39 -2 91 132 -255 255 59
5020 59 -72 -40 8 46 -235 -118 22 68 54 87 -41 -182 -122 -186 -418 -138 -67 -6 86 -330 -254 121 -262 -133
5044 -133 9 264 112 246 -158 215 19 334 -208 24 2 -102 60 -190 -143 -261 -84 80 214 -13 262
5065 262 -273 87 115 92 -41 134 -16 223 -66 -96 21 -17 99 -10 -18 -165 -37 -110 -202 -1 62 26 -119
5088 -119 -155 153 -71 -54 -119 -230 -68 32 165 20 1 -326 67 -80 -97 163 66 39 132 48 152 8 19
5111 19 -18 451 78 72 -179 -12 -47 100 142 285 171 77 95 -42 86 -209 11 -170 29 170 -27 73 -18
5134 -18 170 -166 -393 164 323 24 -283 160 -201 79 -87 -20 46 71 23 -238 74 -214 -119 -59 -139 -192 164
5157A64J82n44L25Mn3j44l02L53Q0P1k17n8K91K2q5j93j62K54J38k1r2J4L12o80
5181c41L13k46L59j44J6L29q5k6l42M41k76R5j62J88l80L77J12k02L60l30Ok63
5203b01O8J16J97j14k06J76n0L17o83M80j26K3J5r7M3J31j1j38l9J84N2o0j84
5226a07K1M34k89K8P8n9l29M85j91j24j35l7O5K76k8j85r2K32K0j58N4m4k37J18
5250b04J14k1J56l85L39k40O01j03k56J08k66K59o3p2J41j43j85J20K76k42K7
5271c9J91n10L00K11l4Lq3K14j25N1j95k57J64j9J88l38L71j93J57J89l54R0K79
5294B61q6R8j90k7K04j83j34M3p0K71J4k69n5qJ48j41J95j01M2L3q9J43Q8k67
5318h0j7J69j76l83N08o5l4J57p0J77j60k90K36mJ8k32L10j9j44R2j89L42k93
$$ plain form
5157 164 346 -198 127 131 78 -66 -368 -15 65 136 -81 -139 152 174 89 -104 -266 -12 126 105 13 27 339 -341
5181 -341 -28 -274 85 -59 -43 286 201 175 -167 274 -2 93 -69 119 -261 116 228 26 386 56 62 -201
5203 -201 -133 -17 180 66 -140 36 -14 303 -380 100 -26 -3 12 -85 -42 89 78 -60 -99 85 137 77 -107
5226 -107 -86 348 59 87 165 106 -223 262 71 -53 -188 -225 -160 116 88 -97 -189 43 63 -95 -41 -85 -322 -204
5250 -204 -90 -111 45 -340 -1 -241 360 257 1 109 -157 102 39 -33 108 -35 -220 -100 176 -66 -39
5271 -39 152 -358 -58 153 119 122 39 253 128 179 -16 -273 -109 -128 60 -278 93 -100 57 246 -108 -18 261
5294 261 175 273 83 56 260 77 -57 -14 -84 187 201 -68 -123 -131 17 -124 71 -30 12 45 -44 99 187 -80
5318 -80 -97 72 -104 -487 21 -44 -78 79 9 186 26 -264 -28 -32 -14 -246 64 45 -99 -7 -196 146 -147
5341a47Q4k39M66j82L35m14J69Pr5K13j10j87J59k7o3O2j78L06k15K37k10J09
5363H0K99k83J45j41k81QK75k21K30m19J71j2q1L93j70k03J08Q8P8qJ0l69M55
5386A52n1J0j00L34l85J42k70L47M7l5o7m56L16J70l84j37K35J09Jj16K83k18
5408g3j99K76R9J85j76j85j25K45J53n2Q0k76K11l53L88j94o7k80L58l6l13J1
5430c23M63q3k20q4M8J08J9K60k43J34k83NN29k00q7J13l11J80Moj7m7K20l93
5454b14J01J80k02l2L72k59k00K16J38k8k51m6K45p3J19o6O0P2Q9l69K21j30J92
5477A35j23P6m54L02q2K98k01j10k7J59L63k55j60M65j82k46j15K08k9Q5k51L38
5499A94j46P7k13l04K59O1o3J74J64j60k7j7J48j45K64o8K37m90J35R5l11L30
$$ plain form
5341 -147 -63 -302 164 -18 317 -97 72 79 -16 197 87 -100 59 32 -31 31 -147 159 -56 181 -29 80
5363 80 379 96 241 100 -181 -173 102 -119 111 -308 -137 -149 -230 163 -7 -210 -102 -14 64 56 66 -303 152
5386 152 101 111 11 345 -40 102 -168 179 226 191 124 -332 -16 154 -230 -367 -132 -23 -22 -138 145 -73
5408 -73 -272 4 103 288 112 -73 -198 47 200 148 228 -48 163 -190 198 4 -63 -343 15 -21 -334 -323
5430 -323 140 57 -163 -247 -199 -91 -72 188 -55 79 -204 -199 330 130 43 156 -155 25 29 23 6 -41 179 -214
5454 -214 -113 67 -135 -167 205 -54 -254 -38 100 72 -179 -225 20 -53 66 0 60 132 221 -148 73 -57 135
5477 135 12 88 -366 -64 -146 152 -49 -159 -186 -27 336 81 -79 386 204 -42 -157 51 22 107 -144 194
5499 194 48 125 -88 -392 -133 -72 -135 39 203 43 16 -1 147 2 266 198 435 -55 80 175 -136 194
5521A94m42J9K62j14J05k49K17k66J43l8K26l7j38J31L30k96j98K00J95k43n2
5542e1j14L05m9k50M41m83K03k38L32n0j75K48j99QR9j62j28M52l03P6j4N8J41
5565A47j92q4L83m31N25l61J34J14m65L37j58N9r6K17K30m02N9J19k96j7J21N
5587e2J70l77J78J86l84L16r7J0j37RR8j1J54j8K09j12l47K46R7j59J08j60J17
5610D4J22k9L8J15m34O8J10jk58L77O6k44J38r5J2l06K57q7M6j63J89J59P3k02
5634ej21P4mo8M04l02J36j66k52K21j6K92k33o1L74m00l7M4k36J75p9L04r3o3
5658a12j8M15j73k95N4J48L6Q8K7p1k60N1J99k59L13k90J55k01L33l10L25p8j11
5681c4Q1j77J62l8k46P7L04N8k23rJ74o6j2J69k19J29k79R4L69k18j97O0J28j16
$$ plain form
5521 194 -248 -229 33 -81 24 -225 -8 -274 -131 -169 57 20 -118 13 343 47 -151 49 244 1 -51
5542 -51 -165 140 91 -159 282 -201 2 -236 96 46 -129 119 -80 -72 27 -135 -263 189 -114 -38 -52 6 147
5565 147 -45 -129 254 -177 348 -13 121 235 -230 107 -51 8 -88 129 359 -43 16 135 -161 -178 -57 -52
5587 -52 118 -259 -81 105 -279 37 -60 -50 -187 -178 -80 -91 63 45 254 142 -205 41 138 -21 87 -73 44
5610 44 166 137 175 290 -144 -76 34 33 -225 152 218 -26 112 17 29 -277 -20 -107 -61 -224 -35 124 197 -5
5634 -5 -126 -52 -56 -124 280 -22 114 -52 -304 -83 -99 193 -40 -101 273 -127 -164 -120 -356 -181 -260 44 -49 -112
5658 -112 -130 285 112 -183 -129 19 55 143 170 99 -161 -110 89 -170 143 -147 8 -193 140 -170 155 77 -34
5681 -34 47 -130 32 -6 -252 -175 129 187 -36 -45 129 63 51 220 1 130 -149 -55 314 96 -101 -41 87 -29
5705b9J36k07p8P8%l46M22K09j02j89p4J49lj55K68j40M3j11m1m3o5K39K32k53
5729f0K00j02j66J34K76m37l7L78l51L66q7m9j19L2l5n9r4K94j77K82j11J2R8
5752A88m7m43L03m0J90o8l3L3j88L36j94k29M81l62NK05k42K64o5k10P6q3O1J4
5776d8J10J0r1K80j86J19m50J14Q0j83O7R0K98l37k4O0k22O43j71k08J59k87K55
5799G8k66M83m54N8O3l1j89R0J33K50N6l75K52l19J49j1Lj06J66l32K98J59J10
5822B65k62l08M06j84J77Jj4k61K65j44L64j88%k05n1K52k42J72m9k5J33n3O9
5845A18k02J52j78N2j19L90n6n7J79j47r1q6J98j73j17M37k17k27P9J79P3j00
5867H7j16M7J23j34M7K37m75q9K44J36j46K3kl9L72m07m7J93j5r4j53L06m4k24
$$ plain form
5705 -29 107 -100 -178 -100 -100 -446 -24 185 83 -106 -180 -31 -34 -189 79 -61 -18 -129 -170 -213 -278 -39 193 -60
5729 -60 140 38 -128 6 282 -155 -192 186 -165 201 114 65 -54 -22 -57 -116 -210 84 -93 189 78 90 188
5752 188 141 -302 1 -39 151 83 50 83 -105 231 37 -192 289 -73 -68 137 -105 159 94 -116 -40 -123 -62 -48
5776 -48 62 72 -19 261 75 194 -256 -142 -62 -245 -178 -88 210 -127 -151 -91 -313 330 159 -49 110 -177 78
5799 78 -188 295 -159 -101 -38 -69 -258 -168 -35 215 271 -104 148 -171 -22 -33 -30 -136 30 -302 -4 155 265
5822 265 3 -305 101 -83 94 95 81 -180 85 -59 305 117 117 -88 -139 113 -129 43 -6 -31 102 49 118
5845 118 -84 68 -110 -58 -177 213 157 100 279 132 41 -45 153 -20 -137 300 83 -144 -65 114 187 87
5867 87 -29 18 141 7 54 291 -184 -273 -29 107 -39 -16 -18 -57 315 -92 -139 54 39 -55 -208 98 54 -170
5891a70LM4J9j2N5N5P5j21P5O9l61K3L02k50K99Ll53J73J17j25K8M54n17l4L45
5916A96m07J16l8J64j7k4q6R9j99J37R7p6j11j0M71n29O3L9j91K37M2n8N26l04
5940A37N0l28j16K75j1J91j86p0K29j26K14j53k26K09o1r9m6N2r5M7j02L98q0
5963A03j51m9J9j02m6K30K0J39j17Q8j26J22J9J21k03Q1n2NL26m07Mj32J62j91
5987a37K58l17O13m07m4l84M7L84M0K15l38J62%k08LL31km17O8l1nK13k54J03
6011a07j3Q4k44L67N9o9j34k5J44Lqk04K44Pl4q0l58M83k63M14j49J5k96L7o7
6036a94L33j1k18n6L93l25J18L9k57K32m8o2L11O9J08K1m41J19n26L21Q1j74O6
6059a01K43m64L08RK01Mp2j72J22j51m3J06jJ56q5k15k16M1K74J44k79M15l29
$$ plain form
5891 -170 -167 -123 -104 -116 -61 -6 69 -52 23 92 -269 -246 56 -194 105 108 -245 -72 45 -80 -52 402 -115 -149 196
5916 196 -211 -95 -133 31 14 -10 -96 3 -196 -59 38 -38 -149 -159 312 -217 -154 -115 -306 -69 -27 -85 441 137
5940 137 187 -141 -257 18 7 198 12 -58 171 45 259 106 -120 89 28 -71 -117 -65 -160 -113 -215 183 103
5963 103 -48 -97 -78 -180 -226 4 24 163 46 134 8 130 149 270 67 148 96 101 427 20 24 -108 54 -137
5987 -137 121 -196 417 10 -34 -418 -371 13 53 268 -70 92 92 -116 -113 218 216 -201 -133 -164 -169 44 -210 -107
6011 -107 -120 -36 -280 87 146 77 -57 -82 62 65 57 -147 97 104 70 -10 -368 115 -148 266 117 132 -164 -127 -194
6036 -194 139 128 -90 -146 247 -78 40 79 -178 54 6 -56 255 324 432 453 12 131 -395 -74 7 -167 -101
6059 -101 142 -322 -14 -5 196 200 128 -44 78 -73 -116 -10 -11 145 60 -155 -371 -330 -56 88 -191 224 -105
6082a05J74k87M22K5k81L58k29j35N9j70J75l0j18K20N0J97l39Q9j88J37l71N81
6104B34l30J91J12NM9l31j78N45k41k72J27K16o43N01m3J40J33J80l16j09Q5L11
6126C66l15j04j30J70J23o3p7M45n88K23J88K4m84J17k32L08j35K92j33r3p1L9
6148a30M9m6Mp0M31l85J32l9L7K8k5P1l70P27o13J74j63L20k79K92j45l5j77O5
6172a47J44L8J4k68J46q8K6L45k26J12N5k0K10m43J98L95l47K4P1k72K22k05j87
6195b03J84K02m55J98P6k46R5p0m4J79J1K59j73q3n3J52N3k95J33o1M43j31j54
6218A7K03m11L27j28r2K32j35l18L01j17J95j93J50J51r7N7k37k14R2L12r2j9
6240a6j78K62r7k7p6M29J2l33QK34K0m02L14o3j97K69j26k41j09M59o4n6L9J02
$$ plain form
6082 -105 69 -218 204 229 -52 306 77 -58 1 -169 6 -24 -142 78 128 325 -14 75 -113 24 -347 234
6104 234 -96 95 207 212 261 -70 -248 297 56 -216 -89 127 -516 -15 -58 82 215 395 79 -30 55 366
6126 366 51 -53 -183 -13 110 47 -30 415 -173 50 238 262 -222 -105 -337 -29 -164 128 -5 -98 -169 -130
6148 -130 -81 -127 -123 -193 238 -147 -15 -54 -17 11 -14 57 -313 414 -199 -25 -188 132 -147 145 0 -35 -212 -147
6172 -147 -3 35 49 -219 -73 -161 -135 210 -16 96 151 131 341 -102 96 491 144 168 239 -33 189 -16 -203
6195 -203 -19 183 -272 -74 2 -244 -149 -219 -263 -84 -73 186 13 -70 -123 29 82 -213 -80 -141 302 171 17
6218 17 220 -191 136 8 -84 148 13 -305 -4 -121 74 -119 31 182 85 142 -95 -309 -217 95 3 -16
6240 -16 -194 68 -29 -56 -132 297 309 -24 -16 218 238 -164 150 87 -110 159 33 -208 -317 142 78 22 61 163
6264A63l34J22l1j90K1K50j22L35K3k06M71q10K21J16J8l9J5j09J5J23j3k82J75
6287f8K81J6j60o3l6j5L05J17m54J08O4k49r2P7J53n6J01j24J3J30J12l68L83
6310A75j93j4J32k02L31j85j24J42j52K81l55O5J16k10K47k10K56k36J16k49l
6331b72L34K0k16J6q9O7O0j23K23n8J59R9j77j31N6R0Qk80L24Q5J3q4q7K06k86
6356d3K7J96j50N1k57N6M29l27J07r6PP8k81K46jk43j17L25J6j11J20k37J60j16
6380a61M24k85j2L0j20j1p0J44K28n3lk03k7M65l64l17K01qR2J18q4P0Mo57O31
6405C2M5J00j43k18J01J76j83LN02o11L64j55p3j15Q5Q4M3m8k6l11M76K1k75R5
6429c1J92J3j54P2j56J5n0J70j40l3j22K21m9K48jj41j61j38M36k72K87k95j43
$$ plain form
6264 163 -171 -49 -80 -270 -249 1 -121 214 237 31 502 -308 -87 29 47 8 23 -86 -71 52 39 -243 -68
6287 -68 213 229 69 6 -30 -45 260 377 -77 31 95 -154 -246 -169 -16 -72 29 -95 -82 48 160 -208 175
6310 175 -18 -32 100 -102 229 44 -80 62 -90 191 -164 -99 17 -193 54 -156 100 -136 -20 -269 -272
6331 -272 62 82 -134 -118 -207 -140 -80 -203 20 -38 121 220 43 -88 -32 58 66 -214 110 195 208 124 37 243 -43
6356 -43 -16 180 30 81 -176 -120 309 -18 89 -7 0 78 -203 43 42 -201 -318 7 23 -88 32 -205 -45 -161
6380 -161 263 -22 -34 -4 -124 -135 -205 -61 167 114 111 -92 -119 346 -18 -335 -134 -142 -50 68 -16 54 58 -599 32
6405 32 77 177 34 -184 -83 93 -90 -87 415 -196 168 13 -60 -175 -90 -6 37 -11 -37 -348 128 149 -126 -31
6429 -31 161 174 20 92 -64 -49 -99 71 -69 -102 -224 -3 -52 196 195 54 -107 -245 191 -81 206 -89 -232
6452b32K88j53L3K60k07J08k07K16j83j4K9j5K18n6j55L53m3l60N4J38R1m36M67
6475A94j20j54K32l31R1J58j10P5rK62n58J12K06M1J0m7j7N0J54j96k7l83M16
6498D9P5k75J11P1Q2j34r2L46j80j3k1j19jl5m2J8P8j88J63L72m00K92m39N44
6522B62R2k80j19Nn9LL62m89J97j75M52l58K36p5k86M12m06L97m4l66J02mK33
6545I2k34O4l3N49k09K4p2m31K14K3J43l09l7K00n2o9K91l31N1L25J05k11J8Q0
6569A91j79J08k24J89j42K03j77k5L97n29L5k86J95K04L50j18j27q0J03j21r0
6590a23J39m3J87l17J40J03j60K42j5O7M4k30N9J5j96n7J92ro4l16M86m61J29
6613a88K18p7j23lJ68j66J49J97n92O46k1j06P4K07k89K4k32J46J07l24L07l25
$$ plain form
6452 -232 56 -97 -64 196 -11 97 -110 106 -77 -91 -62 -77 141 85 -70 283 240 -120 -66 72 163 -273 194
6475 194 74 -80 152 -179 -88 70 -40 35 26 288 -270 -158 48 89 99 52 35 85 239 43 16 -367 49
6498 49 124 -151 -40 31 113 -21 -113 233 53 40 19 -100 -101 -136 -178 -160 -82 -270 -107 265 -135 157 -282 262
6522 262 354 74 -45 -40 -99 -96 266 -223 -26 -201 251 -107 129 54 -232 180 -226 171 127 -239 -137 -141 92
6545 92 -142 -78 -111 438 229 253 181 -250 -36 -13 130 -179 -216 -16 -68 -137 154 -177 -126 199 304 93 111 191
6569 191 12 120 -104 85 -57 146 -31 -56 341 -188 -153 -439 -244 -40 310 192 65 -15 88 -33 -123
6590 -123 16 -27 160 -157 -17 86 -74 168 153 220 264 34 93 108 -88 -145 47 38 -26 -342 144 -317 -188
6613 -188 30 -47 -170 -173 -5 -171 -22 175 -417 229 208 102 176 383 94 118 -114 32 139 -185 122 -203
6635b03J67K1j27R4Q8q0j10k1J73J7j43j43M08J69j52l4K05k91j25L2L7M8j43
6658a13J39K81l93K33J5J23j00j07k55K45j95L18j99j67L49k74J64j63J29k39
6678b09J08q9L91J40m23J44J55o21N12P8J00k76J66j72K4j58L51l38l8L3M0J01
6700A9K03l33J1j46K24j54N5R0K61j64k60M19j39N5m50N4L45k6l76J80K04r2k26
6723b46J42j03J68j09j88L51N3j43j24j65L78j44m8J19J10q2J26k33L80l83K90
6744A49J0j07q2Rkk4J0m0K36k33M85n19L0J07k02jnJ36Q5J5j9k89k08N56j00p2
6770g5J14K5j31K59j33p7Q1j78K62l79k8N28k63J63j98J05j20k33K26J02l34J99
6792h5J32l68J09l0L45k31K76O2q9j71j97J76K15j98K5k7L48k79n8O6J05J25j23
$$ plain form
6635 -203 -36 -15 -142 -48 40 -40 -150 -171 2 19 -124 -267 141 310 158 124 329 38 -87 -55 -18 30 -113
6658 -113 26 307 -86 147 162 285 185 78 -177 68 -127 191 -8 -175 174 -100 64 -99 30 -209
6678 -209 -101 -190 201 341 -82 62 217 -404 108 186 286 10 176 4 28 -130 221 -117 -155 -122 -82 19
6700 19 222 -111 -100 -246 -22 -176 -121 -31 230 66 -194 225 86 141 -309 -255 90 64 -312 -132 72 -20 -246
6723 -246 -104 -207 -39 -148 -336 15 68 -75 -199 -364 14 -130 -178 -59 51 -31 95 -138 242 -141 149
6744 149 159 52 -30 -21 -23 -47 -37 -77 159 -74 411 -108 -78 29 -173 -174 -179 -43 42 57 38 -251 -459 97 -3 -75
6770 -75 39 64 -67 192 59 -18 63 -115 147 -232 -260 268 5 168 -30 75 -45 -278 -52 50 -284 -85
6792 -85 47 -321 -212 -242 103 -128 148 210 121 -50 -247 -71 144 -54 -29 -56 292 13 -45 21 126 251 128
6815A28N2l32M40k46Q9J69n37O7M20k85J34k04J66l35J71J16M6k01m4P1q0K33
6837C8J12l04J04K33K6m6j21p8K24k81K54j44q9K11J8l00PK22j05J39l14L13j31
6860a2k76L04j3j75Or3O25l21K6o0k8J60j87J59q0J50r1j03K35l21K72O0k22L37
6884C52n93P2J76j55K69k32rj14K52k30J87P9r8J97J7j23r3R0j41K6L85m16L27
6907B25l28p3K31m2J78l83J09l7K95j99j8J12j23J94K8j21mJ73M2k68j0JQ4l9
6931B7J87j69Qp6J66l25J63j07N7j5l2J93k82K4K02M3O2l08L6K50l4p2j52J44
6955a0J50n6j80R0O2l4k24k6J15K24j38L37j66j05m0n9k57M09l06L00j13l40M31
6978F4j19r4M44k56K71k18j85K2J68o2J00k25O1P5J16J51m56M08m32M0K73l56
$$ plain form
6815 128 180 -152 288 42 131 300 -237 -170 250 -35 99 -105 61 -274 -103 13 59 -142 -186 -115 -195 38
6837 38 150 -154 -50 183 209 163 42 -36 188 -93 161 17 -72 139 157 -143 -136 86 -19 120 -194 119 -12
6860 -12 -288 16 3 -172 -166 -259 366 45 71 11 -17 143 -44 115 35 185 94 -9 226 -95 177 237 15 352
6884 352 -241 -169 7 -148 121 -111 -120 -234 18 -212 -25 54 -44 153 170 47 -46 44 -97 -71 314 -102 225
6907 225 -103 -176 55 13 191 -192 -83 -120 175 -24 -42 70 -53 141 169 48 44 217 259 -9 -19 -18 66 27
6931 27 214 45 53 -23 143 -182 -19 -126 -69 -84 -116 77 -205 -181 21 64 126 -182 -146 104 70 -2 -154 -10
6955 -10 140 84 -96 -6 56 22 -202 -228 -113 111 -27 310 144 39 -1 -60 -317 92 -214 86 -27 -367 64
6978 64 -55 -149 295 39 310 92 -93 -71 97 35 135 -90 -29 46 162 313 -143 265 -167 -127 146 -210
7000b10J97k07L72P3k26K98l56N3K3k44Q2j16M27K05q1o9j02k10j50K03J40k66
7022a64M78m80J52L80p71M71j9j87qJ93p6J49j28K34l44J55k15j51J25Q8J91O2
7044A35j75r2j3L16J37k05J02k56r0K18k05j5K96l68L08j58N6L8O2j20j06J85
7066E0p9k05J55j45K46l0N9J23j71k39O4J14j91L93m37K19n2L52m03L02q5j37
7088i7J14J46k72Q2L6J5r8J16p6j76K95l28M35n7q1P4j05j09j83K51rK94k24l69
7112c26N68j10L2k44R2j71J54k59L60j20n3N9R0m22J00M28m06R1k27K97j31K65
7134F7mN7m9j54L44k73j04K07j6Jj34K41l06J84p1jp2J23j25L15k64P0R5l45M57
7159B43l88K00l73K43L8J75J36k04M6j28j20K72j33K84k45k7M8l22K69J3j28o8
$$ plain form
7000 -210 -13 -220 152 225 -1 297 -59 -6 17 -227 -145 -261 166 371 290 221 119 -91 -241 -38 102 -164
7022 -164 314 -166 -14 366 -405 66 47 -140 -148 45 -31 118 -10 224 -120 35 -180 -331 -206 -118 73 135
7044 135 -40 -132 -145 171 308 103 205 -51 -141 77 -128 -143 153 -215 93 -65 -9 29 91 -29 -135 50
7066 50 -29 -234 -79 -224 22 -8 51 174 3 -236 -172 -58 -249 144 -293 -74 -126 226 -177 125 40 -97
7088 -97 17 163 -109 -27 9 24 -74 42 -34 -210 85 -243 192 135 54 128 23 -86 -269 -18 -27 267 43 -326
7112 -326 242 132 164 -80 12 -159 -5 -264 96 -24 -77 -18 72 -350 -250 178 -228 -137 -364 -67 -198 67
7134 67 63 120 71 -83 261 -12 -116 91 75 76 -58 183 -123 61 -10 -11 -83 40 -85 230 -34 36 131 -214 243
7159 243 -145 55 -318 -75 -37 138 274 70 116 -12 -132 140 7 291 46 19 67 -255 14 27 -101 -169
7181a69J68j58J12K5K45k80M62n44k72N90Lk10O9l1O0J32j81k67r3L92p5j98K18
7204bJ4j8R7j8k17J77k13J11J82k28K23J5o2L5k00m0K46%k66K27J6l11K30K31
7228B29k23L40n42L03N4m08K71j85J16j60K17j50K22K11k85J67m56J54O8J19k01
7249a39J19QL32n07j74N11j46M2q9L2L0l9j51K18K17m34L22j87N8l3J48P2k67
7272e7R9o2p1K04j20m8J2N3k55L05P6l67K34K00m29O2K4J06l09L60K3j24K80j61
7296C5K38l15J56j40o2k8K4K25o4n5j92J43M1N7j38O6p5j30o6L43j31r0J33j77
7320b02L49j72k2mR4j69M19j24k49J45l06K15M4j26L22o9k99q4K30J23Rk4j15
7343a5N1j7o1q9K06k25k68L53K50l19J92o1J69l82J19K44j58n1m7R7r6k1J22O4
$$ plain form
7181 -169 -1 -159 -47 -22 223 -57 405 -139 -411 179 182 -28 41 10 70 202 21 -246 -339 53 -22 -220 -2
7204 -2 12 -6 91 73 -144 33 -180 -69 113 -115 108 123 61 96 -104 -144 102 102 -164 63 79 -232 -2 229
7228 229 6 346 -196 107 161 -247 24 -161 -45 -205 12 -138 84 295 10 177 -279 -125 -57 62 -139
7249 -139 -20 -12 320 -187 -361 150 4 46 -43 -11 19 -20 -171 47 264 -170 152 -35 23 -10 138 210 -57
7272 -57 42 -20 -91 113 -7 -55 -43 10 -245 60 136 -231 3 203 -226 -164 -140 -34 -343 17 40 -84 196 35
7296 35 273 -42 114 -26 -88 -116 -92 133 69 14 -178 -35 6 63 -75 -9 -84 -214 -280 63 -68 -158 -25 -202
7320 -202 147 -25 -47 -51 43 -126 293 169 -80 65 -241 -26 18 -108 214 145 -154 -238 -8 115 124 100 -15
7343 -15 36 19 -42 -131 75 -150 -418 -65 185 -134 58 -3 166 -216 -97 147 -11 -62 -109 -12 -108 -129 -7 57
7367E7m4ok3k9O1j16J56j58n7K06j22N0k0QK1J66k82Mj61R3K39r3j52j64N66j86
7393A4l85M52L5p6k5Q7J90l07J54j17j1K62j35k11M7j04L53n7q1k02K74j11L68
7416D14m53Nk2J1o8J82Q5k61K65k82L25k40L38j97l00K29Q1j09j80K03o6j29J13
7439e6j7q6R8j63K52q6J08l05K48p8m1L12j90K0j37M4l4M0L42k45r3l7J29mL2
7464E3j05M3l7J72j25j7k29L39J09k30J3kJ72j61o8j23K73j25M5J14J60l32M28
7487C67o22K99M6m12N86j31k29p3K62q2J17r8J74j67Q6k00J5N7P4qp2j48L47j07
7511H1j45K46j84j10K4j0J19l3k71K66j89J78J23m13K3L89Q3m37K47K13j12k40
7533a52J86J26j54l03K61J66l16R1L65k93L1j9k2R5j26j66N68l76K21k00j9NJ08
$$ plain form
7367 57 13 7 -16 -45 16 -100 56 -102 -159 47 -75 -25 -45 -37 -16 150 -132 -128 -289 -196 43 -50 -202 -366 200 14
7393 14 -371 81 116 40 15 102 292 -15 139 22 11 273 138 -73 -26 -130 223 166 85 -117 157 46 414
7416 414 -39 -34 -56 -45 -113 69 154 -107 158 -124 201 -39 299 102 -198 31 112 3 -177 26 -40 -169 -56
7439 -56 -73 -159 -61 -224 28 -58 50 -255 -7 -85 -126 186 -4 16 -121 -77 -111 -71 271 26 -67 -104 25 21 53
7464 53 -52 -9 -46 126 1 -16 -245 94 203 -27 -14 -16 156 -5 -73 -196 77 -48 -3 111 271 -61 367
7487 367 -255 44 90 -322 264 133 -96 -169 93 11 128 30 204 37 123 -77 -62 -5 69 61 -11 -159 188 81
7511 81 -64 182 -2 -112 -88 -98 21 -12 -283 -17 -206 -28 95 -318 -295 94 177 -260 -13 200 88 -152
7533 -152 34 160 6 -297 -36 130 -186 -95 270 -23 8 -11 -33 62 -64 -230 338 -38 183 -17 -36 -31 77
7556G7J34r9j98K28j99K10j65l00M73o7n6n2k3k69J90K19j35o1q1K30P2k07J64
7579H5j5m28K90L8k49k0R9J55j45M01j96k64J61O4K15j16p4P6j25l54J97K75l87
7602c17Q8M14k78J38o0J06j6M9j50m6j34K16J67K2k80L20o5k88M6J81p3j41L2
7625f9J89j53K84k63r9J29J59j21qo8n6n4K26l7k5k16k1N36k89Jk44K05j80L37
7649A63n1Q8k66J51j27n3K55k50k49J86J72j7O7j10j67J93P2m5O2o3l26M24k24
7672a15K03M3k93n6k9J29J7J19M7j62L0K31l05L23j26J30k89K49l51J97r7O8l
7695d0k3J34l41K82L03n00K23l08M24np6L35n28J68m8K32n47M07n6q1k33K04r0
7718a64M10j51q8k66L81k42K26jl06Q6M02p6j66j28j14K34M00n40K44j41l98N96
$$ plain form
7556 77 211 112 -86 142 -57 153 -12 -312 161 94 38 -14 -37 -306 -116 103 -32 -93 -174 56 128 -79 85
7579 85 70 -358 -68 -30 -279 -299 -200 -45 -190 211 15 -249 -88 -24 191 75 1 77 -48 -402 -205 70 -317
7602 -317 -229 185 -93 45 -15 91 75 124 -26 -72 -206 10 177 199 -81 239 174 -114 -68 113 40 -101 -69
7625 -69 120 -33 251 -12 -111 18 177 56 48 -20 -76 -130 96 59 34 -182 -203 333 44 45 -199 6 -174 163
7649 163 112 200 -66 85 -42 -95 160 -90 -339 -153 19 2 69 -41 -208 -15 57 12 74 11 -315 109 -115
7672 -115 88 131 -162 -218 -247 -118 -101 18 65 -97 -67 164 -141 182 56 186 -103 146 -205 -8 -105 -37 -40
7695 -40 -63 71 -270 12 315 -185 38 -270 154 149 73 408 -120 48 0 232 -315 92 36 -45 -278 -74 -164
7718 -164 246 95 7 -259 122 -120 106 105 -201 -115 287 211 45 -83 -197 37 437 -103 141 0 -398 198
7740A98j07k07J9L71r5j99N1r4M5n4L4j27N1j19K69nj14J41k06K95j10l9K00j89
7764IJ48n6m44K55L24k68Q6l7J50j32j52N6K1J46N5l89K48q7r2K38l63J19L42
7787A77m81N53k81O9j47J54M1j88P5J34k01J49o9o8L08n12L15l01K86k13M37k65
7809b8p1NN6M5N6l09K55l24L07l10L54m91O58l04J85j02l17O74n62P7j28QN66
7832C00j64j82J02j87m1M02J0j14l38J61j44K94j73j27J02L23k14k50L26m3K04
7853B47l4p1j97o3J15K13O1n0k48j60L32J5k54K34l6m10n6L92N0j43J56q5o5j12
7877a69K10K20J13o44L07J25k14Q1l02J24P2J00J06m9P5r5k74M62m57K15P5n5
7899B6L4j43L06m91L64K23j44k50O5J94n3J48m50L73l99J36j84K74QJ36m9J09
$$ plain form
7740 198 91 -116 -97 274 179 -20 31 -63 -18 -72 -38 -165 -114 -233 36 31 -83 58 -148 147 37 -2 198 9
7764 9 157 101 -343 -88 236 -32 54 17 167 35 -117 -61 -40 106 161 -228 20 -67 -159 79 -284 -165 177
7787 177 -304 249 -32 37 -110 44 85 -103 -28 106 -95 54 -15 -83 225 -287 28 -273 13 -200 237 -28
7809 -28 -99 -94 -38 7 63 -246 9 -315 -8 -318 36 -455 203 -101 84 -18 -335 339 -223 -146 -274 -266 300
7832 300 136 -46 56 -131 -172 230 240 126 -212 -51 -195 99 -74 -201 -99 224 10 -240 86 43 247
7853 247 213 142 -55 -118 -3 210 271 221 -27 -187 145 160 -94 140 104 -306 -362 30 80 -63 93 8 -57 -169
7877 -169 41 261 374 -270 37 162 -52 29 -273 -149 -77 23 129 80 155 60 -214 248 -209 6 81 26
7899 26 60 -83 223 -268 96 319 175 -75 -10 184 131 279 -171 202 -197 -61 -245 29 37 173 124 233
7921B33k2k86k8K46J03m2m37L0K39k2j0l16K22K05m23L89K7l14J69j68L19m25
7943c11L75j55L53l82Q2N7j1J60n8k68L82j81j85L98J65l51J27l15R3j3l21M98
7965A39l88N20j27m25M50l77L49k76L74m1J28n44J73K38n40O82n81L67q9k36M76
7986B72k55J87k45P6Q5m4P5j63K7M5j94J97J01l42pJ16K05l58K14N4j96M6KJ07
8010EP5J57k61o6l9K87q4j70R8j28K61j06J04m86N42l42J52J80j06m12J08K00
8032c1j25J42k52J61J83J63k51J4J38m02M14j50K97j73L1l40R3M73j72k76R6J62
8054A95J3j59l21L85l79J84j39L58m15L79pJ6k9p9j13R7l0N7l49N30q1K40O7o62
8078b42K70J01Q6j76mj7j39J97K1k05L05l2l00m4l12N88kp22O75J10j87J41j31
$$ plain form
7921 233 211 -75 -103 143 246 204 -233 -203 36 14 4 -312 -90 115 -308 81 108 -206 -37 -205 114 -311
7943 -311 64 -91 262 -120 -38 19 8 168 110 -158 224 43 -142 256 421 70 197 -118 -25 -38 -359 139
7965 139 -249 271 144 -281 169 -208 141 -135 239 198 326 -218 -45 193 -347 335 -246 121 32 -204 272
7986 272 17 204 -41 35 120 76 151 -12 15 60 -134 63 164 -178 -185 -69 136 -222 -8 46 -150 -104 -102 5
8010 5 80 237 -24 -90 -129 158 74 -96 2 -126 135 29 133 -353 189 -153 -1 179 73 -339 -231 -31
8032 -31 -156 -14 -266 -105 78 241 -10 4 142 -260 154 4 301 128 159 -181 -88 385 213 -63 33 195
8054 195 208 49 -272 113 -266 -82 -221 137 -278 101 94 110 81 2 -111 -14 -44 13 -336 194 113 353 420 -242
8078 -242 28 129 215 39 35 18 -121 76 97 -108 197 165 -135 -179 -491 97 95 -627 48 158 -29 112 -19
8101a9Oj3K93r8j69n7L41l14J94n8j91M3J92j44q9j2J0p9K05j45r1O7k33J98K65
8126A02j75J90j17k82J46L9O2j07K17j8l6Q6n7J63k63j58M59l84K39j53N8L1K34
8149B76m43j47M79l93M47J2l24J29j90j4P2K9J96P8K3m37J04J47j11K89j36l38
8171b52K65j10J6J84m18N61m31L4L73k09n2L24l59O6P3k66O2K28j78k4
$$ plain form
8101 -19 -13 -26 267 169 0 -57 284 -30 164 106 -85 -42 150 6 -83 -95 -85 -164 41 -104 -195 -128 -361 -163 102
8126 102 -73 117 0 -282 -136 -97 -35 -142 75 57 21 107 50 213 -50 -208 251 -133 106 -47 11 42 276
8149 276 -167 -314 165 -228 219 231 -93 36 -154 -168 -96 -67 129 207 230 -207 -103 44 -67 222 86 -252
8171 -252 13 -97 -81 103 -315 246 -185 -151 222 13 -39 285 -74 -8 65 -201 -139 89 -89 -113
8191a13
$$ Imaginary data points
##PAGE= N=2
##DATA TABLE= (X++(I..I)), XYDATA
0@%%%%%%%%%Qj6J6j6K4l2L7m5N5o3P2q7J02j16J32j52J74k01K28k57K92l27L67
32A95m12M59n14N74o38P08p85Q70r62J064j178J306j449J607j784J989k224K495
50A321k816L204l679M278n064O140p720J0265j5035K7030j11218k45913J79695
63a59512K96127R9974j54247j05234P4637J12498m4683j14813j0788J00353L0176
74A24488r7629r4808L3428Q0378j2821j03736n9383L4078M2175k2491k5893M8664
86e3550Q1273m227r8262o4232P3965J47875P3020n6914r3025j5745N9601M4218
98I3997k0645m3033l708K6377j926m5337l5724J5225K9755k2173o9001l7258M1865
111g1586O6196Q518m3583k1234L4288L4270j5948l0540K1366O5134K9513l8335
$$ plain form
0 0 0 0 0 0 0 0 0 0 0 8 -8 8 -8 16 -16 21 -24 31 -32 40 -47 55 -61 71 -81 93 -108 120 -137 155 -172 195
32 195 -217 242 -272 302 -336 372 -413 457 -505 559 -619 687 -762 845 -939 1050 -1174 1321
50 1321 -1495 1709 -1970 2308 -2756 3384 -4336 5929 -9106 17924 -93294 -339207 -159512
63 -159512 136615 236589 82342 -22892 51745 164243 119560 4747 -6041 94312 124488
74 124488 26859 -67949 -34521 45857 33036 -70700 -130083 -96005 -53830 -76321 -102214 -53550
86 -53550 27723 23496 -74766 -138998 -65033 82842 155862 98948 5923 -9822 49779 93997
98 93997 73352 30319 26611 52988 51062 5725 -29999 -14774 14981 -7192 -76193 -113451 -71586
111 -71586 -5390 3128 -40455 -61689 -27401 6869 -9079 -39619 -18253 46881 76394 38059
123C8059m4603J3292M7741J0286l8341k7120J8374K1997k1762m3012q033L3225
135A03J8197l0760m2747P06M2875L2630j3883l7213j5460J8352K6912P716p755
148c27J000J6973J1134j4951k8668q204K4645K8344k805k4821j0532J2684P962
161A2434j4418r874J9494K3942j4675m2051o297M8292L7322l5552o8748q438O6632
174H063N2337l2420o7456j2189M3735K0704l3826k4514L6676N0619j1818o0467
186c0556j9432N1034M8322j9568m7826L906N2152K1572m1795m1939J9337M7322
198D2529j536n2834k8983L3279M0258j7820n5274k0916L3621L3945j0571k7459
210c1761M305K6796J836k9091r375M0942M7281n755m9340k1721L8641M8209o198
$$ plain form
123 38059 -6544 6748 54489 64775 26434 -686 17688 39685 17923 -25089 -33122 103
135 103 18300 -12460 -55207 -54501 -11626 21004 7121 -30092 -45552 -27200 -288 7428 -327
148 -327 673 17646 28780 13829 -14839 -23043 1602 29946 27141 2320 -8212 4472 12434
161 12434 -1984 -11858 7636 31578 16903 -25148 -31445 16847 54169 18617 -50131 -58569 8063
174 8063 60400 27980 -39476 -51665 -7930 12774 -21052 -45566 -8890 41729 29911 -30556
186 -30556 -49988 1046 49368 29800 -18026 -14120 38032 59604 17809 -24130 -4793 42529
198 42529 40993 -11841 -40824 -7545 32713 14893 -40381 -61297 -27676 6269 -4302 -31761
210 -31761 -27456 -660 1176 -27915 -37290 3652 50933 45178 -4162 -25883 12758 60967 54769
223E4769n0388k5058K9142L4393j3843m5057j7242K5131K0861j8464l1715O4K6891
236a0516Q687k2492j5326K1357K9802j587k3882n32L3092K2005k1897l3189Q363
249f115M3663K1802l0511m3224k517L0721J4676k2344k5734K641J8506j6k0958
262a9410j2738J0663J6117O6r133J492J2597N277r151p419J0957K0044N037j4430
276I969j4327M881J7014O106j4603j9532j139J6101J0926r003j8949p004R689
289i871Q555k875n399N980J0035l561j6840n519J8461K2990k127k2492j0808J4969
303A498J6712q507k2496j990K4576J5905j7089k9504k772K5526J6847j3574k1384
316a6252K633K2282R289j3815j4218N103J2696j650j0548L632J8551M685k3844
$$ plain form
223 54769 4381 -20677 8465 42858 29015 -16042 -33284 -8153 12708 -5756 -37471 -37407 -10516
236 -10516 -1829 -24321 -39647 -18290 11512 9925 -13957 -14489 18603 40608 18711 -14478 -6115
249 -6115 37548 59350 28839 -14385 -16902 13819 28495 6151 -19583 -16942 1564 1548 -19410
262 -19410 -32148 -21485 -5368 -5302 -14435 -12943 -346 4931 -4220 -11639 -682 19362 24399 9969
276 9969 -4358 523 17537 23643 9040 -10492 -11631 4470 15396 6393 -12556 -19560 -9871
289 -9871 -1316 -4191 -9590 -3610 6425 2864 -13976 -19495 -1034 21956 19829 -2663 -13471 1498
303 1498 18210 9703 -12793 -14783 9793 25698 8609 -20895 -23667 1859 18706 5132 -16252
316 -16252 -13619 8663 17952 4137 -10081 -4978 7718 6068 -4480 -848 17703 22388 -1456
329a456k6957N750L2158J5540k0314k6956K996K4549O345k1997j7254J5239K8201
342A5844K762k3287j2857J7169K0308p126k2599r25K5329J4849j8431k5581L733
355a0812K3942M805k4763j8041J6605K7495m038l3147j7900K0071K8003k313k3580
368a3673o177K0433J5828j1017j7556N652K1824M971j8062j0880J4781J9320o916
381A8528k5580p348K0340J7424j2992k7649m652K1323J4421j3374k0326J674J8538
394C27O451j4383j0720R998J7363j53j5166n248J5204J3470o682j5564l05J7538
408A2130J0306j2594j8768p96J5239P447j1166j2779L729J2804J476j3153j2357
421a8482M372J1260L820m714j573N475M079n606p863K785J1954P494n168q704
$$ plain form
329 -1456 -28413 -22663 9495 25035 4721 -22235 -19239 5310 11655 -10342 -27596 -12357 15844
342 15844 18606 -4681 -17538 -369 19939 12813 -9786 -10711 14618 29467 11036 -14545 -10812
355 -10812 13130 17935 -6828 -24869 -8264 19231 15193 -17954 -35854 -15783 12220 9907 -13673
368 -13673 -19850 583 16411 5394 -12162 -6510 15314 20285 2223 -8657 6124 25444 18528
381 18528 -7052 -14400 5940 23364 10372 -17277 -21929 -606 13815 441 -19885 -18211 327
394 327 6778 -7605 -18325 -8327 9036 8883 -6283 -11531 3673 17143 10461 -5103 -5408 12130
408 12130 22436 9842 -8926 -9722 5517 12964 1798 -10981 -7252 5552 7028 -6125 -18482
421 -18482 -14110 -2850 970 -3744 -5317 158 4237 -1369 -9232 -6447 5507 13001 7833 -871
435h71j02Q200L159p395r132L243J2205O164q654j4011n346O177O703p2l068J643
451a157M568j552p770m226N510P204j091p035J207J3027Q125j0807j9094l902
465a6993J7633J7032n262j7096m754J2195P598j0710j4764M149J9387R451j2193
478E673j6568K22J1807K992q378k618J0643Q630q449j4607J639J5887M159j7133
492f101j5871J0768K5703O051k2106j9783Q257K3032M615j6863j0621J1683J6110
505A4874l970j6844k697J6989J0513j1806j7370L217J7844L636j7832j4327J0887
518f886J8352k235k1188r916J5636J7651n423k0136l900J7475J3124r601j4291
531a1338N278J9637O782j4351j2587P463J4185k455j6580m737J5467J3233j1115
$$ plain form
435 -871 -973 7227 10386 2991 -6141 -2898 9307 15471 6817 -7194 -12540 -6363 340 268 -2800 -1157
451 -1157 3411 1859 -5911 -10137 -4627 2577 1486 -5549 -4342 8685 16810 6003 -13091 -16993
465 -16993 640 17672 12410 -4686 -9440 2755 10353 -357 -15121 -10972 8415 17866 5673
478 5673 -10895 -10673 1134 4126 -4252 -6870 3773 12403 3954 -10653 -9014 6873 11032 -6101
492 -6101 -21972 -11204 14499 20550 -1556 -21339 -13082 9950 14565 -2298 -12919 -1236 14874
505 14874 10904 -5940 -8637 8352 18865 7059 -10311 -7094 10750 14386 -3446 -17773 -6886
518 -6886 11466 9231 -11957 -21873 -6237 11414 5991 -14145 -18045 -570 12554 2953 -11338
531 -11338 -6060 13577 20359 6008 -6579 884 15069 12614 -3966 -8703 6764 19997 8882
544H882k2538n821J5824J2545r877j7875r93J5725J0591p432j1990J94J0632O460
558D327j953k83N431M023o136p989K807J2593O990q523j2136k070Q301K486r764
573a896j1037K018J0749M497q240j1135j72R333N873m060o196L253R737O212l738
588E198n858Q61O267L759j854r99K569J047o712r473p8R279P059p295j4038m087
604a4355R147Q290n374j1684k166J1717R733l180q590l95P545M052m423k601P342
619E058Q712l402j2344m232J0293R821n652j3294k013J1913O075j0860j4677J824
633a2778J5975P284j0501j3317K897J3049L585r965o737P593J0551j674r740j319
647e097J0002M328r255r109P273J5760J114j7344j3193R602J9001K215j7019j1878
$$ plain form
544 8882 -13656 -19477 -3653 8892 -985 -18860 -19853 -4128 6463 -969 -12959 -12765 -2133 4327
558 4327 2374 2091 7522 11545 5409 -2580 227 12820 19810 11287 -849 -2919 5382 7868 -1896
573 -1896 -12933 -10915 -166 4331 -3909 -15044 -15216 -5883 -10 -4070 -10266 -7013 2724 8936 5198
588 5198 -660 201 6468 10227 8373 7374 9943 10990 4278 -5195 -5273 4006 11065 3770 -10268 -14355
604 -14355 -5208 3082 -2292 -13976 -16142 -4425 5308 2128 -6462 -6857 688 4740 317 -2284 5058
619 5058 13770 10368 -1976 -6208 4085 13906 8254 -5040 -7053 4860 10935 75 -14602 -12778
633 -12778 3197 10481 -20 -13337 -10440 2609 6194 -3771 -10508 -2915 7636 5962 -3778 -5097
647 -5097 4905 9233 -22 -9131 -1858 13902 15016 -2328 -15521 -5919 13082 15297 -1722 -13600
661a3600Q820J5330j376j4537p455R487J0266k690r734r26P328K113r129n073
675a1176Q883J1400j989j3131n442J0238J0783l395j0693o65J2199P456q729j3025
689g286L71J2473O224p196r444R85P136L58q039n213M860O092j925o428j46P414
705B36M149o727q722L223J2687Q700n086j0908k563P396O639j556n199n22M294
720F041N35n597m806O12L455n11m345j062L566K710m509o931N14R489O668l955
736A874p514Q56Q395N888n066p404O08R194O138n021q921k461M809K903l178m173
752c073O76K137j032m449j319L398L045k847l369L552P796J808p617p455M508
767d241J2362O013p198j0927o30R089M571n571p175J146O777K61p896n490M683
$$ plain form
661 -13600 -4780 10550 9174 -5363 -12818 -3331 6935 4245 -5489 -6415 913 3026 -6103 -11176
675 -11176 -2293 9107 7118 -6013 -11455 -1217 9566 6171 -4522 -5187 7012 14468 5739 -7286
689 -7286 -6915 5558 11782 4586 -4858 -3873 3263 3621 -4418 -9631 -4771 1321 -604 -7032 -7178 236
705 236 4385 -2342 -11064 -7841 4846 13546 8460 -2448 -5011 2385 9024 7468 2269 1747 6041
720 6041 6576 979 -3827 -3215 240 -271 -4616 -5678 -2112 598 -3911 -10842 -10328 -839 5829 1874
736 1874 -5640 -4784 3611 9499 4433 -2971 -2363 6831 12969 7948 -973 -3434 1375 4278 1100 -3073
752 -3073 -2397 -260 -1292 -5741 -7060 -3662 -617 -3464 -6833 -3281 4515 6323 -1294 -8749 -4241
767 -4241 8121 14134 6936 -3991 -4621 4468 9039 3468 -3707 -2561 4216 4477 -3419 -8909 -4226
782d226O606j111p674r18P739N504n500q150J470J1038M656p047o893M206R501
797I201l4j1429o462P640J0421j271j0971m830N192N182m463o306L015R337J036
812E258r035n913N933J0359l6r770l434R067R447l499j2118l998P703Q603k234
827F333q610k888M953K906m334n089J817O122J550n270l807L942N172j325o148
842d676r16Q249P303l381q619l025P289N706l554p307M31P351L181p493q728N41
858g648P882L743m441m572J485L563j303m634O51P218M253m140n863J172P292
873D658K284n831n506L145P895K064o047o084J42M186L00l105j099L132K688l232
889d10m905j492M278M063Q7l851p5K882K342k191m177O11N298M078k253m910j494
$$ plain form
782 -4226 2380 1269 -6405 -7323 416 5920 420 -7730 -6260 4778 9434 2387 -4506 -300 9201
797 9201 9167 -2262 -8724 -1084 9337 8066 -2905 -7735 -2543 2639 -1824 -8130 -5115 4222 5258
812 5258 -3777 -9690 -3757 6602 6566 -3204 -6638 2429 11876 8377 -3741 -7739 -36 8567 6333
827 6333 -2277 -5165 -212 2694 -1640 -6729 -4912 1210 2760 -2510 -6317 -2375 2797 1472 -4676
842 -4676 -5592 2657 9960 6579 -2040 -5065 2224 7930 4376 -2931 -2500 4851 8032 539 -8189 -7648
858 -7648 234 3977 -464 -5036 -3551 12 -1291 -5925 -5274 1944 6197 2057 -3806 -2634 4658
873 4658 6942 1111 -4395 -1250 6645 8709 2662 -3422 -3280 906 1206 -1899 -2998 134 2822 -410
889 -410 -5315 -6807 -2529 1534 1621 -2230 -2305 577 2919 728 -3449 -2838 2460 6538 4285 -625 -2119
906b119M002K610l405m650J106N873K341m925n696K85M538J533l405j370L578
921B96K907l397n873P11P679L899m926o838J737P914K333o662n830L545Q174J383
937G052o760m773L321M932j623n479l01O288L404m884p315P64O529L342m324m995
953d822K182N475j59o230l463M737P222k97o564l002M677N290k410o084o26O594
969B520M722l377o252r9M888J156m848k979M471O607j777r542m390N602P833j137
985C398p052k010O026L844m534o409K120O925K734m175l588L808M431j936p056
1000c474r78O314O055k682o605j825M516K345m052m387J912N591J046n544m451
1015f219J508M569J513k964k065K375L514m74l144j637K623L214K77j995k22J784
$$ plain form
906 -2119 1883 4493 1088 -3562 -2456 3417 5758 833 -4863 -4578 -40 1493 -1912 -3282 296
921 296 3203 -194 -6067 -5356 2323 6222 1296 -5542 -3805 4109 6442 -220 -6050 -2505 5669 7052
937 7052 292 -4481 -1160 3772 2149 -3330 -3631 2657 6061 1177 -6138 -5374 1155 4497 173 -4822
953 -4822 -2640 2835 2676 -3554 -7017 -2280 4942 4645 -1919 -4921 -244 5046 2636 -3448 -4074 2520
969 2520 7242 3865 -2387 -2486 2402 3558 -1290 -4269 202 6809 5032 -4510 -8900 -3298 4535 3398
985 3398 -3654 -5664 362 4206 -328 -6737 -4617 2308 5042 867 -2721 1087 5518 3582 -3474
1000 -3474 -4452 1862 7917 5235 -1370 -3195 1321 3666 -386 -4773 -2861 2730 3776 -1768 -6219
1015 -6219 -4711 -142 1371 -1593 -3658 -1283 2231 1757 -1387 -3024 -401 2813 3090 1095 873 2657
1031B657M69j862k709K80L750K631k725m940j145K839J598j201k878J051K913
1046G28j20m076j899K813M266j0l612o53L861L841k544n237j268N487N135j414
1062E298m973j612L143J294l094l253J335M254J194m299m135Q06L785Q8k768j260
1078d197L826L388k280m803l51N028L836k521m117J467N448J596n415n228J960
1093b363P097K293m682n545J295L635Nm124j742L949L216k882n595j9N930K464
1109B932m527m394L288O863J432n768n046K864O487J060m735k191L889L424l568
1124B010n664K70N806L402l977m964J33M182K43m254k374M215M260j250n184k382
1140e528L854M549j114m403j000M693L760j829m627n88K522K438p22j408J338
$$ plain form
1031 2657 3126 1264 -1445 -1165 2585 5216 2491 -2449 -3594 -755 843 -358 -3236 -2185 728
1046 728 608 -3468 -5367 -2554 1712 1702 -1910 -2563 1298 5139 2595 -2642 -3910 1577 6712 5298
1062 5298 325 -1287 1856 3150 56 -3197 -1862 2392 3586 -713 -4848 -4042 -257 -169 -2937 -4197
1078 -4197 -371 3017 737 -4066 -4417 611 4447 1926 -2191 -724 4724 6320 905 -4323 -2363
1093 -2363 4734 7027 2345 -3200 -1905 1730 1735 -2389 -4131 -182 3034 152 -5443 -5462 468 2932
1109 2932 -1595 -5989 -2701 4162 5594 -174 -5220 -2356 4131 5191 456 -1735 2154 5578 2010
1124 2010 -3654 -3384 2422 5824 1847 -3117 -2984 1198 1441 -2813 -5187 -972 3288 2038 -3146 -5528
1140 -5528 -1674 2875 1761 -2642 -3642 1051 4811 2982 -1645 -2233 289 2727 2005 597 1935
1155A935J506j946m265n17L906L395k079m173j045K754K238k227m131j17M498
1170b68L280j971l710r94L023K409j126k027J373L531P5k786k511Q35L380J078
1186C591j877j480Q25P04j783k664L43L348J648k145m326l23L085K121j961k864
1202c758R13L573J731j695k615P20K198R5j407M00L077J998k949m583q01L936
1218H33L904j718m214j664K839J747k403l580O08M041K066k813l228M14L657N25
1234A014k441q62K572L164j104l341m41K948J614k234k741J907M502L60n561m899
1250e543K162O342J755m564m049J329L889J81l672j941K798L525q28k868l74K577
1266G19P80k572j788K896M303o5n093k823K765L617l35l442j651L776K794k215
$$ plain form
1155 1935 3441 1495 -2770 -3287 619 4014 1935 -2238 -3283 -529 1709 -518 -4649 -4766 -268
1170 -268 3012 1041 -2669 -3663 -640 1769 643 -1384 -11 3520 3595 809 -1702 -867 2513 3591
1186 3591 1714 234 1059 1763 -20 -2684 -2341 1007 2655 510 -3816 -4139 -1054 1067 -894 -3758
1202 -3758 -2845 728 2459 764 -1851 -1131 1067 1162 -245 155 3232 5230 2281 -2302 -3103 833
1218 833 4737 3019 -1195 -2859 -20 1727 -676 -4256 -3648 393 2459 -354 -3582 -3168 489 1014
1234 1014 -1427 -2289 283 3447 2343 -998 -1439 1509 3123 889 -1852 55 4557 4917 -644 -5543
1250 -5543 -3381 2961 4716 152 -3897 -2568 1321 1502 -2170 -4111 -1313 2212 1384 -1484 -1858 719
1266 719 1499 -1073 -2861 35 4338 4273 -820 -3643 -878 2739 2404 -1038 -2689 1087 3881 1666
1282A666m599r11L779K868j607l085M15K513P52l272j683J589L655J93l073j537
1298b337J861J960j112l271L7M198K739j772m437j143L041K869q38k266r8J783
1314A214K73j409j724J042K171l05k287o39K500J293k340l563l6L594L295j951
1330A128l673m91K774J850j369k675J349K993J481k290k533N72K282Q26j012r69
1346B43P79J170j485k614J51K093J171j439k268K79K342N14k603k628J283L719
1362G07K279k367l301N24K894J299j166j408J387K324m51k822p76J403J794o59
1378A661k556J85K233J038l241l497J81M114K407k697l007N55K239J080k707j083
1394c095K812L075j72l304q54K485K011j022k450Q25L218O47l663l177J334L309
$$ plain form
1282 1666 -2933 -3844 -65 2803 1196 -1889 -1474 1039 1791 -1481 -3164 -1575 2080 2273 -800 -2337
1298 -2337 -476 1484 372 -2899 -2862 1336 4075 2303 -2134 -3277 -236 2633 1795 -471 -569 1214
1314 1214 1487 78 -1646 -604 1567 1262 -1025 -1664 836 2129 -211 -3774 -3810 -216 3079 1128
1330 1128 -2545 -3036 -262 1588 219 -2456 -1107 1886 3367 1077 -1456 -884 1398 2224 1212 243
1346 243 1022 2192 707 -1907 -1756 337 1508 69 -2199 -1920 422 936 -1667 -4295 -3012 707
1362 707 2986 619 -2682 -2158 736 2035 869 -539 848 3172 2721 -101 -877 526 2320 1661
1378 1661 -895 -710 1523 2561 -680 -4177 -3996 118 2525 -172 -3179 -2624 -385 695 -2012 -3095
1394 -3095 -283 2792 2620 -684 -1538 947 2958 1936 -514 311 3529 4176 513 -2664 -1330 1979
1410A979K82l515k163K486K845r53m337k392K809M154O4k176j251K044P88j118
1426d54j181J753K681N62k559j552J547K414n14l595o50K570K843j526m084j647
1442c392K260K559j464k636o8K480J552k725k472Q27L449J100j410j462J711J998
1458B307p62k301n52L455K010j548l099n99K560J450j906k687L10K570O03k468
1474f57j884j58J716Q14j185k63J534M67j070j748L95K497J850j197j746J16K011
1491A492P90j104j801J06K411J226j408k469m75J423P76j384r74O38J381o06j460
1508a438j704J223J910j17j255M69J502R17j878k227J057L597J576j954k910Q76
1524c56K622P36k623j790J174K494M10k840j613O81J605j027j575O53J967Q99
$$ plain form
1410 1979 2261 -1254 -3417 -931 1914 961 -3376 -5768 -2959 1195 1259 -917 -2168 -124 664 -454
1426 -454 -1635 118 2799 3361 802 -750 797 3211 2697 -898 -1548 1022 3865 2339 -1745 -3392
1442 -3392 -1132 1427 -37 -2673 -2741 -261 1291 -1434 -3906 -3079 370 1470 60 -1402 309 2307
1458 2307 1545 -756 -1308 2147 4157 2609 -490 -1089 1471 2921 1015 -1672 -1362 1208 1811 -657
1474 -657 -2541 -2699 -983 -169 -1354 -1617 -83 384 -686 -2434 -2039 458 2308 1111 -635 -519 1492
1491 1492 2282 1178 -623 -517 1894 3120 1712 -757 -1232 191 967 -417 -1391 -753 628 22 -1438
1508 -1438 -3142 -1919 -9 -126 -1381 -912 590 1507 -371 -2598 -1541 2056 3632 1678 -1232 -356
1524 -356 2266 3002 379 -1411 -237 2257 2667 -173 -1786 -1105 500 -527 -2102 -1449 518 1417
1540A417k442k616P07L280J004j624j562J229K206N59k459j424J642K582L49k021
1556H27r69J242J116j383k187O17K054P36j697k708P28J460N49k230j257K144
1572i58K439m92l243j233K268L213k52k180q58K252J731j171j948M7K059R74j469
1589A179j626J375P71j155k389k85K403J870j267l305q68K504J690j141k266N78
1605a932K140J110j609j653R60J676P46n80o61J061R30j082j174n84J452J445
1621B245j024j562m39J092L82j274j444K72K315N39j444k157k72J786J302m13
1637i6r67O10Q77J64q03m49J044R37j66j186M14J729N01j641k392K16K326J404
1655B522j499k230l28J160R12j309j515O35J915N78j945j150R34J478J27j210
$$ plain form
1540 1417 -1025 -3641 -2934 346 1350 -274 -1836 -607 1599 2158 -301 -1725 -83 2499 2848 827
1556 827 -142 1100 2216 833 -1354 -737 1317 2053 356 -2352 -1624 -164 385 -1845 -3102 -958
1572 -958 1481 989 -2254 -3487 -1219 1994 1742 -438 -1296 956 2687 1516 -432 -385 1674 2648 1179
1589 1179 -447 928 1699 544 -1845 -2130 273 2143 876 -2429 -3297 -793 897 -244 -2510 -1932
1605 -1932 208 1318 -291 -1944 -984 692 1438 858 197 1258 2188 1106 -68 -652 800 2245
1621 2245 1221 -341 -780 312 694 -580 -2024 -1752 563 1102 -342 -2499 -2771 -985 317 -96
1637 -96 -1063 -453 424 588 -215 -664 380 1317 1151 -35 379 2108 2609 968 -1424 -1208 1118 2522
1655 2522 1023 -1207 -1535 -375 537 -772 -2287 -1652 263 841 -1104 -2254 -1320 158 285 -925
1671i25M40J626O18j057j744M96K159Q26j592j359Q40J654l1k591j653J149K499
1688A355Q74k410j594L99J014P3j057m19J587P59j002j289P10J611N53j350r31
1705a117J365K423J12k714j447J204K418J29k003j181R33J481j104j882j66J381
1721a68J281j050k285Q01J369k03j441o19K021K028n49k083o46K203J679j092
1737A246j724J60J992J129j035k612n23J611J323o46j306j04O33o60j067l74J542
1754d15O77l37j546l46J899J156j081j664M07K199J794j546j767m22J678J267
1770A953p28j342N89R63k59j448m65p5J346r8j010k56P27M56j177j242M24K423
1788G81L58r70j742J63K037Q35j510j144Q30J824N75j252j325J00Q52K05l76o0
$$ plain form
1671 -925 -485 1141 1759 702 -1042 -546 1613 2439 847 -512 328 1982 1951 -640 -2293 -1144 1355
1688 1355 2229 -181 -1775 -1376 -362 -289 -1346 -1765 -178 581 -421 -1710 -1000 611 1164 -186 -1117
1705 -1117 248 2671 2783 69 -1378 -174 2244 2373 370 -811 122 1603 499 -1383 -1549 -168
1721 -168 1113 63 -2222 -1421 -52 -255 -1696 -2315 -294 1734 1185 -898 -1544 659 2338 1246
1737 1246 -478 -318 1674 2803 1768 -844 -1367 244 1567 921 -385 -489 144 -516 -1583 -1957 -415
1754 -415 262 -75 -1621 -1967 -68 1088 7 -1657 -1250 949 2743 1197 -570 -992 686 1953
1770 1953 1225 -117 472 1435 1176 -272 -737 -812 534 436 -574 -830 -103 353 -824 -2066 -1642 781
1788 781 1139 169 -1573 -1410 627 1462 -48 -1192 -362 1462 2037 785 -540 -440 412 617 241 181
1806A81J073j2j443j102O14J228N11j196j377L96K036k62j622j050O74J967R32
1823A548j237j383N18Q27q6m35m02J130R75l65j289n38J288M09p54m55O05J308
1841A664l35k072j140J242J522K97j704j336J042J782o13j536l82R24J381J68
1857I04j325k49J021Q1q92k38J421J416o02j689j048J314J742p73j590m97J528
1874E24J073j317j743l21J409J213m53j282O2M64K79o49o47R26J563J28j123n58
1892d52P64R13q57p84J00J934J224j846j802k27J248J065r55j239P8P32O32j290
1910g62p69M65P49L59o02k3L98M35q13p41K90J761J041r63j347r4J449M41o83
1929E91j033M72J047N30j365j335L39J040j49k48l93J48P14r13p14j6R30O67n46
$$ plain form
1806 181 1254 1242 -201 -1303 -689 539 1050 -146 -1523 -1127 909 647 -975 -2025 -1351 616 1548
1823 1548 311 -1072 -554 273 187 -248 -650 480 1455 1090 -199 -737 551 960 206 -249 356 1664
1841 1664 1329 -743 -1883 -641 881 1178 -526 -1862 -820 962 349 -1187 -1569 -645 736 904
1857 904 -421 -670 351 432 -460 -698 723 2139 1537 -152 -1200 114 1856 1083 -507 -1004 524
1874 524 1597 280 -1463 -1784 -375 838 385 -897 -835 -371 -92 -741 -1388 -462 1101 1229 106 -452
1892 -452 312 1225 368 -416 -316 1618 2842 996 -806 -1033 215 1280 325 -914 -836 -104 528 -762
1910 -762 -1531 -1066 -317 42 -560 -583 -185 250 -563 -1304 -1014 747 1788 825 -522 -616 833 1274 591
1929 591 -442 30 1077 1607 242 -1093 -754 286 137 -111 -504 -356 358 -555 -1269 -1285 -355 312 -234
1948b34m20P8J095Q6j174p74J338J589Q31j422j445L73R37K86n18j006N22P85
1966I27m23j054o07O32L17n27k12P9J379m21j436q83R28K211J33j105r59Q02J501
1985A282l16j222m9R67J190N1j709q00R56O87q37o36n6J128j6j423q62L91J135
2004a39K43j349l36J188J335r54j334m84J914J723n41r92o04J300L36o85o45J78
2022A54R67J5o80r55O61K79n95r67j43J093Q64q84j490m43J083J547o15m95q7
2041f91R38O90p01o67M72J179N64q48n84L53L11n07j077K71J048M93r07j321K00
2060g84P65L91r99j277Q68J692J41j451j097P92Q77P47l24j89K60N22p17l39J06
2079a6P19N90q02l64j51O74M5j273k75L05J280K43j110j191J58R96L10o18n63
$$ plain form
1948 -234 -654 -576 519 605 -569 -1343 -5 1584 2415 993 -452 -79 858 1144 626 -380 142 927
1966 927 504 -550 -1157 -525 -208 -735 -947 -868 511 90 -1346 -2229 -1301 910 1043 -62 -1021 -219 1282
1985 1282 966 -256 -305 662 1852 1903 194 -606 350 1037 200 -436 -492 636 620 -803 -1665 -1274 -139
2004 -139 104 -1245 -1581 -393 942 -12 -1346 -1830 84 1807 1266 274 -330 970 1306 621 -24 154
2022 154 1121 1136 456 -499 162 441 -154 -1121 -1264 -171 693 -191 -1681 -2124 -1041 506 -109 -604 -691
2041 -691 247 937 236 -431 41 1220 1784 936 352 705 1016 509 -568 -297 751 1244 337 -984 -784
2060 -784 -19 372 -627 -1904 -1036 656 797 -654 -1751 -959 -82 665 341 152 412 934 217 -122 -16
2079 -16 703 1293 491 127 -24 650 695 -578 -853 -548 732 975 -135 -1326 -1168 -172 138 -480 -1043
2098a043P42O90j90n77q99J059N91J78l29k53O73k44k66q71O01J121L73r05r21
2117d70L76Q62k27j356m46P01J229kj282q66M24J101k51m71J87Q76M4o04o85N74
2137b86R82K37p09o14P67P26k66j101m71P18J388k17j108o28K89Q74n83q26k10
2156a038J029M96q06r02P7Q90n9m36M6J067N93q59p03L1Q79R22m23q75k03J148
2176H74L03p41j099J95J020N92r09q43o4M87k35r24l1R71R61p74o30l46J082O73
2196E62o34m53P0J584J52r91r27L03J108L68m81p24L26L04l23p95l94O78O28m27
2216f6l92k28N92j54l97j3O6J168L27r84q30J07J191L15n75j23J38R30k94p76
2236Bp12O17O07J04j22k89k10L18r63k00K25R46K71o01q59K32P40j89o48j64Q74
$$ plain form
2098 -1043 -301 389 199 -378 -1277 -218 373 551 222 -31 642 398 132 -739 -138 983 1356 451 -470
2117 -470 -94 768 541 -815 -1261 -560 669 667 -615 -1481 -1057 44 -207 -678 -491 385 429 -175 -860 -286
2137 -286 696 933 224 -390 377 1103 837 -264 -735 -17 1371 1154 46 -582 -293 581 -2 -828 -1038
2156 -1038 -9 487 -319 -1221 -1144 -254 -313 -749 -703 364 957 98 -605 -574 305 1227 804 -71 -274 874
2176 874 1177 436 -663 -468 552 1144 235 -608 -672 -185 -420 -1344 -1375 -404 557 -217 -847 -1193 -111 562
2196 562 -72 -525 -455 1129 1281 290 -637 -334 774 1142 661 -63 263 567 244 -551 -945 -267 361 -66
2216 -66 -458 -686 -94 -248 -645 -658 -592 576 903 -81 -911 -804 387 702 127 4 142 1072 778 2
2236 2 -710 -93 514 618 496 207 -3 315 -648 -848 -623 323 594 -7 -866 -634 106 -83 -731 -895 -21
2257b1N75N6j102l13N12Q73J04n04p9N88L40n80p59OJ016l43j98k41L03Pk45j004
2279a009P0P61P88Qj463k29P05M57j2r08K4J114L54k99o60k66J036R0k27j26L82
2300E90N42j62j172l87N77P11P9r99k88o7P79m44r45L12R05K85j93r71oN27P84
2321D57o40M1J32J154l32q12k35O11M93l96o56L40Q66L54j393q23K19Q89M13r68
2341b86n33P2P68o8n27n37O98N16k55k62o8K64P72k29n48M88R05j26o84o41j51
2362d32R73K29n56l63O04L59m92q41l93L45O13L46q50k68J66P17k54q76L70O92
2382H9M92l66l90J58M87K9p72N6Q22N69n1j117l78N9Q67L6n73k67M82Nn07n66
2404h36q8Q21J50m9n85K67K97j63j83j37L56J222p2j147l54O62O67m73j97l19
$$ plain form
2257 -21 554 610 -492 -805 -293 580 684 180 101 689 1029 449 -310 -304 712 369 171 -70 233 240 -5 -1009
2279 -1009 -939 -178 610 618 -845 -1074 -369 88 76 -832 -808 306 660 361 -299 -565 471 561 334 208 590
2300 590 1132 970 -202 -589 -12 699 778 -221 -509 -576 203 -241 -1186 -874 31 316 123 -848 -854 -327 457
2321 457 -183 -142 -10 1144 812 0 -235 376 869 473 -183 157 1023 1377 -16 -839 -620 269 682 -286
2341 -286 -819 -747 21 -47 -574 -1111 -413 103 -152 -414 -482 -218 554 325 -223 265 1170 1044 360 -281 -432
2362 -432 541 770 214 -149 455 814 322 -519 -912 -567 46 392 -458 -726 -560 157 -97 -973 -603 89
2382 89 581 215 -175 -17 470 499 -273 -217 605 1174 1123 6 -372 -313 554 590 17 -250 232 237 -270 -836
2404 -836 -924 -103 47 -2 -587 -320 -23 -186 -369 -506 -150 1072 1000 -147 -501 161 828 355 158 -161
2424a61Q16L48o01p80j10L86K92o4N2p55P42ln74o80N36O14J61l14n92J156K3
2445D92l73m54PP79P21m97n95k75P66J67l06m01J84O54n26k70q99M38P62l43l55
2466c24Q9k1L48m10n27J08L93Q74m98j70m31O29K81n41j33M75P57J4n46m79K34
2487A22Q1k6M5l60L94K08m79o61J6N80K51n62k31n4N86K17r53j68L62Q82K88o6
2509D72n01m2N90o9k13l04O14M58n32j19k86L34O1l13o20L21O55m76j049o2P45
2530c36k89M70n58k26O84O56n31o90M43O66N08k6n54N5M00l08p6m0K58J66qq85
2552b21k75K55K31K53q42j00K09N72q3j128K86J52N08K36n50M12K36L73j08p59
2572c43O35N77Q0m14j27J75j97r9m80R1M37M2q4q54J2P6M11k97l83K52N13M94
$$ plain form
2424 -161 655 1003 402 -378 -488 -102 190 126 178 -577 165 162 -412 -1092 -556 58 219 -95 -687 469 492
2445 492 119 -335 -328 451 1172 675 80 -195 571 738 432 31 215 869 343 73 -826 -388 374 31 -324
2466 -324 -235 -256 92 -318 -845 -737 -344 530 32 -138 -569 60 341 -200 -333 142 899 913 367 -112 122
2487 122 203 177 222 -138 256 464 -15 -676 -660 -80 171 -391 -622 -676 -90 127 -826 -994 -632 250 538 472
2509 472 -29 -71 519 450 237 -67 547 1005 473 354 68 402 463 150 -470 -149 506 30 -1019 -1081 -336
2530 -336 -625 -155 -713 -939 -255 401 -130 -820 -377 289 797 771 217 272 672 364 288 248 506 672 664 -221
2552 -221 -496 -241 -10 243 -599 -699 -490 82 -1 -1129 -843 -691 -183 53 -497 -85 151 524 416 -343
2572 -343 292 869 949 535 408 583 386 287 -193 -102 335 377 293 -561 -549 -473 -62 -359 -742 -490 23 517
2594E17p56k17pJ63N76k8n91M93K88j93m07J9O68K83n00l14l18Q77j67k71o74
2615e59J32Q90L6o03m74K56R6K00m06r7K65M28l10l30q8P53%j66l46L47M20K62
2637G06n68o58O60Q00R8p78m48L78L81l65n88l6L99P17o26o48k86M74K34k67P
2658d14J34L88K80p63m07P26K33L15k99j89L03M97j37m91k08L67O68m51n45l61
2678c54Q2L21n36J34o2R3J17J2l89J50K40O3n17J20P26M17l57l36J9J60N38O5
2700G06p60k5M36L23l36l33r3K35L26m75m59j62O78o58j62N0L91L3K67m39j15
2721e72N19J35J01k34K3M72M00n60o07M15P36l7n63k34OK46k81k63r4rO74m42
2743a69j72k66M25K01m92l25N01N13J08k10o28J20P13K47m40m2n7P05j93l83k76
$$ plain form
2594 517 -239 -456 -463 -300 276 248 -343 150 438 245 -162 -143 525 808 308 -6 -324 553 386 115 -559
2615 -559 -427 463 499 -104 -578 -322 -226 -26 -432 -529 -264 164 -146 -476 -564 189 189 23 -323 24 444 706
2637 706 138 -520 140 940 1038 260 -188 190 571 206 -382 -418 -19 698 72 -576 -862 -388 -154 -421 -414
2658 -414 -280 108 388 -375 -782 -56 177 492 193 4 307 804 667 176 -32 335 1003 552 7 -354
2678 -354 -272 49 -487 -353 -415 -322 -205 -193 -582 -432 -192 -129 -646 -526 200 617 260 -76 -57 103 641 706
2700 706 -54 -79 357 680 344 11 -82 153 479 4 -455 -617 61 -597 -759 -709 -318 -285 -18 -457 -572
2721 -572 -53 82 183 -51 -28 444 844 284 -323 92 828 791 228 -6 0 246 -35 -298 -392 -401 273 -169
2743 -169 -341 -607 -182 19 -473 -798 -297 216 324 114 -514 -394 319 566 126 84 27 732 539 156 -120
2764a20K58K75l2j62J4k6l64k78j89K44N60r5l04l68M04N6K11m47j14L74M11n3
2786B55m83K42j38L57K09l30J4O28l22k79j18m41M85K81m75k9L37l6k57m81m15
2807i96R71k43Q98q68l20L49L34j82k64J34N90K42n53l12K12L36j23J06m67O33
2827D77J72m73m11r2J83O14m49k09l38K95N6k04j08j30L15L62j73j44J12N7N36
2848D48p54L53J05O39k43l38j60m8O84o41p5J05L61m3k81o69J96L17J28J2n09
2869d13J15j66J66M4j44O5O51m2l36J8J56K59p4m67N02J34J29j25o90m6N61Oj54
2892A49l41q0L96j21j22n44K64M74k03j06m0q1L60k08N1K38L90j40m64P7K79K10
2914D38k45l49K92K25N09l32n44k76n2L68M0J49o43J08L74l72K0j14R2M03j03
$$ plain form
2764 -120 138 413 381 219 233 207 -157 -435 -624 -380 180 85 -219 -587 -183 -127 84 -363 -477 -103 308 255
2786 255 -228 14 -124 233 442 112 126 754 432 153 35 -406 79 360 -115 -144 193 157 -100 -581 -996
2807 -996 -25 -268 630 -238 -558 -209 125 -57 -321 -187 403 645 92 -220 -8 328 205 311 -156 477
2827 477 649 176 -235 -327 -144 470 21 -188 -526 -231 -175 -379 -487 -617 -302 60 -113 -257 -145 -88 448
2848 448 -306 47 152 791 548 210 50 2 686 45 -30 75 436 393 112 -557 -361 -44 84 96 -413
2869 -413 -298 -464 -298 -254 -398 -333 318 276 -60 -42 114 373 299 -168 334 468 597 472 -218 -264 297 303 149
2892 149 -192 -272 124 3 -119 -663 -399 75 -128 -234 -274 -355 5 -203 -152 86 476 336 -128 -51 228 438
2914 438 193 -156 136 361 870 538 -6 -282 -334 34 74 223 -420 -312 62 -310 -290 -404 -312 91 -12
2935a2m28L22J48J07n26J55R8Q17N8o23m67K77L97q7l07J30M01l8k08j22n21N23
2957I4j03j8j22J2K02M4n42J09o5N63k2n74J38L08K22R0m46k00N26M02m94nJ18
2980B37J9j34j23K44l68M02J58k49p35K64L54j4l03m4K35K3m5k20n32Q83K24o6
3002B10m28J12N0K58j04j01K55m9J66j84j31L72P0l58j98J84K17N7m08o34J16
3023e28N90Q8k31m13L4K99o3J13k22r5N62J68k16N61l83j81J68k30M37j35J91
3044E14l85k58J66K7K15m65l66M03L77J6o69j66j45P90j05m09K69J83Q5j78j53
3065b54M24l30O83k97m08K06L63j82K10n11Q2L67k65l57M7PR8J71k16k50N22k66
3087a56l1l67L43N1Q4J29l9K26j26j10l9J71n3J94k5l33J32lK5m3q5m14L95K64
$$ plain form
2935 -12 -440 -118 30 137 -389 -234 -136 681 739 116 -351 -74 323 236 -71 59 460 422 214 92 -429 94
2957 94 -9 -27 -149 -137 65 109 -433 -324 -389 174 152 -422 -284 24 246 336 -110 -310 216 618 124 119 237
2980 237 256 122 -1 243 -125 277 435 186 -549 -285 69 55 -248 -292 -57 -34 -79 -299 -831 52 276 210
3002 210 -218 -106 -56 202 98 -3 252 203 369 185 54 426 496 138 -60 124 341 398 -10 -644 -528
3023 -528 62 150 -81 -494 -460 -161 -224 -111 -333 -428 134 302 86 647 264 83 251 21 458 323 514
3044 514 129 -129 37 64 279 -186 -552 -149 228 244 -425 -591 -736 54 -51 -460 -191 -8 77 -101 -254
3065 -254 170 -160 523 226 -182 24 387 205 415 -96 -14 353 88 -269 -222 -215 -117 54 -162 -412 110 -156
3087 -156 -187 -554 -211 -160 -76 53 14 240 114 4 -35 136 83 277 252 -81 51 48 73 30 -55 -469 -74 190
3111A90n3m05j69L07m8K8Q0j16K89k96j57L49ML00m31j15K02M06J15o05J16R8
3133H9J98M9p7k48j59M56n00L52j51j85K89l6k89K9j00K96j66j22K5M64n50P8
3155b58j01L58L0J89p2m32K66M36Kk21n72J24L63M39j25m69j07P4L07m57L40l21
3177b07J83m48RK86K61k07k97J0M02J94r2j98j22J14M63J73k24m4q4j78K04j73
3199B5M6K25K1j49j98r9K11j55k34m20O81J79l01J6j95m6L75K9n1j77L9N59l4
3222C47l41N6P5N7j21q2K56J03l07k9k6k13K72L3l01l4n5K74j39k38M49j80K83
3245A39k48p6N5m6LK33J18k30L83m7m52nL99p9r7L27J64k55k21k64K18j25K14
3268A08K53k31l31k58M21M10l91k99L07OK61j23m58Q9M37l09N02j02qJ6n10N9
$$ plain form
3111 190 137 -268 -437 -130 -178 -150 -70 -186 103 -193 -350 -1 3 303 -128 -243 -41 365 480 -125 -9 89
3133 89 287 336 259 11 -148 308 -192 160 9 -176 113 77 -212 -183 -283 13 -153 -275 -250 214 -336 -258
3155 -258 -359 -1 29 218 146 -286 -20 416 418 197 -375 -251 112 551 426 -43 -150 -76 231 -226 114 -207
3177 -207 -24 -472 -463 -177 84 -123 -420 -410 -8 186 94 -104 -226 -112 351 524 300 256 172 -6 198 25
3199 25 71 296 317 168 -30 -129 82 -73 -307 -727 -46 133 -168 -152 -347 -393 -18 11 -40 -217 -178 381 347
3222 347 6 62 137 194 73 -9 247 350 43 14 -12 -225 47 80 -221 -255 -310 -36 -175 -413 36 -144 139
3245 139 -109 -185 -130 -176 -173 60 178 -52 331 284 -168 -173 226 147 50 377 541 286 65 -199 19 -106 108
3268 108 361 130 -201 -459 -38 372 -19 -318 -11 -5 256 133 -325 -236 201 -108 394 292 284 300 -210 -151
3290a51K18J82o4k49pL00k68q1k15M84o14N25J07k98k18K28K15l07L51j74q2L84
3312B66m63K41k08K25p1J2r2J45N08l22k12l90N47L90k27n39K11K2M5m8k46k71
3334d77M21j01J84m3j75J26m58M23J53K45J5l53j15J06K0L39L6k09j13K2L71k75
3356A42k43j42O13k73j99O2k88K80J85n52J63J55J72k92J31Lj38K72j30K3J15
3377E9K09RL16q01k82N06K66K55m57k59J77j1m7j58P3K10l6K41k96pk14K02l16
3400c61KK40N32m74j47l3M02L7r3pj17J63K62l27j62J61j8K07k78J41l36N38l63
3423c1l21L33l21J20J48k45K90j90l8j80L74M0j9P11m59n23K75K60k71j18L36
3444A71n9j7j08k51L57LLk5l74K46lN0j23k30KK81K73k30n7j71K32j59J57K6o4
$$ plain form
3290 -151 67 249 185 -64 -71 229 -39 -120 -335 149 -465 60 167 -131 -349 -121 94 -213 138 -36 -118 266
3312 266 -197 44 -164 61 -10 2 -90 55 563 241 29 -361 186 576 349 -190 21 43 88 40 -206 -477
3334 -477 -56 -157 27 -16 -191 -65 -523 -100 53 298 313 -40 -155 -49 -29 310 346 137 24 46 417 142
3356 142 -101 -243 370 97 -102 -40 -328 -48 137 -415 -252 -97 75 -217 -86 -83 -221 51 -79 -56 59
3377 59 268 277 593 -208 -490 16 282 537 80 -179 -2 -13 -60 -218 -145 65 29 270 -26 -33 -247 -45 -361
3400 -361 -359 -119 413 -61 -208 -241 161 198 105 98 -19 144 406 79 -83 78 60 267 -11 130 -206 332 -31
3423 -31 -352 -19 -340 -220 -72 -317 -27 -217 -255 -435 -61 -21 -40 671 212 -311 -36 224 -47 -165 171
3444 171 112 95 -13 -264 93 96 99 74 -300 -54 -57 -7 -130 -360 -358 -77 196 -34 -91 -262 -30 -189 -32 -6 -70
3469g0J51L6j31j3L77l16L7J52j25J84l67k7J36k87K85o3o6J3J17O8P2o02N4L57
3493b8n8K14p0n15K23L18r3j47J66K38m3j25p1J02q6k88J64RK38r6P4j08k75Q8
3517a69J50M16o49N05l28k48N2K35k19K04N02m56p2q3K97J58k39r7K30L44l30
3538B03k27q3jK34o8l58K00J09o4k8j53k98N53k32K74m18M35k37J29k28k44N80
3560G8k65L66l17K09J27k67p2L3K52M9J26j25m51o1J76N20m42l38K98J06k22o7
3582b87l4J19J49J6n0J72r0J44j68M9j09K57J27m64L28j44K75j5k25P9r4L2J21
3605A88k57M7J7k30Q7K12k62K81j38k6j60L26j07j50M22j61j66O2K30l53L69k94
3627f3L25N6j09l5RP6n87J81J84L0N8k01k02N03k62j6M1k35K33O1l70J98k29K53
$$ plain form
3469 -70 81 117 -14 -27 350 34 71 223 98 282 -85 -112 24 -263 22 -41 -107 -94 23 91 163 -439 -385 -28
3493 -28 -86 128 58 -457 -234 84 -9 -156 10 248 205 80 9 111 25 -263 -99 -90 148 52 126 18 -257 -169
3517 -169 -19 397 -252 253 -75 -323 -271 -36 -255 -51 451 -5 -77 -160 137 295 56 -41 189 533 203
3538 203 -24 -107 -108 126 58 -300 -100 9 -55 -83 -236 -534 19 -213 61 -357 78 -159 -30 -258 -502 78
3560 78 -187 179 -138 71 198 -69 -141 -108 144 193 319 194 -257 -318 -142 378 -64 -402 -104 2 -220 -287
3582 -287 -321 -202 -53 -37 -87 85 -5 139 -29 20 -89 168 295 -169 159 15 290 275 50 129 35 67 188
3605 188 -69 -22 -5 -235 -148 64 -198 83 -55 -81 -241 85 -22 -172 250 89 -77 -15 215 -138 231 -63
3627 -63 262 318 209 174 183 259 -328 -147 37 67 125 -76 -278 225 -37 -53 -12 -247 -14 47 -323 -125 -354 -101
3651a01L50r8j81J6K10M3j28n39M39q9J72J61m22K30L53m47m0O2j38J79k2k17
3673b07k04L65J49k70J45j58J57k62N47n63M6nM54j26J53k86J5J86k26J28k66
3694b28L78l50K78k23J01P0k37K08j37J07J94l05l41K03J57J29k15K29J20k1j11
3715Fj66L10J93k71r0L91j82J47n2k42l86N55o0j42l4l59J47M77j36j70K53l60
3737a71N13l76l12K83J1K0M16k67K7l38L61J48n34J58L68J27k05l57K07K23j77
3758A25j6J40n90O69m40J52j35n1K53J18L2m33k09N48n23J82LJ1K91k09J84j82
3780h0N11o19K35P9p2L48k15p1M0oj95NJ02k61K22Q5n47N39p1j30P5j74L6J03
3804f1M41l06j20l44M54J65j62L67l41k83K9J94m18L05J81j00j58J46P1k29J29
$$ plain form
3651 -101 249 151 -30 -14 196 239 111 -428 11 -78 94 255 -167 63 416 -31 -71 -9 -147 32 10 -207
3673 -207 -411 -46 103 -167 -22 -180 -23 -285 262 -301 -255 -260 194 68 221 -65 -50 136 -90 38 -228
3694 -228 150 -200 78 -145 -44 26 -211 -3 -140 -33 161 -144 -485 -282 -125 4 -211 18 138 117 6
3715 6 -160 150 343 72 -18 373 191 338 286 44 -342 213 153 11 -23 -382 -235 242 106 -64 189 -171
3737 -171 342 -34 -346 -63 -52 -32 384 117 144 -194 167 315 -219 -61 307 434 229 -128 79 302 125
3758 125 109 249 -341 328 -112 40 -95 -146 107 225 257 -176 -385 163 -360 -178 -175 -164 127 -82 102 -80
3780 -80 431 -188 47 126 54 402 187 116 156 150 -45 -40 62 -199 23 108 -439 100 29 -101 -26 -200 -164 -61
3804 -61 380 74 -46 -390 64 229 67 434 93 -190 -161 33 -385 -80 101 1 -157 -11 60 -169 -40
3825d0R9k78N2q0K27R6l77K8L67q8j08o5M27k19J25k07l23L55J25J09j11J71l5
3848B50J03k68k23K02J91j63L28n12J44q1j65nj0K27N4r9k88k1J00J28j26p1M06
3871A01O2j82J19l28L87k17j29R4K50K13k56j77o7j0p9L21l98M7J36Q5P5j19j27
3894a99k9J77K17j02N2R1j13O5o8j38k17M04j42K57m02J70P7J01j10l4k21n6K5
3917a95K33n2j01K17j50k30L34j10Q8j12j50K11mK56L6o28M12K44j9k05q7J54
3939A42J8j15j26K07J08l99K81p4K60k97k08L1kN0N6J14j04k98K95j07M13m39
3961a94J32L0N5j68J90J2q4Q5K97j39j96J92m9l03J6Q8K31O8l55r5L53k89O6o9
3985a26p7Q6L10l7l2l24kj1L78l57L79l6k48K01L1J74j61K04l33R1K2o6k0l55
$$ plain form
3825 -40 59 -219 -167 -247 -20 76 -301 -273 94 6 -102 -167 260 41 166 -41 -364 -9 116 225 114 285 250
3848 250 353 85 -138 64 255 92 420 -92 52 -29 -194 -199 -209 18 72 -27 -315 -336 -236 -108 -234 -305 101
3871 101 163 -19 100 -228 159 -58 -187 -93 157 370 114 -63 -130 -140 -219 102 -296 -249 -113 -28 47 -72 -199
3894 -199 -228 -51 166 64 116 207 94 159 91 -47 -264 140 -2 255 -147 23 100 201 91 57 -164 -220 -195
3917 -195 38 -14 -115 102 -48 -278 56 -54 34 -78 -228 -17 -21 235 271 -357 55 299 280 75 -12 142
3939 142 160 45 -81 126 234 -165 116 42 302 5 -203 -172 -174 -124 -68 46 -58 -356 -61 -168 245 -194
3961 -194 -62 -32 23 -145 45 57 -27 58 355 216 20 212 163 -140 -124 -36 195 263 -92 -187 166 -123 -57 -126
3985 -126 -203 -117 193 156 124 -200 -202 -213 165 -192 187 151 -97 104 135 309 148 352 19 110 132 66 46 -309
4009c09M65k91K91p0J41k55j93K63k01K16j84L56r6l05J44q3J17Jj3R9j31L75
4031C37r6j69j71K17k24K36k31K95k01p7J54q3j51l1l1K39p9J73j17J5n3j61N5
4054a54J90j30M0L1O0q2n7K80m07m6L57j58J71m7r8J61l21l9N5J45j64j9MJ05
4078a23J12l19J95J01R2J7l11K95j21K60L3k76k58L62J55l3l26L51j4j80N8j55
4100h5j0jJ07R4k25J05k16J38J55J08k23N3Q6k38J48n2J4J63l05J65J26K30k07
4123A30j7j57J76J56j77q6j97lJ87j70j74M76m84O00L3m11O6K75j39j85n5J0M3
4146a03L5JJ39K0p7J3j94J96m5q4O6O0J71k82K59j60R3N5O8j68j31J18j0j95K30
4171G5l16J46p3L53m3l06K43l2J36j59k13J93J23q3L2J7K46q9j61j1k9j60M0K11
$$ plain form
4009 -309 156 -135 156 86 227 -28 -221 42 -159 57 -127 229 133 -172 -28 -111 6 7 -6 93 -38 337
4031 337 241 72 -99 118 -106 130 -101 194 -7 -84 70 -13 -164 -195 -226 13 -66 107 -10 5 -48 -209 -154
4054 -154 36 -94 -54 -23 37 -45 -102 178 -229 -275 82 -76 95 48 -50 111 -210 -249 -194 -49 -213 -232 -228 -123
4078 -123 -11 -330 -135 -34 58 75 -236 59 -62 198 231 -45 -303 59 214 181 -145 206 192 12 70 -85
4100 -85 -95 -96 11 105 -120 -15 -231 -93 62 170 -53 0 86 -152 -4 -56 -42 121 -184 -19 107 337 130
4123 130 113 -44 132 288 111 25 -172 -175 12 -158 -332 144 -340 260 293 -118 -52 223 84 -101 -156 -146 -103
4146 -103 -68 -67 72 92 15 28 -166 30 -15 -99 -33 27 198 -84 175 15 108 163 231 63 -68 50 40 -155 75
4171 75 -241 -95 -168 185 142 -164 79 47 183 24 -189 4 127 44 76 93 339 250 89 78 49 -111 -71 140
4195A40l65K72J41j57m1l47L13k41K48q0Jo5k1L77k89N6L94o39J90L6K43j66P1
4218G1p1J1J3q6J42j63j14K68n78M21JJ70j64J41q5n6Q9j21M99k83j24r6J4J16
4242A5qN1l78N13j52J00j39j67L59o3k46K57k10L42l79L9Q1k54K9L21K3l74j23
4265c63L60J68k70L72k87k69P4j66L77L48j53k06M1K13k05L3R9j01j20Pk1J93
4287A24k87J02p2k9J91k82K69r2J9n9J56Q0j1m08J87J9K49j73M4R5n9%j33N67
4311D97l97J86n9j90j67K8M19l83L11o85L45p1L07m1j78L39n07J63o0j28K58J13
4333A00k3k98K04N4P2J4l26R9L94k42o2J09l9K08r1j66k42L11J6k03J14j96K89
4356I6o3q4P4j80K08Q7l82L20p4j86K93N6l52k3K04J89J80m97M51l23L0o9k55
$$ plain form
4195 140 -225 47 188 31 -10 -357 -44 -285 -37 -117 -116 -181 -202 175 -114 -58 336 -303 -113 -77 166 0 71
4218 71 0 11 24 -62 80 -83 -197 71 -507 -86 -85 85 -79 62 -23 -79 10 -111 388 105 -19 -115 -101 15
4242 15 7 58 -320 193 41 141 2 -165 194 131 -115 142 -68 274 -105 -66 15 -239 -210 111 134 -240 -363
4265 -363 -3 165 -105 267 -20 -289 -215 -381 -4 344 191 -15 26 239 34 67 166 65 -55 -48 -69 124
4287 124 -163 -61 -133 -162 29 -253 16 -76 -57 -116 40 120 109 -299 -112 -93 156 -17 27 122 63 63 -70 497
4311 497 100 286 227 37 -130 -102 317 -66 245 -440 -95 -166 141 100 -78 261 -246 -83 -143 -271 -13 100
4333 100 77 -221 -17 37 109 123 -203 -104 290 48 -14 95 56 264 173 7 -235 76 92 -111 3 -193 96
4356 96 33 -51 23 -157 51 138 -244 76 2 -184 109 165 -187 -210 -6 183 363 -134 317 -6 24 -45 -300
4379c00K43K4l2O0j22M87l06k70J6L05N0k31k4r6K85j33k16J03M38j7l37J12j53
4402a14L60k3o9L50l21o5o8J79k9l34J96j72L11l65j82J68L77j18k01Q9p6k76
4424c83L22K92j74J06nk39LJ33M4J83k06k48J15K90q4k35O5Q4j86P0J41j91L23
4447B20l67K71j06Q3k79j7K33n04M18N5j94J26k1O2j52J05K09j70J70k6j18l45
4469c47L20k8qJ37l35M03j45k93J26O6j32Q6K12j23j68L99J83l38lm0q0J61N7
4492A10j36l11K02J08l4L23k78j74N6L89j22k18J57o9p4n5R6K35m12r2J26O5p7
4515a85M34l46K09j14J62j09JK23n77N95k72L5k0j5j38J99J44k75M0k31K46r6
4537i0K75J44m78k50N95k20k8rk43L23pN0j37J56k28J08k7%K64k12j12L22k17
$$ plain form
4379 -300 -57 -33 -65 -5 -127 360 54 -216 -200 105 155 -76 -100 -196 89 -44 -260 -157 281 264 -73 39 -114
4402 -114 246 223 154 504 183 118 50 229 200 -134 62 -110 201 -164 -346 -178 199 81 -120 -31 -107 -383
4424 -383 -61 231 57 163 158 -81 -78 55 99 282 76 -172 -57 233 149 -86 -21 63 -123 -53 88 -103 220
4447 220 -147 124 18 101 -178 -195 38 -466 -48 7 -187 -61 -82 -20 -172 -67 142 -28 142 116 -2 -347
4469 -347 -27 -55 -63 74 -261 142 -3 -296 -170 -104 -236 -150 62 -61 -229 170 353 15 12 -28 -108 53 110
4492 110 -26 -337 -135 -27 -61 262 -16 -190 -134 255 133 -85 72 3 -71 -126 -30 205 -207 -299 -173 -108 -185
4515 -185 249 -97 112 -2 160 51 52 275 -302 293 21 56 36 21 -117 82 226 -49 -9 -240 6 -90
4537 -90 185 329 -149 -399 196 -24 -52 -61 -304 19 12 62 -75 81 -147 -39 -66 -66 198 -14 -126 196 -21
4560b1Q2O5J09n24L67M5l16K03q9J44j51L63l11q6LJ37k07j31K02M2l23N28J15
4583B46l55M66r9%k55J33j63J50n02L84j89Q0J80j89j54L54k65J64j50l10K58
4604b16J58K59j95j62J11OL0R8j4L2j97k54k22L88P38r44K66K36j77J53j62J59
4626I1P0k62K59j23L4o0l4j23K86P6k86J98k92K68K05o19M42Q7j06l17K83K96
4648C73k00o0j17oQ7J0k53J11l5L51O1m47n3m6K41q3J21j36K50j97j17K48j64
4671f1J10o9m16L95K10Pj53l2J47J7O7l71k1M99k88J40j15j37K00k56J81K9k41
4694a58K33k81L54j74j14J29k33K41L1k2k9J49j31p0J1J31m09N50M1l83R8j46
4716a82J89j3k07O41o22l9L78m76M11r1J74k94k12L01k0j34K11k4j70L3L9J00
$$ plain form
4560 -21 61 126 235 -289 78 123 -193 10 -79 65 -86 277 -34 -120 -117 20 -187 -318 -116 -74 -397 131 246
4583 246 -109 357 258 258 3 136 -27 123 -379 5 -184 -104 76 -113 -267 87 -178 -14 -164 -474 -216
4604 -216 -58 201 6 -156 -45 -39 -9 89 75 107 -90 -344 -566 -178 560 -384 -118 118 -59 94 -68 91
4626 91 161 -101 158 35 69 9 -25 -148 138 214 -72 126 -166 102 307 -312 130 217 111 -206 77 373
4648 373 173 113 -4 -10 77 87 -166 -55 -90 261 322 -125 -178 -224 17 -66 55 -81 169 -28 -145 103 -61
4671 -61 49 -20 -436 -41 169 176 23 -9 138 155 222 -149 -170 329 41 181 66 -71 129 -127 54 83 -158
4694 -158 75 -206 148 -26 -140 -11 -244 -3 28 6 -23 126 -5 -75 -64 67 -342 208 249 -134 -36 -182
4716 -182 7 -6 -213 428 -194 -233 145 -331 80 -11 163 -131 -343 -42 -62 -196 15 -9 -179 -146 -107 -7
4738go4j04K08J31rk81J39j49K63l0j63L5J62m23K37k1mJ39kl04M05j90k8J83
4762A23k2k44r3P6Q2K21j75j96J5L91n23M56m56M93j79K59j27L4K7M0m31O1J18
4785e0R7j49J23K25j82j19j58M38j78k35J39j39J29NK22Kl77P9J16P0j9j55L52
4808B36m6k07J86N8m23O6P0J8q4K2n8o9K59L3l1k28J57k54K6p5K22N6M7J01j76
4833i4K4M8K08k80Q5Jr4K44j54k9J37pj58j94k1K64k44L78L3k95J6L88k38K39
4857B57l39n2M26n16L25J4j04k03M27k57L96l22J28j69q7K38k27OK74j60N7L2
4879A44k40J28J37l71Q5N2J06R2k74J59k68L45k6j23R6J75p6p7n1L7j3K2k27K13
4903D5k43L47l86M5K38J8p5p8j23M22l10j86L45j79K25K47m57m7K03r3L34k91
$$ plain form
4738 -7 -71 -175 33 164 155 -126 13 -136 127 97 -66 -31 131 -292 -55 -76 -80 59 57 -247 158 -32 -60 123
4762 123 101 -143 -236 -160 -78 143 -32 -228 -213 178 -345 111 -345 148 -31 228 101 135 162 202 -229 -168 -50
4785 -50 47 -102 21 246 64 -55 -213 225 47 -188 -49 -188 -59 -54 168 170 -207 -128 -12 58 39 -116 236
4808 236 190 -17 169 227 -196 -130 -60 -42 -126 -104 -162 -231 28 61 30 -198 -41 -295 -269 -344 -122 -66 -19 82 -94
4833 -94 -70 -22 186 -94 -9 -8 -102 142 -12 -41 96 89 -69 -263 -284 -20 -264 114 147 -148 -132 256 18 257
4857 257 -82 -134 292 -224 101 115 11 -192 235 -22 374 52 180 11 -76 162 -65 -59 215 55 112 144
4879 144 -96 32 169 -202 -117 -65 41 133 -141 18 -250 95 69 -54 42 217 141 64 13 50 37 59 -168 45
4903 45 -198 149 -237 -192 46 64 -11 -89 -212 210 -100 -286 59 -120 105 352 -105 -152 51 -42 292 1
4925AJ70L1J19k82J17q0L9j54j77L31k32q7O5L19j52j2N1r4l34J91M7K20q9n31
4949e23M10M57m35j93O00j52O0j82J03m9k8q2N9M4P6J00n77L97j09j02o4K5J20
4972d5j83nJ48M1j15J57o4o7L29n7KN8J21l51j95L62L0r7P9Qk48m6K65o9K16j22
4998A52j97k16L04k96M18j59r8J55o9L0K66k88j62J11j20J80k01j78L75J70or6
5020G5j36L66j91K2k84J09p4r6J20J73k78j91J53K03J41J25j03k86J65R5k66k46
5042d04N78j90J81l58M45k52k17M52l88L23n11K71M8j13J63o3j97L57M4nl55J51
5064d0j52M15l12K23k42N0k6M5j39L48k43K82m24K21J78k38M4K4J87j40l6k70
5086b45J36K6j2J61j08Q5J0k33J10p2K54n0k3J13j29k08L35j20j43K04k90K19
$$ plain form
4925 1 171 202 321 39 156 76 115 -39 -216 115 -117 -204 -139 180 28 16 67 -27 -361 -170 -123 97 8 -523
4949 -523 -113 344 -91 -284 316 164 224 42 145 96 68 -14 45 89 165 265 -312 85 -24 -126 -190 -165 -45
4972 -45 -228 -233 -85 -44 -159 -2 -66 -133 196 139 141 199 320 -31 -226 136 166 69 148 156 -92 -138 127 58 274 152
4998 152 -45 -261 43 -253 165 6 -92 63 -6 24 290 2 -160 -49 -169 11 -190 -368 7 177 171 75
5020 75 -61 305 114 136 -148 -39 -113 -209 -89 84 -194 -385 -232 -29 112 237 134 -152 13 108 -158 -404
5042 -404 174 -16 165 -193 252 0 -217 235 -153 170 -341 -70 -22 -135 28 -35 -232 125 169 164 -191 -40
5064 -40 -192 223 -89 134 -108 -58 -84 -39 -178 170 -73 209 -215 6 184 -54 -10 14 201 61 25 -245
5086 -245 -109 -83 -95 66 -42 43 53 -180 -70 -142 112 62 39 152 23 -185 150 30 -113 91 -199 20
5108B0J22r4m4M1K00j00k51K11J30l23O8j52L30M8k22M0K0k70K00J60k38K53l37
5131a88l4J79J96j37PJ71l03j78L47j10J44K6m01J54k38K13K21l58M13K8ol4L5
5154A47j51J21j65K70j97p5J7M8K8l71L77k23j1K79j67k08N18m50K39j6j16J15
5176IK90k32P1L4k20n9K34j08l72K91J8K3L1K23k48J2q7N4l14K02j81K77L42l1
5200B59k19k54J65J80k00J68j80k8O0J06J05j15k1N3Nj48LL40j01j06k04M10j44
5223A34Q6k73j38j44M90k14K10r0k07N1K06L52n43J15q1J28n9J72k59J06l0K1
5245C3j53K42O1k84P8K07kk7k9k43J26K60k62j4K33l8k87J29k21P6K02n8k1J53
5269A61k20K18j60P7j28j00L9J49P7J9k34J47l12K75j25m35K63M63j18k31L7j09
$$ plain form
5108 20 142 48 4 45 245 145 -106 105 235 -88 -20 -172 158 206 -16 24 44 -226 -26 134 -104 149 -188
5131 -188 -222 -43 153 16 23 194 -109 -287 60 -50 94 120 -281 -127 -365 -152 69 -289 124 152 146 112 147
5154 147 -4 117 -48 222 25 -50 -33 15 43 -328 49 -174 -185 94 -73 -281 237 -213 26 10 -106 9
5176 9 299 67 138 172 -48 -107 127 19 -353 -62 -44 -21 10 233 -15 -3 -90 -36 -350 -148 -329 -52 290 259
5200 259 40 -214 -49 131 -69 99 -81 -109 -49 57 162 47 26 79 84 -64 -61 279 178 72 -132 278 134
5223 134 220 -53 -191 -335 155 -59 151 61 -146 -95 111 463 -80 35 -46 82 23 195 -64 42 12 33
5245 33 -120 122 183 -101 -23 184 182 155 126 -117 9 269 7 -7 226 188 -99 30 -191 -115 87 29 8 161
5269 161 -59 159 -1 76 -52 -152 -113 36 113 132 -102 45 -267 8 -117 -552 -289 174 56 -175 -138 -247
5291b47L48J66l4j53o6J6j31q1K25K63l49j71K78pK13j50q0K2QJ32j33n3J4k5
5315EK18m55L35j24L92l59O8j3m1j21M2J15l14K70n4p3j85M97m56J31m2K77k18
5338a05M6K34P7l48L76k58n7J9P4J2j84K7L34k78OK78m58L58n75J13N31j22j1
5361H9K01l00L7k05L05J40m26M0Q6J15l60M6L84l27L75k22J20l39M47k36k75J97
5383a08J10j7P2Lk85Q1L30r1J44j01j58K68o9m64K15k5L03o1j74K99j74j70k67
5406c39J72r2QJ87m8P4J8k41o6j92K84L11J18l77k0M10l50J71K99q7n04L04j24
5429h4j79K94mPL7n2j11K56O4j1m51M05m62L75J2j35k23M62m1k67K47j29o4K05
$$ plain form
5291 -247 101 267 233 80 14 30 -101 -182 43 306 -43 -214 64 57 270 120 40 62 70 202 69 16 30 5
5315 5 223 -232 103 -21 371 12 80 67 26 -95 -53 62 -252 18 -36 -109 -294 203 -253 -122 -164 113 -105
5338 -105 -59 175 252 -96 280 22 -35 -16 58 70 -114 -87 247 -31 -25 253 -205 153 -422 -309 222 100 89
5361 89 290 -10 27 -178 127 267 -159 -119 -33 82 -278 -232 152 -175 200 -22 98 -241 206 -30 -305 -108
5383 -108 2 -15 57 60 -225 -144 186 95 239 138 -20 248 179 -285 -70 -95 208 147 -27 272 98 -72 -339
5406 -339 -167 -259 -251 -64 -112 -38 -20 -261 -327 -519 -235 76 194 -183 -203 207 -143 28 327 240 -264 40 -84
5429 -84 -263 31 27 34 71 19 -92 164 228 217 -234 171 -291 84 96 -39 -262 200 159 -108 139 10 -54 151
$$ [...]
8191a64
##END NTUPLES=NMR FID
##END=
