##TITLE=1H_SL64-SPh(1)-f3-4
 CDCl3, 8 sc, 
 11.1.2019
##JCAMPDX= 6.0         $$ Bruker NMR JCAMP-DX V2.0
##DATA TYPE= NMR FID
##DATA CLASS= NTUPLES
##ORIGIN= UXNMR, Bruker Analytische Messtechnik GmbH
##OWNER= root
$$ XWIN-NMR		Version 3.5
$$ Fri Jan 11 14:03:36 2019 Russian Standard Time (UT+4h)  she@DPX200
##.OBSERVE FREQUENCY= 200.1313
##.OBSERVE NUCLEUS= ^1H
##.DELAY= (6, 6)
##.ACQUISITION MODE= SIMULTANEOUS
##.ACQUISITION SCHEME= undefined
##.AVERAGES= 8
##.DIGITISER RES= 18
##SPECTROMETER/DATA SYSTEM= spect
##.PULSE SEQUENCE= zg30
##.SOLVENT NAME= CDCl3
##.SHIFT REFERENCE= (INTERNAL, CDCl3, 0, 15.7039)
##AUDIT TRAIL= $$ (NUMBER, WHEN, WHO, WHERE, WHAT)
$$ ##TITLE= Audit trail, XWIN-NMR		Version 3.5
$$ ##JCAMPDX= 5.01
$$ ##ORIGIN= Bruker BioSpin GmbH
$$ ##OWNER= she
$$ F:/spectra/data/she/nmr/H-F/1/audita.txt
$$ ##AUDIT TRAIL=  $$ (NUMBER, WHEN, WHO, WHERE, WHAT)
(   1,<2019-01-11 14:02:00.96 +0400>,<she>,<DPX200>,
      <created by zg, POWCHK disabled, PULCHK disabled
       configuration hash MD5:
       00 E9 B6 7A A2 85 ED C7 34 08 36 98 17 FE 4E 26
       data hash MD5: 16K
       E2 36 0B BF A3 B8 31 44 84 CD 23 56 D6 92 8D BB>)
$$ ##END=
$$ 
$$ hash MD5
$$ FD 1A 93 C7 D3 3A C7 DB 2C 1E 37 B2 E3 A3 9A 63
##$RELAX= 
##$RELAX= 
##$RELAX= 
##$RELAX= 
##$RELAX= 
##$RELAX= 
$$ Bruker specific parameters
$$ --------------------------
##$DU= <F:/spectra>
##$EXPNO= 1
##$NAME= <H-F>
##$PROCNO= 1
##$TYPE= <nmr>
##$USER= <she>
##$AMP= (0..31)
100 100 100 100 100 100 100 100 100 100 100 100 100 100 100 100 100 100 
100 100 100 100 100 100 100 100 100 100 100 100 100 100 
##$AQSEQ= 0
##$AQ_mod= 1
##$AUNM= <au_zg>
##$AUTOPOS= <>
##$BF1= 200.13
##$BF2= 200.13
##$BF3= 200.13
##$BF4= 200.13
##$BF5= 200.13
##$BF6= 200.13
##$BF7= 200.13
##$BF8= 200.13
##$BYTORDA= 1
##$CFDGTYP= 0
##$CFRGTYP= 5
##$CHEMSTR= <none>
##$CNST= (0..31)
1 1 145 1 1 1 1 1 1 1 1 1 1 1 1 1 1 1 1 1 1 1 1 1 1 1 1 1 1 1 1 1 
##$CPDPRG= <>
##$CPDPRG1= <>
##$CPDPRG2= <>
##$CPDPRG3= <>
##$CPDPRG4= <mlev>
##$CPDPRG5= <mlev>
##$CPDPRG6= <mlev>
##$CPDPRG7= <mlev>
##$CPDPRG8= <mlev>
##$CPDPRGB= <>
##$CPDPRGT= <>
##$D= (0..31)
0 1.2 0 0 0 0 0 0 0 0 0 0.03 0 0 0 0 0 0 0 0 0 0 0 0 0 0 0 0 0 0 0 0 
##$DATE= 1547200920
##$DBL= (0..7)
120 120 120 120 120 120 120 120 
##$DBP= (0..7)
150 150 150 150 150 150 150 150 
##$DBP07= 0
##$DBPNAM0= <>
##$DBPNAM1= <>
##$DBPNAM2= <>
##$DBPNAM3= <>
##$DBPNAM4= <>
##$DBPNAM5= <>
##$DBPNAM6= <>
##$DBPNAM7= <>
##$DBPOAL= (0..7)
0.5 0.5 0.5 0.5 0.5 0.5 0.5 0.5 
##$DBPOFFS= (0..7)
0 0 0 0 0 0 0 0 
##$DE= 6
##$DECBNUC= <off>
##$DECIM= 24
##$DECNUC= <off>
##$DECSTAT= 4
##$DIGMOD= 1
##$DIGTYP= 9
##$DL= (0..7)
0 120 120 120 120 120 120 120 
##$DP= (0..7)
150 150 150 150 150 150 150 150 
##$DP07= 0
##$DPNAME0= <>
##$DPNAME1= <>
##$DPNAME2= <>
##$DPNAME3= <>
##$DPNAME4= <>
##$DPNAME5= <>
##$DPNAME6= <>
##$DPNAME7= <>
##$DPOAL= (0..7)
0.5 0.5 0.5 0.5 0.5 0.5 0.5 0.5 
##$DPOFFS= (0..7)
0 0 0 0 0 0 0 0 
##$DQDMODE= 0
##$DR= 18
##$DS= 0
##$DSLIST= <SSSSSSSSSSSSSSS>
$$ [...]
##$SUBNAM2= <"">
##$SUBNAM3= <"">
##$SUBNAM4= <"">
##$SUBNAM5= <"">
##$SUBNAM6= <"">
##$SUBNAM7= <"">
##$SUBNAM8= <"">
##$SUBNAM9= <"">
##$SW= 24.933730806125
##$SWIBOX= (0..15)
0 0 2 0 0 0 0 0 0 0 0 0 0 0 0 0 
##$SW_h= 4990.01996007984
##$TD= 16384
##$TD0= 1
##$TE= 0
##$TE2= 300
##$TE3= 300
##$TEG= 300
##$TL= (0..7)
0 120 120 120 120 120 120 120 
##$TP= (0..7)
150 150 150 150 150 150 150 150 
##$TP07= 0
##$TPNAME0= <>
##$TPNAME1= <>
##$TPNAME2= <>
##$TPNAME3= <>
##$TPNAME4= <>
##$TPNAME5= <>
##$TPNAME6= <>
##$TPNAME7= <>
##$TPOAL= (0..7)
0.5 0.5 0.5 0.5 0.5 0.5 0.5 0.5 
##$TPOFFS= (0..7)
0 0 0 0 0 0 0 0 
##$TUNHIN= 0
##$TUNHOUT= 0
##$TUNXOUT= 0
##$USERA1= <user>
##$USERA2= <user>
##$USERA3= <user>
##$USERA4= <user>
##$USERA5= <user>
##$V9= 5
##$VALIST= <valist>
##$VCLIST= <CCCCCCCCCCCCCCC>
##$VD= 0
##$VDLIST= <DDDDDDDDDDDDDDD>
##$VPLIST= <PPPPPPPPPPPPPPP>
##$VTLIST= <TTTTTTTTTTTTTTT>
##$WBST= 1024
##$WBSW= 4
##$XGAIN= (0..3)
0 0 0 0 
##$XL= 0
##$YL= 0
##$YMAX_a= 187098
##$YMIN_a= -251224
##$ZGOPTNS= <>
##$ZL1= 120
##$ZL2= 120
##$ZL3= 120
##$ZL4= 120
##$ABSF1= 10
##$ABSF2= 0
##$ABSG= 5
##$ABSL= 3
##$ALPHA= 0
##$AQORDER= 0
##$ASSFAC= 0
##$ASSFACI= 0
##$ASSFACX= 0
##$ASSWID= 0
##$AUNMP= <proc_1d>
##$AZFE= 0.1
##$AZFW= 0.1
##$BCFW= 1
##$BC_mod= 2
##$BYTORDP= 1
##$COROFFS= 0
##$CY= 11.3945322036743
##$DATMOD= 1
##$DC= 2
##$DFILT= <>
##$DTYPP= 0
##$F1P= 18.9103706918063
##$F2P= -1.10871071338519
##$FCOR= 0.5
##$FTSIZE= 0
##$FT_mod= 4
##$GAMMA= 1
##$GB= 0.15
##$INTBC= 1
##$INTSCL= 1
##$ISEN= 128
##$LB= 0.24
##$LEV0= 0
##$LPBIN= 0
##$MAXI= 10000
##$MC2= 0
##$MEAN= 0
##$ME_mod= 0
##$MI= 1.114404
##$NCOEF= 0
##$NC_proc= 0
##$NLEV= 6
##$NOISF1= 3.799351
##$NOISF2= 2.8
##$NSP= 1
##$NTH_PI= 0
##$NZP= 0
##$OFFSET= 15.70392
##$PC= 1
##$PHC0= -8854.062
##$PHC1= 17.40006
##$PH_mod= 1
##$PKNL= yes
##$PPARMOD= 0
##$PSCAL= 0
##$PSIGN= 0
##$REVERSE= no
##$SF= 200.130013532006
##$SI= 16384
##$SIGF1= 3
##$SIGF2= 2
##$SINO= 400
##$SIOLD= 16384
##$SREGLST= <1H.CDCl3>
##$SSB= 0
##$STSI= 0
##$STSR= 0
##$SW_p= 3612.71676300578
##$SYMM= 0
##$S_DEV= 0
##$TDeff= 0
##$TDoff= 0
##$TI= <>
##$TILT= no
##$TM1= 0
##$TM2= 0
##$TOPLEV= 0
##$USERP1= <user>
##$USERP2= <user>
##$USERP3= <user>
##$USERP4= <user>
##$USERP5= <user>
##$WDW= 1
##$XDIM= 8192
##$YMAX_p= 0
##$YMIN_p= 0
$$ End of Bruker specific parameters
$$ ---------------------------------
##NTUPLES= NMR FID
##VAR_NAME=  TIME,          FID/REAL,        FID/IMAG
##SYMBOL=    X,             R,               I
##VAR_TYPE=  INDEPENDENT,   DEPENDENT,       DEPENDENT
##VAR_FORM=  AFFN,          ASDF,            ASDF
##VAR_DIM=   8192,          8192,            8192
##UNITS=     SECONDS,       ARBITRARY UNITS, ARBITRARY UNITS
##FACTOR=    0.0002004,     1,               1
##FIRST=     0,             0,               0
##LAST=      1.6414764,     0,               0
##MIN=       0,             -251224,         0
##MAX=       1.6414764,     187098,          0
$$ Real data points
##PAGE= N=1
##DATA TABLE= (X++(R..R)), XYDATA
$$ plain form
0 0 0 0 0 0 0 0 8 -8 8 -8 16 -16 24 -24 32 -40 48 -56 65 -80 94 -110 127 -145 167 -193 217 -248 281 -319
30 -319 359 -400 450 -504 562 -626 697 -775 861 -952 1056 -1169 1294 -1434 1587 -1762 1958
47 1958 -2178 2434 -2732 3082 -3501 4015 -4664 5513 -6671 8360 -11068 16126 -28891 132357
61 132357 176160 -73318 -67188 45231 158485 106239 23275 -14722 22232 17795 -28548 -86805
73 -86805 -97579 -103214 -110880 -111897 -69165 -25995 -19915 -52308 -61226 -36334 -6953 -1332 17923
86 17923 71489 125190 114154 53668 17003 47446 90985 83473 34683 9893 25750 32247 -11006
99 -11006 -68610 -83334 -52009 -27946 -41869 -70879 -76902 -57087 -34594 -24602 -22935 -24718 -23404
112 -23404 -5649 33491 70879 72131 37944 13808 29881 60373 58184 22356 2132 21255
$$ packed form
0@%%%%%%Qj6J6j6K4l2M0m8N6p2Q8j04J21j45J74k04K37k72L12l60M10m65N29o00
30c19O78p59Q50r54J066j188J323j472J636j813K008k225K463k728L021l349L720
47A958m136M612n166N814o583P516q679J0177j2184J5031j9428K7194m5017J61248
61A32357M3803k49478O130J12419J13254n2246q2964l7997L6954m437m6343n8257
73h6805j0774n635p666j017M2732M3170O080l2393q918K4892K9381N621J9255
86A7923N3566N3701j1036o0486l6665L0443M3539p512m8790k4790J5857O497m3253
99a1006n7604j4724L1325K4063j3923k9010o023J9815K2493R992J667j783J314
112b3404J7755L9140L7388J252l4187k4136J6073L0492k189l5828k0224J9123
$$ plain form
124 21255 44927 29282 -15824 -42162 -31342 -17027 -27100 -44370 -39726 -16145 -5565 -15173
136 -15173 -23824 -17567 -9488 -11854 -12571 3863 23532 23750 11182 12602 29654 27858 -4837 -30381
150 -30381 -7975 41597 54705 11051 -38139 -37108 3172 29159 18516 -1163 -7985 -10052 -17318
163 -17318 -13647 10853 28906 7719 -33358 -39293 2881 36702 12444 -41503 -57609 -19590
175 -19590 17864 12749 -9967 -8615 9611 7014 -17526 -21054 14686 47376 37293 5015 2255
188 2255 29661 40645 12884 -14751 -2933 27237 25772 -10102 -35046 -22896 -3896 -12224 -34880
201 -34880 -36223 -17283 -11376 -27041 -33083 -11538 12156 5240 -14249 -5543 32658 53796 30792
214 30792 -2128 1247 34375 50668 31816 7376 5095 13126 4699 -15643 -23402 -13511 -9055
$$ packed form
124B1255K3672j5645m5106k6338J0820J4315j0073j7270M644K3581J0580r608
136a5173q651O257Q079k366p17J6434J9669K18j2568J420J7052j796l2695k5544
150c0381K2406M9572J3108m3654m9190J031M0280K5987j0643j9679o822k067p266
163a7318L671K4500J8053k1187m1077n935M2174L3821k4258n3947j6106L8019
175a9590L7454n115k2716J352J8226k597k4540l528L5740L2690j0083l2278k760
188B255K7406J0984k7761k7635J1818L0170j465l5874k4944J2150J9000q328k2656
201c4880j343J8940N907j5665o042K1545K3694o916j9489Q706L8201K1138k3004
214C0792l2920L375L3128J6293j8852k4440k281Q031q427k0342p759R891M456
$$ plain form
227 -9055 -21257 -33411 -30258 -22555 -25934 -33211 -23916 -1166 8701 -1150 -8774 5514 25566 25694
241 25694 11250 11388 32915 47397 32318 5104 -2644 9345 13921 1111 -10118 -6157 -562
254 -562 -11506 -29693 -32415 -18348 -11275 -18843 -22527 -6937 9545 4342 -14343 -15721 6707 25719
268 25719 21179 8364 10655 22573 19258 1164 -5436 10475 23387 9814 -14528 -16558 3212
281 3212 10022 -11393 -31464 -20857 6795 14169 -5033 -20641 -12572 2062 1494 -5323 2586 18387
295 18387 15992 -5892 -17641 -604 19853 12925 -9719 -13650 7610 20584 2505 -23205 -21599
308 -21599 3221 16371 4339 -8289 -2170 10120 5336 -9663 -9126 8070 17758 8000 -4017
321 -4017 934 10079 2785 -15866 -18345 1401 16312 4547 -16203 -18017 -2803 2693 -10404
$$ packed form
227i055j2202j2154L153P703l379p277R295K2750R867r851p624J4288K0052J28
241B5694j4444J38K1527J4482j5079k7214p748J1989M576j2810j1229L961N595
254e62j0944j8187k722J4067P073p568l684J5590J6482n203j8685j378K2428J9012
268B5719m540j2815K291J1918l315j8094o600J5911J2912j3573k4342k030J9770
281C212O810k1415k0071J0607K7652P374j9202j5608Q069J4634n68o817P909J5801
295A8387k395k1884j1749J7037K0457o928k2644l931K1260J2974j8079k5710J606
308b1599K4820J3150j2032j2628O119J2290m784j4999N37J7196R688r758j2017
321d017M951R145p294j8651k479J9746J4911j1765k0750j814J5214N496j3097
$$ plain form
334 -10404 -18575 -4240 16904 17091 -467 -10163 -60 12968 11336 3694 6658 16310 16514 3282
348 3282 -4485 554 5966 359 -9114 -8554 -533 -1544 -13731 -20305 -12000 -1859 -4999 -13946 -11347
363 -11347 2241 6545 -3683 -10822 38 18393 21632 9047 685 6563 13842 9864 2443 5226
377 5226 13801 11763 -2376 -11874 -8292 -2302 -5465 -12117 -10273 -2185 -4515 -16801 -21310 -8752
391 -8752 5482 2640 -8665 -7270 9715 19044 7993 -7184 -4799 11477 20835 15953 11422 13429
405 13429 10820 -4569 -17917 -10535 10178 17270 1925 -14210 -12416 -2916 -5811 -19372 -21993
418 -21993 -6603 7467 3789 -7374 -6572 4318 5708 -5055 -9887 2714 18340 17541 5370
431 5370 810 7769 8992 -585 -6589 3706 16666 10437 -10409 -19634 -7036 6968 3006 -10541
$$ packed form
334a0404q171J4335K1144J87j7558r696J0103J3028j632p642K964R652K04j3232
348C282p767N039N412n607r473N60Q021j011j2187o574Q305J0141l140q947K599
363a1347J3588M304j0228p139J0860J8355L239j2585q362N878P279l978p421K783
377E226Q575k038j4139r498L582N990l163o652J844Q088k330j2286m509J2558
391h752J4234k842j1305J395J6985R329j1051j5177K385J6276R358m882m531K007
405A3429k609j5389j3348P382K0713P092j5345j6135J794R500k895j3561k621
418b1993J5390J4070l678j1163Q02J0890J390j0763m832J2601J5626p99j2171
431E370m560O959J223r577o004J0295J2960o229k0846r225J2598J4004l962j3547
$$ plain form
445 -10541 -10987 1362 4796 -8478 -18776 -9980 7893 10684 -1239 -6838 3440 13291 6460 -6856
459 -6856 -7845 4773 12947 7517 -315 1073 5654 2272 -5249 -3481 4648 6003 -3478 -10012 -2774
474 -2774 7112 4471 -7311 -9032 2549 10879 2287 -12053 -12746 -25 8025 2461 -5245 -2209
488 -2209 5105 3723 -5070 -10326 -5632 1728 4068 4301 6061 5121 -1708 -6692 -1193 11357 13792
503 13792 2288 -7331 -2220 9188 9866 -1139 -7323 -767 5188 -1064 -12561 -13908 -3771 1074
517 1074 -5572 -12343 -6289 4797 5330 -4483 -10518 -4750 2981 5539 6952 13549 18845 12836 -123
532 -123 -4494 4981 13380 8908 -393 80 7420 5047 -10612 -20874 -12691 1609 121 -15088 -22865
547 -22865 -12112 1703 351 -9438 -11028 554 10503 8878 3773 4938 9854 9883 7310 11221 20344
$$ packed form
445a0541m46J2349L434j3274j0298Q796J7873K791j1923n599J0278R851o831j3316
459f856r89J2618Q174n430p832J388M581l382p521J768Q129J355r481o534P238
474b774R886k641j1782j721J1581Q330q592j4340o93J2721Q050n564p706L036
488b209P314j382q793n256M694P360K340K33J760r40o829m984N499J2550K435
503A3792j1504r619N111J1408O78j1005o184O556N955o252j1497j347J0137M845
517A074o646o771O054J1086N33r813o035N768P731K558J413O597N296o009j2959
532a23m371R475Q399m472r301M73P340k373j5659j0262Q183J4300j488j5209p777
547b2865J0753J3815j352r789j590J1582R949j625n105J165M916K9k573L911R123
$$ plain form
562 20344 20033 6841 -6123 -4998 3606 2683 -7752 -13349 -5482 1940 -5345 -21377 -26097 -15101
576 -15101 -3124 -1720 -6311 -4788 1866 4301 1467 408 6703 13937 15195 13326 13483 14102 8420
591 8420 -524 -1495 6230 12386 6753 -5511 -11248 -8644 -7991 -13547 -16595 -10772 -1921 -1237 -7633 -10720
607 -10720 -6246 -2165 -3340 -4285 2843 13674 16682 10147 3931 3849 6699 5840 4895 8680 12639 8769
623 8769 -2441 -8878 -4614 669 -2580 -9523 -8527 -1015 639 -8994 -17762 -12336 860 6015 -1167
638 -1167 -6610 -2357 4796 3905 -1857 -1721 5887 10500 7190 2966 5113 7990 3169 -4731 -3221 7915
654 7915 12822 3719 -8432 -7829 2233 5434 -4224 -11724 -6507 3938 3521 -6534 -12906 -7729 59
669 59 13 -3741 -2130 3279 3558 -2996 -6051 1418 10310 9721 3316 2075 7267 9726 3575 -2574 1369
$$ packed form
562B0344l11j3192j2964J125Q604r23j0435n597P867P422p285j6032m720J0996
576a5101J1977J404m591J523O654K435k834j059O295P234J258j869J57O19n682
591H420q944r71P725O156n633j2264n737K604O53n556l048N823Q851O84o396l087
607a0720M474M081j175r45P128J0831L008o535o216q2K850q59r45L785L959l870
623H769j1210o437M264N283l249o943R96P512J654r633q768N426J3196N155p182
638a167n443M253P153q91n762J36P608M613l310m224K147K877m821p900J510J1136
654G915M907r103j2151O03J0062L201r658p500N217J0445m17j0055o372N177P788
669E9m6l754J611N409K79o554l055P469Q892n89o405j241N192K459o151o149L943
$$ plain form
686 1369 9671 9973 946 -6645 -4924 -965 -3162 -9258 -9609 -3994 -1285 -6572 -11859 -9702 -3757 -1624
702 -1624 -4587 -3586 3357 8429 7144 2222 1720 6350 9799 10027 10030 10927 8959 2700 -2549 -1460 2594
719 2594 2077 -3810 -8096 -6235 -4722 -8029 -14755 -14911 -7514 -1206 -467 -4103 -4995 -2798 -689 965
735 965 4877 10667 12232 8903 6668 8027 9546 6181 697 904 7198 9873 2890 -7718 -11068
750 -11068 -6510 -4306 -8006 -11162 -7477 -1350 -1559 -7733 -11060 -7063 -801 1421 2195 5866 10557
765 10557 7688 37 -2212 4785 12846 11218 4031 1181 4486 5146 -1093 -7346 -4958 1625 1959
780 1959 -4584 -8455 -4875 -491 -3305 -9480 -8877 442 5883 2321 -3894 -3279 2128 3826 345 -205
796 -205 4746 8799 5524 -1858 -3070 1072 3846 2151 201 2279 4096 -137 -5651 -5626 1049 5352
$$ packed form
686A369Q302L02r027p591J721L959k197o096l51N615K709n287n287K157N945K133
702a624k963J001O943N072j285m922n02M630L449K28LQ97j968o259n249J089M054
719B594n17n887m286J861J513l307o726j56P397O308P39l636q92K197K109J654
735I65L912N790J565l329k235J359J519l365n484K07O294K675o983j0608l350
750a1068M558K204l700l156L685O127k09o174l327L997O262K222P74L671M691
765A0557k869p651k249O997Q061j628p187k850L305O60o239o253K388O583L34
780A959o543l871L580M384k814o175O03R319N441l562o215O15N407J698l481n50
796b05M951M053l275p382j212M142K774j695j950K078J817m233n514K5O675M303
$$ plain form
812 5352 1608 -4491 -4580 571 2313 -1995 -6156 -3491 2176 3704 -41 -3907 -4240 -2921 -2189 -954
828 -954 2053 3798 2436 -1137 -801 1868 2238 353 -310 4213 9989 7962 652 -3783 -2274 732
844 732 1146 -379 190 2146 203 -5098 -9237 -7723 -4047 -2613 -2719 -1545 490 -805 -4665 -4949
860 -4949 -376 5391 6442 3400 2838 5844 7316 3685 -109 1628 6911 7044 2275 -1417 -576 1095
876 1095 -3530 -9263 -8985 -1689 2766 -1119 -8548 -10423 -5847 -2077 -2455 -2446 1077 4833 3647 644
892 644 1110 4672 7105 5377 3684 5895 7967 4673 -1341 -2290 2107 5051 1165 -4855 -5860 -2600
908 -2600 -2293 -7313 -10672 -6999 277 2467 -1654 -5249 -4065 -1442 -1293 -1417 1948 7865 9467 5352
924 5352 905 1487 3730 3498 1641 2271 5496 5993 1507 -3898 -4759 -2896 -2145 -3404 -3503 -1169 -371
$$ packed form
812E352l744o099q9N151J742m308m161K665N667J528l745l866l33J319P32J235
828i54L007J745j362l573L36K669L70j885o63M523N776k027p310m435J509L006
844G32M14j525N69J956j943n301m139J514L676J434j06J174K035j295l860k84
860d949M573N767J051l042n62L006J472l631l794J737N283J33m769l692Q41J671
876A095m625n733K78P296M455l885p429j875M576L770l78RL523L756j186l003
892F44M66L562K433j728j693K211K072l294o014r49M397K944l886o020j005L260
908b600L07n020l359L673P276K190m121l595J184K623J49j24L365N917J602m115
924E352m447N82K243k32j857O30L225M97m486n405q61J863P51j259r9K334P98
$$ plain form
941 -371 -3878 -7148 -6227 -1500 764 -25 -1396 735 3333 1952 -595 -1323 2067 6064 5938 4208
957 4208 3009 2577 601 -1259 -1068 1335 2989 1708 -709 -1263 -1802 -3576 -5360 -4123 209 1554
973 1554 -836 -4514 -4754 -1696 287 -339 260 2043 3220 1021 -1487 -844 2577 3980 2056 994
989 994 3259 5265 2835 -2438 -4427 -1087 2355 2123 -241 -122 1264 -305 -5036 -6934 -3483 1036
1005 1036 1756 -817 -1779 -285 -109 -2954 -4214 -391 4885 4838 186 -2536 403 4121 3329 -79
1021 -79 -379 3318 5265 1425 -2901 -2126 1438 2163 -541 -2243 -346 1690 -1025 -5176 -5798 -2141
1037 -2141 1134 346 -1494 -639 739 87 -3261 -3479 849 5046 4064 940 414 2114 2027 -333 -1287
1054 -1287 1978 5695 4864 -226 -3188 -1736 112 -278 -2242 -1565 842 1238 -1783 -4461 -4526 -2031
$$ packed form
941c71l507l270R21M727K264p89j371K131K598j381k547p28L390L997j26j730
957D208j199m32j976j860J91K403J654j281k417n54n39j774j784J237M332J345
973A554k390l678k40L058J983o26N99J783J177k199k508O43L421J403j924j062
989I94K265K006k430n273j989L340L442k32k364J19J386j569m731j898L451M519
1005A036P20k573r62J494J76k845j260L823N276m7m652k722K939L718p92l408
1021g9l00L697J947l840m326P75L564P25k704j702J897K036k715m151o22L657
1037b141L275p88j840Q55J378o52l348k18M328M197r82l124n26J700q7k360r54
1054a287L265L717q31n090k962J452J848l90j964O77K407L96l021k678o5K495
$$ plain form
1070 -2031 -782 -869 -38 1508 1407 -1150 -2379 -570 2270 3075 1882 1803 3146 3312 1274 -1008 -423
1087 -423 2096 3112 1570 78 11 -608 -2685 -3982 -2587 457 1481 -452 -2682 -3203 -2387 -2977 -2860
1104 -2860 102 3466 3882 823 -2271 -1625 796 1539 1235 2562 4432 4606 1387 -1752 -1757 851 1449
1121 1449 -158 -487 1398 2187 -273 -4256 -5651 -2821 -241 -551 -991 504 1392 -869 -4416 -4814
1137 -4814 -47 4208 3430 459 91 2411 2462 -658 -2108 1233 5148 5148 1267 -1382 -139 442 -370
1154 -370 -2187 -617 1599 1632 -1795 -4738 -3269 -774 -608 -2858 -2270 604 1663 -1066 -3729 -2517
1170 -2517 1236 3267 1904 76 1584 3674 2239 -411 -610 1736 3887 3217 1251 801 513 -1501
1186 -1501 -3639 -3278 -29 2285 1002 -3022 -4599 -3932 -2578 -1884 -1198 789 1535 407 -1431 -1326
$$ packed form
1070b031J249q7Q31J546j01k557j229J809K840Q05j193p9J343J66k038k282N85
1087d23K519J016j542j492o7o19k077j297J395L044J024j933k230n21Q16n90J17
1104b860K962L364M16l059l094O46K421P43l04J327J870J74l219l139nK608N98
1121A449j607l29J885P89k460l983j395K830K580l10m40J495Q88k261l547l98
1137d814M767M255p78k971l68K320N1l120j450L341L915%l881k649J243N81q12
1154c70j817J570K216L3l427k943J469K495J66k250N88K874J059k729k663J212
1170b517L753K031j363j828J508K090j435k650j99K346K151o70j966m50k88k014
1186a501k138L61L249K314j283m024j577O67J354O94O86J987P46j128j838J05
$$ plain form
1202 -1326 682 1885 1594 1837 2905 3945 3378 686 -186 508 1551 598 322 1270 1360 -615 -3496
1219 -3496 -4457 -3218 -1118 -1199 -1224 -904 -815 -2223 -4384 -3748 283 3865 3041 524 39 1341 2195 1589
1237 1589 305 2029 4175 3812 1373 -120 87 -32 -1902 -2555 107 2411 1561 -3055 -5569 -3748
1253 -3748 -805 -874 -2613 -1913 1156 2318 -741 -3355 -2129 1502 3446 2387 1026 2355 3773 2061
1269 2061 -1283 -1533 1537 3786 2694 138 -319 378 -737 -3559 -4199 -1019 1936 1221 -1909 -3203
1285 -3203 -2204 -659 -1516 -1717 342 2891 2169 -874 -1924 52 2057 1923 186 517 2874 3453 909
1302 909 -1790 -1573 351 1905 1519 381 156 -130 -1718 -2806 -2001 -271 497 -154 -501 -761 -985 -2041
1320 -2041 -2497 -1260 1481 2239 861 -592 -463 349 340 -223 967 2437 2868 1352 362 -405 -76 -301
$$ packed form
1202a326K008J203k91K43J068J040n67k692q72O94J043r53k76R48R0j975k881
1219c496r61J239K100q1k5L20Q9j408k161O36M031L582q24k517m85J302Q54o06
1237A589j284J724K146l63k439j493K07j19j870o53K662K304q50m616k514J821
1253c748K943o9j739P00L069J162l059k614J226L631J944j059j361J329J418j712
1269B061l344k50L070K249j092k556m57O97j115k822o40L180K955p15l130j294
1285c203R99J545q57k01K059K549p22l043j050J976K005j34j737L31K357N79k544
1302I09k699K17J924J554l86j138k25k86j588j088Q05J730P68o51l47k60k24j056
1320b041m56J237K741P58j378j453J29Q12rn63J190J470M31j516r90p67L29k25
$$ plain form
1338 -301 6 932 2174 1105 -1115 -2525 -2563 -1303 -873 -1243 -669 381 -121 -1910 -3107 -1859 33
1355 33 654 -78 12 1715 2709 606 -1571 -771 2193 3787 2687 490 677 1506 744 -903 -1868 540
1373 540 2065 707 -1905 -3164 -2024 -1707 -2852 -2789 282 1880 517 -2675 -3499 -930 1530 1370
1389 1370 661 1646 3909 3583 491 -1634 -82 2537 2880 1504 582 1569 1347 -917 -3215 -3088 -574
1406 -574 656 -920 -1828 -1648 -1084 -2272 -3660 -2994 -34 2359 1821 316 -383 6 263 500 1753
1423 1753 3280 4207 2836 324 -270 915 1130 -150 -175 495 912 -222 -2002 -3227 -2953 -1681 -1646
1440 -1646 -1664 -862 -722 -1163 -2008 -1806 -790 662 1253 1895 1872 2056 1178 65 685 2424 3490 2874 1428
1459 1428 598 360 -268 -1603 -1554 -432 600 -279 -1887 -2214 -2073 -2123 -3028 -2641 -462 1349 1152 -838
$$ packed form
1338c01L07R26J242j069k220j410l8J260M30l70N74J050n02j789j197J248J892
1355C3O21p32R0J703R94k103k177Q00K964J594j100k197J87Q29p62j647r65K408
1373E40J525j358k612j259J140L17j145O3L071J598j363l192q24K569K460j60
1389A370p09R85K263l26l092k125J552K619L43j376r22R87k22k264k298J27K514
1406e74J230j576r08J80N64j188j388O66K960K393n38j505o99L89K57K37J253
1423A753J527R27j371k512n94J185K15j280k5O70M17j134j780j225K74J272L5
1440a646j8Q02J40m41q45K02J016J452N91O42k3J84q78j113O20J739J066o16j446
1459A428q30k38o28j335M9J122J032q79j608l27J41n0r05L87K179J811j97j990
$$ plain form
1477 -838 -1708 -410 1069 1376 1079 2513 3431 2630 504 -270 969 2215 1610 465 616 1329 720 -1587
1495 -1587 -3524 -2232 -147 370 -1384 -2507 -1242 -887 -1886 -3375 -1618 1320 3017 1440 -405 -381
1511 -381 973 1261 539 1033 3274 4049 2075 241 -659 353 725 -249 -743 105 1386 408 -2513 -3757
1529 -3757 -2838 -1524 -828 -553 -325 361 -748 -2233 -2710 -689 1613 2759 1807 1337 1286 1486 837 303
1547 303 641 1866 1694 1204 684 454 -105 -1368 -1711 -1426 -190 48 -947 -1721 -1825 -1827 -2076 -1186 -199 1044
1567 1044 819 64 -900 -697 372 1197 1640 2348 2049 1130 -181 -341 778 1583 938 11 266 840 429
1586 429 -1204 -2467 -1818 -349 167 -316 -1011 -399 -758 -1842 -2316 -922 1444 2000 794 -216 -308 596
1604 596 92 -542 487 2306 3040 1161 -419 -937 494 291 -354 -637 983 1592 334 -2135 -2694
$$ packed form
1477h38q70J298J479L07k97J434R18q01k126p74J239J246o05j145J51P13o09k307
1495a587j937J292K085N17j754j123J265L55r99j489J757K938J697j577j845K4
1511c81J354K88p22M94K241P75j974j834r00J012L72r74m94Q48J281r78k921j244
1529c757R19J314O96K75K28O86j109j485m77K021K302J146r52m70n1K00o49n34
1547C03L38J225j72m90n20k30n59j263l43K85J236K38r95p74j04kk49Q90R87J243
1567A044k25p55r64K03J069Q25M43P08k99r19j311j60J119Q05o45r27K55N74m11
1586D29j633j263O49J469N16m83o95O12l59j084m74J394K366N56j206j010r2R04
1604E96n04o34J029J819P34j879j580n18J431k03o45k83J620O09j258k469n59
$$ plain form
1621 -2694 -1098 -137 -227 -797 164 855 -121 -2074 -2717 -1136 1557 1926 185 -57 554 873 45 -437
1639 -437 674 1815 1894 1155 -57 695 671 -607 -1587 -633 1617 1776 352 -1773 -1861 -1157 -1051 -938 -706
1658 -706 353 600 -574 -1666 -1574 -526 540 785 857 1267 1243 736 -164 -111 586 1336 1426 1157 1067 1033 -339
1679 -339 -835 -1423 -718 330 273 -96 -764 -1439 -2253 -2256 -1469 365 851 67 -644 -576 25 -267 120 614 1564
1700 1564 2207 1674 888 656 635 165 142 317 1615 1714 372 -1518 -1765 -1251 -408 -1051 -1351 -367 296 -925
1720 -925 -2363 -2880 -1211 649 654 371 338 519 577 -222 -52 1245 2756 2210 1260 748 1253 799 -174 -1263
1740 -1263 -461 1047 1181 -100 -2139 -2023 -1449 -1309 -1454 -1096 165 706 -852 -1901 -1594 -301 388
1757 388 746 618 1753 2344 1209 -475 -507 805 2285 2345 1144 246 391 -171 -1246 -1357 -599 359
$$ packed form
1621b694J596R61r0n70R61O91r76j953o43J581K693L69j741k42O11L19q28m82
1639d37J111J141P9p39j212P52k4j278r80R54K250J59j424k125q8P04J06J13K32
1658g06J059K47j174j092R2J048J066K45P2M10k4n07r00N3O97P50R0k69r0l4j372
1679c39m96n88P05J048n7l69o68o75q14lP87J834M86p84p11O8O01k92L87M94R50
1700A564O43n33p86k32k1m70k3J75J298R9j342j890k47N14Q43o43l00R84O63j221
1720i25j438n17J669J860Nk83l3J81N8p99J70J297J511n46r50n12N05m54r73j089
1740a263Q02J508J34j281k039J16N74J40j45L58J261N41j558j049L07J293O89
1757C88L58j28J135N91j135j684l2J312J480O0j201q98J45n62j075j11P58R58
$$ plain form
1775 359 373 -647 -1428 -1274 -1522 -2233 -1808 -467 929 933 349 -712 -358 -87 735 672 1410 2042 2105 1550
1795 1550 285 234 -237 44 119 750 1289 314 -1059 -2012 -1617 -988 -919 -815 -357 -83 -654 -1184 -1321 -658
1815 -658 -86 333 646 900 822 368 -372 80 908 1395 1630 535 415 687 589 -534 -549 -128 756 683 -259
1836 -259 -891 -1083 -909 -1136 -1160 -682 504 705 -863 -1856 -997 32 575 300 206 1054 1354 440 -514 -305
1856 -305 779 1571 1564 1043 942 710 35 -957 -790 430 1000 350 -765 -1052 -739 -897 -1833 -2097 -902
1875 -902 545 572 -56 -1109 -1109 -437 -179 213 1070 1842 1962 1060 99 184 771 1110 973 1272 1352 1045 -345
1896 -345 -1870 -1931 -826 -199 -233 -887 -1063 -1065 -1139 -1558 -1604 -578 211 448 554 387 90 111 -143 361 1355
1917 1355 2027 1947 1457 909 525 20 190 526 337 311 -193 -617 -1643 -1474 -1556 -1658 -615 -347 -333 -796
$$ packed form
1775C59J4j020p81J54k48p11M25J341J396Mn84j061L54K71Q22o3P38O32O3n55
1795A550j265n1m71K81P5O31N39r75j373r53L95O29O9J04M58K74n71n30j37O63
1815f58N72M19L13K54p8m54p40M52Q28M87K35j095j20K72r8j123j5M21Q84p3r42
1836b59o32j92J74k27k4M78J186K01j568r93Q59J029N43k75r4Q48L00r14r54K09
1856c05J084P92pn21j01k32o75r92J67J220N70o50j115k87L13j58r36k64J195
1875i02J447K7o28j053%O72K58L92Q57P72J20r02r61Q5N87L39j37K99Q0l07j390
1896c45j525o1J105O27l4o54j76kp4m19m6J026P89K37J06j67k97K1k54N04R94
1917A355O72q0m90n48l84n05J70L36j89k6n04m24j026J69q2j02J043K68J4m63
$$ plain form
1937 -796 -1182 -964 -517 178 -119 844 1328 1373 976 17 606 803 1232 1215 1155 1455 1011 -526 -1453 -862 -126
1958 -126 563 47 -814 -788 -838 -1004 -1665 -1426 -634 396 395 17 -586 -595 -258 -232 67 1373 2010 1457 314
1979 314 -256 164 764 701 322 813 1181 1046 -105 -1104 -1288 -536 235 -400 -389 -584 -713 -1147 -1944 -1655
1999 -1655 -515 227 141 -34 231 494 214 -191 12 924 1826 2012 1182 455 291 512 399 253 473 729
2019 729 463 -171 -1226 -992 -1241 -822 -943 -470 -429 -366 -975 -1363 -1579 -376 256 571 1042 932 811 435
2039 435 643 676 1490 1713 1801 1566 874 121 -647 -458 -181 -18 -61 -517 -907 -1751 -1914 -1794 -1296 -769 -461
2060 -461 -425 -383 8 -319 -239 -300 521 1664 2130 1758 907 625 706 677 820 403 620 689 220 -675 -1255 -1307
2082 -1307 -935 -952 -854 -424 -460 -845 -1193 -1495 -1093 -76 859 370 296 1039 819 378 -23 201 1351 1919
$$ packed form
1937g96l86K18M47O95k97R63M84M5l97r59N89J97M29j7o0L00m44j537r27N91P36
1958a26O89n16q61K6n0j66o61K39P92J030jl78o03rL37K6K99J306O37n53j143
1979C14n70M20O00o3l79M91L68j35j151r99j84P52P71o35J1j95j29m34p97K89
1999a655J140P42q6j75K65K63k80m05K03R12R02J86q30p27j64K21j13j46K20K56
2019G29k66o34j055K34k49M19j21M73M1O3o09l88k16J203O32L15M71j10j21l76
2039D35K08L3Q14K23Q8k35o92p53p68J89K77J63m3m56l90q44j63J20M98N27L08
2060d61L6M2L91l27Q0o1Q21J143M66l72q51k82Q1k9J43m17K17O9m69q95n80n2
2082a307L72j7R8M30l6l85l48l02M02J017R35m89p4P43k20m41m01K24J150N68
$$ plain form
2102 1919 1432 669 251 -196 -48 -211 -347 459 470 -212 -1233 -1420 -1137 -934 -599 -604 -73 238 647 -196
2122 -196 -959 -705 -153 679 918 708 694 587 51 -24 -6 769 884 1003 690 424 55 -514 -955 -531 160
2143 160 760 580 23 -1055 -639 -856 -820 -302 -52 -35 53 67 -540 -491 -274 8 521 808 1020 509 239
2164 239 -6 -23 316 936 908 590 409 -23 -306 -429 -241 -343 -178 206 62 -396 -1056 -1488 -1113 -149 220
2185 220 126 -137 -115 187 -274 -503 290 740 803 911 639 560 289 -64 -190 234 732 923 411 -540 -977
2206 -977 -721 -474 -800 -833 -78 98 45 -823 -1388 -804 -376 -209 158 687 708 794 -350 -451 368 895 1059
2227 1059 877 637 484 525 -251 -800 -492 11 776 665 -238 -839 -809 -929 -803 -871 -253 154 -356 -725 -802
2248 -802 -131 -14 15 -137 714 1150 1118 81 -314 -435 466 890 750 441 325 415 219 -183 -508 -757 66
$$ packed form
2102A919m87p63m18m47J48j63j36Q06J1o82j021j87K83K03L35nN31L11M09q43
2122a96p63K54N52Q32K39k10j4j07n36p5J8P75J15J19l13k66l69n69m41M24O91
2143A60O00j80n57j078M16k17L6N18K50J7Q8J4o07M9K17K82N13K87K12n11k70
2164B39k45j7L39O20k8l18j81m32k83j23J88j02J65L84j44m58o60m32L75R64L69
2185B20r4k63K2L02m61k29P93M50O3J08k72p9k71l53j26M24M98J91n12r51m37
2206i77K56K47l26l3P55J76n3q68n65N84M28J67L67N29K1Q6j144j01Q19N27J64
2227A059j82k40j53M1p76n49L08N03P65j11r03o01L0j20J26o8O18M07n10l69p7
2248h02O71J17K9j52Q51M36l2j037l95j21R01M24j40l09j16R0j96m02l25k49Q23
$$ plain form
2269 66 290 95 -292 -871 -1153 -1073 -367 -177 334 351 -145 -580 -409 -247 153 459 394 625 582 572 599 76
2291 76 95 468 800 518 525 -222 -517 -764 -796 -387 -401 -98 -297 -545 -632 -646 -715 -832 -324 -185 372 541 272
2314 272 -215 -274 201 614 872 807 889 677 246 -42 -184 -212 150 225 253 12 -160 -542 -1008 -1008 -445 368 150
2337 150 -148 -834 -480 -219 -144 -175 71 625 730 615 182 -157 -93 493 562 457 297 696 464 -251 -636
2358 -636 -586 171 -37 -71 -3 -149 -452 -746 -909 -616 107 192 2 -115 -309 -105 29 -372 336 676 907
2379 907 732 183 32 243 285 180 505 774 813 101 13 -817 -590 -386 51 312 -268 -564 -598 -772 -831 -661
2401 -661 -643 -295 128 362 -4 -276 -362 -33 468 631 881 951 930 63 314 277 289 489 359 44 112 -276
2423 -276 -409 -964 -678 -318 -92 -190 -468 -684 -609 -689 -388 -194 103 422 359 707 352 337 409 209 684 729
$$ packed form
2269F6K24j95l87n79k82Q0P06J90N11J7m96m35J71J62M00L06o5K31m3j0K7n23
2291G6J9L73L32k82Pp47k95k47l2M09j4L03j99k48q7j4o9j17N08J39N57J69k69
2314B72m87n9M75M13K58o5Q2k12m31k88j42k8L62P5K8k41j72l82m66%N63Q13k18
2337A50k98o86L54K61P5l1K46N54J05j15m33l39O4N86O9j05j60L99k32p15l85
2358f36N0P57k08l4O8j46l03k94j63K93P23Q5j90j17j94K04J34m01P08L40K31
2379I07j75n49j51K11M2j05L25K69L9p12q8q30K27K04M37K61n80k96l4j74n9J70
2401f61J8L48M23K34l66k72q6L29N01J63K50P0k1q67K51l7J2K00j30l15O8l88
2423b76j33n55K86L60K26r8k78k16P5q0L01J94K97L19o3L48l55j5P2k00M75M5
$$ plain form
2445 729 921 782 592 -260 -134 -484 -1 -204 -35 -319 -655 -672 -1026 -596 -565 -119 189 -198 9 63 -73
2466 -73 -307 -45 519 900 1015 642 274 10 129 292 205 194 457 298 192 -359 -823 -706 -468 -169 -63
2487 -63 145 -277 -518 -545 -629 -263 162 232 354 265 282 114 -167 -445 -50 674 629 530 281 -495 -128 -77 384
2510 384 143 5 325 308 -13 -279 -438 -420 106 161 113 82 -41 -556 -259 -568 91 -92 181 264 -294 -96
2532 -96 -155 -227 26 208 652 625 760 350 -126 56 280 485 420 460 355 87 -237 -798 -618 -494 19 0
2554 0 -86 -251 -147 -663 -794 -388 -22 94 462 417 50 160 227 633 390 325 786 774 619 163 -317 43
2576 43 -397 -348 133 1 -410 -716 -1076 -1148 -422 -589 -615 -134 89 239 136 -235 -206 416 808 849 926 605
2598 605 485 387 275 128 204 243 433 101 -450 -824 -549 -674 -442 -520 -209 -144 -40 -540 -805 -265 51 562
$$ packed form
2445G29J92j39j90q52J26l50M83k03J69k84l36j7l54M30L1M46L08l87K07N4j36
2466g3k34K62N64L81J15l73l68k64J19J63q7j1K63j59j06n51m64J17K38K99J06
2487f3K08m22k41k7q4L66M25P0J22q9J7j68k81k78L95P24m5r9k49p76L67N1M61
2510C84k41j38L20j7l21k66j59J8N26N5m8l1j23n15K97l09O59j83K73Q3n58J98
2532i6n9p2K53J82M44k7J35m10m76J82K24K05o5M0j05k68l24n61J80J24N13j9
2554@q6j65J04n16j31M06L66J16L68m5l67J10O7M06k43o5M61j2j55m56m80L60
2576D3m40M9M81j32m11l06l60p2P26j67k6M81K23J50j03l71K9O22L92M1P7l21
2598F05j20r8j12j47P6L9J90l32n51l74K75j25K32p8L11O5J04n00k65N40L16N11
$$ plain form
2620 562 201 483 489 227 227 415 172 543 584 595 279 342 -78 -364 -294 -523 -206 -87 -229 -548 -601 -909 -415
2643 -415 -59 -84 93 351 262 448 264 -121 303 396 385 298 511 510 -8 -371 -110 -186 229 16 149 62 -549
2666 -549 -290 -259 -407 -41 237 436 320 -191 -359 -282 -110 -63 366 246 300 21 53 -177 -150 124 73 119 122
2689 122 432 78 -178 -265 -265 293 332 412 442 -132 158 54 -91 -247 -288 -15 243 51 -486 -783 -679 -497
2711 -497 -160 -126 52 83 145 -264 -301 -307 418 365 551 95 444 -24 114 164 -164 185 259 523 -179 17 -170
2734 -170 -351 -131 -400 -152 72 -218 -155 -331 -267 -126 125 -66 343 448 287 294 -22 261 359 678 752 533
2756 533 602 27 -12 -188 -360 -136 -238 183 -54 -414 -757 -611 -736 -436 -352 -40 162 -164 -39 -151 254
2777 254 259 246 377 757 660 537 125 178 -1 91 286 153 195 -327 -469 -409 -408 -421 -451 6 146 -158 -470 -278
$$ packed form
2620E62l61K82Ok62%J88k43L71M1J1l16O3m20k86P0k29L17J19j42l19n3l08M94
2643d15L56k5J77K58q9J86j84l85M24R3j1q7K13jn18l63K61p6M15k13J33q7o11
2666e49K59L1j48L66K78J99j16n11j68P7J72M7M29j20N4k79L2k30K7K74n1M6L
2689A22L10l54k56q7%N58L9Q0L0n74K90j04j45j56m1K73K58j92n37k97J04J82
2711d97L37L4J78L1O2m09l7oP25n3J86m56L49m68J38N0l28L49P4K64p02J96j87
2734a70j81K20k69K48K24k90O3j76O4J41K51j91M09J05j61Pl16K83R8L19P4k19
2756E33O9n75l9j76j72K24j02M21k37l60l43J46j25L00Q4L12K02l26J25j12M05
2777B54Nj3J31L80r7j23m12N3j79R2J95j33M2n22j42O0Jj3l0M57J40l04l12J92
$$ plain form
2801 -278 10 -146 -42 154 478 516 474 32 -9 145 249 473 200 440 244 -158 -107 -60 -252 -286 -143 -42
2823 -42 -206 -293 74 -453 -494 -311 9 247 81 -74 -4 -12 -45 -97 59 62 340 84 240 107 -96 10 226
2846 226 421 315 134 359 130 -399 -176 25 25 -220 53 -393 -91 -333 -483 -188 -296 5 33 -124 -499
2867 -499 -469 -97 -142 475 292 100 408 271 94 86 109 113 145 134 203 -21 -262 -221 -275 0 3 2 -172 -267 -234 -593
2893 -593 -287 -409 -43 -4 97 205 -40 -303 -118 96 162 311 473 717 145 463 -77 136 303 248 275
2914 275 253 411 -142 -158 -447 -247 -208 115 -419 104 -82 -130 -552 -545 -24 -77 390 108 121 283 417 174 367
2937 367 184 323 455 271 190 -57 -291 1 214 -142 195 112 -493 -465 -653 -592 -371 -359 -56 235 272 229
2959 229 -307 -67 109 377 556 493 443 72 230 239 118 67 -244 36 296 22 -164 -456 -408 -441 -22 -162
$$ packed form
2801b78K88j56J04J96L24L8m2m42m1J54J04K24k73K40j96m02N1M7j92l4J43J01
2823d2j64q7L67n27m1J83L20K38j66j55P0ql3n2J56LK78k56J56j33k03J06K16
2846B26J95j06j81K25k29n29K23K01%k45K73m46L02k42j50K95j08L01K8j57l75
2867d99L0L72m5O17j83j92L08j37j77qK3ML2j1O9k24k41M1n4K75Ljj74r5L3l59
2893e93L06j22L66L9J01J08k45k63J85K14O6J49J62K44n72L18n40K13J67n5K7
2914B75k2J58n53j6k89K00L9L23n34N23j86m8m22PN21n3M67k82J3J62J34k43J93
2937C67j83J39J32j84q1k47k34K92K13l56L37q3o05K8j88O1K21J2L03K91L7m3
2959B29n36K40J76K68J79o3n0l71J58Rj21n1l11K80K60k74j86k92M8l3M19j40
$$ plain form
2981 -162 198 -258 -31 -383 -204 89 186 310 297 176 272 267 209 35 202 473 617 421 201 70 -20 -70 -39
3004 -39 -86 -132 195 -98 -14 -338 -624 -60 -288 -106 -90 -47 195 -76 -165 -353 -228 352 235 219 -45 24 218
3027 218 195 81 146 118 127 232 22 -63 8 -220 -27 -69 313 208 -45 -323 -93 -304 -176 -175 -184 -426 -206 -59
3051 -59 -184 -241 -121 106 423 81 239 -115 50 219 11 437 162 358 96 238 69 -8 -27 -28 -133 24
3073 24 92 -77 -63 -262 -358 -303 -32 -321 -215 9 93 165 -104 37 -97 251 586 167 456 174 83 318 -28
3096 -28 73 469 30 11 -301 -467 -414 -219 -365 -687 -201 -329 176 -320 -493 -249 76 -29 211 488 301
3117 301 617 460 -2 476 375 385 191 406 320 40 -337 -399 -463 37 -307 168 -506 -414 -434 -293 -209 -89
3139 -89 70 73 92 -70 129 -53 -247 215 162 592 463 753 286 401 -123 318 287 146 -27 -314 -195 -354
$$ packed form
2981a62L60m56K27l52J79K93R7J24j3j21R6nn8j74J67K71J44j96k20j31r0n0L1
3004c9m7m6L27k93Q4l24k86N64k28J82J6M3K42k71q9j88J25N80j17j6k64O9J94
3027B18k3j14O5k8RJ05k10q5P1k28J93m2L82j05k53k78K30k11J28Jrk42K20J47
3051e9j25n7J20K27L17l42J58l54J65J69k08M26k75J96k62J42j69p7j9jj05J57
3073B4O8j69J4j99r6N5K71k89J06K24Q4P2k69J41j34L48L35m19K89k82r1K35l46
3096b8J01L96m39j9l12j66N3J95j46l22M86j28N05m96j73K44L25j05K40K77j87
3117C01L16j57m62M78j01J0j94K15q6k80l77o2o4N00l44M75o74R2k0J41Q4J20
3139h9J59LJ9j62J99j82j94M62n3M30j29K90m67J15n24M41l1j41j73k87J19j59
$$ plain form
3161 -354 -450 -297 -683 -431 186 -100 -61 -313 148 -488 -119 -136 -144 163 357 -110 157 324 310 168 103 447
3183 447 131 368 25 -123 7 -100 77 134 5 -123 -59 0 -298 -169 -270 59 -297 49 -157 187 -177
3204 -177 -160 -114 167 210 138 107 -138 -305 31 210 243 430 260 343 241 -152 194 -98 28 159 175 -132 -379
3227 -379 -70 -449 -272 -83 125 231 -282 -177 -305 -212 -60 -1 168 72 432 539 219 5 -46 173 237 356
3249 356 27 335 111 121 -95 -145 -210 51 -120 148 -169 -202 -221 -487 -350 -520 175 -3 285 -37 -186 166
3271 166 38 119 153 216 442 249 437 121 81 142 306 107 410 -136 -35 -88 -492 -15 -183 -184 -200 -261 -343 -190
3295 -190 -102 -510 -279 -216 571 229 106 171 203 -36 56 566 275 40 285 214 102 236 -55 290 10 37
3317 37 40 -100 -335 -443 -485 -135 -211 -419 -305 -113 -108 84 20 -115 91 411 117 137 -81 163 -13 209 93
$$ packed form
3161c54r6J53l86K52O17k86L9k52M61o36L69j7qL07J94m67K67J67j4j42o5L44
3183D47l16K37l43j48J30j07J77N7j29j28O4N9k98J29j01L29l56L46k06L44l64
3204a77J7M6K81M3p2l1k45j67L36J79L3J87j70Q3j02l93L46k92J26J31J6l07k47
3227c79L09l79J77J89K08J06n13J05j28R3J52N9J69r6L60J07l20k14n1K19O4J19
3249C56l29L08k24J0k16n0o5K61j71K68l17l3j9k66J37j70O95j78K88l22j49L52
3271A66j28Q1L4O3K26j93J88l16m0O1J64j99L03n46J01n3m04M77j68jj6o1q2J53
3295a90Q8m08K31O3P87l42j23O5L2k39R2N10k91k35K45p1j12J34k91L45k80K7
3317C7Lj40k35j08m2L50p6k08J14J92NJ92o4j35K06L20k94K0k18K44j76K22j16
$$ plain form
3340 93 10 458 182 349 83 -224 -89 32 96 -405 -81 -99 -148 -188 -365 229 -113 33 119 -19 254 -103
3362 -103 -45 10 126 150 -38 230 190 471 59 100 -42 -54 -5 273 119 -172 -145 -285 -330 -255 131 -81 10 -56
3386 -56 -151 -180 50 -121 -248 -39 83 223 -38 -66 162 116 197 262 430 350 87 50 215 106 208 183 39
3409 39 -83 98 151 -332 -195 -275 -60 -201 -379 -115 -84 -345 -381 53 -34 12 196 332 191 173 49 310 218
3432 218 325 610 279 -49 -218 -2 -225 16 -118 -43 -214 -95 -219 -261 -95 -256 -296 -210 -12 183 186 -28
3454 -28 -465 175 42 446 575 476 476 494 217 38 357 167 281 -54 175 -23 -382 -397 -217 -113 -232 -143
3476 -143 116 -233 -449 -168 -547 -219 169 -32 39 49 213 11 153 -120 123 70 572 513 223 -224 45
3497 45 -137 -47 6 -20 -110 -281 -149 -248 -307 -488 -126 174 -268 86 -425 -391 -34 -132 163 484 182 369 334
$$ packed form
3340I3q3M48k76J67k66l07J35J21O4n01L24j8m9m0j77N94l42J46Q6j38K73l57
3362a03N8N5J16K4j88K68m0K81m12M1j42j2M9K78j54k91K7j40m5P5L86k12R1o6
3386e6r5k9K30j71j27K09J22J40k61k8K28m6Q1O5J68q0k63l7J65j09J02k5j44
3409C9j22J81N3m83J37q0K15j41j78K64L1k61l6M34q7M6J84J36j41j8j24K61r2
3432B18J07K85l31l28j69K16k23K41j34P5j71J19j24m2J66j61m0Q6J98J95Lk14
3454b8m37O40j33M04J29r9%J8k77j79L19j90J14l35K29j98l59j5J80J04j19Q9
3476a43K59l49k16K81l79L28L88k01P1J0J64k02J42k73K43n3N02n9k90m47K69
3497D5j82R0N3k6r0j71J32r9n9j81L62L00m42L54n11L4L57r8K95L21l02J87l5
$$ plain form
3520 334 270 124 7 164 231 31 151 189 -101 -33 -92 -211 -68 1 -28 -169 -394 -65 61 -388 -336 -222 45
3543 45 -10 6 125 -213 -106 -54 1 299 619 188 -9 -11 -23 141 195 266 70 5 1 8 -94 -98 -445 -276 -254 236
3569 236 -125 -274 -319 -122 -63 -411 77 -166 91 73 -24 -69 19 298 442 283 197 5 -114 176 276 6
3591 6 21 322 155 -257 -310 187 -267 -614 -163 -291 172 -46 -220 -53 -265 -190 11 181 213 304 7 458
3613 458 393 -9 166 354 246 251 187 256 -98 -66 -394 142 -243 -51 242 -249 -436 -321 -428 -387 57 -166
3635 -166 -410 177 66 55 -7 -94 306 264 377 482 194 220 -173 -481 110 239 50 -364 -52 -145 -372 -194
3657 -194 -592 -116 -234 -397 -67 -327 -573 -206 -174 -44 -170 26 218 182 230 355 62 85 481 320 318 303
3679 303 84 -317 9 -94 67 73 74 -13 -129 -148 -202 -442 -299 -177 -173 -279 -181 60 -170 -177 -301 174 -110 175
$$ packed form
3520C34o4j46j17J57O7k00J20L8k90O8n9j19J43O9k9j41k25L29J26m49N2J14K67
3543D5n5J6J19l38J07N2N5K98L20m31j97kj2J64N4P1j96o5mPj02ml47J69K2M90
3569B36l61j49m5J97N9l48M88k43K57j8r7m5Q8K79J44j59q6j92j19K90J00k70
3591FJ5L01j67m12n3M97m54l47M51j28M63k18j74J67k12P5K01J70L2R1k97M51
3613D58o5m02J75J88j08No4O9l54L2l28N36l85J92K93m91j87J15j07M1M44k23
3635a66k44N87j11j1o2q7M00m2J13J05k88K6l93l08N91J29j89m14L12r3k27J78
3657a94l98M76j18j63L30k60k46L67L2J30j26J96J92l6M8J25k93K3L96j61kj5
3679C03k19m01L26j03J61OJq7j16j9n4k40J43J22Mj06R8K41k30pj24M75k84K85
$$ plain form
3703 175 287 135 44 -299 418 105 -8 110 514 -312 -63 -112 49 -197 108 -181 -68 105 -63 -88 -305
3724 -305 -274 -328 432 9 -321 -131 25 -80 -128 56 -97 254 409 278 445 96 87 100 343 139 117 207 304
3747 304 -253 -311 -185 59 -291 -259 118 -320 -292 -195 -354 -268 95 32 -17 49 -155 61 32 318 193 302 311 363
3771 363 599 -81 261 -7 -100 72 -74 -243 9 -273 -362 -206 -198 133 -215 -302 -220 -78 109 -128 -57 3 232
3794 232 206 49 325 84 43 -78 314 386 175 102 343 -123 -229 192 -206 57 -304 -196 -8 -466 -266
3815 -266 -367 -680 -131 -329 99 96 -279 -150 -171 -56 291 93 413 415 168 210 212 -18 -227 -244 103 173 -164
3838 -164 -306 -137 -346 -35 23 2 -127 -33 -99 -123 -35 -335 -221 271 109 305 176 84 -314 -159 155 270
3860 270 449 244 66 0 -1 101 192 -275 -24 -175 -200 55 -380 -178 -376 -329 36 226 -92 103 -253 -107
$$ packed form
3703A75J12j52r1l43P17l13j13J18M04q26K49m9J61k46L05k89J13J73j68k5k17
3724c05L1n4P60m23l30J90J56j05m8J84j53L51J55j31J67l49rJ3K43k04k2R0R7
3747C04n57n8J26K44l50L2L77m38K8R7j59Q6L63o3m9O6k04K16k9K86j25J09RN2
3771C63K36o80L42k68r3J72j46j69K52k82q9J56QL31l48q7Q2J42J87k37P1O0K29
3794B32k6j57K76k41m1j21L92P2k11p3K41m66j06M21l98K63l61J08J88m58K00
3815b66j01l13N49j98M28ll75J29k1J15L47j98L20Kk47M2Kk30k09j7L47P0l37
3838a64j42J69k09L11N8k1j29R4o6k4Q8l00J14M92j62J96j29r2l98J55L14J15
3860B70J79k05j78o6jJ02R1m67K51j51k5K55m35K02j98M7L65J90l18J95l56J46
$$ plain form
3882 -107 -294 -26 166 258 275 111 -26 86 174 132 -257 314 468 235 -61 -93 -202 -128 83 45 243 160 -258
3905 -258 -402 -168 71 -229 -341 42 50 -277 -1 -6 -163 -276 -182 64 276 138 35 139 90 42 -95 77
3927 77 113 195 198 4 -96 -145 -302 16 92 -201 51 0 -347 -370 -79 -53 -76 150 -140 277 317 -208 -82 111
3951 111 254 607 384 201 198 154 213 -133 -55 248 326 1 109 -163 -231 -377 -446 -495 6 -343 22 -168 -296
3974 -296 -189 -122 -90 16 128 171 93 274 147 -221 190 324 702 293 306 1 -5 -38 43 -115 -103 -177 -6 -77
3998 -77 -258 -212 -78 -252 -204 -62 22 127 -168 -200 -284 -127 227 184 342 122 191 307 -9 -164 356 294 46
4021 46 -2 -38 -189 -350 -153 -165 -212 -163 81 -181 -126 -288 -174 -452 -50 -33 20 -193 158 107 -50 263 258 300
4045 300 256 244 168 48 -20 -120 229 414 139 59 120 -29 -23 -212 -146 -125 103 -7 167 -349 -337 -174 -125 -97
$$ packed form
3882a07j87K68J92R2J7j64j37J12Q8m2l89N71J54k33k96l2j09P4K11l8J98q3m18
3905b58j44K34K39l00j12L83Ql27K76nj57j13R4K46K12j38j03J04m9m8j37J72
3927G7L6Q2Lj94j00m9j57L18P6k93K52n1l47k3K91K6k3K26k90M17M0n25J26J93
3951A11J43L53k23j83lm4N9l46P8L03P8l25J08k72o8j46o9m9N01l49L65j90j28
3974b96J07O7L2J06J12M3p8J81j27l68M11J34L78m09J3l05ol3Q1j58J2p4J71p1
3998g7j81M6J34j74M8J42Q4J05k95l2q4J57L54m3J58k20O9J16l16j55N20o2k48
4021D6m8l6j51j61J97j2m7M9K44k62N5j62J14k78M02J7N3k13L51n1j57L13nM2
4045C00m4j2p6j20o8j00L49J85k75q0O1j49Oj89O6K1K28j10J74n16J2J63M9K8
$$ plain form
4069 -97 32 43 98 -64 92 78 128 -59 344 539 -75 285 327 -61 -160 138 31 260 -195 -175 -199 -147 -435
4092 -435 -502 -277 -271 -580 -126 100 -392 -256 -118 243 -11 111 205 453 -105 -157 150 220 96 64 428 57
4114 57 115 128 -191 -671 239 -419 -55 -400 -166 -257 -434 -177 -339 -300 -248 -263 11 170 118 -37 -56 -284 354
4137 354 426 367 59 -47 201 -181 25 193 -7 361 140 -101 -18 -265 -461 30 51 -68 -221 -195 -455 -25
4159 -25 -523 -193 -177 71 117 264 86 211 149 159 156 424 155 48 287 -145 -128 -37 -5 13 -100 27 -80 -249
4183 -249 -566 -731 -237 -69 -192 -71 -194 -200 -291 -214 -76 52 166 77 234 -64 187 23 -12 233 219 25
4205 25 346 -78 -153 -163 -117 104 -173 -292 104 -268 -132 62 -510 -210 -14 -105 -287 -201 -480 20 -4 -4 26
4228 26 86 726 407 -28 111 79 257 137 -114 609 -5 217 -198 -250 -502 -98 -25 43 456 -338 -448 -221
$$ packed form
4069i7J29J1N5j62J56j4N0j87M03J95o14L60M2l88r9K98j07K29m55K0k4N2k88
4092d35o7K25Ol09M54K26m92J36J38L61k54J22R4K48n58n2L07P0j24l2L64l71
4114E7N8J3l19m80R10o58L64l45K34r1j77K57j62L9N2j5K74J59n2j55j9k28O38
4137C54P2n9l08j06K48l82K06J68k00L68k21k41Q3k47j96M91K1j19j53K6k60M30
4159b5m98L30J6K48M6J47j78J25o2J0lK68k69j07K39m32J7R1L2J8j13J27j07j69
4183b49l17j65M94J68j23J21j23or1P7J38J28J14q9J57k98K51j64l5K45j4j94
4205B5L21m24p5j0M6K21k77j19L96l72J36J94n72L00J96r1j82Q6k79N00k4%L0
4228B6O0O40l19m35J39l2J78j20k51P23o14K22m15n2k52M04P3O8M13p94j10K27
$$ plain form
4250 -221 -167 -257 -121 -66 -37 3 204 17 -28 199 -22 229 259 226 78 29 167 -144 -297 99 -11 77 42 -169
4274 -169 -2 -176 -114 -370 -186 -336 236 -208 -163 170 233 -54 -167 93 290 20 106 162 27 68 343 369
4296 369 82 135 167 -156 -87 -44 180 62 -181 52 45 -21 -558 -446 -290 -100 -71 -163 -139 -209 -10 -161 24 -16
4320 -16 144 207 259 298 278 191 170 141 171 370 84 328 -174 -317 -200 210 -235 -601 -141 -236 -165 -113 -337 -4
4344 -4 -89 40 231 403 264 199 98 147 7 89 256 616 169 -149 9 148 -32 -40 5 245 12 -11 -129
4367 -129 -96 -340 -356 -102 -195 -296 -15 -66 -194 -216 -32 -356 261 188 69 128 -104 229 -27 159 -161 652
4389 652 387 43 217 -170 -176 -129 133 94 -315 -218 -209 -269 -131 -290 -445 -112 -31 87 73 -121 -171 -177 -73 28
4413 28 199 101 249 -15 -151 -218 22 225 415 247 137 229 -57 -237 -94 -355 -291 103 -118 -262 -445 -420
$$ packed form
4250b21N4r0J36N5K9M0K01j87m5K27k21K51L0l3j48m9J38l11j53L96j10Q8l5k11
4274a69J67j74O2k56J84j50N72m44M5L33O3k87j13K60J97k70Q6N6j35M1K75K6
4296C69k87N3L2l23O9M3K24j18k43K33po6n37J12J56J90K9r2K4p0J99j51J85m0
4320a6J60O3N2L9k0q7k1k9L0J99k86K44n02j43J17M10m45l66M60r5P1N2k24L33
4344dq5J29J91J72j39o5j01M9j40Q2J67L60m47l18J58J39j80qM5K40k33k3j18
4367a29L3k44j6K54r3j01K81n1j28k2J84l24O17p3j19N9k32L33k56J86l20Q13
4389F52k65l44J74l87oM7K62l9m09R7Ro0J38j59j55L33Q1J18j4j94n0oJ04J01
4413B8J71r8J48k64j36o7K40K03J90j68j10R2k86j80J43k61O4L94k21j44j83K5
$$ plain form
4435 -420 -248 -169 -173 -2 14 165 155 44 -129 23 114 364 201 549 64 -155 -144 100 268 230 28 -195 -178
4458 -178 -375 -141 -237 -280 5 6 212 -203 -346 -294 -154 -37 64 146 45 1 56 177 219 127 42 143 16 114
4482 114 140 70 74 77 -45 4 174 -71 -132 -40 -287 -199 -433 -182 -62 -21 235 244 -100 -111 111 -28 314 164 261
4507 261 -123 -299 -226 137 359 468 677 651 258 240 -43 -20 -10 -105 -233 109 70 -200 -18 -351 -52 -196
4529 -196 92 86 -153 -37 18 -197 117 140 215 483 282 179 151 246 -152 132 176 39 274 134 -199 -175 -106
4552 -106 -253 -86 95 166 -226 -422 -2 -93 -200 -345 -278 -103 82 -19 218 -16 19 126 175 186 98 343
4574 343 166 -16 128 -118 103 64 110 209 262 -305 -81 -327 -344 -277 -117 -14 -61 -334 -102 -235 -143 104 -42
4597 -42 130 190 41 318 92 3 200 76 273 370 386 235 -150 22 9 10 56 -13 -5 -323 -78 -313 -310 -676 -178
$$ packed form
4435d20J72P9mJ71J6J51j0j11j73J52R1K50j63L48m85k19J1K44J68l8k02k23J7
4458a78j97K34r6m3K85JK06m15j43N2J40J17J01Q2j01m4N5J21M2r2q5J01j27R8
4482A14K6p0MLj22M9J70k45o1R2k47Q8k34K51J20M1K56Rl44j1K22j39L42j50R7
4507B61l84j76P3L63K22J09K09k6l93j8k83K3J0r5j28L42l9k70J82l33K99j44
4529a96K88ok39J16N5k15L14K3P5K68k01j03k8R5l98K84M4j37K35j40l33K4O9
4552a06j47J67J81P1l92j96M20r1j07j45O7J75J85j01K37k34L5J07M9J1q8K45
4574C43j77j82J44k46K21l9M6R9N3n67K24k46j7O7J60J03m7k73K32j33R2K47j46
4597d2J72O0j49K77k26q9J97j24J97R7J6j51l85J72j3JM6o9Ql18K45k35Ll66M98
$$ plain form
4622 -178 -170 -232 114 -205 -39 401 -362 104 237 146 313 40 21 91 127 309 144 -42 87 73 207 -285 -219
4645 -219 96 -104 224 -189 -134 -51 -287 -148 -91 -221 -324 -27 291 89 -194 174 13 12 374 426 236 128
4667 128 57 12 260 116 114 416 283 -18 38 -250 -321 -435 -297 -324 -272 -457 -396 -347 -407 -67 -173 -425 203 99
4691 99 240 201 226 -144 136 342 12 412 165 -284 138 1 111 -202 -126 -137 -172 -133 -143 -294 -631 -325 -134
4714 -134 347 -141 -189 290 21 -37 97 235 334 238 175 2 219 118 166 2 279 337 97 253 -139 -481
4736 -481 -70 -340 109 4 -241 58 -105 -262 -188 9 -199 290 188 212 156 -59 -177 -29 68 188 483
4757 483 174 181 -39 334 106 -177 54 25 28 103 -201 -259 -422 -377 107 -299 44 195 246 -196 -492 -484 150 136
4781 136 -283 -133 2 66 218 -40 30 225 168 436 200 29 11 -5 -326 -76 -354 -102 245 -47 -98 -128
$$ packed form
4622a78Qo2L46l19J66M40p63M66J33r1J67k73j9P0L6J82j65j86J29j4J34m92O6
4645b19L15k00L28m13N5Q3k36J39N7j30j03K97L18k02k83L68j61jL62N2j90j08
4667A28p1m5K48j44kL02j33l01N6k88p1j14J38k7N2j85O1M9o0L40j06k52O28j04
4691I9J41l9K5l70K80K06l30M00k47m49M22j37J10l13P6j1l5L9j0j51l37L06J91
4714a34M81m88m8M79k69n8J34J38R9r6o3j73K17j01M8j64K77N8k40J56l92l42
4736d81M11k70M49j05k45K99j63j57P4J97k08M89j02K4n6k15j18J48R7J20K95
4757D83l09Pk20L73k28k83K31k9LP5l04n8j63M5M84m06L43J51N1m42k96QO34j4
4781A36m19J50J35O4J52k58P0J95n7K68k36j71j8j6l21K50k78K52L47k92n1l0
$$ plain form
4803 -128 -208 -308 -119 -133 -157 10 -25 -264 -195 23 58 23 166 31 63 386 260 117 159 138 60 21 55 14 -111
4828 -111 -373 -135 -157 218 113 -125 -298 -294 -93 -385 -187 -197 7 -105 160 282 -34 -239 60 115 423 373
4850 373 403 220 327 96 523 -69 118 271 111 -100 -247 -196 -140 -178 -322 178 24 120 -296 -541 -308 131
4872 131 126 224 52 -11 432 -87 234 -6 121 46 -2 131 33 175 -179 -55 -74 -102 -15 274 246 -206 -275 -306
4896 -306 50 -225 -113 45 -289 -12 60 -139 -43 151 392 99 263 117 321 54 17 150 227 181 -363 -36
4918 -36 -87 -101 -175 -169 -93 -130 153 61 -349 -306 20 -195 -222 88 194 136 14 -30 -97 -126 -13 98 7 264 -147
4943 -147 285 -58 264 65 228 219 358 423 -72 -182 -218 54 -150 -248 17 124 -170 -18 -32 -502 -380 -194
4965 -194 63 -106 296 82 -3 104 34 310 108 127 304 230 -64 -12 -140 -17 45 42 106 -218 -163 -94 14 -278
$$ packed form
4803a28q0j00J89j4k4J67l5k39O9K18L5l5J43j35L2L23j26j43M2k1p8l9L4m1j25
4828a11k62K38k2L75j05k38j73MK01k92J98j0K04j12K65J22l16k05K99N5L08n0
4850C73L0j83J07k31M27n92J87J53j60k11j47N1N6l8j44N00j54R6m16k45K33M39
4872A31nR8j72o3M43n19L21k40J27p5m8J33r8J42l54J24j9k8Q7K89k8m52o9l1
4896c06L56k75J12J58l34K77P2j99R6J94K41k93J64j46K04k67l7J33P7m6n44L27
4918c6n1j4p4OP6l7K83r2m10M3L26k15k7L10J06n8j22m4o7k9J13J11r1K57m11
4943a47M32l43L22j99J63rJ39O5m95j10l6K72k04r8K65J07k94J52j4m70J22J86
4965a94K57j69M02k14q5J07p0K76k02J9J77p4k94N2j28J23O2lO4l24N5O9J08k92
$$ plain form
4989 -278 -142 93 -116 250 299 170 -56 -171 299 182 3 667 304 -161 50 -123 -45 201 466 -76 37
5010 37 244 -27 -211 -178 -169 -276 59 -24 -150 -320 -177 -171 -389 -225 -34 245 -161 -217 -148 -169 -273 48 2 90
5034 90 281 326 -20 71 149 -190 62 98 190 -85 -148 -462 -90 120 -139 -107 63 49 -16 -71 -414 -415 173 -192
5058 -192 164 265 -172 -111 27 348 -23 249 3 153 205 181 164 -66 170 -43 -57 88 -4 86 -493 -411 -48
5081 -48 -310 -92 -264 -358 -477 -45 -132 -449 -347 211 483 -25 292 170 174 -89 134 314 316 15 37 282 -60
5104 -60 -66 -115 -305 -123 5 -404 8 130 -559 -347 -96 -9 -210 318 -30 -114 34 168 -62 -3 501 -172
5126 -172 454 51 153 86 50 81 86 172 112 145 7 25 -252 -239 -5 151 -437 282 -35 -510 -41 -50 -218 -134
5150 -134 -135 103 205 -40 -185 -174 81 488 187 399 142 -18 29 -185 -19 -103 152 10 45 -65 -163 -86 -282
$$ packed form
4989b78J36K35k09L66M9j29k26j15M70j17j79O64l63m65K11j73P8K46K65n42J13
5010C7K07k71j84L3Rj07L35q3j26j70J43Ok18J64J91K79m06n6O9k1j04L21m6Q8
5034I0J91M5l46R1P8l39K52L6R2k75o3l14L72K10k59L2J70j4o5n5l43jN88l65
5058a92L56J01m37O1J38L21l71K72k46J50N2k4j7k30K36k13j4J45r2R0n79Q2L63
5081d8k62K18j72r4j19M32q7l17J02N58K72n08L17j22Mk63K23J80Kl01K2K45l42
5104f0om9j90J82J28m09M12J22o89K12K51Q7k01N28l48q4J48J34k30N9N04o73
5126a72O26m03J02o7l6L1NQ6o0L3j38J8k77J3K34J56n88P19l17m75M69rj68Q4
5150a34jK38J02k45j45J1K55M07l01K12k57j60M7k14J66q4K55j42L5j10r8P7j96
$$ plain form
5173 -282 -32 70 -100 9 -63 -127 20 106 -207 -116 -53 200 38 -16 27 296 295 -128 -133 197 296 89 83 118 -125
5198 -125 198 217 -231 -110 -117 -268 -137 -210 -395 52 -236 -53 -223 -152 -227 -137 -87 329 346 -19 147 -184 113
5221 113 -84 290 392 286 351 256 -185 -122 -15 -55 -258 -102 47 -2 23 -329 -309 -458 80 -127 -38 -39 219
5244 219 266 62 12 -35 -24 347 153 117 215 -139 66 -53 121 220 -39 169 17 252 140 -191 -120 -538 -69
5267 -69 87 -48 -237 -566 -211 -207 -55 -61 320 -95 383 459 73 -188 -6 291 202 144 164 49 -106 133 -116
5290 -116 -63 62 269 -372 -144 -165 -380 55 -225 214 -338 102 43 -45 -251 -177 -139 123 353 31 -65 -123 5
5313 5 -37 37 37 23 296 283 67 -98 -68 -188 -210 -25 -47 318 -149 -285 -148 -296 -2 8 55 -202 74 222
5337 222 -217 256 3 192 287 374 189 26 235 -19 80 208 273 189 240 -174 228 18 -96 -117 172 -64
$$ packed form
5173b82K50J02j70J09p2o4J47Q6l13R1O3K53j62n4M3K69jm23nL30R9k07oL5k43
5198a25L23J9m48J21pj51J31p3j85M47k88J83j70P1p5R0N0M16J7l65J66l31K97
5221A13j97L74J02j06O5r5m41O3J07m0k03J56J49m9K5l52K0j49N38k07Q9jK58
5244B19M7k04n0m7J1L71j94l6R8l54K05j19J74R9k59K08j52K35j12l31P1m18M69
5267f9J56j35j89l29L55MJ52oL81m15M78P6l86k61J82K97q9n8K0j15j55K39k49
5290a16N3J25K07o41K28k1k15M35k80M39n52M40n9q8k06P4L8K62K30l22r6n8J28
5313Em2P4%j4K73j3k16j65L0j20k2J85k2L65m67j36J37j48K94J0M7k57K76J48
5337B22m39M73k53J89R5Q7j85j63K09k54R9J28O5q4N1m14M02k10j14k1K89k36
$$ plain form
5359 -64 42 96 -259 -390 -351 -343 151 -220 60 63 61 -125 240 125 95 365 -1 261 200 413 155 142 190 -61
5383 -61 129 233 69 -67 15 -34 174 -165 20 -323 -245 26 -63 -111 -287 7 -34 61 71 45 -352 -176 202
5406 202 127 183 203 -31 374 464 262 -44 -31 -6 -25 -9 327 -8 52 -259 -399 -168 -127 101 37 -90 -328 143
5430 143 132 -133 -39 230 -160 245 450 60 217 52 111 380 -4 261 2 -304 63 -36 -41 -51 33 -415 -242
5453 -242 59 -57 -224 -172 -35 -34 166 -75 187 -179 -38 -518 124 309 34 262 42 311 55 106 287
5474 287 468 219 -61 259 -136 -27 58 -286 -244 -189 32 -69 -53 -115 63 -223 42 -71 110 125 454 212
5496 212 141 232 164 -44 56 98 381 105 -78 18 -42 187 11 121 16 -29 -133 -210 -130 -217 -295 -7 43 -132
5520 -132 126 110 -173 61 8 327 365 148 206 345 -5 40 -261 181 36 157 -112 97 -208 63 -195 -133
$$ packed form
5359f4J06N4l55j31L9QM94l71K80Lkj86L65j15l0K70l66K62o1K13k58j3M8k51
5383f1J90J04j64j36Q2m9K08l39J85l43P8K71q9m8j76K94m1R5J0k6l97J76L78
5406B02p5N6K0k34M05R0k02l06J3K5j9J6L36l35O0l11j40K31M1K28o4j27k38M71
5430A43j1k65R4K69l90M05K05l90J57j65N9K69l84K65k59l06L67r9nj0Q4m48J73
5453b42L01j16j67N2J37JK00k41K62l66J41m80O42J85k75K28k20K69k56N1J81
5474B87J81k49k80L20l95J09Q5l44M2N5K21j01J6o2J78k86K65j13J81J5L29k42
5496B12p1R1o8k08J00M2K83k76j83R6o0K29j76J10j05m5j04p7Q0q7p8K88N0j75
5520a32K58j6k83K34n3L19L8k17N8J39l50M5l01M42j45J21k69K09l05K71k58O2
$$ plain form
5542 -133 169 -86 -325 85 36 -362 -66 -247 135 166 -36 -257 118 38 -211 95 225 42 217 -41 -83
5563 -83 363 6 203 -109 29 43 -55 205 -194 -99 -185 13 -9 -40 -15 3 -77 -12 -167 -130 -177 -112 -171 127 146
5588 146 100 211 156 273 421 412 64 -45 96 99 0 237 59 25 -72 367 -93 117 -193 -349 -202 -155 -32
5611 -32 -56 -125 -236 -153 -371 -74 -191 91 -38 -35 99 40 -5 12 -37 314 213 86 300 -63 39 -176 -302
5634 -302 196 -135 34 40 -270 -325 -306 -391 6 -89 258 67 -21 36 169 188 137 215 244 159 129 109 -92 207 106
5659 106 -96 133 -146 319 49 -246 -125 -192 -46 -113 -86 -172 -26 -231 60 -142 -18 49 -122 299 128 22
5681 22 406 -105 160 230 -69 193 68 -53 -79 -22 184 99 -25 -76 -163 -145 -191 -352 -327 93 118 -236 41 110
5705 110 -183 -82 -252 -212 207 -16 106 6 221 182 243 -250 226 167 100 49 143 92 -43 -320 48 109 154
$$ packed form
5542a33L02k55k39M10m9l98K96j81L82L1k02k21L75q0k49L06J30j83J75k58m2
5563h3M46l57J97l12J38J4r8K60l99R5q6J98k2l1K5J8q0O5j55L7m7O5n9K98J9
5588A46m6J11n5J17J48rl48j09J41Lr9K37j78l4r7M39m60K10l10j56J47M7J23
5611c2k4o9j11Q3k18K97j17K82j29LJ34n9m5J7m9L51j01j27K14l63J02k15j26
5634c02M98l31J69Ol10n5J9q5L97r5L47j91q8N7J33J9n1P8K9q5l0k0k01K99j01
5659A06k02K29k79M65k70k95J21o7J46o7K7q6J46k05K91k02J24O7j71M21j71j06
5681B2L84n11K65P0k99K62j25j21k6N7K06q5j24n1q7J8m6j61K5M20K5l54K77O9
5705A10k93J01j70M0M19k23J22j00K15l9O1m93M76n9o7n1R4n1j35k77L68O1M5
$$ plain form
5728 154 256 358 186 -409 -100 -47 138 -141 -8 28 -249 -255 -158 -44 176 284 -36 -17 -243 -77 110 88
5750 88 20 271 158 -49 152 -126 -84 -66 17 -62 -157 -130 169 -37 -268 -497 -100 -97 -259 -3 83 -39 -406 -56
5774 -56 195 137 8 103 165 121 337 -51 28 284 -54 -47 189 77 5 -145 -229 34 -323 -91 -225 140 40
5797 40 -109 43 -101 -79 -237 3 -50 49 117 -8 -158 152 237 331 -18 271 -12 -61 237 -13 46 -32 185
5820 185 -87 -66 -44 -217 77 -92 102 144 -10 285 -232 -133 174 100 188 488 262 55 64 21 149 106 45 202
5844 202 -204 98 72 -44 -89 -296 118 -311 -27 37 5 11 -156 5 68 167 22 142 34 0 87 -242 -237 14
5868 14 135 -72 220 -94 61 84 1 -3 -81 152 -47 -218 -11 -224 -161 196 -32 -61 173 -49 -1 14 222
5891 222 -210 215 -31 -220 334 -68 56 275 -130 123 192 508 90 -145 18 119 250 14 177 78 -108
$$ packed form
5728A54J02J02j72n95L09N3J85k79J33L6k77oR7J14K20J08l20J9k26J66J87k2
5750H8o8K51j13k07K01k78M2J8Q3p9r5K7K99k06k31k29L97Lj62K56Q6j22l67L50
5774e6K51n8j29R5O2m4K16l88P9K56l38PK36j12p2j50q4K63l57K32j34L65j00
5797D0j49J52j44K2j58K40n3R9O8j25j50L10Q5R4l49K89k83m9K98k50N9p8K17
5820A85k72K1K2j73K94j69J94M2j54K95n17R9L07p4Q8L00k26k07Rm3J28m3o1J57
5844B02m06L02k6j16m5k07M14m29K84O4l2Oj67J61O3R9j45J20j08l4Q7l29NK51
5868A4J21k07K92l14J55K3q3mp8K33j99j71K07k13O3L57k28k9K34k22M8J5K08
5891B22m32M25k46j89N54m02J24K19m05K53O9L16m18k35J63J01J31k36J63r9j86
$$ plain form
5912 -108 -94 -84 103 159 -41 181 -56 446 -193 -260 -69 -183 -273 79 9 -205 77 237 -59 -243 -115 -131
5934 -131 192 218 273 121 150 128 -361 -62 -36 -132 90 10 -260 -28 58 -21 -130 -42 27 -192 -226 -221 -69 212 -60
5959 -60 142 149 37 -97 65 -69 248 -135 -82 130 386 122 401 -22 -156 -24 -355 -304 -132 -226 -69 -272
5981 -272 -33 -188 -191 -192 -67 -233 243 -113 54 110 -18 -277 -460 301 91 284 295 400 34 78 1 115 165
6004 165 -39 -38 -188 -71 -243 50 -232 -326 111 34 -144 -323 88 -300 -193 -154 212 141 -20 167 311 -213
6026 -213 167 202 200 -42 -24 -23 201 35 -241 -27 -102 7 101 -36 -168 97 -385 -118 48 66 -41 66 -3
6049 -3 228 -195 -245 166 230 24 -49 32 81 246 -17 133 -53 298 -17 -36 11 -143 -255 29 -99 -84 -94 -171
6073 -171 81 -11 0 -118 -196 115 -29 -81 -25 -194 -139 151 -4 -287 168 -81 36 -94 -48 310 139 24
$$ packed form
5912a08J4J0J87N6k00K22k37N02o39o7J91j14r0L52p0k14K82J60k96j84J28j6
5934a31L23K6N5j52K9k2m89K99K6r6K22q0k70K32Q6p9j09Q8O9k19l4NJ52K81k72
5959f0K02Pj12j34J62j34L17l83N3K12K56k64K79m23j34J32l31N1J72r4J57k03
5981b72K39j55ljJ25j66M76l56J67N6j28k59j83P61k10J93J1J05l66M4p7J14N0
6004A65k04Jj50J17j72K93k82r4M37p7j78j79M11l88J07L9L66p1j61J87J44n24
6026b13L80L5kk42J8JK24j66k76K14p5J09R4j37j32K65m82K67J66J8j07J07o9
6049cK31m23n0M11O4k06p3Q1M9J65k63J50j86L51l15j9M7j54j12K84j28J5j0p7
6073a71K52r2J1j18p8L11j44n2N6j69N5K90j55k83M55k49J17j30M6L58j71j15
$$ plain form
6095 24 121 -63 -132 -188 29 -71 -73 206 -169 1 76 -132 98 -113 86 -221 -98 214 288 20 73 -5 291
6118 291 108 -35 9 55 -238 -157 -1 -324 11 29 214 141 -73 41 -214 -192 -187 -18 73 -178 -135 -225 -295 -12
6142 -12 -68 -1 -28 164 160 -165 -300 -19 -20 205 171 322 207 -25 22 -106 -262 -209 -30 -225 -207 -66 119 -161
6166 -161 -85 88 -104 -6 -67 279 54 72 -126 -41 293 181 146 209 197 210 88 122 424 -59 -139 87 243 94
6190 94 232 162 -117 86 -94 -11 -34 236 -20 -90 -252 107 -10 269 107 162 57 -112 90 153 91 105 223
6213 223 -44 249 216 -73 -89 246 87 -372 87 -141 -195 28 -351 -283 -1 -167 30 -152 -159 90 31 -135
6235 -135 90 184 42 -98 66 -241 -71 212 123 -203 205 47 188 70 -98 223 -3 -144 -125 -193 -10
6256 -10 -165 -274 -24 -96 -11 -392 -221 -223 185 -334 -36 -14 315 153 38 -87 -278 119 27 108 64 398 210
$$ packed form
6095B4R7j84o9n6K17j00kK79l75J70P5k08K30k11J99l07J23L12P4k68N3p8K96
6118B91j83j43M4M6k93Q1J56l23L35J8J85p3k14J14k55K2NJ69R1k51M3r0p0K83
6142a2n6O7k7J92ml25j35K81jK25l4J51j15k32M7j28j56N3J79j95J8J41J85k80
6166a61P6J73j92R8o1L46k25J8j98Q5L34j12l5O3j2J3j22L4L02m83q0K26J56j49
6190I4J38p0k79K03j80Q3k3K70k56p0j62L59j17K79j62N5j05j69K02O3o2J4J18
6213B23k67K93l3k89j6L35j59m59M59k28n4K23l79O8K82j66J97j82pK49n9j66
6235a35K25R4j42j40J64l07J70K83q9l26M08j58J41j18j68L21k26j41J9o8J83
6256a0j55j09K50p2Q5l81J71kM08n19K98K2L29j62j15j25j91L97r2Q1m4L34j88
$$ plain form
6279 210 8 -173 26 0 -94 -90 29 -76 -193 -31 149 -99 -379 88 -11 -1 -49 30 134 97 322 208 -185
6302 -185 238 -72 406 284 147 66 -55 30 189 -8 -159 -76 62 82 -532 -28 -338 -6 -192 24 75 -170
6324 -170 -133 183 -75 -63 60 -63 5 -147 -100 99 -111 64 183 64 -123 17 121 229 -249 -67 -124 -275
6346 -275 5 -11 7 -137 -222 -109 -198 87 -133 2 250 143 -143 159 -148 51 78 304 120 138 -23 59
6368 59 285 -87 -112 213 150 364 -123 -20 66 -193 0 -3 229 9 200 -137 128 46 -270 -242 86 60 144
6391 144 18 90 111 -60 46 158 213 143 330 -218 26 -134 -40 -97 145 280 -225 -108 -34 195 45 104 -65
6414 -65 -199 -252 -74 -41 63 93 20 -182 256 -33 381 -195 -64 -149 -214 63 42 -3 107 -65 74 359 -107
6437 -107 -139 -147 -161 -161 -257 96 135 -346 -238 49 122 -188 95 -37 -152 432 175 -120 79 285 -40 124 120 314
$$ packed form
6279B10k02j81J99k6r4MJ19j05j17J62J80k48k80M67r9J0m8P9J04l7K25j14l93
6302a85M23l10M78j22j37q1j21Q5J59j97j51Q3J38K0o14N04l10L32j86K16N1k45
6324a70L7L16k58J2J23j23O8j52M7J99k10J75J19j19j87J40J04J08m78J82n7j51
6346b75K80j6J8j44q5J13q9K85k20J35K48j07k86L02l07J99K7K26j84J8j61Q2
6368E9K26l72k5L25o3K14m87J03Q6k59J93lK32k20J91l37K65q2l16K8L28k6Q4
6391A44j26P2K1j71J06J12N5p0J87n48K44j60R4n7K42J35n05J17P4K29j50N9j69
6414f5j34n3J78L3J04L0p3k02M38k89M14n76J31q5o5K77k1m5J10j72J39K85m66
6437a07l2qj4%r6L53L9m81J08K87P3l10K83j32j15N84k57k95J99K06l25J64mJ94
$$ plain form
6461 314 -71 -7 182 60 -228 92 85 -337 55 10 -100 -70 -194 -274 39 -38 -98 44 -45 -159 -156 -43 -324 83
6485 83 -22 102 139 16 10 -63 23 400 37 54 7 -122 -4 -261 178 75 66 -1 -117 -282 -335 -78 82 -208
6509 -208 -13 36 -2 235 114 182 -126 183 -89 -53 -127 262 11 24 213 -49 171 171 -87 159 -43 84 84
6532 84 -315 -156 -231 -152 -39 163 -69 0 -115 29 33 9 -12 151 221 -72 61 309 80 -27 -33 -1 101 381
6556 381 105 -35 212 157 -314 -11 135 -59 127 176 141 -13 74 -152 148 -32 -462 118 -225 87 -130
6577 -130 36 81 65 220 52 -176 418 296 90 -167 227 86 161 -44 -48 -66 -62 -214 -538 -11 133 -80 44
6600 44 -191 -279 -112 -112 36 125 -32 4 243 69 -27 -102 -114 148 6 194 179 -98 240 10 -314 290 -193
6623 -193 349 205 -77 51 101 -117 -85 -222 109 -242 -150 -14 24 -87 2 350 -89 47 41 182 59 199
$$ packed form
6461C14l85O4J89j22k88L20pm22L92m5j10L0j24q0L13p7o0J42q9j14LJ13k81M07
6485H3j05J24L7j23op3Q6L77l63J7m7j29J18k57M39j03ro7j16j65n3K57J60k90
6509b08J95M9l8K37j21O8l08L09k72L6p4L89k51J3J89k62K20%k58K46k02J27%
6532H4l99J59p5P9J13K02k32O9j15J44Mk4k1J63P0k93J33K48k29j07oL2J02K80
6556C81k76j40K47n5m71L03J46j94J86M9l5j54Q7k26L00j80m30N80l43L12k17
6577a30J66M5j6J55j68k28N94j22k06k57L94j41P5k05mj8Mj52l24N27J44k13J24
6600D4k35q8J67%J48Q9j57L6K39j74r6p5j2K62j42J88j5k77L38k30l24O04m83
6623a93N42j44k82J28N0k18L2j37L31l51R2J36L8j11Q9L48m39J36oJ41j23J40
$$ plain form
6645 199 94 30 392 -146 -57 -32 217 12 114 278 -256 -60 199 -1 129 -224 50 260 -206 -229 -95
6666 -95 155 62 142 238 129 12 29 262 187 -98 280 123 119 55 -157 155 -107 -40 74 -253 -4 -152 -268
6689 -268 36 -252 -95 -17 -180 25 -9 19 -360 53 131 -50 91 -79 59 341 186 159 174 285 95 34
6711 34 -56 -138 -138 -350 -20 327 302 303 52 -191 -106 104 383 6 -257 -5 -248 24 65 -70 -116 -205 -51 -6
6735 -6 -112 318 -137 84 -15 231 71 205 -128 -48 218 67 10 -148 83 29 -233 145 -301 -111 320 -30
6757 -30 11 84 116 45 73 -139 17 -55 -70 -192 -155 147 89 -19 -4 -169 216 29 -67 -13 7 -175 17 -112 35
6782 35 -158 -44 -13 113 -170 162 -124 109 67 0 -59 29 3 205 338 77 -61 -168 141 113 207 120 17
6805 17 -24 -207 -256 61 105 -152 -317 19 257 2 181 167 312 47 -139 91 -43 -145 83 141 16 208
$$ packed form
6645A99j05o4L62n38Q9K5K49k05J02J64n34J96K59k00J30l53K74K10m66k3J34
6666i5K50r3Q0R6j09j17J7K33p5k85L78j57mo4k12L12k62O7J14l27K49j48j16
6689b68L04k88J57P8j63K05l4K8l79M13P8j81J41j70J38K82j55k7J5J11j90o1
6711C4r0q2%k12L30L47k5Jk51k43Q5K10K79l77k63K52k43K72M1j35m6q9J54M5
6735fj06M30m55K21r9K46j60J34l33Q0K66j51n7j58K31n4k62L78m46J90M31l50
6757c0M1P3L2p1K8k12J56p2j5j22L7L02n8j08J5j65L85j87r6N4K0j82J92j29J47
6782C5j93J14L1J26k83L32k86K33m2o7n9Q8k6K02J33k61j38j07L09k8R4q7j03
6805A7m1j83m9L17M4k57j65L36K38k55J79j4J45k65j86K30j34j02K28N8j25J92
$$ plain form
6827 208 -159 -161 184 9 -351 -42 382 -155 105 61 -3 -7 -68 -106 -110 102 -122 145 -176 -45 -70 119 72 -14
6851 -14 152 -273 91 239 276 362 16 -53 -270 10 -40 338 -109 -98 342 62 147 -96 148 -92 303 -47
6873 -47 -131 -19 171 27 -232 -132 -125 -264 -190 -126 104 84 -80 66 -29 -53 216 84 48 74 185 105 31 7 -55
6898 -55 243 46 -255 200 -26 106 42 -98 2 -91 37 -182 42 -213 49 -238 140 229 -169 48 191
6919 191 -128 442 -18 -32 -200 43 93 -117 -57 125 149 -120 113 -164 35 22 216 -9 180 -184 46 221
6941 221 -82 4 -66 97 -49 -117 176 67 -7 61 46 222 2 -124 -92 7 391 -123 365 -159 103 143 31
6964 31 -72 -135 111 -121 -90 -124 -124 -329 6 -162 -15 -144 112 145 283 78 102 173 156 -64 292 137 -74
6987 -74 -24 75 -38 0 49 -84 203 -119 -144 -107 -14 24 45 -142 152 -46 133 62 -203 264 -208 52 181 16
$$ packed form
6827B08l67kL45j75l60L09M24n37K60m4o4mo1l8mK12k24K67l21J31k5J89m7q6
6851a4J66m25L64J48L7Q6l46o9k17K80n0L78m47J1M40k80Q5k43K44k40L95l50
6873d7q4J12J90j44k59J00Pj39P4O4K30k0j64J46r5k4K69j32l6K6J11q0p4k4o2
6898e5K98j97l01M55k26J32o4j40J00r3J28k19K24k55K62k87L78Q9l98K17J43
6919A91l19N70m60j4j68K43N0k10O0J82K4k69K33k77J99j3J94k25J89l64K30J75
6941B21l03Q6p0J63j46o8K93j09p4O8j5J76k20j26L2R9L84n14M88n24K62M0j12
6964C1j03o3K46k32L1l4%k05L35j68J47j29K56L3J38k05K4P1j7k20L56j55k11
6987g4N0R9j13L8M9j33K87l22k5L7R3L8K1j87K94j98J79p1k65M67m72K60J29j65
$$ plain form
7011 16 7 -155 -74 -22 -62 -82 -29 -71 -91 16 15 28 9 15 -38 -385 10 -205 -230 -28 -161 -44 118 -137 -133 -439 -82
7038 -82 -103 -112 329 215 112 -294 165 96 128 -17 -160 44 172 170 -15 307 109 -251 8 230 160 -68 -68 -127
7062 -127 217 -241 -270 217 176 202 92 122 44 -56 65 111 173 96 104 155 54 -224 314 61 -146 63 -203 -20
7086 -20 -293 51 -155 70 -160 -257 -104 79 124 -181 -282 -21 -428 243 -70 -135 180 148 -312 -57 184 251
7108 251 160 91 -65 173 -259 -156 202 -140 -181 236 255 -115 145 -140 38 -27 48 -283 252 153 -167 102
7130 102 12 93 -2 -11 114 301 220 28 106 290 229 -160 63 48 -147 237 -218 149 36 -41 57 -24 45 -167
7154 -167 -49 168 -4 -98 -21 152 -181 -112 21 -236 -315 102 -87 60 9 151 -64 97 82 -75 85 122
7176 122 2 292 -124 -300 -83 33 -84 -96 -200 -1 95 -33 -59 -2 142 -149 74 3 -4 -236 88 204
$$ packed form
7011A6rj62Q1N2m0k0N3m2k0J07jJ3j9On3l47L95k15k5K02j33J17J62k55Ml06L57
7038h2k1rM41j14j03m06M59o9L2j45j43K04J28kj85L22j98l60K59K22p0k28%n9
7062a27L44m58k9M87m1K6j10L0p8j00J21M6O2p7QN1j01k78N38k53k07K09k66J83
7086b0k73L44k06K25k30r7J53J83M5l05j01K61m07O71l13o5L15l2m60K55K41O7
7108B51r1o9j56K38m32J03L58l42m1M17J9l70K60k85J78o5P5l31N35r9l20K69
7130A02r0Q1r5rJ25J87q1j92P8J84o1l89K23j5j95L84m55L67j13p7R8q1O9k12
7154a67J18K17j72r4P7J73l33O9J33k57p9M17j89J47n1J42k15J61j5j57J60L7
7176A22j20K90m16j76K17J16j17j2j04J99R6j28k6N7J44k91K23p1pk32L24J16
$$ plain form
7198 204 -273 37 127 -125 89 392 105 261 33 1 -173 11 -218 -137 -84 -161 -229 -9 52 30 94 239 43
7221 43 -304 -267 85 302 37 -53 75 -80 -109 107 -82 236 75 3 -20 124 89 -23 205 -82 64 -96
7243 -96 -139 -272 -34 -28 -305 -61 -97 224 189 95 34 12 136 97 11 52 145 44 281 266 76 -153 194 77 -59
7268 -59 -164 0 304 -77 121 -2 -7 -60 34 -277 -278 119 -65 53 -31 -255 136 -378 246 123 111 174 -168
7291 -168 72 -16 79 174 147 -53 146 297 38 110 -193 -79 1 23 6 -202 40 -115 -73 -12 -155 -370 37
7314 37 95 -73 153 240 102 50 78 80 179 252 15 -143 298 -28 -93 -61 86 73 124 -222 272 -222 -26 8 -20
7339 -20 -242 -155 -12 206 -81 -221 267 50 -302 45 112 267 161 4 -71 88 100 -256 -274 -213 304 192
7361 192 -264 249 99 -222 167 37 75 -6 44 -154 -45 -207 -84 9 -519 -12 -36 147 -104 -172 63 43
$$ packed form
7198B04m77L10R0k52K14L03k87J56k28l2j74J84k29Q1N3p7o8K20O1k2O4J45j96
7221D3l47L7L52K17k65r0J28j55k9K16j89L18j61p2k3J44l5j12K28k87J46j60
7243i6m3j33K38Ok77K44l6L21l5r4o1k2J24l9q6M1R3j01K37j5j90k29L47j17j36
7268e9j05J64L04l81J98j23nn3R4l11jL97j84J18q4k24L91n14O24j23j2O3l42
7291a68K40q8R5R5k7k00J99J51k59P2l03J14Q0K2j7k08K42j55M2O1j43k15M07
7314C7N8j68K26Q7j38n2K8KR9P3k37j58M41l26o5L2J47j3N1l46M94m94J96L4k8
7339b0k22Q7J43K18k87j40M88k17l52L47O7J55j06j57p5J59J2l56j8O1N17j12
7361A92m56N13j50l21L89j30L8q1N0j98J09j62J23R3n28N07k4J83k51o8K35k0
$$ plain form
7383 43 -25 -71 -106 289 -1 159 -126 -119 -108 22 113 -222 212 -133 184 314 -57 -110 210 -70 48 92 -273
7406 -273 166 -106 104 186 -118 -122 196 -26 -209 208 -238 -63 71 367 85 -231 103 -75 117 101 -22
7427 -22 296 -73 150 -102 -380 31 -12 -159 313 33 190 -74 5 239 44 -86 41 85 152 -140 -321 156
7449 156 25 -132 77 238 78 99 -119 -174 -40 -199 40 375 -30 -12 -25 -126 -7 -107 -189 128 -231 35
7471 35 240 479 -101 140 -60 -189 4 -16 119 99 -101 -70 87 259 123 -2 60 -195 -118 -368 -308 -70
7493 -70 141 187 74 52 -244 99 -133 -55 -381 -164 -211 175 189 250 168 -169 296 2 288 122 23 -19 -7 1
7517 1 -180 204 105 72 -191 5 80 175 81 5 16 10 98 -135 -292 -346 -282 -133 37 -293 318 102 -195 229 -45
7542 -45 72 80 88 174 -85 -3 91 133 -97 -114 -215 52 -42 64 -304 -2 -302 88 -55 -117 -171 -237 -114 97 -156
$$ packed form
7383D3o8m6l5L95k90J60k85PJ1J30R1l35M34l45L17J30l71n3L20k80J18M4l65
7406b73M39k72K10Q2l04mL18k22j83M17m46J75J34K96k82l16L34j78J92j6j23
7427b2L18l69K23k52k78M11m3j47M72k80J57k64P9K34j95j30J27M4O7k92j81M77
7449A56j31j57K09J61j60K1k18n5J34j59K39L35m05J8j3j01J19j00q2L17l59K66
7471C5K05K39n80K41k00j29J93k0J35k0k00L1J57J72j36j25O2k55P7k50O0K38
7493g0K11M6j13k2k96L43k32P8l26K17m7L86J4O1q2l37M65k94K86j66r9m2J2Q
7517Aj81L84r9l3k63J96P5R5r4p6J1oQ8k33j57n4O4J49J70l30O11k16k97M24k74
7542d5J17QQQ6k59Q2R4M2k30j7j01K67r4J06l68L02l00L90j43o2n4o6J23K11k53
$$ plain form
7567 -156 -76 23 -56 216 283 27 -117 -136 63 234 -221 -18 -13 -205 -130 -269 -119 -341 -57 174 60 127 -235
7590 -235 -160 -338 -153 147 81 179 -28 194 134 -19 241 -108 261 180 96 -89 216 -148 -84 -136 -140 5 -256
7613 -256 51 -412 -102 -133 8 -132 -207 99 46 -203 -228 176 -184 -176 176 165 -28 64 10 -42 87 -18 -67 35
7637 35 128 32 172 137 93 -295 -31 -136 217 50 263 66 -102 -47 90 -150 65 -41 214 246 52 -228
7659 -228 -120 -76 -68 -213 -56 47 -422 332 -43 231 152 27 -209 41 -183 64 -259 -16 52 210 98 -52
7681 -52 228 -158 123 -411 -241 46 27 97 22 70 -184 40 -195 308 -155 271 111 -348 -284 64 -281 52
7703 52 41 60 -103 -127 -82 -47 -155 165 -77 -96 -191 217 48 -165 78 199 -20 194 -151 -100 529 150 -98
7726 -98 -240 39 -102 -13 -35 95 93 -78 0 148 -11 -255 0 -111 159 -121 -37 -113 16 -31 -288 -24 53
$$ packed form
7567a56Q0R9p9K72O7k56j44j9J99J71m55K03Nj92P5j39J50k22K84K31j14O7l62
7590b35P5j78J85L00o6R8k07K22o0j53K60l49L69q1q4j85L05l64O4n2mJ45k61
7613b56L07m63L10l1J41j40p5L06n3k49k5M04l60QL52j1j93R2n4n2J29j05m9J02
7637C5R3r6J40l5m4l88K64j05L53j67K13j97j68N5J37k40K15j06K55L2j94k80
7659b28J08M4Qj45J57J03m69P54l75K74p9j25k36K50k24K47l23K43O8J58j12j50
7681e2K80l86K81n34J70K87j9P0p5M8k54K24k35N03m63M26j60m59O4L48l45L33
7703E2j1J9j63k4M5L5j08L20k42j9r5M08j69k13K43J21k19K14l45N1O29l79k48
7726i8j42K79j41Q9k2J30kj71P8J48j59k44K55j11K70k80Q4p6J29m7k57K64P7
$$ plain form
7749 53 -51 8 -104 -78 215 310 122 -264 101 58 49 -58 160 -1 -249 -22 -260 -115 -134 -14 0 28 -7 -256
7773 -256 101 -31 196 -47 98 173 -323 -128 -170 -19 219 -1 -156 -117 221 -66 -35 -92 -145 86 -43 238
7795 238 40 150 25 -80 2 -20 157 162 137 -92 -118 -101 -245 -236 215 141 145 -154 -24 122 54 174 -38 -7 7
7820 7 303 17 -10 45 47 -188 -337 -140 -291 -97 122 -65 100 -75 -74 55 31 -30 -288 329 -70 93 -36
7843 -36 130 33 96 -167 -163 -100 -164 -148 51 90 -79 2 60 17 -31 215 -56 -191 -276 -285 101 11 -13 -31 -100 79 9
7870 9 -223 -43 -262 131 2 154 118 56 436 3 156 23 -144 -44 68 -170 -177 -128 281 6 -19 413 -172
7893 -172 -355 -116 138 137 267 270 -39 -62 29 -10 -117 -168 127 172 -93 116 32 219 85 -67 -137 169 -37 72
7917 72 104 105 -30 51 -78 -81 -95 283 56 -116 -138 0 -72 50 114 -25 22 70 178 165 -1 120 163 -1 -56
$$ packed form
7749E3j04N9j12K6K93R5j88l86L65m3rj07K18j61k48K27k38J45j9J20J4K8l5k49
7773b56L57j32K27k43J45P5m96J95m2J51K38k20j55L9L38k87L1n7n3K31j29K81
7795B38j98J10j25j05Q2k2J77Nk5k29k6J7j44RM51p4Mk99J30J46o8J20k12L1J4
7820GK96k86k7N5Kk35j49J97j51J94K19j87J65j75JJ29k4o1k58O17l99J63j29
7843c6J66r7O3k63MO3o4J6J99L9j69Q1N8m3m8K46k71j35q5rL86r0k4j8o9J79p0
7870Ik32J80k19L93j29J52l6o2L80m33J53j33j67J00J12k38pM9M09k75k5M32n85
7893a72j83K39K54jJ30Ll09k3R1l9j07n1K95M5k65K09q4J87j34j52p0L06k06J09
7917G2L2Jj35Q1j29lj4L78k27j72k2J38p2J22O4j39M7M8J08j3j66J21M3j64n5
$$ plain form
7942 -56 188 161 -128 30 -217 120 -150 -72 -5 -88 40 387 192 -275 100 -43 -118 11 -116 43 7 -92 -138
7965 -138 208 127 41 -376 83 78 231 14 258 -144 243 -249 16 -104 29 -272 -115 -103 -256 96 142 -104
7987 -104 -297 87 53 -148 -54 -96 -92 46 -67 -90 -151 192 125 93 102 -100 -29 160 462 53 328 131 -313 -37
8011 -37 -172 -287 -171 43 -362 -73 120 -71 0 221 18 130 254 -169 -15 84 -96 11 -76 55 173
8032 173 -214 124 240 74 -258 46 5 136 296 -85 -88 1 11 204 -106 -275 107 86 38 151 61 43 43 -276
8056 -276 -136 23 62 156 -163 -63 157 137 283 279 53 -93 31 87 -99 210 -2 29 41 82 -63 33 157
8079 157 185 -156 -16 66 -12 -206 37 -175 103 274 17 173 25 175 -252 203 195 493 -142 -130 -13 -39
8101 -39 111 90 194 372 46 126 41 -253 133 -228 2 136 -77 108 -19 -5 -320 -120 -97 4 -124 -199
$$ packed form
7942e6K44k7k89J58k47L37k70P8O7q3J28L47j95m67L75j43p5J29j27J59l6r9m6
7965a38L46q1q6m17M59nJ53k17K44m02L87m92K65j20J33l01J57J2j53L52M6k46
7987a04j93L84l4k01R4m2MJ38j13k3o1L43o7l2Rk02P1J89L02m09K75j97m44K76
8011c7j35j15J16K14m05K89J93j91P1K21k03J12J24m23J54R9j80J07q7J31J18
8032A73l87L38J16j66l32L04m1J31J60l81lQ9J0J93l10j69L82k1m8J13r0j8%l19
8056b76J40J59L9R4l19J00K20k0J46mk26j46J24N6j86L09k12L1J2M1j45R6J24
8079A57K8l41J40Q2p8j94K43k12K78J71k57J56j48J50m27M55qK98o35J2J17k6
8101c9J50k1J04J78l26Q0q5k94L86l61K30J34k13J85j27J4l15K00K3J01j28p5
$$ plain form
8123 -199 138 354 -114 -107 8 -195 40 74 371 -90 -192 167 -47 104 -48 81 -37 36 393 94 -69
8144 -69 -292 193 73 -252 89 -19 -54 -101 -95 -304 215 203 61 -376 -132 103 -195 -261 188 125 -24 26 102
8167 102 109 46 -81 22 211 -136 57 91 -65 -175 -36 -97 250 -69 67 -12 -22 -79 -112 135 202 -230 -164 271
$$ packed form
8123a99L37K16m68PJ15k03K35L4K97m61j02L59k14J51j52J29j18P3L57k99j63
8144f9k23M85j20l25L41j08l5m7Ok09N19j2j42m37K44K35k98o6M49o3j49N0P6
8167A02Po3j27J03J89l47J93L4j56j10J39o1L47l19J36p9j0n7l3K47O7m32O6M35
8191B71
$$ Imaginary data points
##PAGE= N=2
##DATA TABLE= (X++(I..I)), XYDATA
$$ plain form
0 0 0 0 0 0 0 0 0 0 0 8 -8 8 -8 10 -16 16 -18 24 -26 32 -40 44 -50 58 -67 76 -88 99 -114 125 -143 159 -180
33 -180 199 -223 247 -276 306 -340 377 -416 461 -509 566 -628 695 -776 863 -967 1085 -1229
51 -1229 1401 -1617 1889 -2252 2757 -3517 4784 -7280 14140 -72497 -251224 -133234 72774
64 72774 187098 124223 43930 49126 115633 126603 79618 35042 39126 47739 36900 20937 27189
77 27189 22117 -24520 -90566 -117376 -100116 -80387 -82861 -76036 -40270 -12283 -36534 -80464 -74307
90 -74307 -2317 64557 68296 37591 39590 77935 95946 63576 26468 35664 73126 81102 41498
103 41498 -6069 -21725 -14264 -14535 -32709 -54892 -68671 -69684 -55714 -29819 -13896 -28620 -58206
116 -58206 -60302 -20540 23387 28581 7680 8974 44587 71457 53473 14901 4902 28735 45403
$$ packed form
0@%%%%%%%%%Qj6J6j6J8k6L2l4M2n0N8p2Q4r4J08j25J43j64J87k13K39k68L02l39
33a80L79m22M70n23N82o46P17p93Q77r70J075j194J323j471J639j830K052k314
51a229K630l018L506m141N009o274Q301j2064K1420q6637j78727J17990K06008
64G2774J14324o2875q0293N196O6507J0970m6985m4576M084Q613j0839j5963O252
77B7189n072m6637o6046k6810J7260J9729k474O825L5766K7987k4251m3930O157
90g4307P1990O6874L739l0705J999L8345J8011l2370l7108R196L7462P976l9604
103D1498m7567j5656P461k71j8174k2183j3779j013J3970K5895J5923j4724k9586
116e8206k096L9762M3927N194k0901J294L5613K6870j7984l8572r999K3833J6668
$$ plain form
129 45403 30014 7243 6733 18461 12374 -13530 -31942 -29949 -24181 -27847 -29114 -15679 -2483
142 -2483 -7367 -20603 -17419 -328 162 -21126 -26898 7986 50297 44029 -7587 -42985 -19629
155 -19629 29229 44608 17286 -10213 -12880 -4823 -2139 4926 23201 30280 4319 -26450 -16999
168 -16999 26999 46574 8868 -40224 -37979 9825 37542 13726 -22241 -26039 -10818 -15703 -36906
181 -36906 -33696 576 21876 663 -30315 -23725 11009 23803 2392 -11049 14927 48295
193 48295 43793 10157 -3143 19062 39304 25523 -1555 -4974 8313 4894 -19473 -31639 -17687
206 -17687 -7424 -24763 -47244 -37772 -6054 2988 -24805 -46638 -24869 18627 34970 15353
218 15353 -487 11893 31938 31828 19719 20581 33930 35570 18900 3027 2617 4664 -5450 -18926
$$ packed form
129D5403j5389k2771n10J1728o087k5904j8412J993N768l666j267J3435J3196
142b483m884j3236L184J7091M90k1288n772L4884M2311o268n1616l5398K3356
155a9629M8858J5379k7322k7499k667Q057K684P065J8275P079k5961l0769R451
168a6999M3998J9575l7706m9092K245M7804K7717k3816l5967l798J5221m885k1203
181c6906L210L4272K1300k1213l0978O590L4734J2794k1411j3441K5976L3368
193D8295m502l3636j3300K2205K0242j3781k7078l419J3287l419k4367j2166J3952
206a7687J0263j7339k2481R472L1718R042k7793k1833K1769M3496J6343j9617
218A5353j5840J2380K0045j10j2109Q62J3349J640j6670j5873m10K047j0114j3476
$$ plain form
232 -18926 -18176 -8068 -12168 -32529 -42706 -29435 -12578 -15083 -26196 -19039 6414 19820 6171
245 6171 -10117 -1361 23915 35527 26264 17953 24540 29366 16706 -805 -1151 10713 10587 -4453
259 -4453 -14755 -8020 -2524 -16582 -36108 -33244 -9472 4434 -5807 -19256 -13062 3080 3779
272 3779 -7208 -4448 16902 28927 14224 -4929 131 21586 23518 571 -15418 -895 21698
285 21698 17360 -10314 -25650 -13333 2099 -436 -9336 -4772 6306 959 -17544 -19617 2578
298 2578 21386 10998 -10293 -8776 13370 20500 -1094 -21896 -11861 14319 20147 596 -14408
311 -14408 -7039 4488 -1091 -13708 -9371 8969 15714 2641 -7707 -355 10244 5004 -7555
324 -7555 -3333 16903 24637 7101 -14477 -12215 4215 6559 -8566 -16149 -2857 10740 1991
$$ packed form
232a8926P50J0108m100k0361j0177J3271J6857k505j1113P157K5453J3406j3649
245F171j6288Q756K5276J1612r263q311O587M826j2660j7511l46J1864j26j5040
259d453j0302O735N496j4058j9526K864K3772J3906j0241j3449O194J6142O99
272C779j0987K760K1350J2025j4703j9153N060K1455J932k2947j5989J4523K2593
285B1698m338k7674j5336J2317J5432k535q900M564J1078n347j8503k073K2195
298B578J8808j0388k1291J517K2146P130k1594k0802J0035K6180N828j9551j5004
311a4408P369J1527n579j2617M337J8340O745j3073j0348P352J0599n240j2559
324g555M222K0236P734j7536k1578K262J6430K344j5125p583J3292J3597q749
$$ plain form
337 1991 -19713 -25427 -10109 3719 996 -6609 -2229 8415 8199 -1196 -3315 7498 16345 11990
351 11990 4442 7366 14716 11733 -694 -5474 2066 8118 -526 -12837 -11892 -2748 -3311 -16124 -21877
366 -21877 -9758 4629 2088 -12695 -16885 -4681 6757 5424 1584 7395 17211 14910 3802
379 3802 -326 8980 17264 12874 5119 4797 8764 2841 -10395 -13563 -2348 5897 -3894 -18387 -16927
394 -16927 -2931 1071 -12964 -24078 -14559 5617 13054 4951 -1428 1610 3292 -3440 -6252 8835
408 8835 28778 28189 7760 -7621 -1911 9247 5235 -8055 -8524 5375 12431 315 -15209 -15363
422 -15363 -5625 -5293 -15193 -16671 -2314 9832 4466 -8937 -10259 533 5479 -238 -1524 10439
436 10439 20524 10980 -7161 -8875 8412 20684 11625 -4264 -4858 6055 6205 -8669 -16120 -4798
$$ packed form
337A991k1704n714J5318J3828k723p605M380J0644k16r395k119J0813Q847m355
351A1990p548K924P350k983j2427m780P540O052q644j2311R45R144n63j2813n753
366b1877J2119J4387k541j4783m190J2204J1438j333l840N811R816k301j1108
379C802m128R306Q284m390p755l22L967n923j3236l168J1215Q245r791j4493J460
394a6927J3996M002j4035j1114R519K0176P437q103o379L038J682o732k812J5087
408H835J9943n89k0429j5381N710J1158m012j3290m69J3899P056j2116j5524j54
422a5363R738L32r900j478J4357J2146n366j3403j322J0792M946n717j286J1963
436A0439J0085r544j8141j714J7287J2272r059j5889n94J0913J50j4874p451J1322
$$ plain form
450 -4798 9670 6522 -9235 -13981 -3032 4767 -3317 -14591 -9758 5652 11625 3365 -4440 -1417
464 -1417 4661 2549 -3068 -42 7963 7340 -1779 -5933 2129 10229 4661 -6450 -6440 5040 9686
479 9686 -1072 -12573 -8218 6062 11693 2275 -5974 -2826 3823 1046 -8240 -10041 -2528 4489
493 4489 3963 40 -1744 -3641 -8271 -9437 -929 8865 7636 -4128 -9517 397 12637 11528 733
508 733 -2802 6373 12230 5592 -4245 -2312 7971 9622 -169 -7649 -3182 3744 -1136 -14039 -18777
523 -18777 -10533 -2046 -1667 -3592 -764 823 -5226 -13024 -9370 5733 15808 11493 4300 7212 15613
538 15613 13446 872 -3051 8071 19017 11673 -6150 -12821 -2095 6531 -1667 -16380 -18684
551 -18684 -8613 -3199 -9580 -16610 -14045 -6662 -3784 -3594 2571 11157 10647 803 -3994 5971 18824
$$ packed form
450d798J4468l148j5757m746J0949P799q084j1274M833J5410N973q260p805L023
464a417O078k112n617L026Q005o23r119m154Q062Q100n568j1111J0J1480M646
479I686j0758j1501M355J4280N631r418q249L148O649k777r286j801P513P017
493D489n26l923j784j897m630j166Q508R794j229j1764n389R914J2240j109j0795
508G33l535R175N857o638r837J933J0283J651r791p480M467O926m880j2903m738
523a8777Q244Q487L79j925K828J587o049p798L654J5103J0075m315p193K912Q401
538A5613k167j2574l923J1122J0946p344j7823o671J0726Q626q198j4713k304
551a8684J0071N414o381p030K565P383K878J90O165Q586n10r844m797R965J2853
$$ plain form
566 18824 19667 10322 7197 14835 17615 5803 -9442 -11538 281 7220 -171 -11369 -14272 -10549
580 -10549 -10890 -15793 -16305 -8916 -2007 -2058 -4363 -2422 1283 895 -495 5465 16945 22260 14638 3998
596 3998 2490 8620 10490 5164 1562 5019 8096 2059 -9269 -14549 -10912 -7761 -10679 -12311 -6791
611 -6791 -12 -1039 -9348 -13657 -8348 -495 2627 4316 8716 12191 8650 716 -215 7955 14207
626 14207 9826 2874 3262 8565 6058 -4762 -11390 -4669 5900 5070 -6652 -13287 -8581 -1800 -4171
641 -4171 -9550 -8097 118 3697 -1140 -5053 -1624 2423 -189 -3456 1287 11680 13537 2860 -6354
656 -6354 -1129 9903 11759 1393 -4516 2040 10521 6917 -5315 -9755 -2430 4333 1797 -5500
670 -5500 -5725 -1947 -3439 -10519 -11035 -3025 3832 767 -6780 -7223 -241 3018 -1350 -3413 3741 12511
$$ packed form
566A8824Q43r345l125P638K780j1812j5245k096J1819O939p391j1198k903L723
580a0549l41m903n12P389O909n1k305J941L705l88j390N960J1480N315p622j0640
596C998j508O130J870n326l602L457L077o037j1328n280L637L151k918j632N520
611f791O779j027q309m309N309P853L122J689M400L475l541p934r31Q170O252
626A4207m381o952L88N303k507j0820o628O721J0569q30j1722o635M706O781k371
641d171n379J453Q215L579m837l913L429M047k612l267M743J0393J857j0677r214
656f354N225J1032J856j0366n909O556Q481l604j2232m440P325O763k536p297
670e500k25L778j492p080n16Q010O857l065p547m43O982L259m368k063P154Q770
$$ plain form
686 12511 11694 2814 -1209 4066 10239 8274 2554 2533 7002 6310 -1318 -7718 -6170 -1707 -3311 -8275
702 -8275 -9614 -5422 -3422 -7814 -12713 -10616 -3776 913 1559 1858 3835 4393 2202 2130 7841 14021
718 14021 13829 8454 4769 6593 7972 2858 -3163 -3179 1982 3566 -2335 -10191 -13120 -11046 -9508 -8773
734 -8773 -6317 -3208 -3050 -6136 -6774 -2302 2465 2237 1270 5660 13619 14924 7903 208 1565 8883
750 8883 10867 5357 837 2133 4904 -201 -8902 -12384 -7491 -3032 -3782 -6057 -5114 -3630 -7125 -11992
766 -11992 -9288 683 8124 6269 -226 -557 5241 7935 3543 804 5083 11256 9637 1536 -2096
781 -2096 1974 4016 -743 -6750 -4848 2277 3990 -3367 -9973 -8274 -2190 -235 -3495 -3730 673
796 673 3792 -296 -5153 -4305 2198 5697 3502 1024 2120 3574 -171 -3561 -989 5196 7749 2111
$$ packed form
686A2511q17q880m023N275O173j965n720k1M469o92p628o400J548M463j604m964
702h275j339M192K000m392m899K097O840M689O46K99J977N58k191p2N711O180
718A4021j92n375l685J824J379n114o021j6N161J584n901p856k929K074J538P35
734h773K456L109J58l086o38M472M767k28r67M390P959J305p021p695J357P318
750H883J984n510m520J296K771n105q701l482M893M459p50k275R43J484l495m867
766a1992K704R971P441j855o495l31N798K694m392k739M279O173j619q101l632
781b096M070K042m759o007J902P125J713p357o606J699O084J955l260k35M403
796F73L119m088m857Q48O503L499k195k478J096J454l745l390K572O185K553n638
$$ plain form
812 2111 -4134 -2699 2777 3838 -1171 -3851 -323 4720 3983 -1642 -4773 -3742 -1172 -631 -364 561
828 561 226 -2582 -5564 -5167 -1936 -754 -2089 -1572 2655 5565 2656 -3439 -4797 410 6256 6837
844 6837 5041 5156 6005 3299 -1178 -3448 12 3720 3382 171 -1330 -2283 -4375 -8375 -8394 -3515 0
861 0 -1458 -5325 -5567 -2064 116 -2059 -2900 1377 7537 8061 3604 1724 4585 6572 3964 205 2834
878 2834 8545 9383 1613 -6596 -7517 -2544 -182 -3035 -5225 -4049 -2854 -5609 -8533 -7345 -2491 226
894 226 -1579 -2060 1117 3869 2589 9 2095 7970 10597 6322 917 1997 5497 5351 75 -2846
910 -2846 821 5424 3018 -4491 -9184 -7584 -4766 -4423 -5237 -2263 1293 147 -4743 -7568 -4269 1045
926 1045 2384 1937 3342 7006 6913 2725 -727 622 4394 5729 4060 2668 3081 2118 -2215 -4927
$$ packed form
812B111o245J435N476J061n009k680L528N043p37n625l131J031K570N41K67R25
828E61l35k808k982L97L231J182j335N17M227K910k909o095j358N207N846N81
844F837j796J15Q49k706m477k270L460L708l38l211j501r53k092m000j9M879L515
861@j458l867k42L503K180k175q41M277O160N24m457j880K861J987k608l759K629
878B834N711Q38p770q209r21M973K362k853k190J176J195k755k924J188M854K717
894B26j805m81L177K752j280k580K086N875K627m275n405J080L500j46n276k921
910b846L667M603k406p509m693J600K818L43q14K974L556j146m890k825L299N314
926A045J339m47J405L664r3m188l452J349L772J335j669j392M13r63m333k712
$$ plain form
942 -4927 -3195 302 810 -2497 -4768 -3910 -2486 -3727 -6152 -4870 -531 2316 1372 -643 -1314 -666
958 -666 7 366 2359 5077 5805 4091 1657 1131 1292 738 68 1462 3756 3176 -964 -4698 -3874 -812
976 -812 360 -1084 -2382 -1405 -1572 -3631 -5117 -3070 900 2203 111 -1122 1210 2839 632 -2856
992 -2856 -2232 2764 6482 5063 1591 1149 1907 631 -2517 -2919 1431 4991 3339 -1668 -3007 -1808
1008 -1808 -1681 -3897 -4123 -481 2792 901 -4699 -5753 -1719 2358 1147 -2083 -1264 2554 3692 141
1024 141 -2937 143 4727 4938 2088 -179 2162 3477 530 -3096 -2352 2218 3755 1177 -2127 -2027
1040 -2027 -985 -2533 -4822 -4150 521 2968 256 -3529 -3649 -765 -125 -1748 -1100 2970 5362 3164
1056 3164 -1185 -2714 782 3987 3119 1124 1819 3741 2456 -736 -3203 -1966 1019 1099 -519 -974
$$ packed form
942d927J732L497N08l307k271Q58J424j241k425J282M339K847r44k015o71O48
958f66O73L59J993K718P28j714k434n26J61n54o70J394K294n80m140l734Q24L062
976h12J172j444j298R77j67k059j486K047L970J303k092j233K332J629k207l488
992b856O24M996L718j419l472m42P58j276l148m02M350L560j652n007j339J199
1008a808J27k216k26L642L273j891n600j054M034M077j211l230Q19L818J138l551
1024A41l078L080M584K11k850k267K341J315k947l626P44M570J537k578l304J00
1040b027J042j548k289O72M671K447k712l785j20K884O40j623O48M070K392k198
1056C164m349j529L496L205q68j995O95J922j285l192k467J237K985Q0j618m55
$$ plain form
1072 -974 -703 -2206 -4006 -4664 -1841 991 263 -1404 -1376 -87 529 -914 -1912 337 3640 3950 2041
1089 2041 715 1047 1035 512 97 2062 3994 2956 -561 -2678 -2324 -1557 -1681 -1186 131 1678 99
1106 99 -4116 -6335 -3783 -413 437 -71 292 1770 1185 -1624 -3136 -668 3000 3701 2178 1635 3190
1123 3190 3535 392 -2522 -1881 1766 3560 1948 265 -276 -32 -2662 -5404 -3907 708 3042 438
1139 438 -3315 -3648 -795 -468 -2505 -3023 1145 4564 3078 -956 -2366 547 2823 2124 962 2156
1155 2156 4438 3081 -760 -2246 205 2981 1790 -1198 -1397 659 543 -3047 -5016 -3176 1033
1170 1033 1009 -1397 -3215 -1883 -22 -708 -2663 -1120 2218 3663 2532 600 668 1344 914 81 1679
1187 1679 4528 5038 2032 -1571 -3167 -1097 507 142 -230 56 -778 -2781 -4779 -4151 -1680 -808 -927
$$ packed form
1072i74K71j503j800o58K823K832p28j667K8J289O16j443r98K249L303L10j909
1089B041j326L32j2n23m15J965J932j038l517k117L54P67j24M95J317J547j579
1106I9m215k219K552L370Q50n08L63J478n85k809j512K468L668P01j523n43J555
1123C190L45l143k914O41L647J794j612j683n41K44k630k742J497M615K334k604
1139D38l753l33K853L27k037n18M168L419j486m034j410K913K276o99j162J194
1155B156K282j357l841j486K451K776j191k988j99K056j16l590j969J840M209
1170A033k4k406j818J332J861o86j955J543L338J445j131j932O8O76m30q33J598
1187A679K849N10l006l603j596K070J604l65l72K86q34k003j998O28K471Q72j19
$$ plain form
1204 -927 -1438 -536 526 -474 -1688 -888 1160 2725 2803 2483 2730 3050 1211 -264 -215 2251 3403 2198
1222 2198 155 -332 -1223 -2972 -4314 -3237 170 1151 -848 -3954 -4557 -1950 -727 -1506 -1130 838
1238 838 2830 2199 102 -131 1278 2065 1591 1928 3785 4979 2978 -1784 -3020 -249 2089 1148 -1122
1255 -1122 -1556 287 -371 -3613 -5628 -3465 815 1376 -1109 -2062 -688 579 -609 -2270 -913 3018
1271 3018 4484 2568 352 396 1717 1369 -321 86 2960 4260 1962 -2006 -3061 -1275 132 -818
1287 -818 -1549 -76 1031 -683 -3587 -3773 -1057 898 -267 -1461 -836 1565 1765 -564 -2284 -582
1303 -582 2444 3252 2294 809 340 423 -303 -424 831 2271 1962 245 -850 -990 -1061 -1826 -1699 28
1321 28 1520 762 -1760 -2661 -2199 -985 -772 -584 90 1246 1000 -556 -1380 -658 637 915 1219 2539
$$ packed form
1204i27n11R02J062j000j214Q00K048J565P8l20K47L20j839j475M9K466J152j205
1222B198k043m87q91j749j342J077L407R81j999l106o03K607J223p79L76J968
1238H38J992o31k097k33J409P87m74L37J857J194k001m762j236K771K338r41k270
1255a122m34J843o58l242k015K163M280N61k485r53J374J267j188j661J357L931
1271C018J466j916k216M4J321l48j690M07K874J300k298l968j055J786J407r50
1287h18p31J473J107j714k904j86K716J955j165j194O25K401K00k329j720J702
1303e82L026Q08r58j485m69Q3p26j21J255J440l09j717j095j40p1p65J27J727
1321B8J492p58k522r01M62J214K13J88O74J156k46j556q24P22J295K78L04J320
$$ plain form
1339 2539 2580 1507 -251 -1138 -39 1881 2061 1030 637 765 -532 -2340 -3107 -1464 418 274 -1357
1356 -1357 -1773 -486 -523 -2411 -3333 -1473 1478 2597 563 -1069 -667 1157 1456 657 730 2784 3848
1373 3848 1828 -790 -1140 727 955 -89 45 1187 1554 -1163 -4369 -4615 -1423 602 -617 -2181
1389 -2181 -993 332 -409 -2768 -3464 -395 2691 2934 1489 840 2166 2389 363 -455 1050 3957
1405 3957 3827 1453 -333 -562 -231 -1224 -2407 -1888 689 1094 -1089 -3578 -3716 -2676 -1731 -952 -311
1422 -311 940 1099 -282 -1667 -501 1031 2439 2012 2078 2892 2841 2007 32 -311 868 1645 1378 463
1440 463 -270 -382 -1757 -2921 -2569 -1645 -830 -958 -1636 -1628 -1738 -2486 -2229 -451 1460 2414 1264 323 558
1459 558 1013 1518 1279 1875 3389 3507 1972 -136 -302 55 -437 -1236 -729 637 780 -1219 -3774 -3977
$$ packed form
1339B539M1j073j758q87J099J920J80j031l93J28j297j808p67J643J882j44j631
1356a357m16J287l7j888r22J860K951J119k034j632M02J824K99p99P3K054J064
1373C848k020k618l50J867K28j044J34J142L67k717l206k46L192K025j219j564
1389b181J188J325p41k359o96L069L086K43j445o49J326K23k026q18J505K907
1405C957j30k374j786k29L31r93j183N19K577M05k183k489j38J040R45P79O41
1422c11J251J59j381j385J166J532J408m27O6Q14n1q34j975l43J179P77k67r15
1440D63p33j12j375j164L52R24Q15j28o78Qj10p48K57J778J911R54j150r41K35
1459E58M55N05k39N96J514J18j535k108j66L57m92p99N07J366J43j999k555k03
$$ plain form
1477 -3977 -1822 -774 -1390 -1333 -638 -58 -466 -1967 -1397 936 2663 2031 1052 1461 2514 2468 222 -294
1495 -294 1345 3416 2486 495 -1339 -686 -268 -1538 -2330 -1656 692 690 -1857 -3973 -3049 -1557 -929 -1190
1513 -1190 -368 1494 1991 185 -1599 -629 1727 2899 2009 1671 2594 3060 1565 -460 -1400 -130 1538
1530 1538 1402 205 -389 -813 -1952 -3383 -3441 -1036 583 95 -1114 -2248 -1513 -620 -654 -755 610 1860
1548 1860 2124 1461 552 956 747 681 673 1787 2334 1818 827 -475 -1127 -487 -665 -372 -147 379 -910 -2366
1568 -2366 -2583 -1865 -607 34 -67 -93 -209 -917 -1389 -355 1255 2071 1353 692 1167 1428 1222 -245 -570
1587 -570 637 2224 2105 457 -664 -707 -780 -1870 -1444 158 1312 781 -1240 -2512 -1795 -558 -635 -977
1605 -977 -37 1529 1345 -420 -1695 -837 990 1468 738 842 1969 2216 606 -1458 -1313 656 1990
$$ packed form
1477c977K155J048o16N7O95N80m08j501N70K333J727o32r79M09J053m6k246n16
1495b94J639K071r30j991j834O53M18j270p92O74K348kk547k116R24J492O28k61
1513a190Q22J862M97j806j784R70K356J172q90l38R23M66j495k025r40J270J668
1530A538j36j197n94m24j139j431n8K405J619m88j209j134P35Q93l4j01J365J250
1548A860K64o63r09M04k09o6qJ114N47n16r91j302o52O40j78K93K25N26j289j456
1568b366k17P18J258O41j01k6j16p08m72J034J610Q16p18o61M75K61k06j467l25
1587e70J207J587j19j648j121m3p3j090M26J602J154n31k021j272P17J237p7l42
1605i77R40J566j84j765j275Q58J827M78p30J04J127K47j610k064J45J969J334
$$ plain form
1622 1990 1106 -128 62 392 -522 -2459 -2513 -219 1856 854 -1356 -1684 -860 -550 -1109 -1523 -50 1553
1640 1553 1345 175 -468 210 510 31 -269 1147 2855 2433 136 -1344 -976 682 1042 330 92 554
1658 554 122 -1309 -2464 -2338 -857 447 -268 -436 -717 -690 -1274 -1737 -764 634 1122 720 555 191 361
1677 361 5 398 312 1765 2282 1496 1216 12 -619 -838 -540 356 1079 713 -811 -2160 -1820 -1252 -1223
1696 -1223 -1145 -749 378 169 -484 -925 -1055 126 624 607 1198 1973 1708 319 -579 68 1357 1748 1046
1715 1046 674 927 595 -620 -2233 -1756 -219 622 59 -1335 -1327 -1596 -1371 -2080 -1350 601 1098 455 -706
1734 -706 -632 529 1361 626 109 1254 2970 2487 347 -629 -21 1033 1159 172 163 399 131 -1516 -2712
1753 -2712 -2046 -634 -210 -937 -1184 -496 -504 -1575 -2125 -1214 1094 2424 1667 669 345 817 846 516 934
$$ packed form
1622A990q84j234J90L30r14j937n4K294K075j002k210l28Q24L10n59m14J473J603
1640A553k08j170o43O78L00m79l00J416J708m22k297j480L68J658L60p12k38M62
1658E54m32j431j155J26J481J304p15j68k81K7n84m63R73J398M88m02j65l64J70
1677C61l56L93q6J453N17p86k80j204o31k19K98Q96P23l66j524j349L40N68K9
1696a223P8L96J127k09o53m41j30J181M98j7N91P75k65j389q98O47J289L91p02
1715A046l72K53l32j215j613M77J537Q41n63j394Qk69K25p09P30J951M97o43j161
1734g06P4J161Q32p35n17J145J716m83k140r76O08J054J26r87rK36k68j647j196
1753b712O66J412M24p27k47O88qj071n50R11K308J330p57r98l24M72K9l30M18
$$ plain form
1772 934 1937 2542 1808 19 -336 -560 -346 -1039 -777 58 470 -188 -1506 -2393 -2054 -1109 -620 -136 1
1791 1 288 474 -234 -653 -725 333 1024 1708 2068 2031 723 -496 -300 583 1080 1358 910 443 -60 -781
1811 -781 -1506 -1499 -925 -296 179 -511 -547 -802 -1152 -1421 -1010 373 935 503 -311 -22 338 760 -69 186 1098
1832 1098 1960 1464 152 -96 125 474 180 -19 475 1179 184 -1310 -1863 -1028 124 92 -660 -1246 -332
1851 -332 -391 -1197 -1899 -961 241 1572 919 -249 275 73 219 -160 506 1782 2423 1273 148 -215
1869 -215 164 717 -423 -528 539 1284 369 -1281 -2169 -1556 -714 -554 -698 -418 -22 -633 -1131 -1623 -992
1888 -992 644 1124 1217 1147 1381 1134 144 -340 634 1955 2294 1431 549 34 -272 -238 -951 -732 -133 -17
1908 -17 -679 -1000 -1458 -1815 -1623 -1294 -888 71 414 138 -253 -277 -77 540 963 1592 1830 1552 1092 580 591
$$ packed form
1772I34J003O05p34j789l55k24K14o93K62Q35M12o58j318q87L39R45M89M84J37
1791AK87J86p08m19p2J058O91O84L60l7j308j219J96Q83M97K78m48m67n03p21
1811g81p25PN74O29M75o90l6k55l50k69M11J383N62m32q14K89L60M22q29K55R12
1832A098Q62m96j312k48K21L49k94j99M94P04r95j494n53Q35J152l2p52n86R14
1851c32n9q06p02R38J202J331o53j168N24k02J46l79O66J276O41j150j125l63
1869b15L79N53j140j05J067P45r15j650q88O13Q42J60j44K80L96o11m98m92O31
1888i92J636M80R3p0K34k47r90m84R74J321L39q63q82n15l06L4p13K19N99J16
1908a7o62l21m58l57J92L29M06R59L43k76l91k4K00O17M23O29K38k78m60n12J1
$$ plain form
1929 591 236 414 470 1012 746 -286 -996 -1458 -1396 -1013 -683 -819 -833 -684 -964 -1349 -1110 -656 492 489 695
1950 695 737 1026 714 278 -3 821 2004 2337 1071 -48 -209 537 139 -436 -310 489 876 93 -1276
1969 -1276 -1685 -1468 -985 -722 -830 -304 406 -120 -1079 -1250 -361 601 846 567 918 1410 812 -62 -523 231
1989 231 1314 1613 981 333 235 -219 -576 -952 -520 225 448 -415 -1224 -1455 -989 -1184 -1207 -933 -147 959
2009 959 394 -631 -1156 -357 445 835 1097 1328 1453 1263 711 581 522 793 1069 587 337 133 -565 -1222
2029 -1222 -1700 -1147 -533 -77 -781 -1078 -1282 -1572 -1284 -1035 -219 540 639 511 559 334 265 632 1117 1636 2115
2050 2115 1730 904 310 293 -6 -112 31 199 4 -625 -1087 -1232 -1283 -1848 -1379 -657 74 483 -582 -1345
2070 -1345 -679 -105 730 704 1120 1369 1083 1388 812 360 564 1414 1092 935 172 63 -529 -1055 -1708 -907
$$ packed form
1929E91l55J78N6N42k66j032p10m62O2L83L30j36j4J49k80l85K39M54J148lK06
1950F95M2K89l12m36k81Q24J183L33j266j119j61P46l98n75J26P99L87p83j369
1969a276m09K17M83K63j08N26P10n26r59j71Q89R62K45k79L51M92n98q74m61P54
1989B31J083K99o32o48r8m54l57l76M32P45K23q63q09k31M66j95k3K74P86J106
2009I59n65j025n25P99Q02L90K62K31J25j90n52j30n9K71K76m82k50k04o98o57
2029a222m78N53O14M56p04k97k04k90K88K49Q16P59R9j28M8k25o9L67M85N19M79
2050B115l85q26n94j7k99j06J43J68j95o29m62j45n1n65M69P22P31M09j065p63
2070a345O66N74Q35k6M16K49k86L05n76m52K04Q50l22j57p63j09n92n26o53Q01
$$ plain form
2090 -907 24 -217 -1043 -1031 -937 -1158 -990 -1429 -596 762 1157 486 69 -189 170 725 878 1144 1451 1075
2110 1075 629 -321 -626 106 105 47 59 91 -106 -559 -1098 -1099 -1047 111 31 -11 -365 -458 -442 -667 -516 271 665
2133 665 789 555 388 155 165 109 -61 327 836 1148 537 -46 -567 -447 -129 322 415 135 60 -206 -768
2154 -768 -904 -856 -458 47 63 -48 -244 -616 -697 -854 -133 313 518 751 507 -210 48 124 300 641 968
2175 968 960 858 676 -50 -483 -758 -72 585 231 -245 -807 -776 -848 -837 -516 -617 184 35 -437 -389 -473 -179
2197 -179 -468 281 1107 1216 1511 528 -72 -253 683 553 536 398 634 465 -297 -928 -1004 -806 -255 -43 7
2218 7 -586 -666 -968 -1457 -1032 -130 520 328 152 -97 246 505 -63 141 514 1201 1153 1103 101 -307 -153
2239 -153 147 254 533 819 -204 -335 -1049 -1180 -761 -238 -138 -444 -405 -135 -309 -718 -737 -40 430 963
$$ packed form
2090i07R31k41q26J2R4k21J68m39Q33J358L95o71m17k58L59N55J53K66L07l76
2110A075m46r50l05P32jn8J2L2j97m53n39jN2J158q0m2l54r3J6k25J51P87L94
2133F65J24k34j67k33J0n6j70L88N09L12o11n83n21J20L18M51R3k80p5k66n62
2154g68j36M8L98N05J6j11j96l72q1j57P21M46K05K33k44p17K58P6J76L41L27
2175I68qj02j82p26m33k75O86O57l54m76n62L1p2J1L21j01Q01j49m72M8q4K94
2197a79k89P49Q26J09K95r83o00j81R36j30j7j38K36j69p62o31p6J98N51K12N0
2218Gn93q0l02m89M25R02O50j92j76k49L43K59n68K04L73O87m8n0j002m08J54
2239a53L00J07K79K86j023j31p14j31M19N23J00l06L9K70j74m09j9O97M70N33
$$ plain form
2259 963 446 225 249 72 65 137 524 997 1109 915 305 -41 -431 -371 -20 113 189 73 -179 -789 -1218 -934
2281 -934 -689 -71 119 -96 -628 -253 -305 -200 -181 -186 383 891 997 688 223 241 484 690 516 899 609 -107
2303 -107 -249 -449 -425 -276 -8 -59 -156 -316 -263 -608 -1173 -960 -134 234 510 -233 15 146 -3 -88 92 777
2325 777 1212 1261 858 471 -171 213 -141 -269 196 668 -33 -254 -1066 -786 -320 -407 -298 -691 -6 -77 -421
2346 -421 -839 -739 -445 254 618 508 671 343 193 158 -156 890 1038 854 671 115 103 -12 209 -165
2366 -165 -135 340 243 2 -1017 -1090 -617 -373 -381 -92 -56 113 -122 -376 -522 -193 25 213 533 756 519 595
2388 595 -235 -277 229 600 1021 623 -44 -268 -258 -144 -374 -281 51 -198 55 -577 -643 -958 -709 -528 -300
2409 -300 50 89 -346 -308 -449 -136 157 407 994 613 660 586 259 2 126 252 979 770 314 -413 -804
$$ packed form
2259I63n17k21K4j77pP2L87M73J12j94o10l46l90O0L51J33P6j16k52o10m29K84
2281i34K45O18J90k15n32L75n2J05J9nN69N08J06l09m65J8K43K06j74L83k90p16
2303a07j42k00K4J49K68n1r7j60N3l45n65K13Q26L68K76p43K48J31j49q5J80O85
2325G77M35M9m03l87o42L84l54j28M65M72p01k21q12K80M66q7J09l93O85p1l44
2346d21m18J00K94O99L64j10J63l28j50l5l14J046J48j84j83n56j2j15K21l74
2366a65L0M75r7k41j019p3M73K44qK89L6J69k35k54j46L29K18J88L20K23k37P6
2388E95q30m2N06L71M21l98o67k24J0J14k30R3L32k49K53o32o6l15K49J81K28
2409c00L50L9m35L8j41L13K93K50N87l81M7p4l27k57J24J26P27k09m56p27l91
$$ plain form
2430 -804 -523 -634 -589 -185 -362 -169 -247 -689 -817 -467 -544 -118 45 92 544 508 3 -102 177 1145 1191 835
2452 835 614 521 128 155 -487 -410 122 -64 127 -433 -495 -932 -808 -659 -807 -19 178 138 -472 -324 -252 300
2474 300 288 672 678 838 754 404 211 210 -245 349 364 458 186 -72 -123 -795 -377 -132 5 162 -40 -158 -197
2497 -197 -573 -494 -597 -77 355 632 180 -614 -417 -119 293 195 140 226 320 27 -319 35 -242 173 459 368
2519 368 268 27 -89 -229 -446 -137 318 410 -346 -500 -548 -157 -438 -333 -220 -356 306 115 -20 -267 -435
2540 -435 -32 380 744 407 704 504 503 138 15 240 694 684 535 382 215 -279 -622 -624 -566 -88 -151 -269
2562 -269 -860 -729 -659 -274 -148 -120 195 468 368 206 -176 244 684 936 655 658 707 391 206 -485 -183 202
2584 202 168 -285 -727 -546 -523 -839 -901 -926 -503 -163 -116 -239 -378 -230 -144 460 448 591 1266 747 775 177 -72
$$ packed form
2430h04K81j11M5M04j77J93p8m42j28L50p7M26J63M7M52l6n05j05K79R68M6l56
2452H35k21r3l93K7o42P7N32j86J91n60o2m37J24J49j48P88J97m0o10J48P2N52
2474C00j2L84OJ60q4l50j93jm55N94J5R4k72k58n1o72M18K45J37J57k02j18l9
2497a97l76P9j03N20M32K77m52p94J97K98M12r8n5Q6R4k93l46L54k77M15K86r1
2519C68j00k41j16j40k17L09M55R2p56j54m8L91k81J05J13j36O62j91j35k47j68
2540d35M03M12L64l37K97k00jl65j23K25M54j0j49j53j67m94l43kN8M78o3j18
2562b69n91J31P0L85J26K8L15K73j00j62l82M20M40K52k81LM9l16j85o91L02L85
2584B02l4m53m42J81K3l16o2k5M23L40M7j23j39J48Q6O04j2J43O75n19K8n98k49
$$ plain form
2607 -72 629 429 146 124 378 142 -353 -876 -963 -470 -313 -297 -324 -383 -287 -749 -506 -177 152 102 475 385 248
2630 248 242 392 172 177 541 753 501 77 -165 -270 -222 -179 103 -185 -88 105 -116 -574 -510 -741 -25 -129 202
2653 202 302 134 -57 197 338 -106 745 489 408 110 -150 -274 168 199 40 -273 78 170 85 -81 -537
2674 -537 22 -104 218 238 22 302 -82 -167 -92 -371 265 -44 161 -193 -86 -19 -444 -387 -143 344 489 66
2696 66 -116 -135 -3 336 440 215 158 221 331 -16 -112 -133 -72 99 158 -72 -134 -511 -591 -954 -474 2 -15 -23
2720 -23 -40 -283 25 -496 127 -108 78 581 727 723 146 288 49 294 339 221 385 305 -377 -296 -425 -506 -424
2743 -424 37 -365 -380 32 -515 -776 -568 -265 175 116 598 198 78 249 526 319 367 525 700 537 146
2764 146 146 -194 69 -245 -271 122 -1 -165 -537 -799 -768 -407 -460 -135 -428 -246 324 -256 -360 6 72 721
$$ packed form
2607g2P01k00k83k2K54k36m95n23q7M93J57J6k7n9R6m62K43L29L29n0L73r0j37
2630B48oJ50k20NL64K12k52m24k42j05M8M3K82k88R7J93k21m58O4k31P16j04L31
2653B02J00j68j91K54J41m44Q51k56q1k98k60j24M42L1j59l13L51R2q5j66m56
2674e37N59j26L22K0k16K80l84q5P5k79O36l09K05l54J07O7m25N7K44M87J45m23
2696F6j82j9J32L39J04k25n7O3J10l47r6k1O1J71N9k30o2l77q0l63M80M76j7q
2720b3j7k43L08n21O23k35J86N03J46mn77J42k39K45M5j18J64q0o82Q1j29q1Q2
2743d24M61m02j5M12n47k61K08L03M40n9M82m00j20J71K77k07M8J58J75j63l91
2764A46%l40K63l14k6L93j23j64l72k62L1L61n3L25k93J82N70n80j04L66O6O49
$$ plain form
2786 721 791 354 196 202 17 109 391 372 419 157 77 -381 -271 -446 -87 -301 -322 -437 2 -97 -468 -666 -347
2809 -347 -80 229 242 11 134 235 291 11 217 470 482 352 -15 -214 -51 -151 -53 88 355 342 86 -366
2831 -366 -513 -552 -165 105 -220 -118 3 -146 -51 -252 -184 152 85 338 257 420 -138 -189 -133 269 136 512
2853 512 318 32 -80 -45 219 -308 -137 -77 236 308 -370 -100 -217 -220 -522 89 -103 -259 -20 122 -158 -390
2875 -390 -122 -360 155 173 278 50 60 2 -139 38 408 710 607 206 75 56 -159 -170 -343 33 115 -254
$$ packed form
2786G21P0m37j58Oj85R2K82j9M7k62q0m58J10j75L59k14k1j15M39r9l71j98L19
2809c47K67L09J3k31J23J01N6k80K06K53J2j30l67j99J63j00R8J41K67j3k56m52
2831c66j47l9L87K70l25J02J21j49R5k01O8L36o7K53q1J63n58n1N6M02j33L76
2853E12j94k86j12L5K64n27J71O0L13P2o78K70j17ll02O11j92j56K39J42k80k32
2875c90K68k38N15J8J05k28J0n8j41J77L70L02j03m01j31j9k15j1j73L76Q2l69
$$ [...]
8191B47
##END NTUPLES=NMR FID
##END=
