##TITLE=1H_SL63-old(1y)Cryst
 CDCl3, 8 sc, 
 22.10.2020
##JCAMPDX= 6.0         $$ Bruker NMR JCAMP-DX V2.0
##DATA TYPE= NMR FID
##DATA CLASS= NTUPLES
##ORIGIN= UXNMR, Bruker Analytische Messtechnik GmbH
##OWNER= root
$$ XWIN-NMR		Version 3.5
$$ Thu Oct 22 10:01:31 2020 Russian Standard Time (UT+4h)  she@DPX200
##.OBSERVE FREQUENCY= 200.1315066352
##.OBSERVE NUCLEUS= ^1H
##.DELAY= (6, 6)
##.ACQUISITION MODE= SIMULTANEOUS
##.ACQUISITION SCHEME= undefined
##.AVERAGES= 8
##.DIGITISER RES= 18
##SPECTROMETER/DATA SYSTEM= spect
##.PULSE SEQUENCE= zg30
##.SOLVENT NAME= CDCl3
##.SHIFT REFERENCE= (INTERNAL, CDCl3, 0, 15.7039)
##AUDIT TRAIL= $$ (NUMBER, WHEN, WHO, WHERE, WHAT)
$$ ##TITLE= Audit trail, XWIN-NMR		Version 3.5
$$ ##JCAMPDX= 5.01
$$ ##ORIGIN= Bruker BioSpin GmbH
$$ ##OWNER= she
$$ F:/spectra/data/she/nmr/H-F/1/audita.txt
$$ ##AUDIT TRAIL=  $$ (NUMBER, WHEN, WHO, WHERE, WHAT)
(   1,<2020-10-22 10:00:22.96 +0400>,<she>,<DPX200>,
      <created by zg, POWCHK disabled, PULCHK disabled
       configuration hash MD5:
       00 E9 B6 7A A2 85 ED C7 34 08 36 98 17 FE 4E 26
       data hash MD5: 16K
       DF AE 86 29 3A BF AD 64 90 F0 3F 64 AD 6C C9 3D>)
$$ ##END=
$$ 
$$ hash MD5
$$ B0 9B 28 48 EF 49 51 F6 9F 5A D7 B5 E0 8A 27 16
##$RELAX= 
##$RELAX= 
##$RELAX= 
##$RELAX= 
##$RELAX= 
##$RELAX= 
$$ Bruker specific parameters
$$ --------------------------
##$DU= <F:/spectra>
##$EXPNO= 1
##$NAME= <H-F>
##$PROCNO= 1
##$TYPE= <nmr>
##$USER= <she>
##$AMP= (0..31)
100 100 100 100 100 100 100 100 100 100 100 100 100 100 100 100 100 100 
100 100 100 100 100 100 100 100 100 100 100 100 100 100 
##$AQSEQ= 0
##$AQ_mod= 1
##$AUNM= <au_zg>
##$AUTOPOS= <>
##$BF1= 200.13
##$BF2= 200.13
##$BF3= 200.13
##$BF4= 200.13
##$BF5= 200.13
##$BF6= 200.13
##$BF7= 200.13
##$BF8= 200.13
##$BYTORDA= 1
##$CFDGTYP= 0
##$CFRGTYP= 5
##$CHEMSTR= <none>
##$CNST= (0..31)
1 1 145 1 1 1 1 1 1 1 1 1 1 1 1 1 1 1 1 1 1 1 1 1 1 1 1 1 1 1 1 1 
##$CPDPRG= <>
##$CPDPRG1= <>
##$CPDPRG2= <>
##$CPDPRG3= <>
##$CPDPRG4= <mlev>
##$CPDPRG5= <mlev>
##$CPDPRG6= <mlev>
##$CPDPRG7= <mlev>
##$CPDPRG8= <mlev>
##$CPDPRGB= <>
##$CPDPRGT= <>
##$D= (0..31)
0 1.2 0 0 0 0 0 0 0 0.06 0 0.03 0 0 0 0 0.0002 0 0 0 0 0 0 0 0 0 0 0 0 
0 0 0 
##$DATE= 1603346422
##$DBL= (0..7)
120 120 120 120 120 120 120 120 
##$DBP= (0..7)
150 150 150 150 150 150 150 150 
##$DBP07= 0
##$DBPNAM0= <>
##$DBPNAM1= <>
##$DBPNAM2= <>
##$DBPNAM3= <>
##$DBPNAM4= <>
##$DBPNAM5= <>
##$DBPNAM6= <>
##$DBPNAM7= <>
##$DBPOAL= (0..7)
0.5 0.5 0.5 0.5 0.5 0.5 0.5 0.5 
##$DBPOFFS= (0..7)
0 0 0 0 0 0 0 0 
##$DE= 6
##$DECBNUC= <off>
##$DECIM= 32
##$DECNUC= <off>
##$DECSTAT= 4
##$DIGMOD= 1
##$DIGTYP= 9
##$DL= (0..7)
0 120 120 120 120 120 120 120 
##$DP= (0..7)
150 150 150 150 150 150 150 150 
##$DP07= 0
##$DPNAME0= <>
##$DPNAME1= <>
##$DPNAME2= <>
##$DPNAME3= <>
##$DPNAME4= <>
##$DPNAME5= <>
##$DPNAME6= <>
##$DPNAME7= <>
##$DPOAL= (0..7)
0.5 0.5 0.5 0.5 0.5 0.5 0.5 0.5 
##$DPOFFS= (0..7)
0 0 0 0 0 0 0 0 
##$DQDMODE= 0
##$DR= 18
##$DS= 0
$$ [...]
##$SUBNAM2= <"">
##$SUBNAM3= <"">
##$SUBNAM4= <"">
##$SUBNAM5= <"">
##$SUBNAM6= <"">
##$SUBNAM7= <"">
##$SUBNAM8= <"">
##$SUBNAM9= <"">
##$SW= 16.880792210976
##$SWIBOX= (0..15)
0 0 2 0 0 0 0 0 0 0 0 0 0 0 0 0 
##$SW_h= 3378.37837837838
##$TD= 16384
##$TD0= 1
##$TE= 0
##$TE2= 300
##$TE3= 300
##$TEG= 300
##$TL= (0..7)
0 120 120 120 120 120 120 120 
##$TP= (0..7)
150 150 150 150 150 150 150 150 
##$TP07= 0
##$TPNAME0= <>
##$TPNAME1= <>
##$TPNAME2= <>
##$TPNAME3= <>
##$TPNAME4= <>
##$TPNAME5= <>
##$TPNAME6= <>
##$TPNAME7= <>
##$TPOAL= (0..7)
0.5 0.5 0.5 0.5 0.5 0.5 0.5 0.5 
##$TPOFFS= (0..7)
0 0 0 0 0 0 0 0 
##$TUNHIN= 0
##$TUNHOUT= 0
##$TUNXOUT= 0
##$USERA1= <user>
##$USERA2= <user>
##$USERA3= <user>
##$USERA4= <user>
##$USERA5= <user>
##$V9= 5
##$VALIST= <valist>
##$VCLIST= <CCCCCCCCCCCCCCC>
##$VD= 0
##$VDLIST= <DDDDDDDDDDDDDDD>
##$VPLIST= <PPPPPPPPPPPPPPP>
##$VTLIST= <TTTTTTTTTTTTTTT>
##$WBST= 1024
##$WBSW= 4
##$XGAIN= (0..3)
0 0 0 0 
##$XL= 0
##$YL= 0
##$YMAX_a= 100751
##$YMIN_a= -89052
##$ZGOPTNS= <>
##$ZL1= 120
##$ZL2= 120
##$ZL3= 120
##$ZL4= 120
##$ABSF1= 10
##$ABSF2= 0
##$ABSG= 5
##$ABSL= 3
##$ALPHA= 0
##$AQORDER= 0
##$ASSFAC= 0
##$ASSFACI= 0
##$ASSFACX= 0
##$ASSWID= 0
##$AUNMP= <proc_1d>
##$AZFE= 0.1
##$AZFW= 0.1
##$BCFW= 1
##$BC_mod= 2
##$BYTORDP= 1
##$COROFFS= 0
##$CY= 11.3945322036743
##$DATMOD= 1
##$DC= 2
##$DFILT= <>
##$DTYPP= 0
##$F1P= 16.9975609425685
##$F2P= -3.02152046262296
##$FCOR= 0.5
##$FTSIZE= 0
##$FT_mod= 4
##$GAMMA= 1
##$GB= 0.15
##$INTBC= 1
##$INTSCL= 1
##$ISEN= 128
##$LB= 0.24
##$LEV0= 0
##$LPBIN= 0
##$MAXI= 10000
##$MC2= 0
##$MEAN= 0
##$ME_mod= 0
##$MI= 1.114404
##$NCOEF= 0
##$NC_proc= 0
##$NLEV= 6
##$NOISF1= 3.799351
##$NOISF2= 2.8
##$NSP= 1
##$NTH_PI= 0
##$NZP= 0
##$OFFSET= 15.70392
##$PC= 1
##$PHC0= -10695.43
##$PHC1= 18.60089
##$PH_mod= 1
##$PKNL= yes
##$PPARMOD= 0
##$PSCAL= 0
##$PSIGN= 0
##$REVERSE= no
##$SF= 200.130013532006
##$SI= 16384
##$SIGF1= 3
##$SIGF2= 2
##$SINO= 400
##$SIOLD= 16384
##$SREGLST= <1H.CDCl3>
##$SSB= 0
##$STSI= 0
##$STSR= 0
##$SW_p= 3612.71676300578
##$SYMM= 0
##$S_DEV= 0
##$TDeff= 0
##$TDoff= 0
##$TI= <>
##$TILT= no
##$TM1= 0
##$TM2= 0
##$TOPLEV= 0
##$USERP1= <user>
##$USERP2= <user>
##$USERP3= <user>
##$USERP4= <user>
##$USERP5= <user>
##$WDW= 1
##$XDIM= 8192
##$YMAX_p= 0
##$YMIN_p= 0
$$ End of Bruker specific parameters
$$ ---------------------------------
##NTUPLES= NMR FID
##VAR_NAME=  TIME,          FID/REAL,        FID/IMAG
##SYMBOL=    X,             R,               I
##VAR_TYPE=  INDEPENDENT,   DEPENDENT,       DEPENDENT
##VAR_FORM=  AFFN,          ASDF,            ASDF
##VAR_DIM=   8192,          8192,            8192
##UNITS=     SECONDS,       ARBITRARY UNITS, ARBITRARY UNITS
##FACTOR=    0.000296,      1,               1
##FIRST=     0,             0,               0
##LAST=      2.424536,      0,               0
##MIN=       0,             -89052,          0
##MAX=       2.424536,      100751,          0
$$ Real data points
##PAGE= N=1
##DATA TABLE= (X++(R..R)), XYDATA
$$ [...]
2015b44j004J157N16j690J548J3j118J295k41r81J409m19j185J141j157m63J572
2032A49k65J2J906j285l92J149j670J52J091j427J60J395j253N53O92j394N92
2049A65J226r76R92j62k190J297n45r36J679l61r17K028n34r48J405j357p93J437
2067E10p99K05R96j776l91J798j355M07J496j225j30J232j227rr9j360Q01O52
2085b74n13J224k59j493J449j14q50J821q55j244J550n93r73J001q78k60J705
2102D44J75k23O92j402k9Q07j142L85J074j514M72R68j284P69P87j540J208Q37
2120A484q67M79o69j883J647N9p93J451k54q73J455n48o61Q34p33q31J749q92
2138A54n33Q52j483L09J474j314P76R32j518O34M07j727M88M66j418J172J128
$$ plain form
2015 -244 -1248 -91 425 -1265 283 296 -822 473 232 -749 660 241 -944 197 -960 -1423 149
2032 149 -116 -104 1802 517 125 1274 -396 -244 847 -580 -420 975 -278 275 967 -427 165
2049 165 1391 415 1407 1245 -945 352 -193 -1129 550 189 -728 1300 766 -182 1223 -134 -927 510
2067 510 -289 -84 912 -864 -1255 543 -812 -405 1091 -134 -264 968 -259 -268 -367 -1727 -926 -274
2085 -274 -787 437 178 -1315 134 20 -830 991 136 -1108 442 -151 -1124 -123 -1001 -1261 444
2102 444 619 396 1088 -314 -343 464 -678 -293 781 -733 -261 707 -577 192 979 -561 647 1484
2120 1484 617 1096 427 -1456 191 250 -543 908 654 -219 1236 688 27 861 128 -703 1046 154
2138 154 -379 473 -1010 -701 773 -541 235 1167 -351 283 690 -1037 -549 -83 -1501 -329 799
2155G99j518R33j58j243J261J17o88R47n95p68J030q10p97J306m92j19J841q23
2173B23k28O34j237j95J170j033N39P82j392P45M84j586J300M93j042J268M11
2190A336j791Q74k67j287J194J27q04J617k35r26J331r02l62J035p91j47J378
2207A380j512j60R05j525N31J195j102R59O54j780L78N80j825J165N28j535J221
2224E7L40j373J170q0j390J503L6r34J260o12j402J201n16n68J529o20j1J439
2242A029j373l8Q30j478L03J374j471M28Q47j488O97O57j303J139P26j130R16
2259F65J02j525P80o2q85J341K12q62J375r15l33Q32m87n23J410r55l35J439j199
2278G5m54P59o90J61J653j262L2R50j336m85J041j213P51P41j141O47J30j120
$$ plain form
2155 799 -719 214 56 -1187 74 191 -497 450 -145 -913 117 -693 -1490 -184 -676 -795 1046 223
2173 223 -5 629 -608 -803 367 -666 -127 655 -737 8 492 -1094 206 699 -343 925 1336
2190 1336 -455 419 152 -1135 59 186 -618 999 764 -162 1169 267 -95 940 149 2 1380
2207 1380 -132 -292 613 -912 -381 814 -288 671 1325 -455 -77 503 -1322 -157 371 -1164 57
2224 57 397 -976 194 114 -1276 227 263 -671 589 -23 -1425 -224 -740 -1308 221 -399 -410 1029
2242 1029 -344 -382 448 -1030 -727 647 -824 -396 451 -1037 -340 317 -986 153 879 -251 665
2259 665 767 -758 22 -40 -925 416 628 -234 1141 226 -107 725 238 -285 1125 170 -165 1274 75
2278 75 -379 380 -310 -149 1504 242 274 1224 -112 -597 444 -769 -18 723 -418 229 359 -761
2296g61Q32J59o96R80j02j027J225r91p40J304q99k10J439o71M4P96j211l75J261
2315C57j020LJ283j229K49P87j177K30O29p33P91N44j012M80J98j270R65j4o16
2334e55J394o36q97J538o57m90J103m99p37J473o40m65Q07j040k49R78l20L28
2352D36P01j256M43L68j123P67L15j373J273J94j061Q22k68j100R63M3o62J306
2370G88n66j013J092n47o66J066k44m85J239o07m71P15r96k24J358j168N83P08
2388E62j601N00N98r42N66P19j553J186N53q93M67m07r35J235J38o00J033n90
2406C6q51J107l11k71J070p01m59J246p73k30J035j181m4J364o50O0N80j342M07
2425I2O97j191O74K84p72N51P73j516Q96l15r55R86N15p59Q89n12j229J425n08
$$ plain form
2296 -761 71 230 -466 514 412 -615 610 -381 -1121 183 -716 -926 513 -158 -114 682 -529 -904 357
2315 357 -663 -660 623 -606 -357 430 -747 -517 112 -621 170 714 -298 182 380 -890 75 61 -555
2334 -555 839 203 -694 844 187 -303 800 301 -436 1037 397 -68 739 -301 -550 428 108 436
2352 436 1137 -119 324 692 -431 336 651 -722 551 745 -316 506 238 -862 101 144 -518 788
2370 788 222 -791 301 -246 -912 154 -90 -575 664 57 -414 301 -695 -919 439 -729 -146 562
2388 562 -1039 -539 59 -883 -317 402 -1151 35 588 -305 162 -245 -1180 55 193 -407 626 36
2406 36 -815 292 -19 -290 780 79 -380 866 93 -137 898 -283 -327 1037 387 447 1027 -315 92
2425 92 789 -402 272 556 -216 335 1108 -408 488 173 -782 204 719 -40 849 337 -892 533 25
2444B5l74Q93n20l76P50n71j26O17r82J53J054q89K06M83j207L58O86r15M11K82
2464d2q42O98O47j143M87J02q10J159K04q18M48m39p22J392m39l41J286j109K8
2483b54J077q59o0O80r99L59Q46q18j00Q82j063L33Q64j024L21O63j057M74O77
2502I42j007J35K43j127J398K29q14O30m23q42J358n39m00J023o99o80J190p50
2520a33n75J082r95L77P59o45q2O93j397J50R81q48L82L27q75R03J12q76N53K98
2540A91q83Q77pr79Q46o53j95Q48j66o13J064m17l55J065m82n33Q80p93M1R54
2560F90r62J29O91j015O70N95q81P23J88j176O66P1j069R79K92r26O72K08j081
2579e36J338o63l26R68n64n80Q86n41m27R65o53l01Q60m76j0O76p07j78N13r44
$$ plain form
2444 25 -349 544 24 -352 398 -173 -299 318 -664 -511 543 -346 -140 343 -864 -506 180 -735 -324 -42
2464 -42 -884 -186 461 -682 -195 -93 -903 256 460 -358 90 -349 -1071 321 -118 -459 827 -282 -254
2483 -254 823 -36 -96 584 -415 -56 790 -28 -128 754 -309 24 888 -136 185 848 -209 265 942
2502 942 -65 70 313 -814 584 813 -1 629 206 -636 722 183 -217 806 107 -573 617 -133
2520 -133 -708 374 -621 -244 515 -130 -212 481 -916 -766 215 -633 -251 76 -799 104 216 -660 -107 191
2540 191 -692 185 178 -801 45 -608 -803 45 -121 -734 330 -87 -442 623 141 -392 488 -305 -264 690
2560 690 -272 -143 548 -467 203 798 -83 640 828 -348 318 389 -680 299 591 -335 337 545 -536
2579 -536 802 139 -187 781 217 -363 523 -18 -445 520 -133 -434 426 -50 -60 616 -91 -269 244 -700
2599g00K61P28j013O56L19o82M19J6q05J034l8q47P79k55o30O66l98k29R43l35
2619a11l43N70k34p9P17q77N0N29n19nN66n15K49L10q11O19O62r64M99K19q49
2640c17O00p3q24J030J3p96Q59p7n93J005m05p22J053o03m69P94l84n09O61m24
2660a81K35O66o74K7O04r61L57O09j163L22M24r95M84N03r97J114j99o64O06K1
2680A38r68R63j58q79N87q7n72P43l51K29N98j93m15P34p68k03M37l75M7N79p68
2701f82K76P73p19L34L43q82P54L88j074O50j12p79P35N51n91N74j7n36O08L2
2721F26n99M85k92m94Q31n45j78P86n52l17J117o43K38N91j066J72L74r17J90
2740a93J24m95M45L92l07K79K02r17R83n19m05P25o44m23O38k55l15R04l89l27
$$ plain form
2599 -700 -439 289 -724 -68 251 -431 -12 4 -801 233 195 -652 127 -128 -758 -92 -490 -719 224 -111
2619 -111 -454 116 -118 -197 520 -357 -307 222 -297 -302 264 -251 -2 308 -503 116 778 -186 313 532 -317
2640 -317 283 210 -614 416 429 -367 492 415 -178 827 422 -300 753 150 -319 475 91 -418 243 -181
2660 -181 54 720 46 73 677 -284 73 682 -481 -159 265 -730 -246 257 -740 374 175 -489 117 138
2680 138 -830 133 -25 -904 -317 -404 -976 -233 -584 -355 243 50 -365 369 -399 -602 -165 -540 -493 86 -682
2701 -682 -406 367 -352 -18 325 -557 197 585 -489 161 49 -730 5 556 -35 539 522 -14 594 626
2721 626 27 512 220 -274 557 12 -166 620 68 -249 868 225 463 1054 -12 160 534 -383 -193
2740 -193 -69 -564 -119 273 -34 245 447 -470 513 -6 -411 314 -330 -753 -115 -370 -685 219 -170 -497
2760d97P87Nn97N54n69l66N44m79J53P73p58K84O71o58K27L56p40P19l55k26L21
2781A49k62k93N37O3k28P69m12m09P23l00l85L41r9o03Q59m75k3L26oO6N18o80
2803A76M94J65j127N34K78j018O41J29o24Q04K77o58M96l3r15O84j48l95M06k08
2823d2p66Q01l45J1O61l62o6P19q11p2M90p63n49R72m50L7O37n91K40N80m67K77
2845A41k17k87K00J30l03j18K79n63R33K38n79N50j50j61P9k13P9Q8m66O6O68
2866C94l11j71M84l55J77O44p87K38J39p18L67N7n94O01L60n68M44K8m19L8J53
2887B01o02N52pr4k64Q6m77Q06j85J4K79m93J91O09q22j51J89n71J87M44l96J04
2909d00O15o48K11L24n73J50N25o23K41r1m71L78P1k21O72Q9k32L69l98j11L46
$$ plain form
2760 -497 290 295 -302 252 -317 -683 -139 -618 -465 308 -450 -166 505 -153 74 430 -310 409 54 -172 149
2781 149 -113 -406 131 194 -34 735 323 -86 637 337 -48 293 194 -409 450 -25 -48 278 272 338 856 176
2803 176 670 835 -292 242 520 -498 143 272 -352 452 729 71 567 534 -381 303 155 -240 166 -42
2823 -42 -808 -7 -352 -341 320 -42 -108 611 -200 -272 218 -545 -1094 -122 -572 -535 102 -489 -249 331 -136 141
2845 141 -76 -363 -163 -33 -336 -454 -175 -738 195 433 -146 404 254 93 172 -41 38 126 -340 -274 394
2866 394 83 -88 396 41 218 862 75 313 452 -266 101 158 -436 165 525 -43 401 429 10 48 201
2887 201 -401 151 144 50 -214 -128 -605 201 16 30 309 -184 7 616 -206 -357 -168 -739 -552 -108 -504 -400
2909 -400 215 -433 -222 102 -471 -321 204 -419 -178 -269 -740 -362 -291 -512 160 249 17 386 -12 -123 223
2930B23l12l90O02m02k71Q27l22k01Q46o11M98J51m30N0N0o14Q6M73k89Q6L59
2951D09l24K14M12o98M26J70o86L03m6n65O39m04k25O36p1k43N91l12k74N00o60
2972b08m69O50k07o0N98l17p9P0m94L86L34l22J20m0m64J94n6j82J94K38n26R04
2994B64j56k12K95l21j36J2K11o20M85Pk44N27k12K25K92l89L79R1l81j64K48
3015B01n96M14K4r0N27K21p42L91M02o15M43j33n45L43k23k68L63m0j92O60j75
3036C70j83N89n33j00k55Q8j9K40l98M5L40l41r9L00j82o0M49o99L13K03m75L83
3058b4l45k24K37J42J43J33l5j12J74l70l4K77k26k29M95j16k82L04M2j07Q21
3079F64l59l65L84m02r7K73k35j37O24k75M0M09l87J40J35j76J95j86M0ol81p2
$$ plain form
2930 223 -89 -479 123 -279 -550 277 -45 -246 600 -11 487 638 208 258 308 -306 -220 253 -36 50 409
2951 409 85 299 711 13 439 609 -77 226 180 -385 254 -150 -375 261 190 -53 538 226 -48 452 -208
2972 -208 -677 -27 -234 -294 304 -13 -92 -22 -516 -130 204 -118 2 -38 -502 -308 -364 -546 -352 -114 -640 264
2994 264 108 -104 191 -130 -266 -254 -43 -663 -178 -171 -415 112 -100 125 417 28 407 498 117 -47 201
3015 201 -395 19 43 -47 480 701 -41 350 752 137 580 447 -98 245 22 -246 117 77 -115 545 370
3036 370 187 776 243 143 -112 -24 -43 197 -201 -156 184 -157 -256 44 -138 -198 251 -448 -135 68 -407 -24
3058 -24 -369 -593 -356 -214 -71 62 27 -85 89 -281 -315 -38 -264 -493 2 -114 -396 -92 -50 -157 664
3079 664 305 -60 324 -78 -175 98 -137 -274 350 75 115 524 137 277 412 236 431 245 285 279 -102 -174
3101a74J76L51k52O00l60pK05k59l23K98o44rN68k29K17J23m78K44K08k57L4J11
3123A43l83jj5n47M10K09l5M81j24k43l32K85k94N07l20l04N39k28l78N20j39
3144b49j56N58j49oL22r0m37J15o29K43N19k97K04L02m74L70K96o12K81M4J6M6
3166B17j8l43K42l38k08Q50j57k5M49m54oK25l62q5K47k00j06N42k27j63J61k36
3188Ej9K02k4j30L27l38l41M20o50N70m9mN51k51n00K18k07l58L58K17j68R5k50
3211c26j77M26r7k3M73k54J01rk30l86K86l32L82J50j4k7P9k85J76K22k20L00
3233B15j05K9K70m9m14qk23J73K76K30N9m20J42J16k39k4L07n2N4K2r0j68PJ50
3257B58pk20Q2j27l1J17m59M98l2k62J38K51j61J76j65l58K93J64k19k23L58j40
$$ plain form
3101 -174 2 353 101 701 341 334 539 280 -43 255 -389 -398 170 -59 158 281 -197 47 255 -2 32 143
3123 143 -240 -241 -256 -803 -393 -184 -219 262 138 -105 -437 -152 -446 61 -259 -563 -24 -252 -630 -110 -249
3144 -249 -405 153 4 -2 320 230 -207 -92 -721 -478 41 -256 -52 250 -224 146 442 -170 111 155 171 217
3166 217 199 -144 98 -240 -448 402 245 220 669 215 209 434 72 -13 234 34 -72 470 243 80 241 5
3188 5 -14 188 164 34 361 23 -318 102 -548 22 -27 -31 520 269 -231 -13 -220 -578 -220 -3 -171 -76 -326
3211 -326 -503 -77 -174 -197 276 22 123 114 -116 -502 -216 -548 -166 -16 -30 -57 22 -263 -87 135 -85 215
3233 215 110 139 409 360 -54 -62 -285 -112 164 394 453 33 175 291 52 28 335 283 337 359 269 101 108 258
3257 258 251 31 113 -14 -45 72 -387 111 79 -183 -45 206 45 221 56 -302 -9 155 -64 -287 71 -69
3279f9J58l16rN8J7j21L01r4p3J36l72Q6j81q5K25L34m37L76J91l39j58M11k86
3302b47K32oQ8q9L2j39L6O5K66R3J22k18k97J9J77k14K01P4K74j0k91J62l14n
3326A1L40p2l5L36p78N88k36J24j01J8ok4L07l66r9j50L6Q0K8p9q5R6j59nJj29
3352c59L30Q6j15J88m40N7j1j7nL05l97J15J26J77j17l88K17J01R1j64K43Q0k14
3375a11J11j06n8J36J03k81M17j38k54K79o9l09L92K83l30J36J46l70O7j26rL23
3397B32L9O1O8m47K29Q5l03J72M3m6P1j04r8L42k87J67r6k9J36j40j4r5m4J04
3421D6m5j30Nm4J49r5j1K06l67o9L26j39J71k79K6J51j42J49j00M9j17K08K2j24
3445a54M4n0J4K05l96K61k9P2j21L48l7j95Q1O4J26k93J01K52k67m6L65k42p9
$$ plain form
3279 -69 89 -227 -236 -178 -161 -282 19 -75 -148 -12 -384 -298 -479 -564 -339 -5 -442 -66 125 -214 -372 39 -247
3302 -247 -15 -21 67 -22 10 -129 -93 -28 238 331 453 235 -62 -43 134 -80 121 195 469 459 168 330 16 11
3326 11 351 279 244 580 -198 390 154 278 177 195 189 165 472 106 7 -143 -107 -27 1 -78 -163 -67 -226 -231 -230 -359
3352 -359 -29 57 -58 130 -310 -253 -264 -281 -286 19 -378 -263 -137 40 -77 -465 -248 -147 -56 -220 23 103 -111
3375 -111 0 -106 -164 -28 75 -206 211 73 -181 98 29 -280 112 395 65 201 347 -23 44 -82 -91 232
3397 232 271 332 400 -47 182 267 -36 136 179 133 204 100 2 344 57 224 128 99 235 95 81 -14 -58 46
3421 46 1 -129 -124 -168 -19 -114 -125 81 -286 -355 -29 -168 3 -276 -250 -99 -241 -92 -192 -143 -260 -52 -30 -154
3445 -154 -110 -160 -146 59 -337 -76 -105 -33 -154 194 157 -38 43 107 233 -60 41 293 26 -20 345 103 24
3468B4p1L56j71k46M45n0n6Q2k11K7K75l70j13J94rK85k30j86N9q2K24j40k37
3491b01K94r7M6l2j69K84j63k8oP3O0L7j95Q3l22J37J22m5J45k8j22k09L07O4
3515C5k14K49l93M7M5M2r0j3L33N1OP2p8L6k46K0Nr4q2J55J27K35k57Q3L1Q4R0
3542B79k52N9J39k26J87k89K17j6k7j08K22K49j46l6p7L7o2L8k28%J8j18K43j74
3566g1J60J04j48PJ35k51P1k21J22m7l2J42k3n2L31k01k2o0k10L59j34l71L14
3589i8l13N7j04N28r7o5K41j70M4l22M06l24J25k47L58j33m6K10k4J38j22j66
3611a24L21J29m46R0K58l49r0K41J01j7J46q6L3J7N0L7n4j21J64l98Q0K14m7p4
3635G5L74p8r9k46K09M3j2k07j14j47J07j55L45Q1j06n6M6K9l00P6q2j04J43l30
$$ plain form
3468 24 -47 309 138 -108 337 287 231 313 102 129 404 34 -79 115 106 391 161 -25 34 -48 176 36 -201
3491 -201 93 -4 42 10 -159 125 -38 -66 -72 1 61 98 -97 -14 -336 -199 -77 -122 23 -5 -127 -336 -29 35
3515 35 -179 70 -323 -276 -231 -189 -279 -292 41 92 98 170 92 128 -118 -98 -93 -187 -269 -114 13 248 -9 74 105 189 279
3542 279 27 86 225 -1 186 -103 114 98 71 -37 185 434 288 252 175 212 150 188 -40 -40 -22 -140 103 -71
3566 -71 89 193 45 52 187 -64 7 -214 -92 -139 -171 -29 -52 -104 227 26 4 -56 -266 93 -41 -412 -98
3589 -98 -411 -354 -458 70 -27 -92 149 -21 23 -299 107 -217 -92 -339 19 -114 -160 50 26 164 42 -124
3611 -124 197 326 -120 -30 228 -121 -211 30 131 114 260 174 207 224 274 311 257 136 300 -98 -18 196 149 75
3635 75 449 371 272 26 235 278 266 59 -55 -202 -95 -250 95 176 70 14 60 89 -211 -135 -217 -321 -178 -508
3659e08M11j58k33j3M66J70kk53k3J21k92K16j97L6O5k78N02K58l31L4j21N42
3681D12l59m6R8J50m81K92MK2R1j2J89j93J12r0j10k15n5K45n0o0L87k37j4J2
3705I2K87Pm54L3R2j17OO6j64j23K01L7Q0n0M40k87Pj14J52l79j02N8P4j47J36
3730a69J85k37J59J29L0l9k36j31J29K55l27P8K6o2m6Q9J9J4J43R7l30J00J50
3753B6n09J52L07K6J02M0K70j81k44J68k52L64k43J23k93J55J25j8O0j84L16j49
3775A61K86k57j33K00l16K05l03K84j8o0R6O0k9j03Q4j9J77j51k04k0j90Q2J68
3798@J10k25J59l7l9M4JK6k38J9J0l6j32P9P7j3nO0K70qJ2k24L9q6j11K79l54
3825c23J72L16l81J33L54j92k2J59n3o9q7k54K26j31m4L24J75j80Q8K58k37p0
$$ plain form
3659 -508 -97 -255 -488 -501 -35 135 133 -120 -143 -22 -314 -98 -295 -259 -194 -472 30 288 -43 -9 -130 412
3681 412 53 7 105 255 -226 66 70 92 183 171 360 167 279 189 79 -136 -191 54 4 -56 331 94 80 92
3705 92 379 386 -68 -35 57 -60 -54 12 -152 -275 -74 -37 43 -7 433 146 153 39 191 -188 -290 -232 -158 -305 -169
3730 -169 16 -221 -62 67 97 58 -178 -309 -180 75 -252 -174 -148 -210 -256 -167 -148 -134 9 106 -224 -124 26
3753 26 -483 -331 -24 2 104 144 414 233 -11 157 -95 269 26 149 -144 11 136 118 178 -6 310 161
3775 161 447 190 57 257 -59 146 -157 127 109 49 145 205 176 73 157 138 315 164 -40 -60 -250 -168 0
3798 0 110 -115 44 7 -32 12 13 39 -199 -180 -170 -206 -338 -259 -182 -195 -200 -140 130 122 134 -90 -51 -137 -248 31 -323
3825 -323 -151 165 -216 -83 271 79 57 216 163 94 7 -247 -21 -152 -196 128 303 123 211 469 232 162
3847A62K1l3l27r1N50l04K12k5K1J59k42J34o6k11K34M2k04p9k26K02M2N2l0L56
3871C49m19L36K9k13k26L26l34k9R6k14q8L49l1n7J34p9r1J1j23M6p6L07j43k25
3895c65J91m7K25O2o7J83j52K15k25j68m9q0R4n7L29l56N18l8J47j16q9j68J69
3918A56l29K54p9ONL4L52j21q6L81j96J2j53k55j97K08M9n5R3N12n54J96J30j84
3942A79K64q9l18J02r6k07L07k31j51M1K58R0kk1j45o7R8k79r3J10J59o5K77k55
3966a34K18PQ2k82J69J85l55J8P0l24o6M99j61J2j24J65L46j48k77J5K12J16m33
3989a90K67k52kJ28R6J71N2m1RPN6m4k11N8l4LJ38J88n47L68k52L71J3k89J95
4014B58l81Q9k05n4K89J05j52M7Q1N3k50K54m20L34j32q4p5O1p1J09J81j58JJ03
$$ plain form
3847 162 183 150 -177 -268 282 -22 190 165 186 345 103 237 171 -40 194 236 32 -47 -273 -71 -29 23 -7 349
3871 349 -70 266 295 82 -144 182 -152 -181 -85 -299 -387 -38 -69 -126 8 -71 -162 -151 -274 -228 -304 3 -140 -365
3895 -365 -174 -221 4 66 -1 182 30 245 20 -148 -197 -277 -183 -240 89 -267 251 213 360 244 155 -13 156
3918 156 -173 81 2 8 13 47 399 278 192 573 377 389 236 -19 -216 -8 41 -14 79 591 37 233 363 179
3942 179 443 354 36 138 42 -165 142 -89 -240 -199 59 149 147 126 -19 -86 12 -267 -360 -250 -91 -156 121 -134
3966 -134 84 91 173 -109 60 245 -110 -92 -22 -346 -412 87 -74 -62 -186 -21 325 177 -100 -85 127 243 -190
3989 -190 77 -175 -177 -49 47 218 270 229 238 245 301 257 46 104 70 73 211 399 -148 220 -32 339 352 63 258
4014 258 -123 -34 -239 -293 -4 101 -51 -4 77 130 -120 134 -286 48 -84 -168 -243 -182 -253 -144 37 -121 -120 -17
4038a7j6P0J6k86Q1k34J85J30n4j03M57m46K22J37j34j3Q7k75O7K31r3O0l34K77
4062A5K77p6j46K29p1j30J87p2k13p0J30J65k21o7K22j6j0j46K37n8j23N0j36
4085d3J55k83L10K32l31Q5J14q2o2o8r3j55J77L2k48K02j31K63l01L34l48K42
4107An7k68K06j1q5K75o36J26L61L5J6J24l24J26J76j41R4k14K00p2j65k0N28
4130B75k62k17K70K63j36q0l20J07J30L0k9j72L23j18r0j79L16o5O9k21J09J25
4152A28J40j32k58Q9p0j7L91l24N7K50k07l8K32k76j70L25k07j46K75J39k85K08
4174A04L1l9j18j22k0K12l2n0j48K3K3N6p2L8P8m41M07Np8j46J28J09Pr9nM8J03
4201Bq6lJ87j00n4P5Q9Mk72J46LP3J85k50J24m8J12rO7k68M0K49l52m9M00j94
$$ plain form
4038 -17 -33 37 53 -233 -152 -386 -201 -71 -125 -228 229 -217 5 142 8 -5 82 -193 -126 105 12 72 -262 15
4062 15 292 216 70 299 228 98 285 213 0 -70 60 225 4 -63 159 143 133 -13 224 166 43 93 -43
4085 -43 112 -171 139 371 40 125 239 157 95 27 -66 -221 -44 -12 -260 -58 -189 74 -227 107 -241 1
4107 1 -56 -324 -118 -129 -214 61 -575 -449 -88 -53 -37 87 -237 -111 65 -76 18 -196 4 -68 -233 -253 275
4130 275 13 -204 66 329 193 113 -207 -100 30 60 31 -141 182 64 -26 -205 111 46 115 -106 3 128
4152 128 268 136 -122 -33 -103 -120 271 -53 4 254 47 9 241 -35 -205 120 -87 -233 42 181 -104 104
4174 104 135 96 -22 -144 -164 48 16 -34 -182 -159 -136 -80 -152 -114 -36 -477 -70 -65 -143 -289 -161 -52 -45 -144 -149 -101 2
4201 2 -84 -87 100 0 -54 21 110 114 -158 -12 -9 64 249 -1 123 75 187 178 245 -23 17 266 -86 -135 265 71
4227G1KJ67j6k76J73K70k70K46j19j90J05p1j24k35P1J92J60l5J84j63k79l1R9
4250f9M7r6J91m8p5J6j40j34K18m15M63j68J77J50j86j92K09n4L8k08L46k27K48
4273I1k11K49k17j45K02l4J77l81K38J68j03O1o6kP3J45l16K2J29j49M1J34J36
4296B42j75Q3M3n5l9K61P6m17K21k02K11j27m8l6O3O8k46N4j57J74j34K16j07
4319c1K47n6J7qk14j44J95j47k60L00J48K76n8j63l1l13O0j38K44n6J97k91l3
4342b59J03j17K08L6L1j27K03k62K22m7K3M9k07J03n6q8L14k19K12j52J96O3k89
4365f0K14l9nM9m20J44J37J44o4K91k60j23L65k43K0J3pJ46j02J07l76o6K02p3
4389fM72j17l52J85l52J77j90L49j08q8kr2JM9p5J6n6J38J20k48m8J61j72n8K26
$$ plain form
4227 71 73 240 224 -52 121 391 121 367 248 58 163 92 -32 -267 -196 -4 156 121 305 142 -137 -168 -69
4250 -69 -22 -118 73 25 -50 -34 -174 -308 -90 -505 -42 -210 -33 117 -69 -261 -52 -106 -68 -276 70 -157 91
4273 91 -120 129 -88 -233 -31 -65 112 -269 -31 137 34 95 29 27 100 245 -71 -49 80 -69 -28 106 242
4296 242 67 150 193 138 99 360 436 19 240 38 249 122 74 38 101 169 -77 -23 -180 -6 -140 76 -31
4319 -31 216 160 177 169 -45 -189 6 -141 -401 -101 47 323 265 102 71 -242 -182 -320 -76 -132 65 -226 -259
4342 -259 -156 -273 -65 -29 2 -125 78 -184 38 -9 14 63 -144 -41 -97 -185 129 -90 122 -30 166 229 -60
4365 -60 154 115 110 159 -261 -117 20 164 100 391 131 8 373 130 150 163 156 302 200 307 -69 -135 67 -6
4389 -6 466 349 -3 182 -170 7 -183 166 58 -30 -32 -124 -123 -74 -149 -133 -189 -51 69 -179 -227 -66 -238 -296 -70
4414g0j77L89j97j23jnJ07j2r6R8o9j7L25J5k71P9J92p2k2R8k17j04K64j15J43
4439A42m05J32K79r7J48K1J18n14J45J32j5n8L7M6r5p4L10j11m7P2J28k96K00
4462A98o0k60J03o4K34m17M18k13K30l37p4K34j21k03L49l00K96k48L61k83J80
4483B3j0j50J89j16J20p4j73K42j68K03l95K20m7l13M86k73J55K94l09pk06J31
4505a78K02k23j38K05K13k83j01K53Q6J30N6k81L0J92N2K9j74j65L87k94J74J95
4527C67j30m9Nk2k96J98j93R5o2J82k8k4K28l99J13RL9m6no3J04j03p7nM2J69
4553D9n0j76L98j34m71K76R0l41K63J4N6J06k77K27J49k35J6jl3p3J72k14k0m7
4577b56N8J79o8J57l7J28j41L48m25N5lj81J67j3K1j54L76j8L1K0n9P8o7j36j
$$ plain form
4414 -70 -247 142 -55 -178 -179 -184 -77 -89 -185 -87 -156 -173 152 167 -104 -25 167 95 73 171 -46 -150 114 -1 142
4439 142 -263 -131 148 51 199 220 338 -176 -31 101 86 28 65 111 16 -58 252 141 94 166 294 -2 198
4462 198 138 -122 -19 -83 151 -266 152 -61 169 -168 -242 -8 -129 -332 17 -283 13 -235 126 -157 23
4483 23 13 -137 52 -64 56 -18 -191 51 -117 86 -309 -89 -136 -449 37 -236 -81 213 -96 -103 -309 -178
4505 -178 24 -199 -337 -132 81 -202 -303 -50 36 166 222 -59 -29 163 215 244 70 -95 292 -2 172 367
4527 367 237 188 193 171 -125 73 -120 -25 -87 95 67 43 271 -128 -15 -6 33 -13 -18 -81 23 -80 -157 -162 -120 49
4553 49 -1 -177 221 87 -384 -108 -18 -359 -96 -82 -26 80 -197 30 179 -56 -40 -41 -74 -147 25 -189 -209 -256
4577 -256 -198 -19 -87 70 33 161 20 368 -57 -2 -5 -186 -19 -32 -11 -165 211 193 224 244 185 263 196 60 59
4602E9J94j97q8L9Q0L4JJ8j8l0n1m1M5j03K3K4m2r4K56j85K44k15j54L27o8k58
4628b00lJ16j05k62J43JK80j40K27m9k27K64j00r6K42j41j23j0M1K47j34m8R2
4651A5K60j58M6j71O9k90N%L41qk41mJ24L4J10n2K01l26O8L9j00J61j79K41k57
4676g2M0J35K76k95m6L83j58j04j26j42L15k05r8r0K53j35M6J56j81M3j8K75L6
4699B88o38L30q1k81L64j77K91j17J52j64k6q7K33K4n6l28M05k89J86j29k8J01
4721b7OJ27K1k6k00J8j88j9K11m2K95k55M03k31Q4j6j60L8l3N2k4k03P2m4K16
4746G5j94K38J47j73K2k1l20N54j56j68jj2J15j98J84K2NM8j17N6j24m1o5R0o5
4771i9K51j95j5k0J22kk88%J12q9J84j08K41j07k13K25rl4j92K10n2m5p6L4j49
$$ plain form
4602 59 253 56 -32 7 87 121 122 140 122 92 41 0 45 -58 -35 -11 -53 -147 109 -76 168 -47 -201 126 58 -200
4628 -200 -203 -87 -192 -454 -311 -310 -30 -170 57 8 -219 45 -55 -151 91 -50 -173 -183 -142 105 -29 -77 15
4651 15 275 117 163 -8 61 -229 -224 -224 117 109 -132 -136 -12 22 132 80 281 -45 23 62 -38 123 -56 185 -72
4676 -72 -32 103 379 84 38 421 263 159 33 -109 206 1 -97 -187 66 -69 -23 133 -48 -5 -23 252 288
4699 288 -350 -20 -101 -382 -18 -195 96 -21 131 -33 -59 -146 87 111 55 -273 132 -157 29 -100 -128 -27
4721 -27 -21 106 127 101 -99 -81 -269 -288 -77 -119 176 -79 324 93 177 161 1 39 6 58 34 -169 -97 -141 75
4746 75 -119 119 266 93 115 94 -226 328 172 4 3 -9 106 -92 92 114 119 167 50 106 -18 -59 -124 -34 -99
4771 -99 152 -43 -58 -78 44 42 -246 -246 -134 -223 -39 -147 94 -13 -226 -1 -10 -44 -236 -26 -78 -123 -199 -165 -314
4796c14K23J41j82l3N0m0J59L9J41k84M12l52Q9P6k20J19k42K19J43j38l1n1J98
4819A22q4K87o1k45MO7q0j27Q3Q4j6J85j35J3J4k99M62m16m7K62j44J49K58n23
4843a87R4L21J21J49n40R3m01N14o23L48m34K19K02j61m1J92M00k55k1m8j24J05
4865g7J32j49J22m67K39P4Q8m2J42p2J47k99k8J89k46J94j01J10o7K38O2k15M07
4888C81l74Q9k17K28j31L61n39K00J57M7m39M16Q8j90J39j99Q8j04L8K0p9L2J02
4911A14p7m4J41J69l63K2K73j25j95J34RJ07k9l68J13K46k3l2k38L08Pl16J38
4934b9o6j82K48O5k57L25k28j39Q4q6J76o9J58k54J27k17J77K09J1j62K01l6J03
4957A59n7k34L04l07j41K02P9L2J69j91j79J82J5M9L18l47J40l16M10k29K11k28
$$ plain form
4796 -314 -91 50 -132 -165 -115 -155 4 43 184 -100 312 -40 49 125 -95 24 -218 1 144 6 -25 -76 122
4819 122 38 325 264 19 23 90 10 -117 -34 50 34 219 84 97 111 -188 274 -142 -189 73 -71 78 336 -187
4843 -187 -93 228 349 498 -42 51 -350 164 -459 -111 -545 -326 -124 -285 -326 -134 266 11 -10 -58 -182 -77
4865 -77 55 -94 28 -439 -200 -126 -38 -80 62 -10 137 -162 -190 -1 -247 -53 -154 -44 -111 127 189 -26 381
4888 381 7 96 -121 107 -24 337 -202 -2 155 202 -237 179 267 77 216 17 105 1 39 59 -20 12 114
4911 114 37 -7 134 303 -60 -38 235 110 -85 49 58 165 136 -232 -119 127 104 72 -166 142 149 -167 -29
4934 -29 -95 -277 -29 36 -221 104 -124 -263 -179 -265 -89 -158 0 -254 -127 -344 -167 42 53 -109 92 56 159
4957 159 102 -132 172 -135 -276 -74 5 37 206 15 -164 18 33 82 400 53 193 -123 287 58 269 41
4979D1o2J79J5J22k24j21J01j26M6R7n2K00l90R0l4K07k52L17k41J53j3M7j51
5002e1r9J68n1J65l38M37l34P0j97J45lo2J4K98k97J65l26M6m9J31J54k21Q3J10
5026d2J35j75R4p3P6J8m2J43o4j95k7K81k65M34j52O8L3l69K11k46L62k9K7R7
5050C00L4l28rK3R4O1R6r8o0MJ0l54M10j43J14k33N1Rk9J8J90j65LK0Q2N5k5p4
5078E6Pk22K01k63J51l46L32K5r1J12k23J89l2J18J35l40K21M0j77J81l4k33J92
5101aq9l4m7J69N2k55M23r1j7Pk50J25r6M1J31J07k60K10j25K2L23m51L03n9k80
5126a42K71K5J0l6j89j99M57J43j69J25q5j96K21Ll18P8k03J96j13J18q7K21n6
5149G5m1O6k20m3J45k58L03K1j48J05r2K92l18J38Mj32L26m03j18L27j91M6J5
$$ plain form
4979 41 -21 158 173 295 71 -50 51 -75 -29 68 16 216 -174 -84 -118 89 -163 154 -87 66 53 100 -51
5002 -51 -150 18 -33 132 -206 231 -103 -33 -230 -85 -88 -150 -136 162 -135 30 -296 -250 -299 -168 -14 -235 -152 -42
5026 -42 93 -82 12 -61 15 33 -9 134 70 -125 -152 129 -136 298 146 214 247 -122 89 -157 205 176 203 300
5050 300 334 6 -3 20 114 175 271 173 113 117 127 -227 183 40 154 -79 -28 -19 -48 -30 160 -5 -2 18 100 155 130 56
5078 56 63 -159 42 -221 -70 -416 -84 -59 -150 -38 -261 -72 -104 14 149 -191 30 70 -107 74 40 -193 -1
5101 -1 -90 -124 -171 -2 50 -205 218 127 110 117 -133 -8 -104 -63 68 175 -85 125 0 22 345 -106 197 138 -142
5126 -142 129 154 164 128 -61 -260 197 340 171 296 211 15 236 239 -79 -1 -204 -8 -121 -3 -90 131 75
5149 75 34 100 -120 -163 -18 -276 27 48 -100 5 -87 205 -113 25 29 -103 223 -180 -298 29 -162 -116 -101
5172a01J70j60K26k76K07n6p6J01j76L43o1k31M2m5J1l4N4J21p5O7n1J28K21k10
5196A39j51P3M0p1m7J55m5r4J18p7l2J21n6q4J32k25K25k94M24P9l39R9j63p1
5220a44J10M22m22L31l20R4p5l1J32j14j67n2J28l6m5K79m15L25k54J37j96L44
5242C1P9j4j05K9j52J9L39j94j48J00L5j70M19j32k86L12k56J81j36q7m3K79R4
5265A94l60N8M25l97JL33r6j90K58k55J5p8N0j6K7M0l5J60M8p3J66n4j5O5k27
5290D4J34j88JK9J8q0J44k74J29N5j15p2L27k91M5M1M2q5j45Q6J23k1j88P1J50
5315b0k5k6J02Mq8j54K76j34p5O9J64j36j52M49j1j55Plj86K95m35K57J89j1m40
5340b39L22L5Pj74k7o2K79j69J03K55j21j46J81j48j55RL90p5N0j99k45N01k34
$$ plain form
5172 -101 69 -91 135 -141 66 10 -66 35 -141 202 141 -90 -48 -93 -82 -116 -62 59 -16 51 0 128 349 139
5196 139 -12 61 101 30 -17 138 93 -1 117 40 8 129 73 -11 121 -104 121 -173 251 330 -9 90 -73 -144
5220 -144 -34 388 -34 297 -23 71 -4 -35 97 -17 -184 -236 -108 -144 -189 90 -325 0 -254 -117 -313 31
5242 31 110 96 -9 20 -132 -113 226 32 -116 -16 19 -151 268 136 -150 162 -94 87 -49 -136 -179 100 194
5265 194 -166 -108 317 -80 -79 254 158 -32 226 -29 -14 -92 -42 -58 -31 9 -26 134 182 109 275 221 206 271 44
5290 44 178 -10 -9 20 38 -42 102 -172 -43 12 -103 -175 152 -139 -94 -53 -11 -96 -241 -155 -32 -53 -241 -170 -20
5315 -20 -45 -71 31 35 -53 -207 69 -65 -140 -71 93 -43 -195 254 243 88 95 92 -94 201 -234 23 212 201 -239
5340 -239 83 118 125 -49 -76 -138 141 -28 75 330 209 63 244 96 -59 -50 340 265 315 116 -129 372 138
5363A38j11J03m3K7j03j66M7J50R4j91p4K22j56O9q4M3j25l3K59j83l1K22l5J26
5387A65r6q3J04j06oN3M7k32n9J24k69J64K03k3J07Jp5j00J1%J03J54k91M2l8
5412a00m2K45j8rL8j68K86L2m26K19j18%N00o23J49J26N2J58M6k14k02j9K04R7
5436B13j35J9M3P6l81N1J64P9n8k2J31J10n19J93j94J86O3l2j87J18J56j33k73
5459c32J83J06j21m1K38m70M74j26Rj25m6K97N3l30K33j31jP1K0Q5J65Q7m56O9
5483h9k26M76k91J36j21P7K55j54J34k20J39l3r6J05k37J98M0J05j57N1N7j55
5505fn4O6l3J38j75Q9J62j40J55k73J63k84L22j51j72J81R7Oj15n8j07K91k42
5528a40K46L1j03l86L50j71N4K55k02J69l92L72j05l1J47j93K63j30j21R9j11
$$ plain form
5363 138 27 130 87 114 11 -155 -108 42 136 -55 -129 93 -63 6 -78 -35 -160 -193 66 -117 -148 74 39 165
5387 165 69 -14 90 -16 -22 31 78 -154 -213 -89 -358 -194 9 -14 93 94 19 -81 -70 -70 33 187 -104 -62 -100
5412 -100 -142 103 85 76 114 -54 232 264 -162 57 -61 -61 439 -184 -35 91 143 301 347 133 -69 -88 116 213
5436 213 78 97 140 216 -165 -114 50 129 71 49 180 290 -229 -36 -230 -44 19 -13 -200 -82 74 -59 -332
5459 -332 -149 -43 -164 -205 33 -437 37 -89 -80 -205 -251 46 99 -231 2 -129 -130 -59 -39 46 211 298 -158 -89
5483 -89 -315 161 -130 6 -115 -38 217 63 197 -23 116 83 -13 92 -145 53 93 198 41 92 149 -6
5505 -6 -60 6 -27 111 -64 25 187 47 202 -71 92 -192 130 -21 -193 -12 85 91 -24 -82 -189 102 -140
5528 -140 106 137 34 -352 -2 -173 -119 136 -66 103 -289 83 -22 -53 94 -99 164 34 -87 12 -99
5549i9K7j82L0L10j87J89K0j44o6K93j69j40mK62k1j1J52l52k8R4K84j77Q7k46
5573g8L25j51q0J02j84L3k88N38j97m2j1J93j14R5j17J09j14Q5Q4j99K6K11r8
5596A28Qq6oJ20j99N1j6K1l24K98m2o3q0J85kj03K29j39j65J60J70m13J25J20
5620b3r8J76l36M1M48r0k88J55J34j52j45N6R6j49L14j57q3j21J29J03P5j89K
5643a02L31j29l56L82o9l8L65j98j28j30J49J56k47j08o0Q7R6P2q3J20j69n3K89
5666A77l23L58p8k00O6o3o2J72k68M0J19J09Q1o4q3Q2j75j8k8O8k1j52M5j60L49
5691b9m33K43K60M0J37k85K6J18j70j47M22l77L09k14J33q5J9kJ34J28k91K39
5713A75j54P5j41J59l8J08r6Lk54R3m3pK73j25q8j3J13K1J48m00J71M9J85j91
$$ plain form
5549 -99 -72 -254 -224 86 -101 88 108 -36 -102 191 22 -118 -122 140 119 108 260 -92 -120 -26 258 81 168 -78
5573 -78 247 96 16 118 -66 -33 -321 217 20 -22 -33 160 46 141 24 133 19 104 188 -11 15 226 128
5596 128 136 50 44 164 -35 16 0 21 -303 -5 -47 -110 -190 -5 -7 -110 119 -20 -185 -25 145 -268 -143 -23
5620 -23 -121 55 -281 -240 208 118 -170 -15 119 -33 -178 -122 -26 -175 139 -18 -101 -222 -93 10 85 -104 -102
5643 -102 229 100 -256 126 57 19 384 186 58 -72 77 233 -14 -122 -182 -95 1 73 -10 110 -59 -112 177
5666 177 -146 212 134 -66 0 -63 -125 47 -221 -181 -62 47 128 64 -19 63 -112 -130 -158 -90 -111 -263 -218 -378 -29
5691 -29 -462 -219 41 81 218 -67 -41 77 -93 -240 182 -195 114 -100 33 -52 -33 -35 99 227 -64 175
5713 175 21 96 -45 114 76 184 88 91 -163 -70 -113 -120 153 28 -60 -73 40 61 209 -191 -20 29 214 23
5737B3jJ61l76Q5K71l42M3J19N1lp9J66%j32l3j30l9J1J49R3m28K22K8P7M2J21
5763I9k28j70R0M30l60J31k78K65j68K87L8k64K38J85n6o3l18K20Q3p1k06K09
5785I3J49o0r1k08Q5J80j20J9N5L9N8l10K13n1J25k39L93m61O6j19L51M9J2qm14
5810a94L20K30m46P2M1K32k40q2N9L32l93J47k40J11J00j68L11j87Q5k92J27J94
5832A19P2j47l94L17j54J69k05M8l7j06L94k48L13p7M1N9j59K25k37j21J6j0j92
5855c14M17J55l73n2K70k02J7R4k6j17K38j33Q3J1j59j68J48J33k68N10j67LR
5878A09J7OM1m2m3j00nJ71l67K32j18Q6l0K52j21r6q2J1J7j23K61m9q1j87K87
5903D6J83L4l69r1m1L45j31l4r3J1j12J08J60l44L09m4R6l7k05J28K70l42J83
$$ plain form
5737 23 22 183 -193 -108 163 -179 -136 -17 34 31 -48 118 118 -14 -47 -177 -216 -205 -56 37 -391 -169 -141 -64 -22 99
5763 99 -129 -299 -209 221 -139 -8 -286 -21 -189 98 136 -128 110 295 239 176 -142 78 161 90 -116 93
5785 93 242 182 91 -117 -32 148 28 47 102 141 199 -111 102 51 176 -63 330 -131 -65 -184 167 216 228 220 -194
5810 -194 126 356 -90 -18 23 255 15 -67 -8 324 -69 78 -162 -51 49 -119 192 5 90 -202 -75 119
5832 119 191 44 -350 -33 -187 -18 -223 -175 -212 -318 76 -172 141 64 105 164 5 230 -7 -128 -112 -122 -314
5855 -314 103 258 -115 -167 103 -99 -82 12 -14 -131 107 -26 57 68 -91 -259 -111 22 -246 264 97 100 109
5878 109 126 132 173 131 88 -12 -17 154 -213 19 -99 -13 -43 209 88 -8 -90 -79 -62 -185 76 27 -54 -241 46
5903 46 229 263 -106 -197 -238 107 -24 -58 -151 -140 -252 -144 16 -328 -19 -63 33 -4 -209 -81 189 -153 30
5926C0J81l03K37J0l88K37o3O1j56L24k93QJ56J8j98L82j14l69M05p2R9lJ5k49
5950d5K67k29O1J8M2k2r6R5J68k09l7R8k02L31k27L0j2l66K47J03n3K44k88kK86
5975B02l76P3K34k91J87L0k12j0m7Q6o3l1J25J56j99K88l7k17j12K00j02J0K62
5998A56l8n35M32j95K38l3J55l42R8LJ21p3j18L00K7j02J29l23K03m3N0R3m22
6021b19K75R8k1r9N7q2j78J58J14L1O8q1r1r9J71L2kK15k57m5q4K03N6j75N4k41
6047a42Q3n4K41m06L44N0nL3j55q0K18j28L4k22RQ0m5K27n6l7j23L17k04m2n1
6072a14J08l1p3j56L04j41O3j29J05J92j26l9j86K88j63J40l23J70K14j5k19L97
6094B66j67j03K39k52M1K8j43K18k32J43j31J45O2j51L9J82j7k84L05l42K90k53
$$ plain form
5926 30 211 -92 145 155 -233 4 -59 2 -154 170 -123 -115 41 59 -139 243 129 -240 165 93 192 189 204 -45
5950 -45 222 -7 54 72 114 92 -4 91 259 50 13 111 -91 240 13 43 31 -335 -88 15 -38 206 -82 -84 202
5975 202 -174 -101 133 -158 29 59 -153 -163 -210 -124 -187 -218 -93 63 -136 152 115 -102 -214 -14 -116 -106 156
5998 156 118 -417 15 -180 58 25 180 -162 -64 -61 60 -13 -131 169 196 94 223 -100 103 60 110 203 -219
6021 -219 56 154 133 34 91 9 -169 -11 103 134 202 121 30 -69 102 134 132 347 90 45 -39 164 220 45 99 -142
6047 -142 -59 -113 128 -278 66 116 111 144 -11 -91 127 -1 33 -189 -180 -100 -145 82 26 -11 -134 183 -21 -63 -114
6072 -114 -6 -37 -110 -266 38 -103 -40 -169 -64 128 2 -37 -223 65 -98 42 -281 -111 103 88 -131 266
6094 266 99 -4 235 -17 24 52 -91 127 -105 38 -93 52 114 -37 2 184 167 -117 188 -154 136 -117
6116a17K39j34J68J6J04j51k66J67j12J14j61J22n7R5j35j47J6q1L51k02j62L52
6138A9k06J31J22o3j5j93J24k09M78k99R2j39oN86o57L59k3N1l72M40l44J32J33
6161A41j83P2O1J20j90j61K98J4o1k3L4j73Q2J42j40n9J21k51J94Q9k43K20l12
6184b08J65Q2l8j09R3j6P0pj15Oj03J77j05K7L3P2N8q0o1r3J98l05K52Q1l8k40
6210b04K13k0j05j33L80r9N8r0p6K9J33p5j10OJ43n05L70M7K66l03k6j4O7L5R6
6235H3l52J82Q6q0q3j03J28M13j87m7r5N6J21R3j45j21K39j54M9j00J25p7j5K4
6259D0k0J9jJ0J61j67r0j39M19p9j30r2n4j04k4R4K34j19J61l8j31M0j8J60j42
6284a0J73m1k75K43k58J42p5oJ39Pj90M0M54k61l7j00J2j2j47N6Q5L05j04O9j79
$$ plain form
6116 -117 122 -12 156 172 276 125 -141 26 -86 28 -133 -11 -68 27 -108 -255 -239 -320 31 -171 -333 19
6138 19 -187 -56 66 3 -12 -205 -81 -290 188 -111 -19 -158 -164 422 -235 124 101 152 -220 220 -124 8 141
6161 141 -42 30 91 211 21 -140 158 172 111 88 122 -51 31 173 33 -26 95 -156 38 127 -116 104 -208
6184 -208 -43 39 1 -108 -15 -31 39 32 -83 -77 -180 -3 -108 -81 -48 24 82 2 -59 -152 46 -259 -7 74 36 -204
6210 -204 9 -11 -116 -249 131 32 90 0 -76 -47 86 11 -99 -93 50 -455 -85 -38 228 -75 -101 -115 -48 -13 83
6235 83 -269 -87 -1 -81 -164 -267 -139 274 87 40 -55 1 122 215 70 -51 188 34 83 -17 108 31 16 40
6259 40 20 39 38 48 209 42 -48 -187 232 153 23 -69 -123 -227 -251 -157 77 -42 119 81 -50 -10 -28 132 -10
6284 -10 163 122 -153 90 -168 -26 -101 -107 32 39 -151 -111 343 82 45 -55 -43 -55 -202 -146 -61 244 140 209 30
6309C0K31l12M2r2M9q4N7l9K64l6j79K10J9k62M7K9J89p4q8J51l09L73l24K47
6333A39j78n2N5lQ5k14K19L3L0K5k32J81J16l9M1k11J78k32L37k47k26L12l23
6356b06L4J23M5k0Q0OJ06k78K36k79j36J64K59m6k64K05r9J64k49K81R2l36Q8
6379c0P0P2N6j98J71j06j47J65k1JO3J25p7j37oJ47l2k12j1L61k26l2o8K5O6K69
6405B88k65o1j0K06K8j88J14k05n3J69R2k1n8L4J3l80L50Kq0O0l6L1P2j60j73
6430b31K78r7L2J6j24L69l07J35k39J72j09j29K23o7K47l0nk28q6J22j9Q6k0L1
6454B0j8K00k96j70J19K52k32K31o8L7m1l5K6j19j23K11J72l4j13j31K41m7m2
6477D0p1O7j01K1L5k4lj5J63o5n0oN4o1J38l75M34j70J19j60J0p5L20j31k83J92
$$ plain form
6309 30 261 -51 -9 -101 -52 -136 -79 -118 146 110 -69 141 160 -102 -55 -26 163 89 1 152 -157 216 -108 139
6333 139 -39 -91 -36 -39 46 -168 51 84 114 139 -93 88 204 165 206 -5 173 -59 278 31 -195 117 -206
6356 -206 -172 -49 -4 -24 56 62 168 -110 126 -153 -289 -125 134 88 -176 29 -70 94 -155 126 218 -118 -30
6379 -30 40 112 168 -30 141 35 -112 53 32 33 96 221 144 7 1 148 116 -96 -107 254 28 -4 -72 -47 19 288
6405 288 23 -38 -48 158 186 -2 112 -93 -146 23 115 94 36 70 83 -297 53 55 -25 35 -1 30 102 -58 -231
6430 -231 47 -50 -18 -2 -126 243 -64 71 -168 4 -105 -234 -11 -78 169 139 134 -94 -180 -58 -77 9 -11 20
6454 20 2 202 -94 -264 -145 107 -125 106 38 75 34 -1 25 -94 -217 -6 166 132 19 -112 129 82 40
6477 40 -31 36 -65 -44 -9 -33 -36 -51 112 47 -3 -9 45 -16 122 -253 181 11 130 -30 -20 -95 225 94 -189 3
6503Cl1L2J17k60J85k76J54J35n5q2J29q0j56J05J97k03J46J18j66J13J34l19
6525f0K12l34K90j35N8P3m20M32j10M8k13l3J48j36J51J46q5j7L6j34J13j10N5
6548b5J82m21M35k78j76K96n9K46l15K54J38j37J37l35J46k51K08p7k53L90J2
6569A17p7J25k55K30p6r2j28J53Q7j25J25j52J68j73QL1Q2P9j22J01k55l2K12
6592C1k00K63j73L88j27j50j55L6J04j25J98Ll6m8J2M0j13L22m8r%nj79K49J15
6617C93k57P1j85p1o3L03j94o0OJ40m3k10M38k38P4k17J32j04J26J82j55J79k25
6640B2J55k83J56M7K1L5j09l26K51n5K35%R2k24p3n1J54k12Q5j34L99k86j29L91
6664A61j25J04j89nk01J00j59J98l4k5K11l6j86K2J90Q0j52P6J84l06K52k00N6
$$ plain form
6503 3 -28 4 121 -139 46 -230 -76 59 4 -78 51 -29 -185 -80 117 -86 60 178 12 125 259 -60
6525 -60 152 -182 108 -27 31 104 -316 116 6 54 -159 -192 -44 -180 -29 117 32 15 51 -83 30 -80 -25
6548 -25 157 -264 171 -107 -283 13 -46 200 -115 139 277 140 277 -58 88 -163 45 -32 -285 105 117
6569 117 40 165 -90 140 64 -28 -156 -3 84 -41 84 -68 100 -73 -65 -34 48 127 5 106 -149 -181 31
6592 31 -169 94 -79 309 182 32 -123 -87 17 -108 90 93 57 9 21 61 -52 270 222 213 213 208 29 278 393
6617 393 136 207 22 -49 -112 191 -3 -63 -57 83 40 -170 268 30 104 -113 19 -85 41 223 68 247 22
6640 22 177 -106 50 97 118 153 44 -282 -31 -86 149 149 241 17 -56 -107 47 -165 -80 -214 185 -101 -230 161
6664 161 36 140 -49 -54 -255 -155 -314 -116 -150 -175 36 0 -186 -164 26 106 -46 30 214 -92 160 -40 16
6687A6J92j88j76O7J26jj2k52L00J60l39j13L85j48j03K24m7k55J22LN9N8R3o1
6711A10M3k59k9J35j6J02j02P6k73J42K81k18j45j1k3Q2J20p0K28p2l15J87LR0
6735F6q6j72Q5k50K47L6J23M0J06l33j78R3L46k65K96n7l4L2k55K13L9L0l19K07
6759A0q9N4Qj14K71K32k83J19j02j87P2p9L40j48j44L88l40r4K25j48M1R8N0k00
6783b0O4O3l8J1j80K16R5l91M94l29K0m2jJ36j02j14r2K08j39M4L9l21N21k78
6807a36lJ33J14k78J72ol9O2m7l06L92p3j23P0k6P8o9L35n12L05k29M7mK25%j43
6833f1r5J70j04Q4K14n22o2L21Kp2J92P5L5m7j53j00O2K19j11P7k09J11K4m4K1
6858B7K07k17r2R7j95K35O0l21J45%L9K12k14K94k91j79q6N15k47J28k40j67J50
$$ plain form
6687 16 208 20 -156 -89 37 36 24 -228 72 232 -107 -220 165 17 -86 138 91 -164 -42 -39 20 78 171 110
6711 110 153 -106 -135 0 -16 86 -16 60 -213 -71 210 -8 -153 -164 -187 -105 15 -55 173 101 -214 -27 -24 66
6735 66 -20 -192 -107 -357 -110 -74 49 89 195 -138 -316 -223 123 -142 154 97 63 95 -160 53 92 122 -197 10
6759 10 -79 -25 -17 -131 140 372 89 208 106 -81 -9 -88 252 104 -40 348 8 -86 139 -9 32 130 180 -20
6783 -20 44 107 69 80 -100 116 211 -180 314 -15 5 -37 -38 98 -4 -118 -210 -2 -141 -97 -58 -379 142 -136
6807 -136 -139 -6 108 -170 2 -4 -43 19 -28 -334 58 -15 -138 -68 -94 -16 -85 250 -262 43 -186 -139 -143 82 82 -61
6833 -61 -156 14 -90 -6 208 -314 -376 -55 -53 -125 67 142 177 130 -23 -123 -61 158 47 124 -85 26 50 6 27
6858 27 234 17 -75 22 -173 62 122 -199 -54 -54 -15 197 -17 277 -14 -193 -279 236 -11 117 -123 -290 -140
6881a40L02k81j08J72m8M95m78J37j03P5l4J15k74N6L3L4l7n7OJ93l0lj95K64
6905I4K09l50K80k30j29j06K33K0j03J52j0N1j82P3l10L43M1j40q9K51L3j60J04
6928G5o5L0P7L7k45O0K60p0l34K54j93J86O6l23L14k45M1J27Q0k66JJ4J57L5j07
6953c4O6k25J09J81j14P9N2J00l04J5o2j15N3J7K2J64q7J62l07j22L97JOj00L1
6978a5nj31Q0R5p2O8K30l22J03j29J02n9Q6R5n1j69o1M6Q0J35j60P3q3%L08p9
7004A65r8j99J32Q3l25Q3J66k58M27rj22L4J36j38m6j43M9L9n6J72m9o4q2Q3p1
7029i1J40m1l7j20K06j60K36k22J62k81M8J52p3M51n85Q2q7K5J04J01l08L14J09
7052A25j95J80k39J22O2o9K49l37Q5J01k02R2M5k12K57L1n3J86l67J42j52K67
$$ plain form
6881 -140 162 -119 -227 -55 -103 392 -86 51 -52 23 -11 104 -170 -114 -81 -47 -84 -141 -135 58 28 25 -170 94
6905 94 303 -47 233 3 -126 -232 1 21 -82 70 60 111 -71 2 -308 35 76 -64 -153 98 131 -29 75
6928 75 10 40 117 154 -91 -31 229 159 -175 79 -114 72 138 -185 129 -116 -75 52 132 -134 -133 -119 38 73 -34
6953 -34 32 -193 -84 97 -17 62 114 214 -90 -75 -137 -252 -199 -182 -160 4 -83 79 -228 -350 47 48 54 -46 -15
6978 -15 -20 -151 -71 24 -48 20 250 -72 31 -98 4 -55 31 126 75 -94 -155 -109 -29 106 -54 19 -64 -64 244 165
7004 165 67 -132 0 83 -242 -159 7 -251 176 167 45 79 215 77 31 -112 -63 -24 -80 92 43 -21 -103 -20 -91
7029 -91 49 8 -29 -149 57 -103 133 -89 73 -208 -160 -8 -81 370 -215 -133 -220 -195 -91 10 -298 16 125
7052 125 -70 110 -129 -7 55 -14 235 -102 -17 84 -118 -26 19 -193 64 95 42 228 -139 3 -149 118
7074A18j14o7O9M8l95K32q5K96K9j77O4K9R5J7n5k05L45k29P4J6k6k46L9L34k77
7099g1J27q1kM6j71J49n6J90j12Kj74J39j42j5N0j75L62l41K80L9J00l04P2K17
7123A29j83K05l09J04P8L8K6r5K13k65O5r2pJ57k35J37k57K84o1R2M4j11J39j60
7147f4J82L6o7j85k68O05k27p1k83J57j30J89J4J48M5p5J31j9k30P7K45J1m26
7170b05K57j21L12j91o7j10qK60l47M25k78K07j88K28o8l56K43o2k42L79j96m3
7192a71N5o3J73L3j52K73j7k60J44m9J79m20J82J34j42J8m3K11l12J11k14N74
7214B44l06L0K25o6j22J02l8jo3l2K47l03J73k74K26J16k81K79k56J75l2p0l7
7237f4j86L79k92L83r2j76n4J04N6k11J59r1M6k7M0Q5N2l9k15oJ06Mj22K96j4
$$ plain form
7074 118 4 -63 6 54 -341 -109 -194 102 131 -46 18 47 142 159 104 -101 244 15 89 105 79 -167 -128 206 -71
7099 -71 56 -25 -27 19 -152 -3 -59 131 19 21 -153 -14 -156 -171 -121 -296 66 -275 5 44 144 -160 -88 129
7123 129 -54 151 -158 -54 24 62 88 -7 206 -59 6 -86 -93 64 -171 -34 -291 -7 -68 24 68 -43 96 -64
7147 -64 118 154 87 -98 -366 239 12 -59 -342 -185 -315 -126 -112 36 81 6 137 118 -112 -35 210 221 -205
7170 -205 52 -69 243 52 -15 -125 -133 127 -220 205 -73 134 -54 174 106 -250 -7 -69 -311 68 -128 -171
7192 -171 -116 -179 -6 27 -125 148 131 -129 15 -34 145 -275 -93 41 -101 -83 -126 85 -227 -116 -330 244
7214 244 -62 -32 193 127 5 107 69 68 5 -27 220 -83 90 -184 42 158 -123 156 -100 75 43 -27 -64
7237 -64 -250 129 -163 220 128 -48 -102 2 58 -153 6 -85 -39 -66 -26 59 111 72 -143 -149 -43 -39 -161 135 121
7262A21l05K69k19j7R8k8K66k17L45m19L19l96K6J38j88R5m4Lo7j9K12k1J71p4
7286D9j74O9j82J44j24K76J44j37Q2r4k20R6p7J77j11j45J81R7m9K19k93K81j38
7309G1k50M17k57Q4j74M91m13k94J41J91Q7K3j00P7K81o08L66k24k52M50p6m0
7331ip7M9J66l6j70K7L15k36j21j23J74J62k1rj70N2R6o6j97L28j29K0R9j90q
7356g4K49r7O1m7l48K79l1P3n0O8O5J00l00M8j76J87m3j65K81L5j52J6L8J03j56
7381c6J80P0l31N2Lj67M51k33K59l02J80j72K24l57lK94j45K61k62j27J76k39
7403b24K00m7K0N2r2J39j59J67j32N5M2k76J69N9nm4R6K7j45M5J71Nj98J03J07
7428A35q1N5n8m9j16J22q9K1Q8j80L07k79N25n44pK66R0j60K6j5j13J57k72K49
$$ plain form
7262 121 -184 85 -134 -151 -53 -81 185 -32 313 -106 213 -183 -157 -19 -207 -112 -156 -153 -220 -239 -27 -48 123 49
7286 49 -125 -56 -238 -94 -218 58 202 65 147 53 -167 -71 -148 29 -82 -227 -46 51 2 221 -72 209 71
7309 71 -179 238 -19 65 -109 382 -31 -325 -184 7 94 117 17 94 375 -233 133 -91 -343 107 31 -9
7331 -9 -86 -37 129 93 -77 -50 265 29 -92 -215 -41 121 100 91 -79 -27 69 3 -194 134 5 25 124 -66 -74
7356 -74 175 78 139 92 -256 23 -8 65 15 83 148 248 -52 -4 -180 7 -36 -201 80 115 -37 -21 17 120 -36
7381 -36 144 214 -117 -65 -62 -229 222 -11 248 -54 126 -46 178 -179 -182 112 -33 228 -34 -161 15 -224
7403 -224 -24 -71 -51 1 -91 48 -111 56 -76 -21 21 -255 -86 -27 -32 -76 20 47 -98 -53 118 123 -75 28 135
7428 135 54 109 51 2 -114 8 -81 -60 28 -152 155 -124 401 -143 -150 116 206 46 72 57 -56 101 -171 78
7452G8J03J2j92J86k92j3K86j72K74k09J35k67R5J57j13k3R1j36J39k15J30j42
7474h8N2n7K32j16j48K5J22P0k60J44k5J38r0k6j77L26q4j49P6K42j9k78L1j52
7498b11K57k67L06p5l26L92n5n7m3N7J06k31K25j41q2J30J75P4k14M2j24K81n7
7521A62K2J2l03K03K86l13j58K80j74J27l01J74K8n0K7k00O6L21j12r4j2PK9L1
7545E8J4o8Q5J08r5k55K20j77J34J98l19R1k27K64O9j78K18k71J45N1j04J19M6
7568A26k24o8O0N2K27l82J51k0J39r7j83L7K63j1j22l4M3J3qK29l09J08l3j53
7592a96J62k8J89j91L3P7J67n9O9q8j27J51k40N2J03nk06L8K8K2J0K2j51L58l67
7617a77m2P7J92k32J48K0J63J16m14K92j72K3M4J62n4k50L00j70r0q4J87J5k14
$$ plain form
7452 78 181 193 1 187 -105 -118 168 -4 270 61 196 -71 24 181 68 45 136 0 139 -76 54 -88
7474 -88 -36 -93 139 23 -125 -100 22 92 -168 -24 -49 89 -1 -27 -204 122 38 -111 -35 207 188 -90 -59 -211
7498 -211 46 -221 85 10 -316 76 21 -36 -79 -22 84 -147 78 -63 -145 -15 160 234 20 62 -62 219 162
7521 162 184 196 -107 96 382 69 -89 191 17 144 -157 17 45 -5 22 -178 -112 209 97 3 -9 -2 27 58
7545 58 72 4 89 197 102 -153 67 -110 24 222 -97 -6 -233 31 100 -78 140 -131 14 65 -39 80 126
7568 126 -98 -166 -106 -54 173 -209 -58 -78 61 -36 -219 -182 81 70 -52 -86 -43 -30 -38 191 -118 -10 -43 -196
7592 -196 -34 -62 127 -64 -31 46 213 154 223 135 8 159 -81 -29 74 69 -137 -99 -71 -49 -39 -17 -168 190 -177
7617 -177 -219 -142 50 -182 -34 -14 149 265 -149 143 -29 -6 38 200 146 -104 196 26 -64 -148 39 54 -160
7640a60K08K4j41L05j74J23j86k61Q6L85k11L1K18m38K6k4J68j77L31m0l33J81
7662e9j47K81j77J64l2l3j13P6J01k40J10q2P5R3lJ81N6j47K41j84J83k43j80
7685g9J11N6M5R6j12k1k24J39l3o1J04m9N9r6o7J48j9k6k64K82LJ70k72k7m8K19
7711C4j18mq6j54J74K07l41L12l8M6O5M7j35j22J27J2K8l6j20K63j70j94K25K21
7735B43r2m05J86J51j39O2J71j53n3K06k48P3R5K2o8k66J89J69j21j96L07l11
7757a78K86j89L0R0M1R2o1j53L38j62Q4j2r2k03J17j00J40r1o0j41J04n1K3J56
7781Hj25pJ51j29n5J84L8kk88K27J41j01k07J86J15q7j66K21q5k88r5J90K07J3
7805D6j61J16J4J54l15N6Q6PJ75j43K8p4J28p7j78J61%jk15n0L40Mm24K36J05
$$ plain form
7640 -160 48 72 -69 236 62 185 -1 -262 -176 209 -2 29 247 -191 -165 -189 -21 -198 133 93 -240 -59
7662 -59 -206 75 -102 62 30 -3 -116 -40 61 -179 -69 -151 -76 17 14 195 251 104 345 161 344 101 -79
7685 -79 32 88 133 229 117 96 -128 11 -22 -83 21 -28 31 -65 -132 16 -3 -29 -293 -11 -8 162 -110 -137 -185 34
7711 34 -84 -88 -174 -328 -154 53 -288 24 -14 32 97 144 9 -113 14 26 54 18 -102 161 -9 -203 22 243
7735 243 151 -254 -68 83 -56 6 177 24 -29 177 -71 2 97 119 51 -215 -26 143 22 -174 133 -178
7757 -178 108 -81 -51 39 80 172 111 -42 296 134 218 206 114 -89 28 -72 68 -23 -83 -224 -120 -171 -148 8
7781 8 -117 -124 27 -102 -157 27 65 63 -225 2 143 42 -165 21 136 49 -117 104 19 -269 -364 -174 33 46
7805 46 -115 1 15 169 -146 -90 -4 3 178 35 63 -11 117 40 -138 23 23 22 -193 -243 97 101 -323 -87 18
7830A8r8K1M87l2o34M71r7Q2l61L78q5k49K14m6rj13L34j77J33l33L20m79J72
7853h3M5j0j83L28m1o0j80N5K82q5k25K26J12o24J84K22R4p4j73l1K65or9K84
7877B23j64j68L00q0j06k76M04m8P8l69L36o7j14j19J94K43l72K06k41R3J23j26
7899e0K84j61j04o0j95K46r7O4K03P3J04j08j88l1J5j7K6j46K52P4j80Q9j70J63
7923H6l2r1j49L1J63J24M7m43K35J63q7k03R3r8K65o1n2J79N5k67J18k09L51k46
7947b8k99J77J23j29L43j2p7p7J30J1j4J9k11N5k07K57J0J04j86P9m4J1j23J90
7971A02M8l75j3K86M6j60o9K74J27n74L73j69J25k21J31J59J04m25k2M93q5n3
7993A02l40J33K13j70n9J98o2j68L29r8k10J15j73M50j86j06j23J6K38k37O3M0
$$ plain form
7830 18 -80 -59 428 396 -238 233 136 218 -143 235 150 -99 115 69 60 -53 281 104 237 -96 224 -255 -83
7853 -83 -38 -48 -231 97 56 -4 -184 -129 153 68 -157 69 181 -443 -259 -37 57 -17 -190 -221 44 38 -61 223
7877 223 59 -109 191 111 5 -271 133 85 163 -206 130 63 -51 -170 24 267 -105 101 -140 -47 76 -50
7899 -50 234 73 -31 -91 -286 -40 -137 -73 130 203 307 199 11 -20 -5 -22 4 -142 110 184 4 93 -77 86
7923 86 54 -37 -186 -155 8 132 179 -264 -29 134 47 -156 -63 -161 104 43 -9 170 225 -42 76 -133 218 -28
7947 -28 -327 -150 -27 -156 187 175 98 21 151 162 148 167 -44 11 -196 61 71 175 -11 68 24 35 -88 102
7971 102 150 -225 -238 48 94 -66 -135 139 266 -308 65 -104 21 -200 -69 90 194 -231 -253 240 155 102
7993 102 -238 -105 108 -62 -121 77 15 -153 176 78 -132 -17 -190 260 74 -32 -155 -139 99 -138 -75 -35
8015c5P9Q9l60L05j96J09k65K95J21j02p2J07J0j3j30L79j82l81M70l08K07k28
8037a01J61M1k34K54l08Q5J37K36j52k4R0k69L84j72n7n6p2qJ5K78m07J62N0r
8061B4J28j44l11N9L2K50k25K00k5R2p0j46l8O2J22R0O6l6m13K61j9l73K42J67
8085eK04j82o0P2k42K63P7J46j38q5P1j49j39R0K03j2j12J22O6j18k16M7o3K6
8109a34K53k74J83L6j92K12j34l3k19N07m02J09pM0R9j84M98j85m3M6j55O1L4
8132A16j91OJ58k11K8o0P0RQ6RJ40k33J41J00k0r9k66M17l95J18R3P7J42l62o3
8157a90J96p7j18M14l98O0O2K70j25L0l3k4k18N6J59k3%q0M0oq7J80j6n3m2J18
8183I5j54L49k87k24J57J5j43J65
$$ plain form
8015 -35 44 133 -227 78 -118 -9 -274 21 142 40 -32 75 85 72 -58 321 139 -242 228 -80 127 -101
8037 -101 60 101 -133 121 -187 -102 35 271 119 95 185 -84 300 128 71 15 -57 -65 -50 228 -179 -17 33 24
8061 24 152 8 -303 -244 -212 38 -187 13 -12 80 10 -136 -174 -112 10 100 166 130 -283 -22 -41 -414 -172 -5
8085 -5 199 17 -43 29 -213 50 127 273 135 50 121 -28 -167 -77 126 114 2 124 190 72 -144 -97 -160 -134
8109 -134 119 -155 28 64 -128 84 -50 -83 -302 205 -197 -88 -95 -55 44 -140 358 173 130 176 21 82 116
8132 116 -75 -69 89 -122 -94 -154 -84 -75 11 20 160 -73 68 168 148 49 -217 200 -195 -77 16 93 235 -127 -190
8157 -190 6 -71 -189 225 -173 -113 -51 219 94 124 91 67 -151 -95 64 41 41 -39 1 -5 -92 88 72 19 -23 95
8183 95 -59 290 3 -221 -64 -49 -192 -27
8191b7
$$ Imaginary data points
##PAGE= N=2
##DATA TABLE= (X++(I..I)), XYDATA
0@%%%%%%%%%%%%%Qj6J6j6J6k4L2l2M0m9N7p1Q1r1J06j23J43j65J87k12K41k72
35a44L05l43L86m32M80n34N95o61P31q06Q92r87J088j197J319j455J600j762J945
54A020k149K378k638K936l282L689m173M766n509O471p765R606j2454J7457k8671
69a8318R7166j8587j49313J62238q0734o8970J34628l1918o8532O3052k7383o642
81a3313K9950l945J163k1035r839M5642k4037n417L0820n4916j1347N1091k8019
94a3202J2949L3047l9393M31K0980k4041M504J5226j7744q392K4535j1059k0593
107b2752L4194j2662k9454M8511r976l0049N0359j9775l5156M0786k8047j8515
119c2536M8000k6158K543L6993m9511J3665L0957n0943L6332J6504n7136M2537
$$ plain form
0 0 0 0 0 0 0 0 0 0 0 0 0 0 0 8 -8 8 -8 8 -16 16 -16 24 -25 32 -39 42 -49 57 -66 77 -88 99 -113 128 -144
35 -144 161 -182 204 -228 252 -282 313 -348 383 -423 469 -518 570 -627 692 -763 837 -925 1020
54 1020 -1129 1249 -1389 1547 -1735 1954 -2219 2547 -2962 3509 -4256 5350 -7104 10353 -18318
69 -18318 78848 60261 -89052 73186 -7548 -76518 58110 26192 -42340 20712 -6671 -13313
81 -13313 16637 12692 13855 -7180 -17019 28623 4586 -831 29989 -24927 -36274 14817 -13202
94 -13202 -253 32794 -6599 -6168 14812 -9229 -4725 10501 -7243 -15635 8900 -2159 -22752
107 -22752 11442 -1220 -30674 17837 7861 -22188 28171 8396 -26760 14026 -14021 -32536
119 -32536 15464 -10694 -8151 28842 -20669 -7004 23953 -26990 9342 25846 -31290 11247
131A1247J458m2442M5995j8573k5376M6083k1878J847L6548m0525K793K1032m0183
144b1974K0836J8848l5696K3627P471k7753K5680l055j8858K2838n703l780J4335
157A6816j5704o107K320n316M399L724M544l548J63J2753j2805k271J0369k3330
171a3993P834J8799k2525J3169M445l1996K3729N542k0826L5791j1457k6390L5289
184A7411k2253j4300L4930l2748j143L1869k8355J7585J4872l6306K1576K89k3679
197b0252L7070j0326k2568L0389k3050j2825L4771k1284l201K8529k1120L151
209g16J8526k1439J111O140j3122Q574M945l102K472l890L88o42J400P632n054
224C223L107J458j0094O275m447r161J3318p459K55J9696j6553J563J4092k6390
$$ plain form
131 11247 12705 -29737 16258 -2315 -27691 18392 -3486 -1639 34909 -5616 -2823 18209 -21974
144 -21974 -1138 17710 -17986 5641 13112 -14641 11039 7984 -10874 11964 6261 2481 16816
157 16816 1112 -4995 -2675 -7991 -3592 132 4676 1128 1291 14044 1239 -1032 9337 -13993
171 -13993 -6159 12640 -9885 3284 7729 -24267 -538 5004 -15822 19969 8512 -17878 17411
184 17411 -4842 -19142 15788 -16960 -18103 13766 -14589 2996 17868 -18438 3138 3427 -20252
197 -20252 16818 6492 -16076 14313 -8737 -21562 13209 -8075 -11276 17253 -3867 -716
209 -716 17810 -3629 -2518 3622 -9500 -926 4019 917 3389 -501 -113 -755 645 8277 3223
224 3223 6330 7788 -2306 3969 -478 -9639 3679 -3780 -3525 16171 -382 1181 15273 -11117
238a1117J0565J4938k7726J8595N352k9473K5521k978k2151L0805j2915j1072
250a1656L2573k3100l402K2250l3832O516K0575k8254J9711J1717k9931K0838
262D005K352k2394K4445n059j5689K0887j0435p482J5471j3494k240J0046o275
275e862O553O140l654r77l548k5j774k78O705n227l46O098q133N103M314r580
291d491R751j141o861J6470j2508p915J6778k1518L481K5478k6365R565J9795
304B0519l3595J5690J4992l2421K0005O589k6805K3607j429j9559K0275j1110
316c242p679K3191j2893J473J3665k2875O388R106k0314J4226L023j7530J8481
329E020j062j2226J5166q137q693J4369l234m239P440n633p440L648M378m894
$$ plain form
238 -11117 -552 14386 -13340 5255 10607 -18866 6655 3677 -18474 12331 -584 -11656
250 -11656 20917 -2183 -5585 16665 -17167 -10651 9924 -18330 1381 13098 -16833 4005
262 4005 6357 -16037 8408 3349 -12340 8547 -1888 -9370 6101 -7393 -9633 413 -5862
275 -5862 691 6831 3177 2200 -1348 -1373 -3147 -3425 3280 -1947 -2293 3805 -4328 775 5089 -4491
291 -4491 5260 4119 -2742 13728 1220 -6695 10083 -11435 -7954 17524 -8841 724 20519
304 20519 -13076 2614 17606 -14815 5190 11779 -15026 8581 7152 -12407 7868 -3242
316 -3242 -10921 12270 -623 850 14515 -8360 -1972 7134 -13180 1046 4069 -13461 5020
329 5020 3958 -8268 6898 -1239 -9932 4437 1203 -3036 4404 -1229 -8669 -5021 -643 -5537
343e537K975Q406r676J569J1101j3726P94R637j5436O791J0741j5736J0120L207
357E230j6722J5925j508j1121K0101r760p106J7610j9738Q78J6185k0910J2682
370A746J0497k3448J8579K742k2100K3636n153k0327K4676p673j2114K3050j4783
383f72r993J7769j1188L828J3112j4269K765J954r144R859j338q016N480l185
397c038L82Q103k888l477j994q14L270L032K614n110o355L031k072L217P167r956
413d888L34P495q996J0290M140j9343R463J741j2499K1271l619j7180J6500r473
427d764n448K3354j4017m444J4613j7739O736J3327j9737O903N023j5078J7210
440E939K328j3885J3381q313p202J7537r833k407J2325j4689K905J0086j2823
$$ plain form
343 -5537 -2562 5844 -3832 -2263 8838 -4888 -4094 5543 -9893 -3102 7639 -8097 2023 5230
357 5230 -11492 4433 2925 -8196 11905 2145 -4961 12649 -7089 -6211 9974 -10936 1746
370 1746 12243 -11205 7374 10116 -11984 11652 6499 -13828 10848 3175 -8939 14111 -672
383 -672 -10665 7104 -4084 -256 12856 -1413 1352 3306 -5838 4021 2683 -5333 147 -3038
397 -3038 -2656 5447 2559 -918 -2912 -3726 -456 2576 5190 80 -6275 -3244 -5316 -2099 5068 -4888
413 -4888 -4554 2941 -6055 4235 8375 -10968 -1505 236 -12263 9008 5389 -11791 4709 -4764
427 -4764 -10212 13142 -875 -5319 9294 -8445 -1709 11618 -8119 -1216 3807 -11271 5939
440 5939 8267 -5618 7763 -550 -7752 9785 -48 -2455 9870 -4819 -1914 8172 -4651
453d651M533O160j0199O720M433p217J590R48l635N23K768j389k738M210L90m311
469a865M958l034n409R371k823l532Q486j0323j959J0890j0624M683P570j5239
483h850Q797N512j3615J3051l239j4031J6728n375o289J6814j3785n078J6492
496G132j3973L940J3257j8868O317R081j5602J1447K714j5817J2063K88p929J3039
510G089m978p496Q991m618p79P553n242k033L521k149R29K208j749k413J612K333
526B779j324J547N45n654J998K405l511N490j818n936P731m371k116J0156j0696
541b775o78J0805j2803N202R534j7430P132P752j5742J1720L375j4910J1593j033
555A742r947J3307n741n790J2064j0134P59J0535j3404M330P928j4374Q721N089
$$ plain form
453 -4651 -118 6042 -4157 2563 6996 -221 1369 2317 -1318 -795 1973 584 -2154 2056 2446 -1865
469 -1865 3093 59 -5350 4021 1198 -2334 6152 -4171 -6130 4760 -5864 -1181 6389 -8850
483 -8850 -53 5459 -8156 4895 1656 -12375 4353 -1022 -7311 9503 -4282 -9360 7132
496 7132 -6841 -2901 10356 -8512 -2195 6886 -8716 2731 5445 -10372 1691 1979 -5950 7089
510 7089 2111 -5385 3606 -1012 -1791 5762 520 -1513 2008 -141 788 2996 1247 -1166 446 2779
526 2779 1455 3002 3547 -2107 -109 2296 -1215 4275 2457 -3479 4252 -119 -2235 7921 -2775
541 -2775 -3453 7352 -5451 -249 9285 -8145 -1013 6739 -9003 2717 6092 -8818 2775 1742
555 1742 -8205 5102 -639 -6429 5635 -4499 -3740 6795 -6609 -2279 5649 -8725 -4 5085
569E085j2635Q330J798q954P411J011n866L818N37k454J699O72j176l96Q41K94
585A5m01J406k1j393J702j068N76J863l711J956J007n375P133p54o554R390n021
602G50m651J1812p854l176J1194j1774J312J0794j2514M027P241j3295P179N344
616F389j1589R281n4j1096J1029k729p101J0885o317l522R590p533L97O644p226
631b952J698L367n529K937Q71l445K356p90j384K784r66J25K002k102o66J479
647b15j006n61J849j73l153K219K726n164L701L566q562O028M403j0755P775J085
663C763j1097R284O06q547J0774k680n854R458n422k103P688p418J250N581q700
678c417M865K962r787Q348O68q118J0458k534p316R665m524n459P886m961j762
$$ plain form
569 5085 -7550 780 2578 -6376 1035 2046 -3820 -2 535 -1919 -220 452 -724 -1120 -279 15
585 15 -386 1020 999 -394 1308 240 816 2679 -1032 924 1931 -3444 3689 2935 -3619 5771 750
602 750 -3901 7911 57 -3119 8075 -3699 -2387 8407 -4107 -80 7161 -6134 1045 6389
616 6389 -5200 4081 4027 -7069 3960 1231 -5870 5015 -1302 -4824 4766 -2767 -2370 4274 -2952
631 -2952 -1254 2113 -3416 -479 392 -3053 -697 -1487 -2871 -87 -1053 -928 1074 -1028 -1694 -215
647 -215 -1221 -1782 67 -106 -3259 -1040 1686 -3478 223 3789 -4773 1255 5658 -5097 2678 3763
663 3763 -7334 1950 2556 -5991 4783 2103 -3751 5707 285 -1818 5870 -1548 -298 5283 -3417
678 -3417 1448 4410 -5377 2971 3639 -4479 5979 3445 -3871 5794 1270 -4189 3697 -1264 -3026
693c026O122l399o38L128l120L71J911j605Q33nj721K78m28j231P00L81k02J113
711e38K064j986q30K612m004j7M966o023P52N866p414K926N131r294N317M311
727C839p537O757M69q605N988j279m398P789l505k979P460n048R79O257q455J486
743g82M434o963N700K260q709M257J35l835O966J46l472L062k324m35L260l430
759B70j056J047k339K343K826k306q28P13j297M96L506o85l677J368q93l058M477
776I07r01n082N952l33k176O250m319l991N159m077L74M635n769P22K997m665
792d317M157J515n272N887j210l037O896n446m342O530n079N8P591o206N78N395
808C698m959J783L042n240J743J528k978L292j068m010K544l38N9M465m11j878
$$ plain form
693 -3026 3096 -303 -941 2187 -933 -562 1349 -256 577 572 -1149 -871 -1299 -2530 -1830 -1449 -1651 -538
711 -538 1526 -460 -1290 1322 -2682 -2699 2267 -3756 -3004 2862 -4552 -1626 3505 -5789 -472 3839
727 3839 -3698 3059 3528 -5077 911 -368 -4766 3023 -482 -3461 3999 -1049 -70 6187 -2268 -782
743 -782 3652 -3311 2389 4649 -4060 197 332 -3503 3463 3609 137 3199 875 440 3700 270
759 270 -786 261 -2078 265 3091 785 -43 670 -627 -131 3375 2690 -987 381 -512 -3570 907
776 907 6 -5076 876 543 -1633 4617 298 -3693 1466 -2611 -2237 2398 -3371 -2649 348 -4317
792 -4317 -160 1355 -3917 1970 760 -2277 4619 -827 -5169 1361 -3718 -3660 3931 -2275 -1697 3698
808 3698 -1261 522 3564 -1676 67 1595 -1383 1909 841 -3169 -625 -963 -904 3561 3150 1272
824A272P11r1j714O81N0k613L40L177j105O05J315l971J202K571j498K536j275
841B193l970K477j844j737M491l394q56O227l279L21M198p154L01M087n598L419
857a18K632p285L671Q69m443N633p3l428M873j504j873K643m265j223K690k554
873c755L053K826l897K210Q80l587L205J018l867J979J439k901N37J386k944p0
889b488L798n57P85K945l227j669K007k198p87K931k454R10K042k273J215R39
905A919l003K844P99j779L005k824k783K632l496K90M760l383J647L623n086J846
921A011K309o270K990J597m655L974J93m678L122l23k339M342K16j921K699k001
937B66k282J396j769j110J950K28P65P04M35o67n68K24K7M52L03m00r43r22n3
$$ plain form
824 1272 1983 1892 178 859 909 -1704 -1364 1813 708 1313 2628 -1343 -141 2430 932 3468 2193
841 2193 -1777 700 -1144 -2881 1610 -1784 -2640 3587 308 629 4827 -2327 -2026 2061 -3537 -118
857 -118 2514 -4771 -1100 -231 -4674 959 886 -2542 2331 827 -1046 1597 -2668 -3891 -1201 -3755
873 -3755 -702 2124 -1773 437 1317 -2270 935 1953 -1914 65 1504 -1397 -860 526 -2418 -2488
889 -2488 1310 753 1538 4483 1256 -413 1594 -604 -1391 1540 -914 -4 2038 -235 980 1919
905 1919 -1084 1760 2559 780 3785 961 -1822 810 -2686 -2396 2364 -1019 628 4251 -835 1011
921 1011 3320 -2950 40 1637 -3018 956 1149 -3529 -407 -730 -3069 1273 1489 -432 2267 266
937 266 -2016 -620 -2389 -3499 -1549 -1321 -556 148 583 -84 -652 -428 -401 51 354 -46 -989 -1911 -1964
956a964Q25q19J580K099j521K397R68m608Q07R51m003L121K920m718K621J561
972B217m110L072J452k878K759J25j721J289k133j200N60j939K727K078j901K363
988B760Q4m163L001J54l836K848J09l243L073l83l275J953R08n51K027R21j196
1005A191p03r69j057p71M47L31L97O01O39L87j199j94J116j255O05K265k692j058
1023a919J563k887k50L764j262L36L450j737o55J508l147p16J569r49J817j74
1039C11n17J032j768L93K748j978J174K584l698L1J574m045k71L232j733J056
1055A25L408j901k56Q19j923m31R94l98k5J09k50j041l96O70K14Q07J089N57o43
1074A528r98m36j244j378J291K10j44K084n05j523J212n88j058K221m05r60J200
$$ plain form
956 -1964 -1139 -1958 -378 1721 200 2597 3565 -1043 -236 715 -3288 -167 2753 -1965 656 2217
972 2217 -1893 1179 2631 -247 2512 2637 916 2205 72 -1128 -568 -2507 220 2298 397 2760
988 2760 2844 -1319 1682 1836 -2000 848 957 -2286 787 404 -2871 -918 -10 -561 1466 2387 1191
1005 1191 488 -481 -1538 -2309 -1862 -1531 -1134 -533 106 493 -706 -900 216 -1039 -434 1831 -861 -1919
1023 -1919 -356 -3243 -3493 271 -991 -655 2795 1058 403 1911 -1236 -1952 -383 -1332 485 311
1039 311 -206 826 -942 -549 2199 221 1395 3979 281 312 1886 -2159 -2430 802 -931 125
1055 125 3533 1632 1376 2195 272 -159 835 437 412 521 271 -770 -1166 -496 -282 525 1614 2171 1528
1074 1528 530 94 -1150 -2528 -1237 -1027 -1171 913 408 -1115 97 -491 -1549 672 267 -693 507
1091E07j538j459J426k024L61K835n98J896J077k716l02J8j882J846M86j368J361
1108g4J57j097J325l33o57J650O25N4M84j537j415n83k54Q83J394L05N83q7m2
1127A381L08n10o58n08J132n22OM78k018n24J363j28J478J280p75o26J92j356
1145gm67k9j636J185J375k43Q72m96k048J241J08n3J775j133j504Q28j342m89
1163b063P85l24J58J929M01p4L9j543r37N64J87M00R2n13k12K0L11P24l78O94
1183B60O12M56N9q26j552q31L62N68O15J862o80n11J011n52o03J018r07n52J430
1202A239Lj167R3p69q49K357P22J9J288j484j164K85p22o68O12m05L93J077J77
1221A037m28q24k86M83M68N56P9j213j017J17r49L05J120l66O84J241l90m80j96
$$ plain form
1091 507 -1031 -2490 -1064 -3088 -2727 108 -490 1406 2483 -233 -535 -517 -2399 -553 -67 -1435 -74
1108 -74 83 -1014 311 -22 -679 971 1596 1650 2134 597 -818 -1401 -1655 -772 622 927 1510 1423 1381
1127 1381 1689 1179 521 13 1145 623 629 1107 -911 -1435 -72 -200 1278 2558 1783 1157 1349 -7
1145 -7 -474 -503 -2139 -954 421 178 1050 554 -1494 -253 -145 -198 1577 444 -1060 -232 -1574 -2063
1163 -2063 -1278 -1602 -1444 485 886 812 851 -692 -1629 -1065 -878 -478 -386 -899 -1111 -1091 -780 -56 -434 260
1183 260 872 1328 1387 561 -991 -1822 -1460 -892 -277 1585 905 394 1405 853 250 1268 361 -191 1239
1202 1239 1242 75 168 -601 -1450 907 1629 1648 2936 1452 288 573 -149 -817 -205 -610 -217 860 1037
1221 1037 609 -215 -501 -18 450 1006 1085 -128 -1145 -1028 -1977 -1672 -552 -918 -234 1007 617 137 -59
1240e9r69p97J094M19l74N60k47j131L30P00j4J008L15l96j8m21p80k94j21J18
1260a077P17J200L23l18l20m17q3K97N56l45j33L29p10l45L80l55R9J013R31K29
1280A971k92p55j236j83N74k34P99K25o69J67M6k85O5J14L34K91l0l84m00j259
1300a141o33O24Q23L66O05l8o45J63j91n71j42q2Q6K49N36m10m58m33j6O95P79
1321A66L38k50q83J99n31n04P65k02l14J627M8l07M37o85q36J358M28q32R31n95
1341C58j332O15K64l05J089J15o4N59L34p15o77q23J46M40O18N38j55r69K63N9
1361C58l96J003j3q95N91M4m62k50o68n27R85J053j72O22j060r98Q23j02o91P59
1381Dl59k91R63m70r40Q32r04JJ800l99l32M54j427l97J065o16K03J128r12Q57
$$ plain form
1240 -59 -1028 -1825 -731 -312 -686 -126 -373 -1504 -1174 -474 -488 520 835 439 421 0 -780 -1074 -1195 -1077
1260 -1077 -360 840 1163 845 525 108 25 322 878 533 400 729 19 -326 54 -301 -202 811 1742 1971
1280 1971 1679 924 -312 -495 79 -155 644 869 200 367 413 128 193 307 641 932 902 518 118 -1141
1300 -1141 -1774 -1150 -327 39 644 606 -39 124 -67 -638 -780 -862 -776 -527 9 -401 -859 -1292 -1308 -613 166
1321 166 504 254 -629 -430 -961 -1465 -700 -902 -1216 411 459 152 589 -96 -932 426 854 22 953 358
1341 358 -974 -359 -95 -400 689 804 740 1299 1633 918 241 -582 -436 4 622 1160 1005 36 299 358
1361 358 -38 965 952 57 648 692 230 -20 -688 -1215 -230 823 651 1273 213 -785 38 -64 -755 4
1381 4 -355 -646 317 -153 -1093 -261 -1165 -1164 636 237 -95 359 -1068 -1465 -400 -1016 -813 315 -597 260
1401B60P1q72M17o31o18J620J06m80P01j162m31J331o49k05J826p73m20J237j044
1420B84o62Q14p59M54J065n14q7L84j259M50N86o23Q02J21o17N63J32j730O04
1439HJ38n14J419j4r98R96p83j179J384l50j005J908r12r98J772j601o13J821
1457D79j354K59J642j488j35R37j664J32R41r75R83M00p69M55l16r58J312n08
1475f27n15J586r24k48J547j440k85J463j234J27J844q17r96R30n98m77J542k65
1493F13q12J237n40l84O68n22o1j17J13N26K23n29M46q97n11J183K82q77J197
1512A238n08j399J582m33j483J583n47n69J901q84j029Q15p06MJ240j267J31L03
1530b8q53P93K62j279Q96J52j073J391J08j211L53l0r62J249P3m32K59k07k08
$$ plain form
1401 260 331 -541 -124 -755 -1373 247 353 -127 574 -588 -1019 312 -337 -542 1284 511 91 1328 284
1420 284 -378 436 -323 131 1196 682 595 979 -280 170 756 133 935 1056 439 1002 1134 -596 8
1439 8 146 -368 1051 1037 39 1035 252 -927 457 107 -898 1010 98 -900 872 -729 -1342 479
1457 479 -875 -616 1026 -462 -597 340 -1324 -1192 -251 -1226 -243 157 -612 -157 -473 -1431 -119 -627
1475 -627 -1142 444 -480 -728 819 -621 -906 557 -677 -550 1294 477 -519 411 -187 -664 878 613
1493 613 -199 1038 498 114 782 260 199 82 195 721 944 415 861 -36 -547 636 918 41 1238
1512 1238 730 -669 913 480 -1003 580 33 -536 1365 481 -548 267 -439 -435 805 -462 -331 -28
1530 -28 -881 -88 174 -1105 -209 -57 -1130 261 369 -842 -489 -519 -1481 -232 -159 -591 -332 -539 -747
1549g47O67o0l23J02k20J44M70k52l50N01o81O52J232j247L05Q67j533L27R11
1568G65j469M65R14j025M88J388j666P21N92j351J332Kj108J045r04n86J079n28
1586A54j06R50j166O84J081j764K26R15j339L17R75j687K39R53j223O26P65r72
1604c72L21M17q51J76J59o99N72l12l23P45l20R5Q61q49l52Q94n36l30O86j040
1624a058l02J570p51m71J914j620n2K025j321q6J054j908K13J716j362jR97j225
1642f68P80R96o70O08n16p88J068o59r9Q97j522J18J618j300N83J382k029K64
1660F3J784j487j51J146j815m30J653r11n2R92j027k58J455m38k88p3p59K38J47
1679b11m33P62o09q96J246O9l39J139p54r77J421l89j143Q31r47o54J945k62k49
$$ plain form
1549 -747 -80 -140 -463 -361 -581 -437 33 -219 -569 -68 -749 -97 1135 -112 193 1060 -473 -146 765
1568 765 -704 -239 675 -350 138 1526 -140 581 1173 -178 1154 1156 48 1093 189 -397 682 154
1586 154 48 998 -168 516 1597 -167 59 974 -365 -48 927 -760 -521 432 -791 -165 600 -372
1604 -372 -51 366 -485 -309 -150 -849 -277 -589 -912 -167 -487 -392 469 -380 -732 162 -374 -704 -18 -1058
1624 -1058 -1360 210 -541 -1012 902 -718 -770 1255 -66 -152 902 -1006 -793 923 -439 -440 557 -668
1642 -668 112 1108 438 1046 530 -258 810 151 52 949 -573 -455 1163 -137 446 1828 -201 63
1660 63 1847 360 209 1355 -460 -890 763 -148 -200 792 -235 -493 962 524 236 163 -596 -358 -211
1679 -211 -644 118 -491 -1387 -141 -72 -411 728 -26 -1003 418 29 -1114 -283 -1230 -1884 61 -201 -450
1698d50R03r19l43J505p57m10O56j355O49P48j457J042n0q72J709P84j893J683
1716A173n48j901K049m29j104J505k68j342J565J81n53Q59l31o20Q49l21n88R0
1734B66q62OJ102m27M39J70q53R33N44j257K39J96j685J239N39j657R80l82r35
1753a405K018N1q06J043r12r24J581j140r60J288j132J24K136j415j86J439j672
1770h72N6J914j606J19O65j614P37M02r25Q02M14q40J511K49j001N86q65n16J095
1789C11m78l23J058q86r5J598r31j43J476j168l21J896j950m91Q35j308J48J826
1807A054p63K2J515j640K75Q45j640N79M60j314Q98K21j678J258Pq91J667J42
1825A017j398J602j077j001J113j158o04J428m48j67J452j186R6J025j390N67
$$ plain form
1698 -450 453 -466 -809 696 -61 -471 185 -1170 -521 227 -1230 -188 -238 -1110 599 1383 -510 1173
1716 1173 625 -1276 773 344 -760 745 477 -865 700 881 328 1187 856 236 1085 764 176 266
1734 266 -596 -590 512 85 524 694 -159 774 1318 61 300 496 -1189 50 589 -1068 -88 -470 -1405
1753 -1405 613 664 -142 901 -11 -935 646 -494 -1454 -166 -1298 -1174 962 -453 -639 800 -872
1770 -872 -816 1098 -508 -389 276 -1338 -601 -199 -1124 -322 92 -748 763 1012 11 597 -268 -784 311
1789 311 -167 -490 568 -318 -413 1185 254 111 1587 419 98 1994 44 -447 388 -920 -772 1054
1807 1054 291 313 1828 188 463 1308 -332 247 707 -607 291 512 -1166 92 99 -792 875 1017
1825 1017 -381 1221 144 -857 256 -902 -1506 -78 -526 -693 759 -427 -331 694 -696 -129
1841a29O20j550M16P34j722P41N69j260J396P68j111J497m10j672R07J98j419
1858a427J629l1j200J234k18n21J353j99o95J640q33j025J141j011r11J458j056
1875f72J27J959j146J06J537j798L77O33j257P47J61j485J213k97j262J903j32
1892G14r28J675o24r15J594j558j417J671q98n99K040r51o41J410q25j54J513
1909A107j291k84J377j594q2M38j206P12M23m06J229L29j049R89o67j465J650
1926B10q90r25J990o97j157J900m54r34J826m85o24J557j003q09J126j679J35
1943i13J254r84J000J269j709Q29J024k283R12O92j624J371J43k056J388j86j138
1960a011J697M42q81J302l94j405J025q53r99J207n72m2J518q60l60R96j632N77
$$ plain form
1841 -129 491 -1059 -643 91 -1631 -890 -321 -1581 -185 583 -528 969 559 -1113 -206 -8 -1427
1858 -1427 202 171 -1029 205 -13 -534 819 620 -75 1565 732 -293 848 -163 -1074 384 -672
1875 -672 -545 1414 268 374 1911 113 490 1123 -134 613 774 -711 502 205 -1057 846 714
1892 714 -214 1461 837 -78 1516 -42 -1459 212 -686 -1285 755 -196 -837 573 -252 -406 1107
1909 1107 -184 -468 909 -685 -767 -329 -1535 -823 -400 -806 423 752 -297 692 25 -1440 210
1926 210 -680 -1605 385 -312 -1469 431 -23 -957 869 384 -240 1317 314 -495 631 -1048 -913
1943 -913 341 -643 357 1626 -83 746 1770 -513 399 1091 -533 838 981 -1075 313 127 -1011
1960 -1011 686 1128 247 1549 1155 -250 775 -78 -1077 130 -442 -484 1034 174 -186 810 -822 -245
1978b45J418j454L36O48k272N90P05j294J145J052j536J365P18k024Q21p7j662
1995a766J250K78o63J217q22p97J438k26l56J699r12o73J866k043n25J226j696
2012a505M30J861r89P08Q77j819L11J103r69L91M78j194N55M40j438R53j92p40
2030g39K311p7j166J284j048j334J509r51m46J422p03o61J914j319j48Q84r65
2047b33N4J346r52q3m7j779N87J132r85J232O34j392J093K83j829R68l87j460
2065a818K219m66j196J592q94j331K767q41n46J653j129q24J305j261m19P05n65
2082a049N87J478p36k0N00j647J234L13j140Q98K14j542J213M42j705J157L23
2099E20o57J817q6j276N14q03q56J301l86m56J254q13k17J583j507m0J120j136
$$ plain form
1978 -245 1173 -281 55 703 -1569 -979 -274 -1568 -423 629 -907 458 1176 -848 -27 -104 -1766
1995 -1766 -516 -238 -901 316 -506 -1303 135 -91 -447 1252 340 -333 1533 -510 -1035 191 -1505
2012 -1505 -1075 786 -203 505 1382 -437 -126 977 8 399 877 -317 238 678 -760 193 1 -739
2030 -739 1572 1495 329 1613 565 -769 740 -211 -657 765 62 -599 1315 -4 -152 732 -233
2047 -233 -179 1167 215 132 85 -1694 -1107 25 -960 272 906 -486 607 890 -939 29 -358 -1818
2065 -1818 401 -65 -1261 331 -563 -1894 873 32 -514 1139 10 -814 491 -770 -1189 -484 -1049
2082 -1049 -462 1016 280 260 760 -887 347 660 -480 418 632 -910 303 745 -960 197 520
2099 520 -137 1680 1594 318 832 29 -827 474 88 -368 886 73 -144 1439 -68 -108 1012 -124
2117a24L63J268j285m93K18j204Q57O98l94O91O9j287J177K4j769J213j46q97
2135a021J389k35j216J038p02j35J375m09j60P52j191n31J410j889K20J517j282
2152a070P86J481j643L12K42o51M86P50j213O08K45j324R62J63j068J731Jj089
2170b91J896o04j619Q56l13r38J875p12l61J187r32k77J213r97J21J346j582M90
2188C58P31j811L6R93j118P24J100j230Q85O7j266Q23P5j346J450k76q93J091
2206C93k96j284J149k08m21J754j025l76J002j541k19J129j266J72J602j323N48
2223b10R65j752N18R28j505J075P10j491O58L19j545R67N78o77J279J27j163J210
2241I91j040r04J589q78l67J563p78m56J404j298k74J500j041L28J067j438J33
$$ plain form
2117 -124 239 1507 222 -271 -53 -1257 -400 298 -96 595 664 -623 554 578 -1191 22 -124 -1021
2135 -1021 368 133 -1083 -45 -747 -882 493 84 -76 676 -515 -1046 364 -1525 -1305 212 -1070
2152 -1070 -284 1197 -446 -134 108 -543 -57 693 -520 88 333 -991 -29 134 -934 797 798 -291
2170 -291 1605 1001 -618 238 -75 -1013 862 150 -211 976 44 -233 980 -17 104 1450 -132 358
2188 358 1089 -722 -686 307 -811 -87 1013 -217 668 735 -531 292 367 -979 471 195 -698 393
2206 393 97 -1187 -38 -246 -667 1087 62 -314 688 -853 -1072 57 -1209 -1037 565 -758 -210
2223 -210 755 -997 -479 449 -1056 19 729 -762 -104 215 -1330 -363 215 -462 817 944 -219 991
2241 991 -49 -953 636 -242 -609 954 176 -280 1124 -174 -448 1052 11 339 1406 -32 101
2258A01O73j544N90O56j029J109N98j192N50L10j574J247k01r78J263k05j041
2275f67J290j057p01J890o31p23J815j077r31J210j151k70J281p85NJ057j101
2292e46PQ86j171O45J95n37L07O62j117L97R0j000J111L28q87J319k66q86R50
2311D87o91n25J108K4p62R47n26o84J288p27K5J074p76N6P94j105N8M72j235N69
2331a29R92j095Q23M99j559Q03K84j046Q51J58j012J068k34j062R23k20o97J680
2349A027n55q20R45q46n79J000q48J5J105j212L76Q74j062J59Q58j336N73J069
2367G43j159N78Rj314Q41M23j057J070p5n90Q47J6j101Q58n72m02J454m02o07
2386d40J096q89l27R29n59PR23q59m3J344j441K47M23r36Q20O86j059O25N1j458
$$ plain form
2258 101 774 -770 -180 476 -553 556 1154 -38 512 822 -752 495 294 -684 579 374 -667
2275 -667 623 -434 -1135 755 124 -599 1216 139 -792 418 -733 -1003 278 -507 -502 555 -546
2292 -546 -539 347 -824 -179 16 -521 -214 448 -669 -272 -182 -1182 -71 257 -630 689 423 -463 487
2311 487 -204 -729 379 403 -359 588 62 -622 666 -61 -36 1038 262 318 1112 7 65 537 -698 -129
2331 -129 863 -232 591 1090 -469 334 618 -428 423 581 -431 637 403 -659 264 44 -653 1027
2349 1027 472 -348 597 -249 -828 172 -676 -661 444 -768 -392 482 -580 -421 437 -899 -326 743
2367 743 -416 162 171 -1143 -302 121 -936 134 59 -531 316 332 -769 89 -483 -885 569 167 -440
2386 -440 656 -233 -560 369 -190 -183 740 -119 -162 1182 -259 -12 411 -525 295 981 -78 547 598 -860
2406h60J493L82j282R47l31q61J139J75j130R50n34n20J370m12o48Q25j221j21
2424f39J143m32l77O42r51K07Q44q69n3P55j259O49R27j393N86l1r92J090L79
2443B26j039Q94k68o21R58j89p03P95k34o32J529n31p99Q50m01k81J010p67j36
2462c39R11r74K71P19j030J12R05j080R19N33j338L06M14o67Q20K63r54Q17k13
2481C95p28J090q3j047J095r16j48J373n46j021J341r35l0J155q23j85N36m71
2499E2l67R16q62k45O15m52L68M40r65N38N9q08P75L90j243N29M4q21J286k05
2519D4q47Q01j67o61J186n05o23Q92m70m41J254o60l8O54r43M33L62p11R0R33
2539E83r60M72M45j243N22L16o28J098N4r26Q07Kp73N10K41r14O29K36o75N81
$$ plain form
2406 -860 633 1015 -267 680 349 -512 627 802 -328 622 88 -432 938 526 -122 703 -518 -639
2424 -639 504 72 -305 337 -614 -407 437 -432 -485 270 -989 -340 587 -806 -220 -251 -1243 -153 226
2443 226 -813 81 -187 -808 150 -39 -742 53 -181 -813 716 185 -614 236 -165 -446 564 -203 -339
2462 -339 572 -402 -131 588 -442 -330 575 -505 414 947 -391 -85 329 -338 482 745 -209 608 395
2481 395 -333 757 674 -373 722 -194 -342 1031 485 -536 805 -130 -160 995 172 -13 523 52
2499 52 -315 601 -261 -506 109 -343 25 465 -500 38 97 -711 64 454 -789 -260 -216 -1037 249 44
2519 44 -803 -2 -169 -830 356 -149 -772 120 -350 -791 463 -197 -235 419 -524 -91 271 -440 -350 583
2539 583 -377 95 540 -703 -181 135 -493 605 659 -267 540 542 -231 279 520 -394 235 471 -204 377
2559C77n9p25J144n51l17J065o77j26N43j005K92M09o16K87M80j146Q06L11r45
2578d53Q29n4q54P08J92q09M93l85p11Q95k2o62J219l91n70O26m54o27J029n58
2598e59K34L05m37M7Q75q71M74K85q61N92M07j120L89L44r17Q24L40p56O99K16
2618E10m47N68m70l14M95l32j76O71n05m94R42l11k73Q51n76K11M50p15kM61p09
2639a65m4Q41j277P46N27p30K03M68p35P89o0j345P38K46q01M43N7l26P79j51
2659B03k68N06m26m90P16o51l98R05m47n43R80p07M13L29k83J69K32o26J05N00
2679B19j004M98O81r96M02O98r22M02M47n21M71jp34P46k35o54O98m06LO12r1
2700C13k90P82n84P4M49p39K4P50j073J1Q28q95N42N67o83L43O25j227L52L69
$$ plain form
2559 377 318 -407 737 186 -131 934 257 131 674 -331 -39 370 -246 41 521 -625 181 492 -453
2578 -453 376 322 -532 176 368 -441 52 -333 -1044 -149 -171 -833 386 -5 -575 51 -403 -1030 -1 -559
2598 -559 -325 -20 -457 -410 465 -406 68 353 -508 84 491 -629 -240 104 -813 11 351 -405 294 510
2618 510 63 631 161 -153 342 10 -166 505 0 -494 448 137 -136 715 139 350 800 85 83 544 -165
2639 -165 -209 632 -645 101 628 -102 101 569 -166 623 563 -782 -44 202 -599 -156 -99 -425 354 203
2659 203 -65 441 15 -475 241 -410 -808 97 -350 -893 87 -620 -207 122 -161 8 240 -386 -281 219
2679 219 -785 -287 394 -602 -200 498 -424 -22 425 -96 375 374 -360 386 151 -503 195 -211 -208 404 313
2700 313 23 805 221 295 744 5 29 779 -294 -283 545 -350 192 759 76 419 1044 -183 169 538
2720E38j088O08%o17P45K8m15N55o1n34Q15m74l28L10l62l85Q66n06m88Q56o07
2741e44M23L70n04O2N81j250N12N03r09J42O40o52N46M18r37P86K39q37R26k86
2761B29r91P83l85m04Q86J90n83J054n39k08O15m87p6L41o10J78P51q93K00K44
2781B95m48P69K08p69N37J21r15N61j84p63M81P6k06N56K05o75N53l2o24Q54l28
2802B72o93O61n05k65N62k53o2J71j38K81K25o35J43L07p30Q5N49p74L48J05l99
2823g45R13J67n64L01Q7n00O03k67q06O47j56j15P07k01k97N32l02l0O84o15j39
2844i6N88o41J56K77q38M52N47p26P36N61r46J47M30o98L71j52n59K91K77m55
2864b78Q79j57p30Q30k94m84P88n28k95L54j56m03N17j44N6P09p46L60J81q25
$$ plain form
2720 538 -550 58 58 -559 186 214 -201 354 293 -241 574 100 -228 82 -280 -665 201 -305 -793 63 -544
2741 -544 -121 249 -255 -193 388 -862 -350 153 -756 -614 26 -626 -80 338 -599 187 426 -411 515 229
2761 229 -762 21 -364 -768 118 308 -275 779 240 32 647 160 84 425 -185 -7 744 -149 51 295
2781 295 -153 616 824 55 592 713 -202 359 175 -588 -107 -31 -237 319 524 -151 402 370 -254 600 272
2802 272 -421 240 -265 -530 32 -221 -283 -112 -250 31 256 -379 -236 71 -659 -574 -25 -799 -451 -346 -745
2823 -745 168 335 -229 72 159 -341 262 -5 -811 -164 -320 -435 272 71 -226 306 4 -26 658 43 -96
2844 -96 492 -149 7 284 -554 -102 445 -281 455 1016 70 217 647 -51 320 168 -391 -100 177 -278
2864 -278 601 444 -286 544 250 -234 554 26 -269 85 -71 -474 43 -101 -45 664 -82 278 459 -366
2884c66o1P34r97O24R4q53L77J05k07P29R8l67K52j30k82l4J61n67N29k43k38
2905f42R02l22k34N59k16l43P23n57o7L43n57J41K65j78L54K77k65M11J75o26
2925A43J01J54p09L39K74p49Q46j02j48N65l08j91L80K9q33M43j99m34L88k97
2945c08p7N47Km9N70o23k77L50m31L55J36p53L96r3j45K81o5l30N56L52n28M58
2967C24k86o55L58k4n47O39K77m95O17k95k53K26J6J31J36p30L77p6k13P6O32
2988B35n36L43K77m37M91Q7o25L43j39l41L51J99k32K57L33o87M03J06k22L75
3008E81j40k38M21p84J35J0l7K22L54n07J66L13n45N5K49m74K3L83m10J18J40
3029C5n63M31J50m36N13L34n58J41m95l78M51K9l37N30J80m58O02m43O6O41p86
$$ plain form
2884 -366 -427 307 -690 -66 28 -825 -448 -343 -550 179 277 -90 162 32 -250 -284 -123 -690 -161 -404 -642
2905 -642 260 -62 -296 263 47 -296 427 -130 -197 146 -411 -270 -5 -183 171 448 183 594 769 143
2925 143 244 398 -311 28 302 -447 399 297 149 714 406 215 595 624 -209 234 35 -399 -11 -308
2945 -308 -385 162 164 115 685 62 -215 135 -296 59 195 -558 -162 -255 -400 -119 -184 -514 42 394 -134 324
2967 324 38 -617 -259 -283 -830 -191 86 -409 208 -87 -340 -114 -98 33 169 -561 -184 -260 -473 -397 235
2988 235 -301 42 319 -118 373 460 -165 178 39 -302 49 248 16 273 606 -81 322 428 206 581
3008 581 441 203 624 -160 -25 -15 -52 170 524 17 183 496 -49 6 255 -219 -196 187 -223 -105 35
3029 35 -528 -97 53 -383 130 464 -94 47 -448 -826 -375 -346 -683 -153 27 -431 171 -272 -206 435 -351
3050c51p0O84n96j11K24l20Q0M66p4M20r1k06J04j48k05j73K13m5L63n4k15K59
3072A54L34m95M90l6l49L73j84k25M3j76m11O35m2M9K18J36l62K26l84J57j87
3093c6k38M55p8k85J15M20o92L85M09j86o0n1l96L53l46k43K19j74J05M47j3o36
3115e26O99l11k22L75j68n7nj96r5K93j18k6M90q4j29L98n61nJ04l00K00K54r3
3138h3J05K52n05L99o6k69M67J03k55o0L2j92QL4j89N57N4M%k77M5J97k85k44
3162a68M48k26K3J50k72k2O2j39M65K08l47L02l83m20Q0J57k25J57K10j70N5J3
3184d2l33L56j14O0J52j74k25m6k00J59M68l82J98J84n3J91l33j42K22p0j54J33
3206a45L58k30k79K68r9P5N77n32K24j45K2P5k53j35J02J8N07R6k54j47L53l63
$$ plain form
3050 -351 -421 263 -333 -444 -220 -540 -460 6 -68 352 261 55 159 11 -194 -367 -154 -199 164 110 -105 154
3072 154 488 -7 483 447 98 471 287 62 105 -71 -482 153 111 160 378 514 152 378 -6 151 -36
3093 -36 -274 181 103 -182 -67 353 -339 46 455 269 209 158 -238 115 -231 -474 -255 -429 -324 123 110 -526
3115 -526 173 -138 -360 15 -153 -210 -215 -411 -506 -213 -331 -357 133 49 -80 318 -243 -248 -144 -444 -244 10 -83
3138 -83 22 274 -231 168 102 -167 300 403 148 88 120 -72 -64 -30 -219 338 392 396 396 119 164 361 76 -168
3162 -168 280 54 77 227 -45 -67 -5 -144 321 529 182 484 101 -319 -239 -82 -307 -150 60 -110 -55 -42
3184 -42 -375 -19 -133 -73 79 -95 -320 -366 -566 -407 61 -321 -123 61 8 199 -134 -276 -54 -124 -278 -145
3206 -145 213 -17 -296 -28 -127 -52 525 -7 217 72 94 169 -84 -219 -117 -99 408 504 250 103 456 93
3228I3R2L47l94j16J18j8q8K75l79R8K28lK8R6j53N5k72l51M51J59n48L39J46
3251B03k99K07j80j03K73k16OL88n64%J95k28j21N01l81J74L52j61k05J25n60
3272e94M02P6J00J31N5m26L77k56o8L41onJ26j80l83L75k65j56M63Nk95O87l54
3295A50k16L54k50m3J34J24j42J5Jp5oO5l2J04J65J48j57k33P4%l82q5M74j36
3319E1J42k85M9RJ82j65j3Nj3K30k28l04K80k53L30L13l87j92L58n33K06O7j23
3342b74L35j49k09R2K0p1P3J22j50M1L6N3O6l18j30M77k87K78J92k78j56J95m8
3365i0k19M87%k01K79r4Rlk07L43n5j36J48N1j38K74k0l80J75l5k48L49Q5l92
3389a8N2K37k34P2j0k86O97j62m1k37j04j78J86Q6q7r5j37R8J05j45n2J70K19
$$ plain form
3228 93 185 532 138 22 140 122 34 309 -70 28 256 253 281 377 224 279 7 -344 107 266 -282 57 203
3251 203 -96 111 -69 -172 101 -115 -109 279 -285 -285 -90 -318 -439 62 -319 -145 207 46 -159 -34 -594
3272 -594 -192 -116 -16 115 170 -256 121 -135 -203 138 132 127 253 73 -310 65 -200 -356 107 112 -183 504 150
3295 150 -66 288 38 -5 129 253 111 126 127 52 46 111 79 183 348 496 339 106 180 180 -202 -287 187 51
3319 51 193 -92 -43 -34 148 -17 -30 -25 -38 192 -36 -340 -60 -313 17 330 -57 -249 109 -424 -218 -151 -274
3342 -274 61 -88 -297 -205 -185 -256 -183 -61 -211 -170 -134 -81 -15 -333 -463 14 -273 5 197 -81 -237 -42 -90
3365 -90 -309 178 178 -23 256 162 171 168 -39 304 249 113 261 312 174 448 428 48 223 188 -60 289 374 -18
3389 -18 34 271 37 109 99 -187 510 348 307 70 -34 -212 -26 60 -27 -122 -259 -161 -56 -201 -253 -83 136
3412A36k07J1k28j04K85j15K7k8p9K84k12J7K35m35J78L81l42Q4rJ07J28j31o3
3435h0j51L36j78J9J57L7j55R9J00k10J35j25L81k77r0K28k71J60P8q2n4L50k58
3458A49k40L27j18rm0J06O3J32j11m73K05j09J20O1l87M39l79L06j38j81J87L02
3480B12j71j6N8K7k82J48l82L25j02J11j96N6O0j45n0L29r6o7L9k1O8m07J9J3
3504d70M69j04J57m1j85J41K9J60m90N47j12qNj82P6Q0O6O3p7J15N5O7j07k25
3528B9K61m34N7L17n3QL19j28l67L01j53J0N5j38m0p5L5Q3j56j6K71l28M19j94
3552H3J15j48k36L1o6L3K29k43J32j01J86R4l56L70j27oj21q7K6P6j09K86m22
3575c61K21K54om04K49j36J64P4j14k28K09J41j13K24Q3k41J39m2K80l37mK3k8
$$ plain form
3412 136 -71 -60 -288 -392 -107 -222 -195 -223 -302 -18 -230 -213 22 -413 -235 146 -196 -112 -121 -14 114 -17 -80
3435 -80 -231 105 -73 -54 103 140 -15 84 184 -26 109 -16 365 88 -2 226 -45 115 193 111 57 407 149
3458 149 -91 236 118 109 69 175 238 370 259 -214 -9 -118 2 63 -324 115 -264 42 -96 -277 -90 212
3480 212 41 25 83 110 -172 -24 -406 -81 -183 -72 -268 -212 -152 -297 -347 -18 -114 -181 -142 -163 -95 -502 -483 -470
3504 -470 -1 -105 52 11 -174 -33 -4 156 -334 213 101 93 98 -84 -8 72 138 201 124 239 294 361 254 29
3528 29 290 -144 -87 230 177 185 504 376 9 310 157 167 222 84 44 -31 4 87 -69 -85 186 -142 277 83
3552 83 198 50 -186 -155 -221 -188 41 -202 -70 -171 15 109 -247 123 -4 -10 -131 -218 -192 -116 -225 61 -361
3575 -361 -140 114 108 -296 -47 -183 -19 55 -59 -287 -78 63 -50 174 257 16 155 113 393 56 52 75 47
3598D7l40L93j47J91J73l83M99j52q3l9r1J89j63J58k83q3K38j35P4K41k88O0
3620G6K46k59j50Q3K0m1j90J33j11J4L24l34K71j62J10R3j35p1k70k9n4L06j17
3643b47p8K68L2q1K9M8j93L5j33P8j31J53J67L0M0L4j23p0N45n14j72K89L4o7
3667b7J26j25j00K86j5r7j01L3K47k81K95P2l96J11k9J19l4K16j39L8J75j38j61
3690G5L36l91K78N8l74J66j77j2j19L55l4K8j0j4k34J03Lo4l6m55L34j78M14n6
3714dj40J05J6J6J50k13j15J89l97J78Pp7J69K3J84J90j21J39m41J08j20om5K24
3738A9p9J12j62R5J35m6K43l2k09J66k93RL5J23j0J48l2P7q9j27K25l80L02l02
3762g2J80j7j55k7m2K52KP2%J5L0j21l22N46m64R5k03R7j1J64k0j58K94k21J69
$$ plain form
3598 47 -293 100 -47 144 317 -66 433 281 198 159 68 257 94 252 -31 -114 124 -11 63 304 16 76
3620 76 322 63 -87 -4 16 -25 -215 -82 -193 -179 145 -189 82 -80 30 123 -12 -83 -353 -382 -436 -130 -247
3643 -247 -325 -57 -25 -106 -77 -29 -222 -187 -320 -242 -373 -220 -53 -23 17 51 -72 -142 403 -111 -283 6 40 -27
3667 -27 99 -26 -126 160 145 48 -53 -20 227 -54 241 313 -83 28 -1 118 84 300 161 199 374 236 75
3690 75 411 20 298 356 -18 148 -29 -41 -160 195 161 189 179 165 -69 34 37 -27 -63 -518 -184 -362 52 -4
3714 -4 -144 -39 -23 -7 143 -70 -185 4 -393 -215 -208 -285 -116 -93 91 281 160 299 -142 -34 -154 -160 -205 19
3738 19 -60 52 -110 -15 120 74 317 285 76 242 -51 -42 -7 116 106 254 222 299 210 83 308 -72 230 -72
3762 -72 108 91 -64 -91 -133 119 121 193 193 208 238 117 -205 341 -123 -28 -231 -134 -145 19 -1 -159 135 -86 83
3787H3P4k91K5j7m8p0j39Q7j09K77J37qj00l5l36K60J63j14j8k23L75j81J8J98
3811HJ78j25J33J38l87J17J01k88P0K1j88K98j17j34L40K96k27m9n3N4j64j71
3833a49L85n33K25J71l0k4P2J34O2j7R2o09J73O4o2k02M30k00K1R8k0q1N9o9j18
3858a28j74R2j76J12j61J26J65k4K09m7k20J28m5j60J54k13NK38j88Q8j28J74
3880a73J1M17p1k53Q4l74J71R3R6jp0J32j44J79Q9j10q0K49mJ13l18J20j93J14
3904G7Ql02M57j21K71p2K2j56j14J26q1k92K95j2k51L5R6O7J12o9m6j5J08l38
3928a95K06j70j87K08l8J97k7L9J22j81K84k25k99J37j53p7M5J01J66j24p0J49
3950i2J45n0j6J3J23j91j61K40j14J39j79J16J33j85K39p4k5K73k03n4pK1l76
$$ plain form
3787 83 157 -134 -109 -126 -174 -244 -383 -296 -405 -128 9 1 -99 -134 -470 -210 -47 -161 -179 -402 -27 -208 -190 8
3811 8 186 61 194 332 -55 62 163 -125 -55 -34 -222 76 -41 -175 165 461 234 185 132 186 22 -149
3833 -149 236 -297 -72 99 69 45 117 251 313 296 388 -221 -48 16 -46 -248 182 -18 3 101 81 0 59 -10 -128
3858 -128 -302 -210 -386 -274 -435 -309 -144 -168 41 -6 -226 -98 -143 -303 -149 -362 -357 -119 -307 -219 -347 -173
3880 -173 -162 255 184 -69 15 -359 -188 -95 1 0 -70 62 -82 97 186 76 -4 245 241 354 36 156 -37 77
3904 77 85 -217 240 119 390 318 340 184 70 196 115 -177 118 106 -145 -110 -14 53 165 96 50 35 143 -195
3928 -195 11 -159 -346 -138 -176 21 -6 33 155 -26 258 33 -266 -129 -282 -359 -314 -213 -47 -171 -241 -92
3950 -92 53 3 -13 0 123 -68 -229 11 -103 36 -143 -27 106 -79 160 86 61 334 131 77 70 91 -285
3973b85L96mJ20j27q7L07p7%j29Q9l14K02K44k47p5j26J74k08K67J68j33Rn0n6
3997E8j00l8NJ29q4o4j0p1K46L55m24r4n6N4p6J19k86L44l40K32j69K66J88l98
4021b14J25P5l52J20k22N86k82q4K23l54L28j31K21j01ql2o4L06l34J64M7n6R
4044c0K61J00j18k6L4Q3j30o8K3M25o78J36O0k10k1J61J62j79K81m7N8j86l02
4067b11K12K99l98QL59j82r6J99j81oj32K45QJ58j17l07l82M23k5R8N5J60p1j67
4091e1k05J75j88j81O54k49p9J40l7j18j76L89j27J02J5j47J50k13r2j23L86l92
4113c67J16J88K80k18K74m37Q6J06K25l07J27K5k65J23J03k25L54j36Q1O7k6k08
4135c4O7J62J1m3k73K85j33L17l16J77k08K44l15k2J35l15J16K7j26K96n2j71
$$ plain form
3973 -285 111 107 227 100 13 320 243 243 114 203 -111 91 335 88 13 -113 61 -147 120 288 155 164 114 58
3997 58 -42 -80 -75 54 -30 -94 -104 -175 71 426 2 -92 -148 -94 -170 -51 -337 7 -333 -101 -270 -4 184 -214
4021 -214 -89 -14 -366 -246 -468 118 -164 -248 -25 -379 -51 -182 39 -62 -70 -102 -166 140 -194 -30 17 -39 -30
4044 -30 231 331 213 187 221 304 174 106 129 554 -124 12 72 -138 -159 2 164 -15 266 219 277 91 -211
4067 -211 1 300 -98 -90 269 87 -9 190 9 3 -129 116 124 282 165 -142 -524 -101 -126 -28 27 187 116 -51
4091 -51 -256 -81 -269 -450 204 -45 -124 16 -21 -139 -315 74 -53 49 64 -83 67 -146 -238 -361 25 -367
4113 -367 -251 -63 217 -1 273 -164 -78 28 253 -54 73 98 -167 -44 59 -166 188 52 133 200 174 -34
4135 -34 33 195 206 163 -110 175 42 359 43 220 12 256 -59 -81 54 -261 -145 -118 -244 52 0 -171
4157a71K70j16k78M35k48r1J9p8K88n1O2n0j87K88j18K92m50N3J6j91K45q3K48
4180A04l18J02J69k33K27Q8R8l01j5M4J23j09K16k6j55j02K75k63J01K21J19k48
4202A17K69k98J94j44p7q1K09N9K5k52p3M03j25p4j24P9PO5l17K08j63M8K7p2
4226i0Q3J76j22J34l01j06K65q1J61k72J07l6k01K09J8N6K8kk2j48l9j9K70m07
4250c39J89j16M48l84M8j75N25p0m15K63o3L6J00j0qN9n9r1M00k89j71K79l1q4
4274D2K52j32j80L00j42J18q0m24K91j62J97j43J67k9l3r6J52J04nk26k0L15j88
4297G8r7L2M0p6j37J82K72k57j35j0J20j48J61j91mJ59n1j32M8j87N6P8j30M15
4321H6j68k93K57K22l07o9J42n6K42j32K91l39Q8J03Q0oJ31k38J75m60L33p3j7
$$ plain form
4157 -171 99 -17 -295 140 -108 -199 -180 -258 30 -21 41 -9 -196 92 -26 266 -184 -131 -115 -306 -61 -144 104
4180 104 -214 -112 57 -176 51 139 237 -64 -79 -35 88 -21 195 169 14 -88 187 -76 25 246 365 117
4202 117 386 88 282 138 61 -20 189 248 273 21 -52 351 226 152 28 107 114 179 -138 70 -93 -45 -18 -90
4226 -90 -7 169 47 181 -120 -226 39 -42 119 -153 -46 -82 -283 -74 -56 0 28 26 4 -144 -183 -202 68 -339
4250 -339 -150 -266 182 -202 -154 -329 196 126 -289 -26 -89 -53 47 37 29 88 29 -62 338 49 -122 157 126 42
4274 42 294 162 -18 282 140 258 178 -246 45 -117 80 -63 104 75 42 -54 98 202 197 -29 -49 266 78
4297 78 -19 13 53 -23 -160 22 294 37 -98 -108 12 -136 25 -166 -170 -11 -62 -194 -146 -333 -277 -199 -329 86
4321 86 -82 -375 -118 104 -203 -272 -130 -186 56 -76 215 -124 -36 67 147 141 272 34 209 -251 82 9 -8
4344hj4R3j5J10J79m56K81L3J4L2j42j76K99j78L7L4O8M4j3j59k10K8K61j05J21
4369A58k36M99j85j04j83l6J47J1k17J53l8J16j01J4r7k5j54M7P7N4J23k14J79
4392a2j28j39O0j0N7J12mL8j7l09K71j53K13j23n1j83J49p8J38K12J87l8J6j66
4416D2p3J76o0j77J12j76k9L7M0K13L30m06J16O7o0j26J03L3P2k81Q5j89L11m8
4440A12K0j8roN7r5p4J4J5j23N7q6K61j24J31k07J97kj8k88J24J13k35j61R5J89
4466f1r9K97p5j63o5l2p2L16l96J60J11j03K29j62j29M66l20J28P9j3mP4k95L6
4490i3K6L3n4NK11n4O8o7j00L9ML8J42j80k24J21K5O3P2K8J52j94q3J18rj71L48
4517B64kl56J22k4p0L93l87m7J15n9J27k00O7m40M13n2N4K65n6j52J37j88J4N9
$$ plain form
4344 -8 -22 71 56 166 345 -111 170 203 217 249 107 -69 230 52 89 123 191 235 222 63 -147 -119 142 37 158
4369 158 -78 421 236 132 -51 -87 60 71 -146 7 -31 85 -16 -2 -99 -124 -278 -231 -154 -100 23 -191 -12
4392 -12 -140 -279 -219 -229 -172 -60 -64 -26 -43 -352 -81 -234 -21 -144 -195 -378 -229 -307 -169 43 230 192 208 42
4416 42 -31 145 85 -92 20 -156 -185 -148 -108 105 435 29 145 212 152 26 129 162 234 -47 38 -151 160 112
4440 112 132 114 105 99 156 61 -13 1 16 -107 -50 -136 125 1 132 -75 122 120 102 -186 -62 51 -184 -345 -250 -61
4466 -61 -160 137 62 -101 -166 -198 -270 46 -350 -190 -79 -182 47 -115 -244 222 -98 30 109 96 92 166 -129 -93
4490 -93 -67 -34 -88 -83 128 74 142 75 -25 14 18 56 198 18 -206 -85 -60 3 75 103 255 61 -22 96 87 -84 264
4517 264 262 -94 28 4 -66 327 -60 -107 8 -51 76 -124 -57 -497 -84 -136 -82 183 127 -25 112 -76 -62 -3
4541cQ8l09o0J18K01L8n20L20J14j20J4K04k20j1Qj52K28j79K72R6J03l09J62
4564H3O0j55J37K7nk76K62l07J67J43r8O0K40k66Q3J56j7m39J13l5K57p3k38J23
4588Bj86L73l3J37j82N0j37k3K0l15K98j91N8Q5J36j46J71p8j00M8k10J85O3k80
4612b55O5O1j21P2L3K31n5j46n8J77j08j98L30l20J19J19k83j54R8L91p9L19r9
4635A39k95J95m6K60j95j03j50K13k65K73J28O2K00m73q3M66j98jl35L64k23n7
4657a24L7j31K60J78k73J95q8J04P5n5j73KJ02o4J28m11J71k63L96J00J01j94
4679G3N2R8k93J93K2l58k12L86j8L5K07k29Oo3J07k52J82J8K5j12j6O5k20K34
4703g0J1L8Q4k60j02L36j18Jr4L96l76M5l3K44O1j28K01k46n0j97L14j9J19o8
$$ plain form
4541 -3 85 -224 -284 -166 35 73 -447 -127 -13 -133 -119 85 -135 -146 -138 -290 -62 -241 31 127 230 -79 83
4564 83 143 -12 125 152 147 -129 133 -174 -7 136 38 98 338 72 155 311 294 -145 -32 -67 190 117 -121 2
4588 2 -184 189 156 293 111 161 24 1 21 -294 4 -187 -129 -44 92 -54 117 39 -61 -13 -223 -38 25 -255
4612 -255 -190 -129 -250 -178 -145 86 31 -115 -173 4 -104 -302 28 -292 -173 -54 -337 -491 -393 -2 -81 238 139
4635 139 -156 39 -7 253 58 -45 -195 18 -247 26 154 216 416 -57 -140 326 128 127 -208 156 -67 -124
4657 -124 -87 -218 42 220 -53 142 54 158 233 178 5 7 109 45 173 -238 -67 -330 66 166 267 73
4679 73 125 223 -70 123 145 -213 -425 -39 -57 -22 185 -44 -38 -101 6 -246 -64 -46 -21 -133 -149 -84 -304 -70
4703 -70 -59 -21 63 -197 -299 37 -81 -80 -174 222 -154 -109 -142 102 163 35 236 -10 -60 -257 57 38 157 89
4727H9n6k6J28j13K46m5o0j5j37J08k12q5R0P4K18j10J17K5k48J77Lk08J25n7
4751B8K48m38J48l02O0K24Q8rj78k22K66J3l80M22k26J43j05Q2K3K16n6k07K6
4774a36J69j06J94m89L26Q7k60K40J9j21P1l5J80L2J14j80j62K34j27N8k06N8
4796d0q1J15K28j97k8J60P2%k11o9Pj23K17k8J63R5k37J17k9p3J37M4j50n6J28
4821A61r4k3n7N7J10k05j5L3K95k55J69m13K41m4j19p4k2L62k02j83L54p6Q3k45
4845a62K09%j57J82J11k27j7j91J20P97l55m10J18K40l46J87k54K29p1q6K89j28
4867G8q2L49j69lo2K0k39J18J48j25nL4l8R9L36m84K95J28l09j63M24j93k3N4
4891A88Jj17K0J85n6K96q18J83l0M84l61j35L50m8k39j1L66l17O0M9r6l7j05n5
$$ plain form
4727 89 33 7 135 22 268 223 163 148 11 119 -93 -178 -88 -14 204 94 211 236 -12 165 168 -40 85 28
4751 28 276 -162 -14 -316 -256 -32 56 47 -131 -353 -87 -74 -454 -32 -258 -115 -220 -138 -115 101 45 -162 -136
4774 -136 33 -73 121 -368 -42 45 -215 25 44 -77 -6 -41 139 171 285 105 -57 177 50 108 -98 -40
4796 -40 -121 -6 222 25 -3 157 229 229 18 -51 -44 -167 50 22 185 280 43 160 131 58 195 239 89 33 161
4821 161 67 44 -13 44 154 -51 -66 -33 262 7 176 -237 4 -40 -159 -233 -255 107 -95 -278 76 0 83 -162
4845 -162 47 47 -110 72 183 -44 -61 -252 -132 665 310 -100 18 258 -88 99 -155 74 3 -83 206 78
4867 78 -4 345 176 173 111 131 -108 10 158 33 28 62 24 123 459 -25 270 398 89 -74 350 157 134 188
4891 188 189 72 92 277 221 517 -301 -118 -148 336 -25 -160 190 142 -97 -108 258 -59 1 50 -46 -83 -188 -243
4915b43P2O3k09P7J87r3J70Q0m01K05K76j68k1m9J4k9P8q8P3k65L66P8k47j26
4939b00M62r4r5M7k02J19J7k7Q0M9l05J81kK89j91l3j81K90j30L3j78RK28k54
4963h8L37j26J05O1j09p4P3j93m4Q1N9N8j31K7J56j1k35N2j97K14m8j32n6K72
4987E1k51n5K14j85Q1j01K41L6k41P3L62k65j55K55j16j37J33M4J9k4M5r8MJ60
5011I0j36J37j92O4p4k14P8M33r1j58K69r0q3j36L65l69J81J08j42J80k52oK73
5034B35j52K67j71J5m3j71K35r0J07m66L54k28K34J89j48P6j85j20J67K03m73
5055a65J79l09L55k6ol14J51J09j60K02l4k6M2k83M6L58j98k72P7K60l81L67O4
5078C6j56k37L23J18j37r3o8L3J54J70j36Q1o8N2K44n62j0L15o7J03m39L03K28
$$ plain form
4915 -243 -171 -108 -317 -240 -53 -146 24 104 -297 -92 184 16 -5 -54 -40 -69 9 -79 -6 -271 95 173 -74 -200
4939 -200 262 168 73 120 -82 37 54 27 107 156 -149 32 30 319 128 95 -86 204 74 107 -71 -62 166 -88
4963 -88 249 123 228 289 180 106 179 -14 -58 23 82 140 9 36 192 181 -54 -2 -199 15 -33 -165 -221 51
4987 51 -200 -255 -41 -226 -145 -246 -5 31 -210 -137 225 -40 -195 60 -56 -193 -60 -16 3 -21 24 -74 -70 90
5011 90 -46 91 -101 -37 -111 -325 -247 186 95 -63 206 116 33 -103 262 -107 74 182 40 220 -32 -38 235
5034 235 83 350 179 194 151 -20 215 125 232 -234 120 -108 126 315 167 243 58 -62 105 308 -165
5055 -165 14 -295 60 34 28 -286 -135 -26 -186 16 -18 -44 -2 -285 -239 119 -79 -351 -274 -14 -395 -28 36
5078 36 -120 -357 -34 84 -53 -146 -214 -181 -27 143 7 88 20 72 316 -246 -256 59 -8 95 -344 -41 187
5101A87j20Rk38Q6L9o6K26N8j53P9j56K07k02J41M7N0l0j20J08j70k6J20j73j05
5125b02K42o8M2n9n6O0Q9q7J90Kk92k66L54nP9j20j44K8L32l86J27K13M7j54M4
5150A0l8N4q0K06k18j59K91j71mJ37rj9M3j02n8K13J0j17j3q4K91Pj95J51j34
5175A2N2O9j88J59J29k6n9j15R8K3k21J97J2ql07L06K9k75J79j2p4J94l99M38
5199B13O4l72J09j44K64k72M8K2r3K78Pj85k03K85q6K4k35M22m39L22j7N6r2k92
5223c16R2J64%J42k08k9K76p4L6k2k83J46K13K0j26j13J30P0k21p6L76l52L15
5246A60l53K75n2m4N0j6qJ17o8n9N5J66l41J05O9J09J18l2j96R4n5o4j25J8K00
5271A23k28r5PM1J20k37K08J60k6j03m3j0L4J57j31k06L84j90O9j51R5j07K3N7
$$ plain form
5101 187 67 76 -162 -76 -37 -103 123 181 28 107 -49 158 -44 97 144 194 164 44 152 -18 -44 76 -97 -202
5125 -202 40 -28 14 -45 -101 -41 48 -39 151 153 -139 -405 -51 -56 23 -97 -241 -213 119 -267 -140 73 120 -34 10
5150 10 -28 26 -54 152 -66 -225 66 -105 -109 28 19 0 43 -59 -117 96 106 -11 -24 -108 183 190 -5 146 12
5175 12 64 133 -55 104 233 207 148 33 131 154 -67 130 142 134 -173 133 162 -113 66 54 -20 174 -225 213
5199 213 277 -95 14 -130 134 -138 -90 -68 -161 117 124 -61 -264 21 -65 -41 -276 146 -293 29 12 68 -24 -316
5223 -316 -224 -60 -60 82 -126 -155 121 47 83 61 -222 -76 137 157 31 -82 48 118 -103 -179 197 -155 160
5246 160 -193 82 30 -14 36 20 12 129 61 2 57 223 -118 -13 56 165 283 251 55 149 94 30 -95 -77 123
5271 123 -105 -200 -193 -152 -32 -269 -61 99 73 -30 -73 -83 -49 108 -23 -229 155 -35 34 -117 -22 -129 -106 -49
5295d9K58j17j09J30r0NL4J0l8o6n2J36R2l24N2q9J53M3rN1j11J41j00J7j52L44
5321A60j2j8j44J3j18j93L79J37j97J93q2k2K45Pm99L21N7j65k09R4o6J04%L0
5345A5K00j64l0j36L31j68K9j01J9J3k11K79J8l16J51L9r7J63j37m4K23j31jp9
5369a35J85J99l22K38m88K43J74qk17J06j35J40q9L4r6k0K5J86M9R9j43j42J73
5392E6j20J74k97J67j0k6l2J75j30J41j56J23P4q9L1N8j25N5m8K71o6k19Q9j09
5416a3L0R6L2l72J15J40o6R0l9j91N04m21J95j01j7j36L0K08l15K85J18m39M2
5439b25N8J39k1j87K40K3j43J4L7J05p5j07K41J44k25k29K30kJ9J54j95K47k36
5462FJ24j44M5k01J17P0l8j3N0J68k82J55j77p8j29M01L4j56M6J09j97R6R2j7
$$ plain form
5295 -49 209 92 -17 113 23 28 62 72 34 -32 -84 52 144 -180 -128 -217 -64 -21 -30 21 -90 51 -49 -32 -184 160
5321 160 148 130 -14 -1 -119 -312 67 204 7 200 118 96 341 348 -151 170 227 62 -147 -53 -119 -15 -15 15
5345 15 215 51 21 -115 216 48 77 -24 -5 8 -203 76 94 -222 -71 -32 -129 34 -103 -147 76 -55 -56 -135
5369 -135 50 249 -73 165 -323 -80 94 86 -131 -25 -160 -20 -109 -75 -171 -191 -166 20 69 168 25 -117 56
5392 56 -64 110 -187 -20 -30 -56 -88 87 -43 98 -58 65 139 50 81 139 14 69 21 292 226 7 96 -13
5416 -13 17 113 145 -227 -112 28 -38 52 13 -178 326 -95 100 -1 -18 -154 -124 84 -231 54 172 -267 -225
5439 -225 -167 -28 -49 -236 4 27 -116 -102 -65 40 -35 -142 99 243 18 -211 19 17 36 190 -5 242 6
5462 6 130 -14 31 -170 -53 17 -21 -34 16 184 -98 57 -120 -198 -327 74 108 -48 -2 107 -90 6 98 81
5486H1j29J72l1j6K86l04Mj97N1J37j09L28m77M71j94j97o9J86k3J75O5l14N7
5509d7k3O4J66j33R3k70K73j51j34N5KO6oo1J90l69L70j08J18j15J16j05k13J65
5533e7j70N3R2O5J48J74n8j92j92J28Ok6j11K92k48K16j68j11J02K34l88K57K63
5556C09n85J61K83q4l3k00R3m4M13l21K34j01%j11rl0L1j70JL05k29J78j56K54
5580A89j96L38m56j81J97n6n5M8RJ86q5k1R8N0%pp8k1j24J19j87R3K0K56j27P0
5606G9j59K16j08J03N7%j23jj53K4k9J06O4j33j18L90m7K02n75L61N1r5L9m9k27
5631a25N2K28k82L44j30J1L0J7J18j38j7j71q5r3L55k99N11k12L9p9k03K01L1
5654A03j11r8K15m8m4j16K29j04p0R3k5o6Q7Q6j69K07k72R0L6j01j05J92k05L81
$$ plain form
5486 81 -48 124 93 77 363 59 63 -134 -83 54 -55 273 -204 267 73 -124 -193 -7 -30 145 210 -104 -47
5509 -47 -70 -6 160 27 120 -150 123 -28 -162 -107 -105 -39 -45 -106 84 -285 85 -23 95 -20 96 -9 -222 -57
5533 -57 -227 -174 -82 -17 131 305 247 55 -137 -9 -3 -29 -140 152 -96 120 -48 -159 -57 177 -211 46 309
5556 309 -276 -115 168 84 51 -149 -56 -100 313 -8 226 125 125 14 5 -25 6 -164 -163 142 -87 91 -65 189
5580 189 -7 331 -125 -306 -109 -165 -220 -172 -163 23 -62 -83 15 65 65 58 -20 -41 -165 -46 -233 -140 -120 136 9 79
5606 79 -80 136 28 131 188 188 65 64 -89 -65 -94 12 76 -57 -175 215 168 370 -205 156 207 112 151 102 -125
5631 -125 -73 155 -127 217 87 98 128 145 263 125 108 -63 -148 -241 114 -185 326 114 153 74 -129 72 103
5654 103 -8 -106 109 61 17 -99 130 26 -44 49 24 -42 45 131 -38 169 -103 -13 23 -78 -183 9 -196 185
5678A85j2k4k27k6M68n19n8K80k53j22N37k73K9J39M7L2n1k0p6m9k52J88j42J66
5702c3J86P9N6l89J24P3l05J87j91L7K52K0k18L9J0J02k6Q0j66L7J19j15K00J22
5726B80j80j87J64l2J29j68j48Q5J5Q5J28m20K76j6p5j11L01o7m2k20K26P5l68
5749b70L60j21pj91O6P7L6n4M5K94q1j10mm9q0J85L8k35M9r7N2J96L9J39k1j55
$$ plain form
5678 185 173 149 -78 -104 364 -155 -213 67 -186 -308 229 -44 -15 124 171 203 152 132 56 7 -245 -57 -199 -33
5702 -33 153 232 288 -101 23 96 -209 -22 -213 -176 76 96 -122 -83 -73 29 3 83 -83 -46 73 -42 158 280
5726 280 100 -87 77 45 174 6 -142 -57 -42 43 171 -249 27 11 -64 -175 126 59 17 -203 23 98 -270
5749 -270 90 -31 -38 -229 -163 -86 -50 -104 -59 235 154 44 40 -9 -89 96 134 -101 -52 -149 -97 99 138 277 256 101
$$ [...]
8191f3
##END NTUPLES=NMR FID
##END=
