##TITLE=1H_SL63-Dau-f4(500)
 CDCl3,48 sc, 
 5.02.2021
##JCAMPDX= 6.0         $$ Bruker NMR JCAMP-DX V2.0
##DATA TYPE= NMR FID
##DATA CLASS= NTUPLES
##ORIGIN= UXNMR, Bruker Analytische Messtechnik GmbH
##OWNER= root
$$ XWIN-NMR		Version 3.5
$$ Fri Feb  5 13:11:25 2021 Russian Standard Time (UT+4h)  she@DPX200
##.OBSERVE FREQUENCY= 200.1315066352
##.OBSERVE NUCLEUS= ^1H
##.DELAY= (6, 6)
##.ACQUISITION MODE= SIMULTANEOUS
##.ACQUISITION SCHEME= undefined
##.AVERAGES= 48
##.DIGITISER RES= 18
##SPECTROMETER/DATA SYSTEM= spect
##.PULSE SEQUENCE= zg30
##.SOLVENT NAME= CDCl3
##.SHIFT REFERENCE= (INTERNAL, CDCl3, 0, 15.7039)
##AUDIT TRAIL= $$ (NUMBER, WHEN, WHO, WHERE, WHAT)
$$ ##TITLE= Audit trail, XWIN-NMR		Version 3.5
$$ ##JCAMPDX= 5.01
$$ ##ORIGIN= Bruker BioSpin GmbH
$$ ##OWNER= she
$$ F:/spectra/data/she/nmr/H-F/1/audita.txt
$$ ##AUDIT TRAIL=  $$ (NUMBER, WHEN, WHO, WHERE, WHAT)
(   1,<2021-02-05 13:10:15.96 +0400>,<she>,<DPX200>,
      <continue with go, POWCHK disabled, PULCHK disabled
       configuration hash MD5:
       00 E9 B6 7A A2 85 ED C7 34 08 36 98 17 FE 4E 26
       data hash MD5: 16K
       6D 3C 39 6B 65 64 F0 0E 43 C2 7A 39 B3 BE 2D D0>)
$$ ##END=
$$ 
$$ hash MD5
$$ 7A 43 8C 81 19 08 5F 58 6F C7 A7 7F 8E EE 75 1C
##$RELAX= 
##$RELAX= 
##$RELAX= 
##$RELAX= 
##$RELAX= 
##$RELAX= 
$$ Bruker specific parameters
$$ --------------------------
##$DU= <F:/spectra>
##$EXPNO= 1
##$NAME= <H-F>
##$PROCNO= 1
##$TYPE= <nmr>
##$USER= <she>
##$AMP= (0..31)
100 100 100 100 100 100 100 100 100 100 100 100 100 100 100 100 100 100 
100 100 100 100 100 100 100 100 100 100 100 100 100 100 
##$AQSEQ= 0
##$AQ_mod= 1
##$AUNM= <au_zg>
##$AUTOPOS= <>
##$BF1= 200.13
##$BF2= 200.13
##$BF3= 200.13
##$BF4= 200.13
##$BF5= 200.13
##$BF6= 200.13
##$BF7= 200.13
##$BF8= 200.13
##$BYTORDA= 1
##$CFDGTYP= 0
##$CFRGTYP= 5
##$CHEMSTR= <none>
##$CNST= (0..31)
1 1 145 1 1 1 1 1 1 1 1 1 1 1 1 1 1 1 1 1 1 1 1 1 1 1 1 1 1 1 1 1 
##$CPDPRG= <>
##$CPDPRG1= <>
##$CPDPRG2= <>
##$CPDPRG3= <>
##$CPDPRG4= <mlev>
##$CPDPRG5= <mlev>
##$CPDPRG6= <mlev>
##$CPDPRG7= <mlev>
##$CPDPRG8= <mlev>
##$CPDPRGB= <>
##$CPDPRGT= <>
##$D= (0..31)
0 1.2 0 0 0 0 0 0 0 0.06 0 0.03 0 0 0 0 0.0002 0 0 0 0 0 0 0 0 0 0 0 0 
0 0 0 
##$DATE= 1612516045
##$DBL= (0..7)
120 120 120 120 120 120 120 120 
##$DBP= (0..7)
150 150 150 150 150 150 150 150 
##$DBP07= 0
##$DBPNAM0= <>
##$DBPNAM1= <>
##$DBPNAM2= <>
##$DBPNAM3= <>
##$DBPNAM4= <>
##$DBPNAM5= <>
##$DBPNAM6= <>
##$DBPNAM7= <>
##$DBPOAL= (0..7)
0.5 0.5 0.5 0.5 0.5 0.5 0.5 0.5 
##$DBPOFFS= (0..7)
0 0 0 0 0 0 0 0 
##$DE= 6
##$DECBNUC= <off>
##$DECIM= 32
##$DECNUC= <off>
##$DECSTAT= 4
##$DIGMOD= 1
##$DIGTYP= 9
##$DL= (0..7)
0 120 120 120 120 120 120 120 
##$DP= (0..7)
150 150 150 150 150 150 150 150 
##$DP07= 0
##$DPNAME0= <>
##$DPNAME1= <>
##$DPNAME2= <>
##$DPNAME3= <>
##$DPNAME4= <>
##$DPNAME5= <>
##$DPNAME6= <>
##$DPNAME7= <>
##$DPOAL= (0..7)
0.5 0.5 0.5 0.5 0.5 0.5 0.5 0.5 
##$DPOFFS= (0..7)
0 0 0 0 0 0 0 0 
##$DQDMODE= 0
##$DR= 18
##$DS= 0
$$ [...]
##$SUBNAM2= <"">
##$SUBNAM3= <"">
##$SUBNAM4= <"">
##$SUBNAM5= <"">
##$SUBNAM6= <"">
##$SUBNAM7= <"">
##$SUBNAM8= <"">
##$SUBNAM9= <"">
##$SW= 16.9725356469052
##$SWIBOX= (0..15)
0 0 2 0 0 0 0 0 0 0 0 0 0 0 0 0 
##$SW_h= 3396.73913043478
##$TD= 16384
##$TD0= 1
##$TE= 0
##$TE2= 300
##$TE3= 300
##$TEG= 300
##$TL= (0..7)
0 120 120 120 120 120 120 120 
##$TP= (0..7)
150 150 150 150 150 150 150 150 
##$TP07= 0
##$TPNAME0= <>
##$TPNAME1= <>
##$TPNAME2= <>
##$TPNAME3= <>
##$TPNAME4= <>
##$TPNAME5= <>
##$TPNAME6= <>
##$TPNAME7= <>
##$TPOAL= (0..7)
0.5 0.5 0.5 0.5 0.5 0.5 0.5 0.5 
##$TPOFFS= (0..7)
0 0 0 0 0 0 0 0 
##$TUNHIN= 0
##$TUNHOUT= 0
##$TUNXOUT= 0
##$USERA1= <user>
##$USERA2= <user>
##$USERA3= <user>
##$USERA4= <user>
##$USERA5= <user>
##$V9= 5
##$VALIST= <valist>
##$VCLIST= <CCCCCCCCCCCCCCC>
##$VD= 0
##$VDLIST= <DDDDDDDDDDDDDDD>
##$VPLIST= <PPPPPPPPPPPPPPP>
##$VTLIST= <TTTTTTTTTTTTTTT>
##$WBST= 1024
##$WBSW= 4
##$XGAIN= (0..3)
0 0 0 0 
##$XL= 0
##$YL= 0
##$YMAX_a= 303665
##$YMIN_a= -250657
##$ZGOPTNS= <>
##$ZL1= 120
##$ZL2= 120
##$ZL3= 120
##$ZL4= 120
##$ABSF1= 10
##$ABSF2= 0
##$ABSG= 5
##$ABSL= 3
##$ALPHA= 0
##$AQORDER= 0
##$ASSFAC= 0
##$ASSFACI= 0
##$ASSFACX= 0
##$ASSWID= 0
##$AUNMP= <proc_1d>
##$AZFE= 0.1
##$AZFW= 0.1
##$BCFW= 1
##$BC_mod= 2
##$BYTORDP= 1
##$COROFFS= 0
##$CY= 11.3945322036743
##$DATMOD= 1
##$DC= 2
##$DFILT= <>
##$DTYPP= 0
##$F1P= 15.9154993809931
##$F2P= -4.1035820241983
##$FCOR= 0.5
##$FTSIZE= 0
##$FT_mod= 4
##$GAMMA= 1
##$GB= 0.15
##$INTBC= 1
##$INTSCL= 1
##$ISEN= 128
##$LB= 0.24
##$LEV0= 0
##$LPBIN= 0
##$MAXI= 10000
##$MC2= 0
##$MEAN= 0
##$ME_mod= 0
##$MI= 1.114404
##$NCOEF= 0
##$NC_proc= 0
##$NLEV= 6
##$NOISF1= 3.799351
##$NOISF2= 2.8
##$NSP= 1
##$NTH_PI= 0
##$NZP= 0
##$OFFSET= 15.70392
##$PC= 1
##$PHC0= -10765.95
##$PHC1= 19.60094
##$PH_mod= 1
##$PKNL= yes
##$PPARMOD= 0
##$PSCAL= 0
##$PSIGN= 0
##$REVERSE= no
##$SF= 200.130013532006
##$SI= 16384
##$SIGF1= 3
##$SIGF2= 2
##$SINO= 400
##$SIOLD= 16384
##$SREGLST= <1H.CDCl3>
##$SSB= 0
##$STSI= 0
##$STSR= 0
##$SW_p= 3612.71676300578
##$SYMM= 0
##$S_DEV= 0
##$TDeff= 0
##$TDoff= 0
##$TI= <>
##$TILT= no
##$TM1= 0
##$TM2= 0
##$TOPLEV= 0
##$USERP1= <user>
##$USERP2= <user>
##$USERP3= <user>
##$USERP4= <user>
##$USERP5= <user>
##$WDW= 1
##$XDIM= 8192
##$YMAX_p= 0
##$YMIN_p= 0
$$ End of Bruker specific parameters
$$ ---------------------------------
##NTUPLES= NMR FID
##VAR_NAME=  TIME,          FID/REAL,        FID/IMAG
##SYMBOL=    X,             R,               I
##VAR_TYPE=  INDEPENDENT,   DEPENDENT,       DEPENDENT
##VAR_FORM=  AFFN,          ASDF,            ASDF
##VAR_DIM=   8192,          8192,            8192
##UNITS=     SECONDS,       ARBITRARY UNITS, ARBITRARY UNITS
##FACTOR=    0.0002944,     1,               1
##FIRST=     0,             0,               0
##LAST=      2.4114304,     0,               0
##MIN=       0,             -250657,         0
##MAX=       2.4114304,     303665,          0
$$ Real data points
##PAGE= N=1
##DATA TABLE= (X++(R..R)), XYDATA
$$ plain form
0 0 0 0 0 0 0 0 0 0 0 0 0 0 0 0 0 0 -4 48 -48 48 -48 48 -58 96 -96 96 -143 144 -189 192 -239 249 -287 335 -382
35 -382 425 -475 526 -585 655 -725 805 -894 991 -1092 1205 -1332 1470 -1618 1775 -1964
51 -1964 2159 -2378 2629 -2905 3220 -3575 3995 -4477 5052 -5751 6614 -7713 9163 -11177
65 -11177 14156 -18984 28144 -51289 228787 303665 -250657 97011 75115 -122153 114759
76 114759 82593 -58286 65900 6263 23419 57033 -29319 16410 42890 -20831 53676 11251
88 11251 -14800 96799 17939 -59952 34569 8292 12711 79792 33834 -46088 -47812 56602
100 56602 67711 -46139 -10172 5957 -28697 37907 1628 -45733 -14936 -22486 31346 -13722
112 -13722 -93352 29764 15778 -60256 34578 -25898 -75345 53312 418 -62262 27175 -13041
$$ packed form
0@%%%%%%%%%%%%%%%%mN2r6R6r6R6j06J54j92J92k39K87l33L81m31M88n36O22p17
35c82Q07r00J001j111J240j380J530j699J885k083K297k537K802l088L393l739
51a964M123m537N007n534O125o795P570q472R529j0803J2365j4327J6876k0340
65a1177K5333l3140M7128p9433K80076P4878n54322L47668k1896j97268K36912
76A14759l2166j40879J24186n9637J7156L3614q6352M5729K6480o3721P4507m2425
88A1251k6051J11599p8860p7891R4521k6277M419O7081m5958p9922j724J04414
100E6602J1109j13850L5967J6129l4654O6604l6279m7361L0797p550N3832m5068
112a3722p9630J23116j3986p6034R4834o0476m9447J28657n2894o2680Q9437m0216
$$ plain form
124 -13041 -25918 52955 -13207 -47375 2238 -15288 31602 20211 -68878 27069 40602 -51992
136 -51992 14784 -15381 -58127 59669 32335 -27600 -1728 -32155 7189 33082 -16203 9818
148 9818 3981 10423 54039 -10839 -21049 37304 9055 15641 40859 9571 15053 27102 19050
161 19050 7308 -13617 19360 47315 15333 10082 -5929 -25309 27030 29452 -17065 -10783 -12833
174 -12833 9674 27756 -29635 -17694 -3027 -34893 30752 8598 -70667 14939 15760 -49066
186 -49066 5270 -14199 -29006 13870 -28263 -21498 -7504 -38613 13310 -3971 -55170 -6731
198 -6731 -29756 -32830 35613 -21822 -62962 1626 -530 -20161 -6754 -24109 -22618 4176 12787
211 12787 2626 -22310 -13434 19180 -3303 -9577 21652 10812 9073 23168 -4332 -9636 15014
$$ packed form
124a3041j2877P8873o6162l4168M9613j7526M6890j1391q9089R5947J3533r2594
136e1992O6776l0165m2746J17796k7334n9935K5872l0427L9344K5893m9285K6021
148I818n837O442M3616o4878j0210N8353k8249O586K5218l1288N482J2049q052
161A9050j1742k0925L2977K7955l1982n251j6011j9380N2339K422m6517O282k050
174a2833K2507J8082n7391J1941J4667l1866O5645k2154p9265Q5606Q21o4826
186d9066N4336j9469j4807M2876m2133O765J3994l1109N1923j7281n1199M8439
198f731k3025l074O8443n7435m1140O4588k156j9631J3407j7355J491K6794Q611
211A2787j0161k4936Q876L2614k2483o274L1229j0840j739J4095k7500n304K4650
$$ plain form
224 15014 30499 24358 -647 12979 17456 1195 34707 15409 -24147 24194 29597 7931 27093
237 27093 -5253 -9998 17982 10740 22996 -1464 -15175 46074 9453 -39490 19959 12778 -13922
250 -13922 24785 -2006 -25981 12611 3586 -9179 -1485 -18455 -12960 3213 -3219 -3494 -28568
263 -28568 -25477 19710 -15117 -36774 8341 -18121 -30867 14284 -11138 -36986 -10017 1409
275 1409 -4067 -21460 -21466 -1516 -1991 3251 -5036 -24814 -5588 8225 -1494 -3731 -4406 5510 6832
290 6832 -815 3675 -5857 -2070 24860 10397 -5551 14467 8051 619 21497 10542 -9011
303 -9011 11516 28318 21835 1091 -6305 15244 11418 6185 29075 687 -8780 35322 6128
316 6128 -14308 20128 1729 3399 23789 -8488 -4222 13396 1104 6272 -9638 -13460 16467
$$ packed form
224A5014J5485o141k5005J3626M477j6261L3512j9298l9556M8341N403k1666J9162
237B7093l2346m745K7980p242J2256k4460j3711O1249l6621m8943N9449p181k6700
250a3922L8707k6791k3975L8592r025j2765P694j6970N495J6173o432k75k5074
263b8568L091M5187l4827k1657M5115k6462j2746M5151k5422k5848K6969J1426
275A409n476j7393oJ9950m75N242q287j9778J9226J3813r719k237o75R916J322
290F832p647M490r532L787K6930j4463j5948K0018o416p432K0878j0955j9553
303i011K0527J6802o483k0744p396K1549l826n233K2890k8388r467M4102k9194
316F128k0436L4436j8399J670K0390l2277M266J7618j2292N168j5910l822K9927
$$ plain form
329 16467 1042 -8170 7853 -19705 -22860 15544 3151 -20981 -9677 -8976 -11718 554 -6660
342 -6660 -18643 -14517 -2716 -2984 -15091 -11775 2060 -6197 -9947 -5705 -13413 -5681 10369 1991
356 1991 -16449 -10591 13147 5084 -4559 6246 -9818 -7471 23834 8818 -4088 5303 -6166
369 -6166 6214 14040 1372 7037 2935 5369 23480 -2146 -4802 27358 6748 -2088 21923
382 21923 4441 3470 29639 10029 -8043 10735 12247 16594 17802 606 763 6123 7223 16571
396 16571 -1368 -10033 13032 3921 -5382 8547 -6142 -12772 4585 3827 -9102 -8114 -1328 -1803
410 -1803 -8638 -6405 -8302 -9958 1992 174 -17087 -15628 -1886 2855 -10760 -15470 -6017 -9829
424 -9829 -6945 256 -16095 -19521 1977 -5575 -14106 -3529 -14542 -17318 8648 -1810 -16006
$$ packed form
329A6467j5425r212J6023k7558l155L8404j2393k4132J1304P01k742J2272p214
342f660j1983M126J1801k68j2107L316J3835q257l750M242p708P732J6050q378
356A991j8440N858K3738q063r643J0805j6064K347L1305j5016j2906R391j1469
369f166J2380P826j2668N665m102K434J8111k5626k656L2160k0610q836K4011
382B1923j7482r71K6169j9610j8072J8778J512M347J208j7196J57N360J100R348
396A6571j7939q665K3065r111r303J3929j4689o630J7357p58j2929R88O786m75
410a803o835K233j897j656J1950j818j7261J459J3742M741j3615m710R453l812
424i829K884P201j6351l426K1498p552q531J0577j1013k776K5966j0458j4196
$$ plain form
437 -16006 -6884 -5448 3622 222 -9622 8603 -3700 -6315 24070 -1566 -14349 21767 8603
450 8603 -72 14063 1690 10419 18072 3532 3259 5347 11584 19671 3030 -957 8440 2283
464 2283 8042 17108 -2853 -9740 8254 11226 454 2362 -1377 -6481 3270 10350 -3617 -9236
478 -9236 2898 2464 -9033 -5115 -1816 -4082 -2492 -5888 -11827 -13482 -5400 3056 -14169 -21055 -5483
493 -5483 -12006 -9458 3650 -19301 -23546 100 -4282 -10159 -6284 -12013 -6924 -1217 -4096 -1369
507 -1369 -7999 -3926 11006 -2885 -8753 12047 2134 -770 15495 -4315 -5419 17907 8319 2314
521 2314 5908 817 9084 11870 6931 8259 -3723 6515 22640 558 -273 11523 4093 10820
535 10820 10910 4230 5145 8147 14142 7164 -4061 9006 6571 2122 12182 -1405 -7201 9106
$$ packed form
437a6006R122J436R070l400r844J8225j2303k615L0385k5636j2783L6116j3164
450H603q675J4135j2373Q729P653j4540k73K088O237Q087j6641l987R397o157
464B283N759R066j9961o887J7994K972j0772J908l739n104R751P080j3967n619
478i236J2134m34j1497L918L299k266J590l396n939j655Q082Q456j7225o886J5572
493e483o523K548J3108k2951m245K3646m382n877L875n729N089N707k879K727
507a369o630M073J4932j3891n868K0800r913k904J6265j9810j104K3326r588o005
521B314L594n091Q267K786m939J328j1982J0238J6125k2082q31J1796p430O727
535A0820R0o680R15L002N995o978j1225J3067k435m449J0060j3587n796J6307
$$ plain form
549 9106 5517 -223 -4138 -6642 5100 -1499 -6257 2299 -11589 -7668 9750 -10726 -14900 314
563 314 -6867 -3789 -1626 -14869 -7393 1051 -3626 -2682 -9347 -7570 3397 -6109 -2880 4035 -14952
578 -14952 -5045 12372 -7022 -9448 3219 -2270 -1984 40 -4090 -3497 880 5971 47 -8957 1455
593 1455 10928 1693 -1407 4382 -225 3780 12818 4682 -429 4657 8461 6604 8477 7010 -86
608 -86 4823 15661 4957 -2325 9257 7301 1401 6037 577 3316 7419 2888 5685 -7158 -4098
623 -4098 13521 -1159 -5198 5886 -10162 -217 11168 -8814 -5946 2265 -6204 14 -608 -6383
637 -6383 -2758 -7088 -260 721 -14682 -4652 6462 -9969 -9098 -3909 -8534 -4858 -18 -7715 -9925
652 -9925 -5802 -755 -968 -7407 -5515 -5371 -4268 2831 130 -7116 -1524 2474 1894 163 -485 2388
$$ packed form
549I106l589n740l915k504J1742o599m758Q556j3888L921J7418k0476m174J5214
563C14p181L078K163j3243P476Q444m677R44o665J777J0967r506L229O915j8987
578a4952R907J7417j9394k426J2667n489K86K024m130N93M377N091n924r004J0412
593A455R473r235l100N789m607M005R038q136n111N086L804j857J873j467p096
608h6M909J0838j0704p282J1582j956n900M636n460K739M103m531K797j2843L060
623d098J7619j4680m039J1084j6048R945J1385j9982K868Q211q469O218o22n775
637f383L625m330O828R81j5403J0030J1114j6431Q71N189m625L676M840p697k210
652i925M123N047k13o439J892J44J103P099k701p246N592L998n80j731o48K873
$$ plain form
668 2388 1925 4613 6897 -5539 2593 14313 571 1095 6957 -1570 6598 11672 3391 1448 2822
683 2822 6921 10508 1328 3035 9502 1091 5544 11453 -3977 592 13003 -360 -1168 5683 -1404
698 -1404 2720 5402 -1151 -2768 -2477 3649 3799 -6216 -4164 855 -6799 -157 1036 -11588 -5941
713 -5941 917 -4641 -5972 -4963 -5374 -6225 -3792 -2736 -10775 -6418 603 -4585 -8125 -5523 -5228 -2282
729 -2282 -2131 -3606 -4843 -6949 -103 4111 -5773 -4490 2638 -2918 1554 4290 -4822 22 7066
744 7066 165 320 2663 2818 6238 3794 2908 3265 -1450 8419 11759 -3919 964 8812 2340 7047
760 7047 7660 -1829 2595 7610 5089 3638 2004 3199 3219 2318 3489 461 -987 5528 3273 -4178
776 -4178 -760 2790 -998 -646 -184 -5397 -4547 3135 1561 -7794 -6997 -1343 -3976 -3131 -1483 -7220
$$ packed form
668B388m63K688K284j2436Q132J1720j3742N24N862q527Q168N074q281j943J374
683B822M099L587r180J707O467q411M453N909j5430M569J2411j3363q08O851p087
698a404M124K682o553j617K91O126J50j0015K052N019p654O642J193j2624N647
713e941O858n558j331J009m11q51K433J056q039M357P021n188l540K602K95K946
729b282J51j475j237k106O846M214r884J283P128n556M472K736r112M844P044
744G066o901J55K343J55L420k444q86L57m715R869L340j5678M883P848o472M707
760G047O13r489M424N015k521j451j634J195K0r01J171l028j448O515k255p451
776d178L418L550l788L52M62n213Q50P682j574r355P97N654k633Q45J648n737
$$ plain form
792 -7220 -6697 -921 -2283 -3894 -6669 -4059 223 -5922 -3023 -1352 -6230 740 1900 -8123 -2150
807 -2150 2777 -2233 1074 1502 -5111 -1150 4109 3061 -1000 -3112 2755 4513 643 2760 3216 -2003
823 -2003 6148 8136 -259 641 5714 3887 3690 4292 1630 3812 6408 6782 3075 673 5209 6049
839 6049 3689 4327 2820 -415 5349 5521 325 -1526 4148 3456 -2098 1075 603 -2515 2854 1684
855 1684 -5275 -4244 -142 1148 -1383 -4076 -2634 -2787 -1611 1473 -3439 -7644 -992 -503 -4672 -2433
871 -2433 -2766 -6777 -2753 606 -5222 -5156 -875 -1912 -4387 -3873 -3593 -2987 -1813 171 -3358 -6434 761
888 761 3336 -3585 -1457 543 -2162 2534 4723 -1254 -2342 3614 3478 1336 2754 1902 1771 3021
904 3021 4660 2716 788 4346 5290 1586 1265 3326 2917 4262 5097 236 -2528 4261 5831 551
$$ packed form
792g220N23N776j362j611k775K610M282o145K899J671m878O970J160j0023N973
807b150M927n010L307M28o613L961N259j048m061k112N867J758l870K117M56n219
823b003Q151J988q395R00N073j827j97O02k662K182K596L74l707k402M536Q40
839F049k360O38j507l235N764J72n196j851N674o92n554L173m72l118N369j170
855A684o959J031M102J290k531k693J442j53J176L084m912m205O652M89m169K239
871b433l33m011M024L359n828O6M281j037k475N14K80O06J174J984l529l076P195
888G61K575o921K128K000k705M696K189n977j088N956j36k142J418q52j31J250
904C021J639j944j928L558R44l704l21K061m09J345Q35m861k764O789J570n280
$$ plain form
920 551 1372 2509 69 2452 3421 -826 -1929 -647 2454 721 -2828 -1581 -65 -3664 -644 -2367
936 -2367 -7315 -247 217 -6257 -4228 -3915 -5438 -2621 -2543 -5263 -6318 -2354 -851 -5327 -6135 -4082
952 -4082 -3942 -3437 -1510 -1537 -5002 -1216 2608 -2408 -4285 1166 -979 332 2787 -521 -2394 2551
968 2551 4005 2254 -395 623 2979 2016 2649 2970 495 1710 6579 971 1687 5005 3647 2015
984 2015 3826 3925 1093 3686 7660 3216 -454 4313 3900 2963 2751 842 -463 1912 4006 1569
1000 1569 -2622 -75 1912 -1642 -60 1013 -5040 -1208 1908 -4111 -3728 -1689 -2380 -2084 -1446 -3586
1016 -3586 -4492 -3336 1279 -2625 -6712 -2138 294 -2442 -2193 -2540 -4606 -1894 1600 -3004 -4445 -722
1032 -722 -1364 -2082 -347 -1289 -2499 -1023 1480 293 -2212 -614 2484 1150 541 1203 -1132 1133
$$ packed form
920E51Q21J137k440K383R69m247j103J282L101j733l549J247J516l599L020j723
936b367m948P068M64o474K029L13j523K817P8k720j055L964J503m476q08K053
952d082J40N05J927k7l465L786L824n016j877N451k145J311K455l308j873M945
968B551J454j751k649J018K356r63O33L21k475J215M869n608P16L318j358j632
984B015J811R9k832K593L974m444l670M767m13r37k12j909j305K375K094k437
1000A569m191K547J987l554J582J073o053L832L116o019L83K039o91K96O38k140
1016c586r06J156M615l904m087M574K432k736K49l47k066K712L494m604j441L723
1032g22o42p18J735r42j210J476K503j187k505J598L098j334o09O62k335K265
$$ plain form
1048 1133 5129 2584 -625 2006 4418 2332 2542 3028 1491 3172 4929 2545 463 2879 3922
1063 3922 1504 1755 2492 1676 605 3479 2807 -2417 -467 3452 278 -392 709 -1804 -400 2889
1079 2889 -1829 -2062 -1620 -84 389 -3597 -1029 -1474 -3909 -227 -834 -5339 -1851 162 -3978 -2346
1095 -2346 -3069 -3152 -2308 -1916 -1165 -4768 -4204 1223 -2046 -3494 -1053 -2689 -814 -15 -592 -2377 -2613
1112 -2613 1032 -33 -2231 1276 917 -359 2611 1981 -1129 934 3176 1357 1243 1594 1228 2116
1128 2116 3117 2948 1259 556 4195 2393 877 1563 2847 1277 3436 2765 -86 1443 3671 696
1144 696 1385 1888 1134 330 254 1858 -2414 -1840 2083 1654 -3032 -653 -435 -2539 865 616 -3016 -2188
1162 -2188 -405 -1146 -2872 -2265 -1228 -1990 -2053 -2232 -3602 -2712 -604 -1615 -3688 -2018 -1473 -1886 -2239
$$ packed form
1048A133L996k545l209K631K412k086K10M86j537J681J757k384k082K416J043
1063C922k418K51P37q16j071K874o72n224J950L919l174o70J101k513J404L289
1079B889m718k33M42J536M73l986K568m45k435L682o07m505L488K013m140J632
1095b346p23q3Q44L92P51l603N64N427l269j448K441j636J875P99n77j785k36
1112b613L645j065k198L507l59j276K970o30l110K063K242j819j14L51l66Q88
1128B116J001j69j689p03L639j802j516O86J284j570K159o71k851J529K228k975
1144F96O89N03p54q04p6J604m272N74L923m29m686K379K18k104L404k49l632Q28
1162b188J783p41j726O07J037p62o3j79j370Q90K108j011k073J670N45m13l53
$$ plain form
1179 -2239 -998 -3168 -2846 1094 2085 -3693 -718 -656 -2236 1322 460 -1274 1073 410 543 -38 -324
1196 -324 2029 212 98 1934 543 469 4237 2400 98 2186 3831 3099 3543 2485 -91 1881
1212 1881 2547 3187 1830 2424 3257 1130 179 1779 255 -260 1890 1152 -1170 -166 1392 415 -909
1229 -909 640 -1251 -2353 305 -294 -2250 -1930 -1153 -1270 -1292 -1212 -2627 -2971 -1646 -712 -2791 -3161 -441
1247 -441 -3191 -2708 -1337 -1846 -2719 351 353 -2909 -2052 250 -309 -206 -239 -20 -1479 727 1568 -633
1265 -633 -1116 978 675 -82 542 1236 -352 2119 3239 -158 582 1983 2382 1124 1883 1662 655
1282 655 2624 2483 825 875 2514 2684 2108 2365 438 143 1170 3063 -445 -380 2197 373 -335 621
1300 621 575 -1098 -49 -247 -1606 -1109 -29 -134 -1326 -1751 -1454 -839 -1607 95 -1731 -2874 -904
$$ packed form
1179b239J241k170L22L940R91n778K975O2j580L558q62j734K347o63J33n81k86
1196c24K353j817j14J836j391p4L768j837k302K088J645p32M44j058k576J972
1212A881O66O40j357N94Q33k127r51J600j524n15K150p38k322J004J558r77j324
1229i09J549j891j102K658n99j956L20P77j17k2Q0j415l44J325R34k079l70K720
1247d41k750M83J371n09q73L070Kl262Q57K302n59J03l3K19j459K206Q41k201
1265f33m83K094l03p57O24O94j588K471J120l397P40J401L99j258P59k21j007
1282F55J969j41j658N0J639J70n76K57j927k95J027J893l508O5K577j824p08R56
1300F21m6j673J049j98j359M97J080j05j192m25K97O15p68J702j826j143J970
$$ plain form
1317 -904 -125 -2075 -1412 -1518 -2366 -1041 -741 -1295 -2431 -1103 291 -1665 -1412 -928 -1745 -1176 -40 -1591
1335 -1591 -1218 39 726 41 -369 -104 -1012 1344 1789 234 -725 2385 2139 2043 2413 1261 2228 362
1353 362 3244 2182 318 2782 2902 1371 1676 2004 1523 1000 2451 1158 15 1805 1043 778 896
1370 896 842 603 1054 2190 1755 -523 1028 375 -198 -1801 575 -1372 -1177 -855 -470 -2066 -631 472
1388 472 -1848 -1460 -1268 -1694 -1322 -1142 -2323 -3282 -994 -741 -873 -1584 -1006 -1677 -1791 -83 -952 -2230
1406 -2230 -1343 386 -929 -1499 -22 -559 -689 502 92 -553 354 1573 331 -762 913 1257 1123
1423 1123 1737 1091 87 1931 1747 1329 1147 1275 2306 1426 2216 2185 1148 1002 3435 1002 6 1577
1441 1577 1222 -29 1569 663 94 873 2309 984 -1447 433 758 36 957 -318 -1432 -343 829
$$ packed form
1317i04P79j950O63j06q48J325L00n54j136J328J394j956K53M84q17N69J136j551
1335a591L73J257O87o85m10K65r08K356M45j555r59L110k46r6L70j152R67j866
1353C62K882j062j864K464J20j531L05L28m81n23J451j293j143J790p62k65J18
1370H96n4k39M51J136m35k278J551o53n73j603K376j947J95L22L85j596J435J103
1388D72k320L88J92m26L72J80j181r59K288K53j32p11N78o71j14J708q69j278
1406b230Q87J729j315n70J477n37j30J191m10o45R07J219j242j093J675L44j34
1423A123O14o46j004J844j84m18j82J28J031q80P90l1j037j46K433k433r96J571
1441A577l55j251J598r06n69P79J436j325k431J880L25p22R21j275j114J089J172
$$ plain form
1458 829 -564 -1898 -859 -537 -1280 -1623 -247 -2309 -2272 -802 -2396 -1700 -1355 -1431 -946 -736 -1245 -2029
1476 -2029 -1988 -369 -764 -2797 -1243 -367 -1223 -566 -884 -1173 -587 607 -515 -1275 -425 885 -208 -74
1494 -74 898 -150 1018 2042 1177 -226 570 1825 1111 1108 1949 978 983 2618 2468 770 980 1564 1528 765
1514 765 923 1060 790 1788 1290 -831 552 1468 297 27 547 -507 189 519 29 -911 -2623 206
1532 206 -385 -709 21 -1691 -1230 223 -512 -2648 -1471 -697 -752 -2234 -988 -420 -2495 -620 300 -2217
1550 -2217 -1499 21 -1022 -1010 -837 -1262 -1416 -242 -76 -770 -2029 269 28 -734 582 311 -763 864
1568 864 480 184 1042 1318 1065 25 672 1888 105 986 1427 197 434 2445 1502 302 1592 1435
1586 1435 1626 836 1250 2 359 477 2003 -76 692 -143 889 888 1064 -758 -86 1108 -535 151
$$ packed form
1458H29j393j334J039L22p43l43J376k062L7J470j594O96L45p6M85K10n09p84
1476b029M1J619l95k033J554Q76q56O57l18k89N86J194j122p60Q50J310j093J34
1494g4R72j048J168J024q65j403P96J255p14lQ41r71NJ635j50j698K10N84l6p63
1514G65J58J37k70R98m98k121J383R16j171k70N20j054O96L30m90r40j712K829
1532B06n91l24P30j712M61J453p35k136J177P74n5j482J246N68k075J875R20k517
1550b217P18J520j043J2J73m25j54J174J66o94j259K298k41p62J316k71j074J627
1568H64l84k96Q58K76k53j040O47J216j783Q81M41j230K37K011r43j200J290j57
1586A435J91p90M14j248L57J18J526k079P68q35J032jJ76j822O72J194j643O86
$$ plain form
1604 151 719 -278 -1082 54 247 -526 -991 -608 -1049 -1094 -1154 -1121 -1393 -501 -886 -1858 -1936 -196 -566 -1751
1624 -1751 -1032 -684 -1221 -1065 -425 -1180 -1863 -101 312 -259 -380 167 -435 35 431 -90 128 318 1305
1643 1305 -378 113 1003 595 601 1272 -237 10 1511 595 729 609 2128 1844 897 1518 1289 150 1170
1662 1170 2168 -1091 879 1539 281 530 962 333 1342 608 608 -877 -752 309 436 467 316 -499 -528
1681 -528 -245 38 -1517 -2059 35 -431 -1094 -1188 -427 -1808 327 -392 -1281 -1937 -252 -2124 -985 -256
1699 -256 -416 -1507 -392 -764 -1204 -1218 242 -112 -767 73 287 -710 -34 752 -519 235 928 591 155
1718 155 182 822 -233 735 959 904 743 1875 1090 790 1205 1111 648 981 471 1196 610 761 1571 886
1738 886 -231 -162 328 381 1217 531 387 1494 510 226 -98 -255 -139 -245 827 -875 -594 371 -499
$$ packed form
1604A51N68r97q04J136J93p73m65L83m41m5o0L3k72Q92l85r72p8J740l70j185
1624a751P19L48n37J56O40p55o83J762M13n71j21N47o02M70L96n21K18J90R87
1643A305j683M91Q90m08OO71j509K47J501r16J34j20J519k84r47O21k29j139J020
1662A170R98l259J970O60j258K49M32o29J009p34%j485J25J061J27L1j51q15k9
1681e28K83K83j555n42K094m66o63r4P61j381K135p19q89o56J685j872J139P29
1699b56j60j091J115l72m40j4J460l54o55Q40K14r97O76P86j271P54O93l37m36
1718A55K7O40j055R68K24n5j61J132p85l00M15r4m63L33n10P25n86J51Q10o85
1738H86j117O9M90N3Q36o86j44J107r84k84l24j57J16j06J072j702K81R65q70
$$ plain form
1757 -499 -1052 -667 -1231 -1487 -978 -405 -495 -1039 -648 323 -1399 -1159 6 -798 -706 -870 -562 -2498 128
1776 128 -1033 -547 -340 -249 -550 -83 625 -61 -1284 61 -440 318 -344 -541 190 7 1196 -199 519
1795 519 -175 1378 -151 615 752 -46 -216 828 -678 1300 398 135 398 509 1532 -96 1219
1812 1219 936 851 168 664 1934 -718 -739 546 -836 620 1208 -464 -418 965 667 204 -52 573
1830 573 -208 -650 129 -97 -980 -1184 392 -1140 -1178 -500 -626 -1128 -265 -1897 -836 -651 -1217 -1430 -710
1849 -710 -476 -353 -971 -123 345 -633 -786 -554 -82 -1238 -542 164 385 -216 515 -446 477 1080 293 758
1869 758 -63 798 78 1200 42 1234 428 1385 797 1019 1532 846 549 1061 1123 527 919 2101 -34
1888 -34 97 1417 1165 387 133 1163 -29 105 1121 785 -190 1045 344 436 823 881 -763 545 621
$$ packed form
1757d99n53L85n64k56N09N73r0n44L91R71j722K40J165q04R2j64L08j936K626
1776A28j161M86K07R1l01M67P08o86j223J345n01P58o62j97P31j83J189j395P18
1795E19o94J553j529P66J37p98j70J044j506J978r02k63K63J11J023j628J315
1812A219k83q5o83M96J270k652k1J285j382J456N88j672M6J383k98m63k56O25
1830E73p81m42P79k26q83k04J576j532l8O78j26n02Q63j632J061J85n66k13P20
1849g10K34J23o18Q48M68r78j53K32M72j156O96P06K21o01P31r61R23O03p87M65
1869G58q21Q61p20J122j158J192q06R57n88K22N13o86k97N12O2n96L92J182k135
1888c4J31J320k52p78k54J030j192J34J016l36r75J235p01R2L87N8j644J308P6
$$ plain form
1907 621 -376 -1511 -454 -306 -1111 -83 -786 -1043 -573 -215 -685 -1412 -672 -525 -353 -946 -690 -411 -895
1926 -895 -182 -366 -1351 -879 -190 211 59 258 -971 -835 -888 -681 -120 1089 1011 -693 219 363 680 403
1946 403 1234 1127 1008 178 41 279 -130 1240 892 654 1663 480 187 1332 1297 804 980 622 -673
1965 -673 749 1371 1300 -47 -1395 -287 1017 287 1585 121 -1248 990 -382 -813 -86 -361 -581
1982 -581 -724 -250 -134 -1381 -1401 -299 -136 -1215 -1712 -332 -460 -971 -785 -650 514 30 -1521 -416
2000 -416 572 -1027 175 -357 -5 706 -1053 -34 -552 -206 -356 28 -415 -259 109 291 724 1636 -785
2019 -785 -1280 4 -268 771 136 390 196 -171 -106 1182 29 702 1050 149 464 942 867 1091 158
2038 158 518 1116 1011 1553 389 598 792 741 166 722 -597 405 -346 1217 -317 351 -225 -610 411
$$ packed form
1907F21r97j135J057J48q05J028p03k57M70L58m70p27P40J47J72n93K56K79m84
1926h95P13j84r85M72O89M01j52J99j229J36n3K07N61J209p8j704R12J44L17k77
1946D03Q31j07j19q30j37K38m09J370l48k38J009j183k93J145l5m93J76l58j295
1965f73J422O22p1j347j348J108J304p30J298j464j369K238j372m31P27k75k20
1982e81j43M74J16j247k0J102J63j079m97J380j28n11J86J35J164m84j551J105
2000d16R88j599J202n32L52P11j759J019n18L46j50L84m43J56L68J82M33R12k421
2019g85m95J284k72J039o35K54j94l67O5J288j153O73L48r01L15M78p5K24r33
2038A58L60N98j05N42j164K09J94n1n75N56j319J002p51J563j534O68n76l85J021
$$ plain form
2057 411 -157 -1191 -128 -89 -141 -1493 -843 -429 -696 -1388 -639 -650 -571 -1305 143 -119 -1571 -708 238 884
2077 884 -570 -155 -226 0 -1538 -133 -391 199 -1936 -364 267 -51 -662 909 -2 -828 385 1409
2095 1409 386 794 217 373 -419 1497 1260 860 -186 1582 149 -170 917 -606 321 1390 575
2112 575 432 680 631 1103 1075 1094 1197 -5 129 -907 521 -426 -441 -409 644 68 1087 300 117 5
2132 5 -65 -1708 -816 -362 1247 -415 -304 -181 -582 649 -230 876 -868 -915 -535 -1924 -1318 -805 -1747
2151 -1747 -833 -19 360 -229 -942 -2178 -78 611 -1143 348 872 550 360 -73 1204 -406 -455 -441
2169 -441 775 381 852 -333 -52 1303 -456 185 890 197 40 1254 -483 779 192 33 217 -591
2187 -591 979 1455 -1261 383 75 1214 152 214 357 113 68 315 233 -106 756 -595 -933 486 1014
$$ packed form
2057D11n68j034J063L9n2j352O50M14k67o92P49j1P9p34J448k62j452Q63R46O46
2077H84j454M15p1K26j538J405k58N90k135J572O31l18o11J571r11q26J213J024
2095A409j023M08n77J56p92J916k37m00j046J768j433l19J087j523R27J069q15
2112E75j43K48m9M72k8J9J03j202J34j036J428r47j5L2J053n76J019p87j83j12
2132Ep0j643Q92M54J609j662J11J23m01J231q79J106j744m7L80j389O06N13r42
2151a747R14Q14L79n89p13j236K100O89j754J491N24l22j90m33J277j610m9J4
2169d41J216l94M71j185K81J355j759O41P05o93j57J214j737J262n87j59J84q08
2187e91J570M76k716J644l08J139j062O2J43k44m5K47q2l39Q62j351l38J419N28
$$ plain form
2206 1014 238 -513 292 -604 102 1113 -1260 -600 660 -545 190 460 -216 -1590 -106 525 194 114
2224 114 57 -35 -156 288 292 506 86 -979 -784 -739 590 455 226 -755 482 652 733 318 547 -18 470
2245 470 471 926 -190 513 639 488 875 482 163 64 868 479 532 -280 235 580 1189 771 160 488 597
2266 597 492 452 242 617 120 238 348 -317 473 501 -218 166 134 -178 -203 -226 -350 -312 -323 183 -256 -695
2288 -695 115 -148 -574 -578 -407 -1328 -281 -338 -431 -911 -195 -900 -455 -27 32 -378 -602 332 -409 -493 302 -680
2310 -680 -276 -139 -149 -776 -351 338 6 -159 -465 166 206 637 294 -129 128 948 493 -23 783 1194 -204
2331 -204 1110 1031 12 738 575 255 362 441 809 481 -606 2 -26 -178 -166 312 -84 -232 755 -509
2351 -509 -57 153 -133 643 243 -563 -568 -214 291 -621 -558 -395 -71 -273 -311 -307 -815 -250 -519 -506 -1001 -132
$$ packed form
2206A014p76p51Q05q96P06J011k373O60J260j205P35K70o76j374J484O31l31q0
2224A14n7r2j21M44MK14m20j065J95M5J329j35k29r81J237J70Q1m15K29n65M88
2245D70JM55j116P03J26j51L87l93l19r9Q04l89N3q12N15L45O09m18o11L28J09
2266E97j05m0k10L75m97J18J10o65P90K8p19L84l2l12k5k3j24L8j1N06m39m39
2288f95Q10k63m26mJ71r21J047n7r3m80P16p05M45M28N9m10k24R34p41q4P95r82
2310f80M04J37j0o27M25O89l32j65l06O31M0M31l43m23K57Q20m55n16Q06M11j398
2331b04J314p9j019P26j63l20J07P9L68l28j087O08k8j52J2M78l96j48R87j264
2351e09M52K10k86P76m00q06nL54N05r12O3J63L24k02l8Mn08N65k69J3m95Q69
$$ plain form
2373 -132 -273 -514 -471 157 -748 -556 122 475 -88 -42 -196 -1506 -480 -401 -246 -400 -301 55 -468 470 464
2394 464 683 539 1174 372 309 907 -173 455 1162 842 318 -52 1087 -151 678 536 1053 373 948
2413 948 789 150 595 242 1056 119 1091 183 -199 420 -1066 122 -631 595 -225 298 -74 -954 -365
2432 -365 -670 14 -571 -244 -827 352 977 74 -860 -511 374 -225 -277 -631 72 392 -845 556 -1141
2451 -1141 -91 -602 60 -660 894 -407 -442 -49 -397 -1748 -864 1142 -345 -959 44 -111 -424 546
2469 546 804 412 -331 -643 922 334 29 505 -865 26 193 73 503 425 1075 955 964 339 -361 677
2489 677 872 -381 94 -48 684 83 -278 185 -1076 -135 730 -287 -1273 32 -544 64 253 -257 -941
2508 -941 -588 -133 -654 523 64 -164 -490 -378 -22 76 -751 -537 -385 -277 71 -676 -1112 -1508 -804 226
$$ packed form
2373a32j41k41M3O28r05J92O78L53n63M6j54j310J026P9J55j54R9L56n23R38o
2394D64K19j44O35q02o3N98j080O28P07l20n24l70J139j238Q29j42N17o80N75
2413I48j59o39M45l53Q14r37R72r08l82O19j486J188p53J226q20N23l72q80N89
2432c65l05O84n85L27n83J179O25r03r34L49Q85n99n2l54P03L20j237J401j697
2451a141J050n11O62p20J554j301l5L93l48j351Q84K006j487o14J003j55l13R70
2469E46K58l92p43l12J565n88l05M76j370Q91J67j20M30p8O50j20Ro25p00J038
2489F77J95j253M75j42P32o01l61M63j261R41Q65j017r86J305n76O08J89n10o84
2508i41L53M55n21J177m59k28l26J12L56R8q27K14J52J08L48p47m36l96P04J030
$$ plain form
2528 226 -1162 -195 -327 -367 -69 20 69 -949 336 109 228 -442 -585 -43 623 67 804 -323 -1036 530
2548 530 460 14 -455 1090 1049 43 148 1239 22 -11 -674 386 172 628 -379 202 -1016 -275 1008
2567 1008 1133 907 407 211 -828 363 900 253 -867 533 844 267 -374 -362 656 -428 -89 1842
2585 1842 171 673 -636 -1135 -6 -549 -2818 -978 86 79 -2355 -375 -142 -410 -24 -1245 -565
2602 -565 -44 -842 -1004 -1478 -397 -557 -472 -109 148 -950 -282 -208 618 -2281 -1234 -10 -427 -130 -1906
2621 -1906 1197 -954 -636 443 544 174 -114 767 -1263 443 6 891 725 -675 -721 -112 516 -849
2639 -849 213 205 -863 256 -150 377 1145 10 796 272 -172 242 139 -180 761 -427 -424 -549 253 14
2659 14 -404 -65 476 157 52 -547 -550 284 -480 -1418 148 -103 172 -871 516 192 102 -655 -155 -2056
$$ packed form
2528B26j388R67j32m0K98Q9M9j018J285k27J19o70j43N42O66n56P37j127p13J566
2548E30p0m46m69J545m1j006J05J091j217l3o63J060k14M56j007N81j218P41J283
2567A008J25k26n00j96j039J191N37o47j120J400L11n77o41J2J018j084L39J931
2585A842j671N02j309m99J129n43k269J840J064pk434J980K33k68L86j221O80
2602e65N21p98j62m74J081j60Q5L63K57j098O68P4Q26k899J047J224m17K97j776
2621a906L103k151L18J079J01l70k88Q81k030J706m37Q85j66j400m6O09O28j365
2639h49J062qj068J119m06N27P68j135P86n24m44M14j03l19R41j188Lj25Q02k39
2659A4m18L39N41l19j05n99lQ34p64r38J566k51K75j043J387l24r0p57N00j901
$$ plain form
2679 -2056 -1002 -452 -712 238 -167 301 17 650 612 304 -1048 -205 -1101 765 47 -593 742 1269 -397
2698 -397 -328 379 737 765 36 -242 292 74 250 2343 -693 1011 675 298 1040 309 293 -116 287 569
2718 569 -374 750 -12 -656 -541 -409 -1479 -340 -492 -806 664 -503 170 -1073 -3 -385 440 112
2736 112 38 80 660 -589 -800 293 -257 -26 402 -805 -117 681 -1296 -796 39 -1392 57 -372 -918
2755 -918 -318 -440 -1057 -740 -705 88 652 121 392 707 472 -1126 84 135 155 930 -1441 18 2663
2774 2663 187 -229 52 60 37 -393 948 943 193 389 700 58 -699 941 786 616 612 396 534 -177 -148
2795 -148 169 -122 -849 564 682 -2 85 -539 986 1406 190 -81 -1269 -449 536 610 52 -371 290
2814 290 29 -541 -340 619 -794 -718 10 -86 -884 373 -154 -865 -90 -509 70 598 -107 -176 1060 -151
$$ packed form
2679b056J054N50k60R50m05M68k84O33l8l08j352Q43q96J866p18o40J335N27j666
2698c97O9P07L58K8p29k78N34k18J76K093l036J704l36l77P42p31j6m09M03K82
2718E69r43J124p62o44J15J32j070J139j52l14J470j167O73j243J070l82Q25l28
2736A12p4M2N80j249k11J093n50K31M28j207O88P98j977N00Q35j431J449m29n46
2755i18O00j22o17L17L5P93N64n31K71L15k35j598J210N1K0P75k371J459K645
2774B663k476m16K81Qk3m30J341np50J96L11o42p57J640j55j70mk16J38p11K9
2795a48L17k91p27J413J18o84Q7o24J525M20j216k71j188Q20R85P4n58m23O61
2814B90k61n70K01R59j413P6P28r6p98J257n27p11P75m19N79N28p05o9J236j211
$$ plain form
2834 -151 -322 14 -1635 -339 227 97 -43 -811 420 -827 171 1401 -271 -412 -478 -488 -183 627 346
2853 346 -590 44 29 -1477 1364 1554 -174 468 213 -316 662 567 767 -672 -5 172 -1151 280 -792
2872 -792 -118 336 510 -748 -214 -568 1052 232 689 205 328 -318 296 -530 89 76 -1478 -773 -325
2891 -325 1110 91 60 268 9 184 -1065 -1684 -42 -995 171 64 -729 -122 -64 326 40 1244 -547
2910 -547 -1630 365 -858 1318 964 829 438 -188 1160 -112 519 623 -205 -508 -315 226 -10 230
2928 230 536 336 -661 527 680 210 653 599 208 269 575 -101 685 -271 -157 692 961 -171 70 -81
2948 -81 -817 -186 -546 371 444 -753 225 -866 -100 14 -147 -361 -851 -255 -384 382 -1036 450 208
2967 208 370 -39 433 15 343 -59 -260 -1067 370 -200 -748 -404 -388 414 -711 655 -57 -1384 204
$$ packed form
2834a51j71L36j649J296N66j30j40p68J231j247R98J230j672j41o6j0L05Q10k81
2853C46r36O34j5j506K841J90j728O42k55n29R78r5K00j439O67J77j323J431j072
2872g92O74M54J74j258N34l54J620q20M57m84J23o46O14q26O19j3j554P05M48
2891c25J435j019l1K08k59J75j249o19J642r53J166j07p93O07N8L90k86J204j791
2910e47j083J995j223K176l54j35l91o26J348j272O31J04q28l03J93N41k36K40
2928B30L06k00r97J188J53m70M43n4l91O1L06o76P86r56J14Q49K69j132K41j51
2948h1p36O31l60R17P3j197R78j091P66J14j61k14m90N96j29P66j418J486k42
2967B08J62m09M72m18L28m02k01q07J437n70n48L44J6Q02j125J366p12j327J588
$$ plain form
2986 204 -97 224 -572 1073 -370 616 -39 -147 -679 159 372 -730 -178 320 1049 -908 140 257
3004 257 1178 275 -138 717 257 52 100 -14 957 -887 983 -144 896 401 -54 820 -581 -468 1001
3023 1001 -1064 -351 1258 799 -55 98 282 12 -95 -242 400 -761 -386 -184 -403 -678 678 -80
3041 -80 -575 -656 494 -1353 -880 656 911 -644 -744 -212 117 424 -630 740 -149 -757 -120 851 -280
3060 -280 -498 343 -63 336 277 35 638 -835 -790 -689 314 -1235 552 -355 -54 692 -85 217 806
3079 806 668 1196 23 -1083 1139 -981 274 648 -84 193 614 276 52 208 1131 155 -404 -311 -2
3098 -2 -119 789 -246 -539 -517 85 -183 431 232 -1312 -73 140 -153 -248 527 1472 479 -372 491 -909
3118 -909 -1434 90 697 -149 -724 174 85 -943 -1310 -736 -315 -1080 -586 -531 1128 -311 -242 167 -413 -226
$$ packed form
2986B04l01L21p96J645j443R86o55j08n32Q38K13j102N52M98P29j957J048J17
3004B57R21r03m13Q55m60k05M8j14R71j844J870j127J040m95m55Q74j401J13J469
3023A001k065P13J609m59q54J53J84k70j07j47O42j161L75K02k19k75J356p58
3041h0m95q1J150j847M73J536K55j555j00N32L29L07j054J370q89o08O37R71j131
3060b80k18Q41m06L99n9k42O03j473M5J01J003j549J787r07L01P46p77L02N89
3079H06j38N28j173j106K222k120J255L74p32K77M21l38k24J56R23r76n59R3L09
3098bj17R08j035k93K2O02k68O14j99j544J239K13k93r5P75R45r93q51Q63j400
3118i09n25J524O07q46n75Q98q9j028l67N74M21p65M94N5J659j439O9M09n80J87
$$ plain form
3138 -226 573 -295 -291 845 220 -264 -467 1035 1182 781 -955 138 2194 1567 684 -438 -571 114 1264
3157 1264 -199 96 514 71 -286 -809 -261 -390 678 696 936 -549 -705 -4 556 383 -22 -311 -138
3176 -138 -687 1554 -363 -1084 567 -164 348 -171 -574 -369 -177 -220 -149 282 4 568 -513 -962 -311
3195 -311 -895 -228 -472 -151 -552 152 397 -147 120 -1001 -778 172 180 -48 -789 -6 -197 -127 -78 7 1576
3216 1576 -1291 843 -125 512 -197 477 -1 -76 301 179 -243 606 -46 -9 -592 194 241 -376 -22 33
3236 33 -194 249 375 367 51 132 15 996 -110 310 -424 654 -165 498 -172 -548 -222 -404 249 -17 272
3257 272 93 -72 -457 -78 336 -643 -353 279 -92 133 -279 316 -156 -100 214 -479 -413 -340 -624 92 -659
3278 -659 -185 -841 -63 91 6 -661 291 585 -195 161 61 289 273 376 -487 -25 -816 124 235 693 93
$$ packed form
3138b26P99q68MJ136o25m84k03J502J47m01j736J093K056o27q83j122j33O85J150
3157A264j463K95M18m43l57n23N48j29J068J8K40j485j56P01N60j73m05k89J73
3176a38n49K241j917p21J651p31N12n19m03K05J92m3P1M31k78N64j081m49O51
3195c11n84O67k44L21m01P04K45n44K67j121K23R50Qk28p41P83j91P0M9Q5J569
3216A576k867K134r68O37p09O74m78p5L77j22m22Q49o52L7n83P86M7o17L54N5
3236C3k27M43J26ql16Q1j17R81j106M20p34J078q19O63o70l76L26j82O53k66K89
3257B72j79j65l85L79M14r79K90O32l71K25m12N95m72N6L14o93O6P3k84P16p51
3278f59M74o56P78J54q5o67R52K94p80L56j00K28j6J03q63M62p91R40J11M58o00
$$ plain form
3299 93 86 -57 166 72 -64 -155 259 -103 278 49 77 67 -96 280 -40 185 636 476 -316 336 -430 220
3321 220 300 22 75 300 156 67 -47 -13 325 322 318 -651 1 -416 -103 -139 -272 -160 -402 -111 -714 525 -429
3344 -429 -576 -180 -180 -346 347 -351 -75 40 -216 -497 -336 6 64 -77 -228 -572 -292 -258 -136 508 400
3365 400 -240 -670 386 104 75 -400 221 -293 260 409 298 453 -275 371 145 86 -184 -198 142 379 -164
3386 -164 567 -501 -496 211 177 -119 -306 458 618 -324 -340 -192 797 91 -1378 697 -365 312 -101 -271
3406 -271 41 487 -651 346 18 210 -434 -659 426 914 -247 286 280 -1009 -850 -943 202 822 423
3425 423 196 382 -58 -259 -220 106 -703 -35 48 41 -709 -761 186 -279 -96 273 -504 -203 -929 563 -391
3446 -391 -592 -47 -15 -58 727 212 495 -15 392 1256 120 320 -105 -134 378 331 205 959 -91 -786 234
$$ packed form
3299I3pj43K23r4j36r1M14l62L81k29K8j0j63L76l20K25M51j60p92O52p66O50
3321B20Q0k78N3K25j44q9j14L4L38lmr69O52m17L13l6j33J12k42K91o03J239r54
3344d29j47L96%j66O93o98K76J15k56k81J61L42N8j41j51l44K80L4J22O44j08
3365D00o40m30J056k82k9m75O21n14N53J49j11J55p28O46k26n9k70j4L40K37n43
3386a64P31j068NP07l4k96j87P64J60r42j6J48R89p06j469K075j062O77m13j70
3406b71L12M46j138R97l28J92o44k25J085M88j161N33oj289J59r3J145O20l99
3425D23k27J86m40k01L9L26q09O68Q3pp50n2R47m65J83L69p77L01p26J492r54
3446c91k01N45L2m3P85n15K83n10M07Q64j136K00m25k9N12m7j26P54j050o95J020
$$ plain form
3467 234 -1035 166 402 165 -407 -146 343 -777 -319 380 -157 270 182 -326 -169 219 -499 -55 -336
3486 -336 278 -192 410 94 -13 173 114 57 -118 -359 -109 60 -979 348 57 -670 -37 -198 70 533
3506 533 -501 -293 -342 176 -48 143 230 -352 333 315 -760 428 -302 -292 560 1 -370 8 -1025 875
3526 875 182 142 -253 260 949 77 -59 536 -344 928 -769 -229 163 416 554 62 -799 -4 651 -562
3546 -562 -728 1224 772 -436 -320 258 -40 143 416 -301 362 132 558 435 -255 -52 470 -330 -210
3565 -210 -657 -431 -772 251 509 -1088 169 438 131 -306 84 845 273 84 448 65 91 -632 239
3584 239 93 -643 -72 -385 963 544 -166 93 -773 -108 -41 -5 -137 15 1378 -203 204 42 -264 151
3604 151 -996 -69 -468 230 543 -182 -112 523 84 47 236 49 -11 195 -251 -113 153 -175 14 -385 -108
$$ packed form
3467B34j269J201K36k37n72K61M89j120M58O99n37M27q8n08J57L88p18M44k81
3486c36O14m70O02l16j07J86n9n7j75k41K50J69j039J327k91p27O33j61K68M63
3506E33j034K08m9N18k24J91Q7n82O85j8j075J188p30J0Q52n59l71L78j033J900
3526H75o93m0l95N13O89q72j36N95q80J272j697N40L92K53J38m92q61P95O55j213
3546e62j66J952m52j208J16N78k98J83K73p17O63k30M26j23o90K03N22q00J20
3565b10m47K26l41J023K58j597J257K69l07m37L90P61n72j89L64l83K6p23Q71
3584B39j46p36N71l13J348m19p10K59q66O65O7L6j32J52J363j581M07j62l06M15
3604A51j147R27l99O98L13p25P0O35m39l7J89j87o0K06m46J38K66l28J89l99K77
$$ plain form
3625 -108 51 -211 -88 -206 -290 271 -75 431 21 83 475 86 -566 -326 -337 3 28 -154 512 -113 -339
3646 -339 -434 -301 -312 -6 23 -569 -499 148 557 256 -552 -197 269 -842 -1382 -291 694 515 -240 -357 85
3667 85 178 -227 -344 -515 12 -525 -163 2 345 75 -264 73 -186 -612 357 695 386 543 68 22 403
3688 403 278 -448 532 359 652 -79 802 605 487 86 71 225 126 197 506 186 277 374 -404 -378 135 323
3710 323 149 -282 -345 416 25 -12 -708 795 419 -1246 361 320 317 -730 -122 685 -215 37 -517 -362
3730 -362 476 111 -36 57 175 -444 -386 -384 788 857 -424 265 -81 97 27 -547 -730 -263 34 -527 -49
3751 -49 -110 -58 484 -540 222 560 837 666 713 -73 446 536 355 157 174 271 -372 -173 32 313 559 144
3773 144 699 -217 472 615 -665 -536 -1350 351 919 104 976 221 924 -304 -148 -177 -400 141 319
$$ packed form
3625a08J59k62J23j18q4N61l46N06m10O2L92l89o52K40j1L40K5j82O66o25k26
3646c39r5J33j1L06K9n92P0O47M09l01q08L55M66j111n40J091R85j79p55j17M42
3667H5R3m05j17j71N27n37L62J65L43k70l39L37k59m26R69L38l09J57m75m6L81
3688D03j25p26R80j73K93p31Q81j97j18m01j5J54r9P1L09l20R1R7p78K6N13J88
3710C23j74m31o3P61l91l7o96J503l76j665J607m1lj047O08Q07r00K52n54J55
3730c62Q38l65j47R3J18o19N8KJ172O9j281O89l46J78p0n74j83M67K97n61M78
3751d9o1N2N42j024P62L38K77j71M7p86N19R0j81j98J7R7o43J99K05K81K46m15
3773A44N55r16O89J43j280J29q14J701N68q15Q72p55P03j228J56k9k23N41J78
$$ plain form
3792 319 -309 6 -774 -288 -192 322 6 -379 -740 315 281 -89 625 147 -172 33 327 -288 261 -45
3812 -45 -40 -154 -118 -534 -602 544 741 17 323 -274 845 -213 254 -106 -179 -44 156 692 -108 37 -365
3833 -365 -271 434 714 -33 -170 -79 -249 -281 -325 -197 -56 482 172 -154 -56 38 -3 338 456 -265 162 559
3855 559 53 219 286 -414 -258 -29 189 442 27 260 409 452 -193 232 -280 674 -452 409 -306 339
3875 339 515 -429 -186 -51 -552 -258 -287 -233 135 -109 -243 -525 1 -60 -346 -258 68 -345 641 -101 -867
3896 -867 -184 -475 496 -778 -280 -181 45 405 1022 -277 -352 -398 -444 -315 -28 -596 47 572 206 -165 -407
3917 -407 568 663 -220 -155 524 191 -569 -13 95 386 8 336 480 129 -50 106 -676 -998 356 697
3937 697 1406 155 334 -446 335 220 -357 365 368 -912 -2038 -636 328 -121 -3 284 1129 -52 -170
$$ packed form
3792C19o28L15p80M86R6N14l16l85l61J055l4l70P14m78l19K05K94o15N49l06
3812d5Nj14L6m16o8J146J97p24L06n97J119j058M67l60p3J35K00N36q00J45m02
3833c65R4P05K80p47j37R1j70l2m4J28J41N38l10l26R8R4m1L41J18p21M27L97
3855E59n06J66O7p00J56K29K18K53m15K33J49M3o45M25n12R54j126Q61p15O45
3875C39J76r44K43J35n01K94k9N4L68k44j34k82N26o1k86Q8L26m13R86p42p66
3896h67O83k91R71j274M98R9K26L60O17j299p5m6m6J29K87n68O43N25l66l71k42
3917d07R75R5q83O5O79l33p60N56J08K91l78L28J44l51j79J56p82l22J354L41
3937F97P09j251J79p80P81j15n77P22Lj280j126J402R64m49J18K87Q45j181j18
$$ plain form
3956 -170 -318 -474 -23 -389 -174 -383 844 -438 855 882 1017 -321 1110 591 -419 41 -483 483
3974 483 418 -548 -1446 -868 -124 -326 -728 122 -126 -25 148 263 401 396 879 511 -890 192 363 504
3994 504 -587 241 -275 208 -325 -136 598 213 141 788 151 -81 200 -197 805 -82 644 -784 1122
4013 1122 -705 -1278 901 -248 321 -398 524 -549 -178 -1114 -96 -248 -49 234 -54 -912 651 -511
4031 -511 346 55 -838 233 -380 -88 -641 7 -101 -161 547 -21 -540 93 -594 -50 -278 191 1126 -177
4051 -177 86 575 -201 -170 119 341 415 -74 543 -958 241 391 -240 1658 479 309 315 1740 -178
4070 -178 -766 -414 -57 264 1413 717 549 -279 321 891 -907 427 -193 462 526 166 99 639 632 -184
4090 -184 781 -370 -1204 380 244 -610 86 74 338 484 -252 -726 1576 -828 -624 -177 -481 343 356
$$ packed form
3956a70j48j56M51l66K15k09J227j282J293K7J35j338J431n19j010M60n24R66
3974D83o5r66q98N78P44k02m02Q50k48J01J73J15J38nM83l68j401J082J71J41
3994E04j091Q28n16M83n33J89P34l85p2O47o37k32K81l97J002q87P26j428J906
4013A122j827n73K179j149N69p19R22j073L71r36J018j52J99K83k88q58J563j162
4031e11Q57k91q93J071o13K92n53O48j08o0P08n68n19O33o87N44k28M69R35j303
4051a77K63M89p76L1K89K22P4m89O17j501J199J50o31J898j179j70OJ425j918
4070a78n88L52L57L21J149o96j68q28O00N70j798J334o20O55O4l60o7N40pq16
4090a84R65j151q34J584j36q54O96j2K64J46p36m74K302k404K04M47l04Q24J3
$$ plain form
4109 356 97 -227 -834 393 402 -693 807 -173 -188 708 -359 140 -266 -1027 124 -1543 53 713 -382
4128 -382 484 1092 -744 102 -237 257 -30 -99 -85 352 -524 -595 -81 -964 120 492 871 -749 404 -443
4148 -443 -173 -1608 -765 -732 1227 520 58 -800 -1207 -210 -261 755 -1671 -311 717 -1337 -1191 668
4166 668 608 -493 -2047 274 -1973 -845 -562 -704 879 -2054 1413 1140 -318 -231 -369 -208 -68 1128
4184 1128 -35 373 858 -615 111 -35 -762 690 -323 -204 -487 349 810 11 -445 1466 -622 244
4202 244 -459 7 432 -1076 -1144 -217 -104 413 1679 518 -59 -1146 19 1118 -410 900 -968
4219 -968 -1770 -6 -1134 269 156 -826 342 -1359 530 2034 42 -31 634 365 599 -1639 215
4236 215 -381 -723 -816 108 -328 1268 -674 1264 62 896 -800 629 385 505 1035 -66 1599 -565
$$ packed form
4109C56k59l24o07J227Rj095J500r80j5Q96j067M99m06p61J151j667J596O60j095
4128c82Q66O08j836Q46l39M94k87o9J4M37q76p1N14q83J084L72L79j620J153q47
4148d43K70j435Q43L3J959p07m62q58m07R97n1J016k426J360J028k054J46J859
4166F68o0j101j554K321k247J128K83j42J583k933L467k73j458Q7j38J61J40J196
4184A128j163M08M85j473P26j46p27J452j013J19k83Q36M61p99m56J911k088Q66
4202B44p03M66M25j508o8R27J13N17J266j161n77j087J165J099j528J310j868
4219i68q02J764j128J403j13r82J168j701J889J504j992p3O65k69K34k238J854
4236B15n96l42r3R24m36J596j942J938j202Q34j696J429k44J20N30j101J665k164
$$ plain form
4254 -565 -115 358 -1367 510 -64 203 3 92 -1219 -31 794 -1652 499 -359 -386 1853 -1068 533
4272 533 1241 -279 -677 -578 902 -123 579 310 -768 -860 802 -51 -269 -843 -800 -467 -1056 618 -687
4291 -687 -228 510 143 304 -324 -260 -216 982 -61 -644 -489 -121 308 579 -1250 -115 897 -291 -474
4310 -474 913 -536 566 292 -1018 138 -885 1378 304 -892 -79 -154 -359 46 194 -3 -713
4327 -713 295 393 341 183 -838 557 -884 469 851 113 282 152 -509 253 -430 230 -543 878 -209
4346 -209 524 140 -258 -63 -166 251 -260 -343 208 -503 67 1113 -1 667 253 -615 -35 127 168 -456
4366 -456 -683 -230 -203 -68 190 349 1613 293 -428 53 894 1141 -683 -752 -190 -506 -522 531 -345 301
4386 301 500 235 -154 2161 975 79 730 274 236 -702 1329 958 -80 24 269 -371 -562 882 355
$$ packed form
4254e65M50M73j725J877n74K67k00Q9j311J188Q25k446K151q58k7K239k921J601
4272E33P08j520l98R9J480j025P02k69j078r2J662q53k18n74M3L33n89J674j305
4291f87M59P38l67J61o28O4M4J198j043n83J55L68M29K71j829J135J012j188j83
4310d74J387j449J102k74j310J156j023K263j074j196Q13p5k05M05J48j97p10
4327g13J008R8n2j58j021J395j441J353L82p38J69j30o61P62o83O60p73J421j087
4346b09P33l84l98J95j03M17n11q3N51p11N70J046j114O68m14q68N80J62M1o24
4366d56k27M53K7J35K58J59J264j320p21M81Q41K47j824o9N62l16j6J053q76O46
4386C01J99k65l89K315j186q96O51m56l8r38K031l71j038J04K45o40j91J444n27
$$ plain form
4405 355 601 -734 -1190 -150 74 -459 217 753 474 -753 -1438 339 -576 -1444 493 -698 118 9
4423 9 1164 762 -121 811 1402 768 469 176 -55 558 -78 1102 382 139 -602 300 -222 710 -1034 -1661
4443 -1661 551 955 -252 -856 -162 679 1144 525 -1247 31 -259 249 498 -792 -13 579 -160 -875
4461 -875 214 86 -254 -892 1334 340 -314 61 1064 464 1011 197 -912 -298 23 -355 517 -264 922
4480 922 -360 615 1132 550 -273 -1487 737 -525 850 415 713 -1093 188 -75 158 750 1009 514
4498 514 -178 -972 -10 -400 -514 935 -749 -1363 -221 -564 607 -1035 461 3 193 288 388 65
4516 65 -183 -1279 623 386 518 440 -222 314 -633 92 -604 431 -615 -592 -227 -245 -15 1723 -662
4535 -662 2 354 -22 -732 466 -429 -368 -650 -350 412 -39 303 -400 -1312 319 105 -284 267 65 333
$$ packed form
4405C55K46j335m56J040K24n33O76N36k79j227o85J777r15q68J937j191Q16j09
4423IJ155m02q83R32N91o34k99k93k31O13o36J180p20k43p41R02n22R32j744o27
4443a661K212M04j207o04O94Q41M65o19j772J278k90N08K49j290P79N92p39p15
4461h75J089j28l40o38K226r94o54L75J003o00N47q14j109O14L21l78Q72p81J186
4480I22j282R75N17n82q23j214K224j262J375m35K98j806J281k63K33N92K59m95
4498E14o92p94R62l90j14J449j684o14J142l43J171j642J496m58J90R5J00l23
4516F5k48j096J902k37J32p8o62N36r47P25o96J035j046K3L65j8K30J738k385
4535f62O64L52l76p10J198q95O1k82L00P62m51L42p03r12J631k14l89N51k02K68
$$ plain form
4555 333 -828 352 -1430 134 -881 93 44 666 -753 -1245 -769 -690 -1296 1151 -625 -403 5 429
4573 429 -137 894 1082 -218 454 -1082 4 606 993 -77 -1009 -915 784 540 -649 115 315 -577
4591 -577 419 -559 -935 -295 30 -168 -902 -149 220 675 -399 -642 -911 90 -528 -1423 655 -200 1349
4610 1349 237 -56 405 310 -949 -49 259 586 -68 -59 363 -365 -84 162 316 76 222 -460 464 -359
4630 -359 -29 -508 -681 -109 590 -214 -469 323 492 316 348 380 704 444 -8 -112 -309 -285 -508 579 -750
4651 -750 18 532 -21 981 237 -787 -734 -398 817 -819 -657 986 261 -263 262 -46 142 -453 276
4670 276 367 -109 -657 -505 -511 520 -304 252 540 -702 246 472 -83 -485 -161 -381 -253 338 101 494
4690 494 -461 -524 657 544 424 149 618 565 204 -25 -279 -33 -3 1810 789 -246 1195 -146 443
$$ packed form
4555C33j161J180j782J564j015R74m9O22j419m92M76P9o06K447j776K22M08M24
4573D29n66J031J88j300O72j536J086O02L87j070r32R4J699k44j189P64K00q92
4591e77R96r78l76O40L25j98p34P53L69M55j074k43k69J001o18q95K078q55J549
4610A349j112k93M61r5j259R00L08L27o54RM22p28K81K46J54k40J46o82R24q23
4630c59L30m79j73N72O99q04k55P92J69j76L2L2L24k60m52j04j97K4k23J087j329
4651g50P68N14n53J002p44j024N3L36J215j636J62J643p25n24N25l08J88n95P29
4670B76R1m76n48J52oJ031q24N56K88j242R48K26n55m02L24k20J28N91k37L93
4690D94r55o3J181j13j20k75M69n3l61k29k54K46L0J813j021j035J441j341N89
$$ plain form
4709 443 -284 -118 -433 -1091 330 -1288 669 -1183 118 -1164 -783 -532 748 286 1019 141 331 -73
4727 -73 -53 299 -601 710 59 -120 -954 616 -191 18 -149 354 350 95 324 -274 -347 -297 664 -1252 1159
4748 1159 997 66 790 -467 581 1390 -646 315 803 183 -79 -796 -192 374 -1071 853 -563 -1044
4766 -1044 531 679 -100 292 722 -1387 99 767 52 -902 100 -657 -261 -332 -796 1093 -953 -1135
4784 -1135 748 -749 -46 -687 854 -390 199 -675 -605 -387 -692 -418 399 -134 177 430 75 596 -699
4803 -699 337 646 750 350 -103 794 1094 257 -170 -75 843 153 -773 59 -482 843 476 -596 739
4822 739 -523 621 639 -7 -934 476 604 426 208 -1206 -324 212 298 -446 -367 -501 358 -62 -238 339
4842 339 81 971 660 -330 364 841 423 -183 416 616 225 -70 -255 193 153 -23 278 -414 714 -190
$$ packed form
4709D43p27J66l15o58J421j618J957j852J301j282L81K51J280m62P33q78J90m04
4727g3K0L52r00J311o51j79q34J570q07K09j67N03mk55K29n98p3N0R61j916K411
4748A159j62r31P24j257J048Q09k036R61M88o20k62p17O04N66j445J924j416m81
4766a044J575J48p79L92M30k109J486O68p15r54J002p57L96p1m64J889k046j82
4784a135J883j497P03o41J541j244N89q74P0K18l05K74Q17n33L11K53l55N21j295
4803f99J036L09J04m00m53Q97L00q37m27R5R18o90r26Q32n41J325l67j072J335
4822G39j262J144J8o46r27J410J28j78k18j414Q82N36Q6p44P9j34Q59m20j76N77
4842C39k58Q90l11r90O94M77m18o06N99K00l91k95j85M48m0j76L01o92J128r04
$$ plain form
4862 -190 838 232 -13 -507 165 450 73 -846 -624 440 350 -145 504 -14 182 775 -256 -637 188
4881 188 61 -1139 570 -711 -208 -1030 -175 123 269 384 189 -735 46 -343 -80 207 909 -586 386
4900 386 814 10 -142 -644 366 -571 -266 1531 550 -213 950 -192 353 565 273 472 1270 -55
4918 -55 -330 -583 509 -507 -686 428 -513 -181 1131 -660 -1014 737 -85 117 581 361 -103 602
4936 602 99 -296 256 381 -520 -281 737 -1288 -598 625 -957 520 -171 -506 55 -966 -1168 -9
4954 -9 602 -57 533 279 431 444 862 -190 424 -892 73 -128 508 214 527 -176 -1508 127 78 -148
4974 -148 822 -463 -198 -613 -122 130 232 -1149 262 -339 -147 -89 -907 -285 170 -268 -932 -16 575
4993 575 269 777 561 1331 -778 -1396 526 311 1468 -514 1187 657 -897 -236 -99 492 -127 1284
$$ packed form
4862a90J028o06k45m94O72K85l77r19K22J064r0m95O49n18J96N93j031l81Q25
4881A88j27j200J709j281N03q22Q55K98J46J15j95r24P81l89K63K87P02j495R72
4900C86M28q04j52n02J010r37L05J797r81p63J163j142N45K12k92J99P98j325
4918e5k75k53J092j016j79J114r41L32J312j791l54J751q22K02M64k20m64P05
4936F02n03l95N52J25r01K39J018k025O90J223j582J477o91l35N61j021k02J159
4954iO11o59N90k54J52J3M18j052O14j316R65k01O36k94L13p03j332J635m9k26
4974a48R70j285K65m15M91K52J02j381J411o01J92N8q18O22M55m38o64R16N91
4993E75l06N08k16P70k109o18J922k15J157j982J701n30j554O61J37N91o19J411
$$ plain form
5011 1284 489 -1159 129 -225 -172 -1452 -186 418 -612 -475 -300 99 -7 -443 223 670 133 -785
5029 -785 -144 -256 -324 -715 133 -836 -377 932 455 -160 -111 214 -911 -1267 923 -413 48 -129 -548
5048 -548 -712 9 927 -704 -556 9 1460 -531 -1 557 1052 -430 324 152 -187 -579 -364 -955 723
5067 723 68 -1092 -1472 -740 998 288 4 540 -1611 911 1483 33 170 636 399 722 -1265 -148
5085 -148 -396 380 -414 -962 853 829 733 693 635 330 385 376 679 68 444 97 245 621 846 375 -310 -175
5107 -175 78 909 627 1122 873 626 68 -112 152 -790 238 619 636 -119 780 -545 -175 -151 -345 569
5127 569 116 135 -4 22 163 64 -624 -769 34 -203 -696 246 -116 -214 -805 -331 123 -522 -539 -114 -388 -658
5149 -658 229 -188 -360 345 -471 375 -313 307 -303 -277 -580 123 -181 -226 686 41 46 1098 560 36 230
$$ packed form
5011A284p95j648J288l54N3j280J266O04j030J37J75L99j06m36O66M47n37r18
5029g85O41j12o8l91Q48r69M59J309m77o15M9L25j125l56K190j336M61j77m19
5048e48j64P21R18j631J48N65J451j991N30N58M95j482P54j72l39l92K15n91J678
5067G23o55j160l80P32J738p10k84N36k151K522N72j450J37M66k37L23j987J117
5085a48k48P76p94n48J815k4r6m0n8l05N5rL03o11L76l47J48L76K25m71o85J35
5107a75K53Q31k82M95k49k47n58j80K64r42J028L81J7p55Q99j325L70K4j94R14
5127E69m53J9j39K6J41r9o88j45Q03k37m93R42l62r8n91M74M54o45j7M25k74k70
5149f58Q87m17j72P05q16Q46o88O20o10K6l03P03l04m5R12o45NJ052n38n24J94
$$ plain form
5170 230 -271 511 -154 -287 397 366 -41 -23 152 -31 -86 -42 197 81 -51 -59 180 512 -764 90 98 -18
5192 -18 289 115 168 -167 -137 -316 407 67 -415 -295 -564 20 -177 363 -96 -17 -225 263 146 -333 -59
5213 -59 91 252 -35 23 643 -284 378 178 -391 -396 150 462 11 -369 -5 256 356 140 486 541 -310 -138
5235 -138 -150 381 -82 -507 299 -87 -109 285 69 261 343 -261 408 -17 -120 -227 -780 -39 -373 -231 -152
5256 -152 22 79 43 -907 -138 250 46 -646 -222 105 -235 -321 -289 -577 405 -339 155 -169 475 -119 -509
5277 -509 304 -351 282 147 142 -75 -786 -398 -89 -375 -84 57 184 -54 -153 287 250 -637 482 -724 -303
5298 -303 -352 -202 -175 -155 -13 -108 -356 -81 -567 -106 329 -140 -50 -117 90 -189 -597 -23 202 414 -131 145
5320 145 -308 -209 362 281 -289 -89 142 229 403 -79 -316 424 -70 -69 -298 -297 469 -759 -124 -58 318 -406
$$ packed form
5170B30n01P82o65j33O84l1m07J8J75j83n5M4K39j16j32qK39L32j276Q54Qj16
5192a8L07j74N3l35L0j79P23l40m82J20k69N84j97N40m59P9k08M88j17m79K74
5213e9J50J61k87N8O20r27O62k00n69nN46L12m51l80L64K61J00k16L46N5q51J72
5235a38j2N31m63m25Q06l86k2L94k16J92Q2o04O69m25j03j07n53P41l34J42P9
5256a52J74N7l6r50P69L88k04o92M24L27l40q6L2k88R82p44M94l24O44n94l90
5277e09Q13o55O33j35nk17p11L88L09k86K91J41J27k38r9M40l7q87J119j206M21
5298c03m9J50K7K0J42r5k48K75m86M61M35m69R0o7K07k79m08N74K25K12n45K76
5320A45m53R9N71q1n70K00K31Q7J74m82k37P40m94Jk29JP66j228O35O6L76p24
$$ plain form
5342 -406 239 389 -2 -334 347 118 -106 319 56 -418 637 312 -412 -10 -305 54 -303 -414 -192 263
5362 263 19 210 -375 119 37 -443 -375 670 -288 584 454 -176 403 61 -315 -362 -130 -274 93 244 -314
5383 -314 198 -419 337 -63 165 425 -846 297 231 531 494 65 655 382 -479 99 90 -353 601 -230 -116
5404 -116 240 -203 84 180 481 -236 203 -193 -54 247 438 -186 20 140 -362 -760 -162 -192 -181 -195 -279 216
5426 216 372 282 -149 338 -57 215 -121 -52 -8 -586 -780 577 -45 -33 266 221 -246 -82 163 -308 -83
5447 -83 -314 -227 545 -914 60 529 124 717 -19 -7 61 280 -155 455 264 -242 -90 523 90 107 189 587
5469 587 59 293 -157 -233 -150 339 -108 124 275 -324 -408 327 319 448 -157 407 573 -264 -988 -569 138 785
5491 785 363 29 -497 541 -1260 -474 -766 -697 -758 -535 1050 -1375 325 -878 -239 -226 -391 778 -47
$$ packed form
5342d06O45J50l91l32O81k29k24M25k63m74J055l25p24M02k95L59l57j11K22M55
5362B63k44J91n85M94q2m80O8J045r58Q72j30o30N79l42l76m7K32j44L67J51n58
5383c14N12o17P56m00K28K60j271J143o6L00l7m29N90k73q61N78rm43R54q31J14
5404a16L56m43K87R6L01p17M39l96J39L01J91o24K06J20n02l98N98l0J1j4q4M95
5426B16J56r0m31M87l95K72l36O9M4n78j94J357o22J2K99m5m67J64K45m71K25
5447h3k31Q7P72j459R74M69m05N93p36J2O8K19m35O10j91n06J52O13m33J7Q2L98
5469E87n28K34m50p6Q3M89m47K32J51n99q4P35qJ29o05N64J66q37p24M19P07O47
5491G85m22l34n26J038j801P86k92O9o1K23J585k425J700j203O39J3j65J169q25
$$ plain form
5510 -47 -330 -84 106 -388 111 -60 -200 319 -248 457 450 -450 417 129 415 -309 538 187 262 255 223 -22
5532 -22 281 688 454 -148 13 759 -409 -116 -220 -116 126 144 -17 511 -632 180 -648 -48 103 -459
5552 -459 33 -524 -208 115 -1102 472 -262 -152 -654 428 -673 78 -1031 -144 198 188 -55 -170 456
5571 456 -307 -759 -97 959 288 -485 -335 -573 1086 435 -754 -78 321 -368 -485 -208 -183 400 307 -653
5591 -653 -88 -124 400 565 168 -151 246 513 -244 567 -93 -22 -205 -357 260 114 526 -18 174 110 315
5612 315 444 -471 190 404 -644 -296 -86 611 68 -622 256 110 744 -478 -7 192 -600 902 -575
5631 -575 848 -1419 -533 241 283 -59 -353 753 382 435 97 73 -94 126 -338 -206 -226 -17 515 -469
5651 -469 212 842 1029 -400 -155 -355 -257 -1247 581 -142 306 1547 -480 364 -304 858 -437 218
$$ packed form
5510d7k83K46J90m94M99j71j40N19n67P05pr00Q67k88K86p24Q47l51P5pl2k45
5532b2L03M07k34o02J61P46j168K93j04J04K42J8j61N28j143Q12q28O00J51n62
5552d59M92n57L16L23j217J574p34J10n02J082j101P51j109Q87L42j0k43j15O26
5571D56p63m52O62J056o71p73J50k38J659o51j189O76L99o89j17K77K5N83r3r60
5591f53N65l6N24J65l97l19L97K67p57Q11o60P1j83j52O17j46M12n44J92o4K05
5612C15J29r15O61K14j048L48K10O97n43o90Q78j46O34j222M71J99p92J502j477
5631e75J423k267Q86P74M2l42k94J106l71N3l38k4j67K20m64J32k0K09N32r84
5651d69O81O30J87j429K45k00R8r90J828p23M48J241k027Q44o68J162j295O55
$$ plain form
5669 218 342 -39 -256 -241 -542 1116 1201 60 652 -399 196 -379 367 1067 -720 -572 284 672 -552
5688 -552 -9 -856 340 -628 4 411 338 -233 -364 -191 560 769 -38 -1259 -255 -462 -184 -904 -1217
5707 -1217 104 -461 464 -685 -375 514 -195 393 -493 175 -150 -467 251 -413 -701 33 -180 -577 -925
5726 -925 -546 -307 -262 383 -304 -664 464 446 273 -676 12 -122 111 513 133 -266 882 496 -219 -265
5746 -265 491 -42 -70 67 -32 76 -622 604 -286 95 127 29 405 315 95 160 -259 677 -78 -162 -379 234
5768 234 209 386 127 -823 -326 -228 -335 -373 342 -95 638 -182 253 -122 -56 -513 -295 182 -202 -319 62
5789 62 682 -625 -42 66 -357 -135 492 272 -80 -6 -175 -701 506 389 -831 1239 -364 564 -810
5808 -810 7 -386 -300 800 -633 8 119 59 245 -1150 873 263 384 289 -457 603 -1075 369 760
$$ packed form
5669B18J24l81k17J5l01J658Q5j141N92j051N95n75P46P00j787J48Q56L88j224
5688e52N43q47J196r68O32M07p3n71j31J73P51K09q07j221J004k07K78p20l13
5707a217J321n65R25j149L10Q89p09N88q86O68l25l17P18o64k88P34k13l97l48
5726i25L79K39M5O45o87l60J128j8j73r49O88j34K33M02l80l99J148l86p15m6
5746b65P56n33k8J37r9J08o98J226q90L81L2r8L76r0k20O5m19R36p55q4k17O13
5768B34k5J77k59r50M97R8j07l8P15m37P33q20M35l75O6m57K18M77l84j17L81
5789F2O20j307N83J08m23K22O27k20l52P4j69n26J207j17j220K070j603R28j374
5808h10Q17l93Q6J100j433O41J11o0J86j395K023o10J21r5p46J060j678J444L91
$$ plain form
5827 760 -546 -317 -30 -299 505 587 690 -561 466 -543 46 90 104 -105 -369 385 -77 -346 105 -365
5847 -365 148 -270 -131 104 -208 -74 650 698 97 -463 -931 1196 173 -836 1339 260 720 186 620
5866 620 -604 157 -404 198 508 653 37 -1418 -188 -576 130 917 89 -202 34 582 -589 -973 245
5885 245 -333 543 -206 813 23 -599 -754 381 -115 817 -70 -618 125 214 1111 -186 404 319 -485 97
5905 97 366 -958 -392 374 425 -39 -254 154 -592 375 -574 -3 -741 -884 -276 835 -33 -322 -1130 -865
5925 -865 175 757 -923 -463 238 501 -306 -53 413 -121 -217 -130 -436 -953 165 10 -166 -100 -547 -845
5945 -845 -365 -29 -117 237 -1029 -61 -911 -451 -209 -286 -374 -283 -9 -566 -995 -261 -58 -62 -168 296 420 -256
5967 -256 138 -58 268 75 -305 209 -356 -357 -330 -193 -3 31 -291 9 330 210 -129 -463 -279 -186 103 240
$$ packed form
5827G60j306K29K87k69Q04Q2J03j251J027j009N89M4J4k09k64P54m62k69M51m70
5847c65N13m18J39K35l12J34P24M8o01n60m68K127j023j009K175j079M60n34M34
5866F20j224P61n61O02L10J45o16j455J230l88P06P87q28k91K36N48j171l84J218
5885B45n78Q76p49J019p90o22j55J135m96R32q87n48P43Q9Q97j297N90q5q04N82
5905I7K69j324N66P66N1m64k15M08p46R67r49N71p38j43O08J111q68k89q08K65
5925h65J040N82j680M60P01K63q07K53M66n34r6Q7l06n17J118j55j76O6m47k98
5945h45M80L36q8L54j266R68q50M60K42p7q8R1K74n57m29P34K03mj06M64J24o76
5967b56L94j96L26j93l80N14n65jK7J37J90L4l22L00L21j20l39l34J84R3K89J37
$$ plain form
5989 240 -326 -76 -18 182 56 -24 36 -235 -104 -24 -478 -576 -123 624 -167 111 -342 386 -334 -450 -297 139
6011 139 -63 -221 -308 234 -75 -136 664 539 -511 -121 375 171 -5 -215 360 -835 -29 -582 -25 690
6031 690 -504 36 -1164 -837 -117 -239 150 587 42 -137 541 -195 322 333 -579 -115 641 28 132 -19
6051 -19 317 -221 -308 370 249 -247 -403 831 -494 245 15 -282 -536 -607 98 -855 459 460 651 -329 189
6072 189 -430 214 -569 -216 222 -465 27 1111 742 891 270 21 -34 81 -481 -264 -349 -561 -491 -15 -234
6093 -234 66 -607 -462 -56 -106 210 335 -353 -624 293 520 -616 61 7 -357 -122 -495 102 32 -168 41
6114 41 -787 -608 -15 150 -595 -416 144 -177 478 -35 -210 567 67 88 71 -321 -14 400 173 -232 -222
6135 -222 913 110 -767 -379 25 937 -878 342 20 -229 -268 -66 3 -170 -384 -53 312 -1074 -523
$$ packed form
5989B40n66K50N8K00j26q0O0k71J31Q0m54r8M53P47p91K78m53P28p20j16J53M36
6011A39k02j58q7N42l09o1Q00j25j050L90M96k04j76k10N75j195Q06n53N57P15
6031F90j194N40j200L27P20j22L89M37n45j79O78p36N17J1r12M64P56o13J04j51
6051a9L36n38q7O78j21m96j56J234j325P39k30k97k54p1P05r53J314JJ91r80N18
6072A89o19O44p83L53M38o87M92J084l69J49o21k49n5J15n62K17q5k12P0M76k19
6093b34L00o73J45M06n0L16J25o88k71R17K27j136O77n4l64K35l73N97p0k00K09
6114D1q28J79N93J65p45J79N60l21O55n13j75P77n00K1j7l92L07M14k27m05J0
6135b22J135q03q77L88M04R12j815J220l22k49l9K02O9j73k14L31L65j386N51
$$ plain form
6154 -523 -299 220 -88 136 207 214 -320 41 -133 81 -520 -875 52 311 30 486 -40 538 -31 62 -132
6175 -132 628 -417 303 312 267 -592 -226 110 -905 -446 -24 721 756 -171 110 409 29 920 -800 -554
6195 -554 630 68 -197 -310 297 345 28 250 -168 -350 -420 -21 301 -57 214 -253 -113 171 -143 166
6215 166 58 -152 -35 317 678 382 -408 -328 345 212 207 -186 116 -551 -457 -262 410 -1266 -237 642 -313
6236 -313 1266 209 -194 -184 -209 48 137 -1618 -578 711 363 -180 -172 14 704 -196 67 -213 -307 -112
6256 -112 -1111 -128 -257 396 256 -365 -937 426 -200 297 131 -63 -1024 -564 484 -94 -176 59 139 -552
6276 -552 -1025 -498 12 182 -521 73 -325 -203 19 876 -252 -985 -173 -431 -752 -470 -78 595 300 -460
6296 -460 -104 421 -300 -847 686 -166 -347 431 -258 -422 291 1177 -329 288 801 625 -1153 498 -368
$$ packed form
6154e23K24N19l08K24P1Pn34L61j74K14o01l55R27K59k81M56n26N78n69R3j94
6175a32P60j045P20Rm5q59L66L36j015M59M22P45L5r27K81K99l80Q91j720K46
6195e54J184n62k65j13O07M8l17K22m18j82p0L99L22l58K71m67J40K84l14L09
6215A66j08k10J17L52L61k96p90Q0O73j33nl93L02o67R4J95O72j676J029Q79r55
6236c13J579j057m03J0k5K57Q9j755J040J289l48n43QJ86O90r00K63k80r4J95
6256a12r99R83j29O53j40o21n72J363o26M97j66j94r61M60J048n78q2K35Q0o91
6276e52m73N27N10J70p03N94l98J22K22Q57j128p33Q12k58l21K82L92O73k95p60
6296d60L56N25p21n47J533q52j81P78o89j64P13Q86j506O17N13j76j778J651q66
$$ plain form
6315 -368 511 -835 -19 -801 -1246 -1005 158 -603 148 -7 1096 -87 -441 -79 12 620 184 -764 -985
6334 -985 1325 989 -489 744 -763 -847 498 370 -551 686 569 -222 926 473 83 534 602 -368
6352 -368 474 75 482 1062 91 -1457 1686 -872 80 434 194 1312 302 601 -412 -389 888 527
6370 527 -222 256 252 237 51 -154 -455 204 -242 -106 325 235 -132 809 483 -372 179 965 -46 282 -102
6391 -102 -795 -457 -202 1817 1055 1 -34 641 -335 1184 -371 344 101 -302 -352 820 527 -124 -217
6410 -217 -104 -78 -489 -91 200 733 222 260 -19 -130 -227 777 -541 134 1033 888 -648 270 -137 875
6430 875 -431 633 -1323 153 684 397 -95 -354 -302 247 -878 -63 -202 -226 -487 356 -196 -61 -583
6449 -583 -1043 511 864 1660 -143 568 142 1057 322 548 947 -388 -557 114 -389 346 378 466 -267 -1095
$$ packed form
6315c68Q79j346Q16p82m45K41J163p61P51j55J103j183l54L62R1O08m36r48k21
6334i85K310l36j478J233j507q4J345j28r21J237j17p91J148m53l90M51O8r70
6352c68Q42l99M07N80r71j548L143k558R52L54k40J118j010K99j013K3J277l61
6370E27p49M78mj5j86k05l01O59m46J36M31r0l67R41l26q55N51P86j011L28l84
6391a02o93L38K55K019p62j054l5O75r76J519j555P15k43m03n0J172k93o51r3
6410b17J13K6m11L98K91N33n11L8k79j11r7J004j318O75Q99j45j536R18m07J012
6430H75j306J064j956J476N31k87m92k59N2N49j125Q15j39k4k61Q43n52J35n22
6449e83m60J554L53P96j803P11m26R15p35K26L99j335j69O71n03P35L2Q8p33q28
$$ plain form
6469 -1095 485 535 478 1399 411 -432 64 -217 170 498 -117 -235 -865 -607 -659 1246 -462 849 -527
6488 -527 -159 -559 -363 -127 212 679 582 -106 924 237 -465 377 -93 57 -149 528 693 287 631 497
6508 497 1143 260 -454 628 511 324 -398 567 -379 319 621 -657 693 11 452 -72 -88 -89 271 -95
6528 -95 409 302 821 -570 -188 377 -33 -856 -643 -833 -62 752 -53 263 -499 -1080 156 683 -846
6547 -846 -106 -29 -71 302 -1177 -129 200 461 -257 312 1073 -103 370 -258 -60 544 155 740 448 -957
6567 -957 -351 -23 -714 211 145 -1184 348 -807 106 -377 435 153 -240 -167 -31 316 -172 -640 -117 29
6587 29 95 698 65 14 -45 -410 285 -598 -174 15 118 99 -152 408 118 226 -454 100 -423 155 -8 505
6609 505 -379 -246 532 337 -399 -48 -224 -84 25 -101 355 257 79 -204 404 -187 -93 -8 401 -94 -895
$$ packed form
6469a095J580N0n7R21r88q43M96k81L87L28o15j18o30K58n2J905j708J311j376
6488e27L68m00J96K36L39M67r7o88J030o87p02Q42m70J50k06O77J65m06L44j34
6508D97O46q83p14J082j17j87p22R65r46O98L02j278J350o82M41n24j6jL60l66
6528i5N04j07N19j391L82N65m10q23K13j90P71Q14q05L16p62n81J236N27j529
6547h46P40P7m2L73j479J048L29K61p18N69P61j176M73o28J98O04l89N85k92j405
6567i57O06L28o91R25o6j329J532j155R13m83Q12k82l93P3J36L47m88m68N23J46
6587B9O6O03o33n1n9l65O95q83M24J89J03j9k51N60k90J08o80N54n23N78j63N13
6609E05q84J33P78j95p36L51j76J40J09j26M56r8j78k83O08n91R4Q5M09m95q01
$$ plain form
6630 -895 277 60 702 -302 381 218 172 150 -12 -562 -365 -115 -428 171 -104 625 -639 178 -205 -649
6650 -649 -312 380 306 920 -33 -396 -56 -164 199 -22 -239 -45 544 -88 -253 153 -56 81 74 327 -78
6671 -78 -127 -34 468 166 -204 50 490 -427 346 -240 294 -50 1006 -128 428 516 -396 -196 246 -410 -62
6692 -62 -49 -247 334 42 135 -275 458 170 -198 -47 -155 140 351 306 55 315 279 -200 222 -567 -136 -100
6714 -100 -335 668 -70 -737 -6 -283 -63 297 -196 -217 373 224 841 143 -60 532 212 -844 130 770
6734 770 -375 838 45 344 726 166 650 191 121 419 357 -774 -265 123 682 -119 -687 -353 -849 335
6754 335 512 230 210 -330 -664 -709 -224 274 1121 395 263 -386 626 126 621 131 232 48 648 -586
6774 -586 -160 104 -13 -690 -488 263 33 -253 -91 260 109 312 209 286 -728 143 26 192 136 -84
$$ packed form
6630h95J172k17O42j004O83j63m6k2j62n50J97K50l13N99k75P29j264Q17l83m44
6650f49L37O92p4O14r53l63L40j08L63k21k17J94N89o32j65M06k09J37pK53m05
6671g8m9R3N02l02l70K54M40r17P73n86N34l44J056j134N56Q8r12K00M42o56L48
6692f2J3j98N81k92R3m10P33k88l68J51j08K95K11m5k51K60l6m79M22p89M31L6
6714a00k35J003p38o67P31k77K20L60m93k1N90j49O17o98k03N92l20j056R74O40
6734G70j145J213p93K99L82n60M84m59p0K98o2j131N09L88N59q01n68L34m96J184
6754C35J77k82k0n40l34m5M85M98Q47p26j32o49J012n00M95m90J01j84O00j234
6774e86M26K64j17o77K02P51k30k86J62L51j51K03j03P7j014Q71j17J66n6k20
$$ plain form
6794 -84 -81 -394 105 299 -503 179 -318 -189 -331 -35 -321 -775 -459 432 558 -407 525 110 476 -485 -334
6815 -334 259 362 307 131 117 476 95 -7 561 -425 24 200 77 -146 -176 237 -151 433 -101 -213 3
6836 3 464 -774 245 22 -180 399 -1 -96 -43 176 -90 -259 254 -126 -163 -65 -451 122 -256 -290 -222 414
6858 414 38 223 -553 322 -81 376 -236 -362 -91 -294 -216 -84 434 167 129 -774 679 -174 -383 -566
6878 -566 -489 2 -313 -173 -453 -308 167 -56 118 300 342 672 -251 406 301 -489 -623 -156 -262 797
6898 797 227 -54 -577 -696 -125 -427 307 -383 234 23 36 -136 -448 -143 42 -677 81 246 -406 26
6918 26 122 510 314 520 491 -424 442 241 46 404 278 -69 -227 170 69 397 -311 -136 201 -64 467
6939 467 441 -104 -592 -913 562 203 -69 287 -91 386 -532 -556 949 161 -596 457 -48 -206 -159 -295
$$ packed form
6794h4Ll13M99J94q02O82m97J29j42K96k86m54L16Q91J26r65R32m15L66r61J51
6815c34N93J03n5j76j4L59l81j02N68r86M49J76j23k23l0M13l88N84n34j12K16
6836CM61j238J019k23k02N79m00r5N3K19k66j69N13l80l7R8l86N73l78l4O8O36
6858D14l76J85p76Q75m03M57o12j26K71k03P8J32N18k67l8r03J453q53k09j83
6878e66P7M91l15J40k80J45M75k23J74J82M2L30r23O57j05p90j34M67j06J059
6898G97n70k81n23j19N71l02P34o90O17k11J3j72l12L05J85p19P58J65o52M32
6918B6R6L88j96K06k9r15Q66k01j95L58j26l47j58L97j01L28p08J75L37k65N31
6939D67k6n45m88l21J475l59k72L56l78M77r18k4J505p88p57J053n05j58M7j36
$$ plain form
6959 -295 120 419 -671 -209 255 223 116 227 296 -464 -727 -341 466 -336 500 -193 750 -1085 71 297
6979 297 -224 -190 138 139 185 347 311 -30 495 308 -829 170 537 -256 -669 -339 135 -101 569 137 -171
7000 -171 140 -421 74 145 -195 -610 -335 655 -848 -363 -378 213 281 630 163 -273 -748 -211 -227 191 1344
7021 1344 366 -228 160 293 -662 231 -890 -400 517 -204 38 -548 114 893 -993 864 -724 719
7039 719 16 1172 -771 823 704 17 288 670 681 -1208 1319 744 463 -56 -2126 -212 220 -93
7057 -93 -900 -263 -1414 655 -192 276 -81 -679 -460 -270 -486 -184 456 58 -129 83 430 -103 -94 -245
7077 -245 -339 788 -410 -547 -742 109 30 9 -21 -154 -458 110 -129 147 288 -643 -99 323 802 107 -44
7098 -44 190 -277 103 -200 112 -515 349 273 -332 -458 -152 173 -104 488 391 502 577 -138 -269 599 286
$$ packed form
6959b95M15K99j090M62M64l2j07J11O9p60k63L86Q07q02Q36o93R43j835J156K26
6979B97n21L4L28JM6J62l6l41N25j87j137R99L67p93m13L30M74k36O70m32l08
7000a71L11n61M95P1l40m15K75R90j503M85j5N91O8L49m67m36m75N37j6M18J153
7021A344r78n94L88J33r55Q93j121M90R17p21K42n86O62P79j886J857j588J443
7039G19p03J156j943J594j19o87K71L82J1j889K527n75k81n19k070J914M32l13
7057i3q07O37j151K069q47M68l57n98K19J90k16L02O40l98j87K12L47n33Rj51
7077b45r4J127j198j37j95Q51p9k1l0j33l04N68k39K76J41r31N44M22M79o95j51
7098d4K34m67L80l03L12o27Q64p6o05j26L06L25k77N92r7J11P5p15j31Q68l13
$$ plain form
7119 286 -55 35 -201 -662 -784 -602 453 149 -463 -545 424 526 -70 -208 -16 83 -65 -387 -320 339 216
7140 216 -263 -406 170 930 244 710 -784 -700 -175 -501 528 -479 175 -806 530 -645 -648 99 169 220
7160 220 614 114 -1336 -365 -144 -264 -660 -307 -648 -170 53 18 964 624 -85 -1161 -431 -241 -1015 -49
7180 -49 -641 336 -177 137 1367 -82 293 -156 -800 -485 -284 -515 -341 -461 -378 33 549 691 -270 -1081
7200 -1081 -350 431 234 179 -604 -357 -196 -103 10 -839 -707 -1631 445 -593 401 -495 -560 692 -2 -388
7220 -388 -233 466 -1245 -576 403 -1065 -632 -685 -576 -328 -518 132 344 229 -1314 -91 -1023 202 -828
7239 -828 197 -205 -624 -162 -288 -684 -539 -73 -729 -330 639 -321 -60 -80 -65 -484 -1189 179 -49 -1428
7259 -1428 -350 473 -107 4 -713 -489 -413 -1413 1072 83 325 -75 410 363 84 -287 421 64 -494
$$ packed form
7119B86l41R0k36m61j22J82J055l04o12q2R69J02n96j38J92R9j48l22O7O59j23
7140B16m79j43N76P60o86M66j494Q4N25l26J029j007O54r81J336j175lP47P0N1
7160B20L94n00j450R71K21j20l96L53l41M78K23l5R46l40p09j076P30J90p74R66
7180d9n92R77n13L14J230j449L75m49o44L15K01k31J74j20Q3M11N16J42r61q11
7200a081P31P81j97n5p83K47J61R3J13q49J32r24K076j038R94q96o5J252o94l86
7220c88J55O99j711O69R79j468M33n3J09K48j90O50K12j15j543J223r32J225j030
7239h28J025m02m19M62j26l96J45M66o56L99R69r60K61k0J5m19p05J368k28j379
7259a428J078Q23n80J11p17K24P6j000K485r89K42m00M85m7k79l71P08l57n58
$$ plain form
7278 -494 -129 -385 -322 310 -483 635 -825 -387 141 -146 319 479 -446 -458 -53 820 -363 -396 95 -296
7298 -296 -427 -1188 183 -129 -10 79 -342 -624 -105 -1074 -347 -89 186 48 323 531 -72 233 313 -50
7318 -50 -154 10 -971 411 772 550 -718 417 -1079 636 997 598 -275 -103 -177 -357 -328 145 239 -128
7338 -128 -554 498 107 -942 43 142 -554 35 -1392 230 -423 397 -762 -400 230 -434 352 -874
7356 -874 -115 555 -1055 -581 -801 -1104 -781 53 788 186 1217 -11 -719 -500 -287 -1189 -239 -416 -200
7375 -200 -810 52 -246 28 -70 -111 516 -234 -305 -20 9 -310 -6 -316 -93 -316 146 157 511 736 -221 -107
7397 -107 64 -197 -32 -549 -382 -421 -600 369 -482 291 -206 -317 -559 -562 -317 -641 496 474 461 68 175
7418 175 117 -792 582 -32 -617 -91 -385 -123 275 -566 168 -18 558 320 187 359 724 -829 -469 -105
$$ packed form
7278d94L65k56O3O32p93J118j460M38N28k87M65J60r25j2M05Q73j183l3M91l91
7298b96j31p61J371l12J19Q9m21k82N19r69P27K58K75j38K75K08o03L05Q0l63
7318e0j04J64r81J382L61k22j268J135j496J715L61l99q73J72p4j80K9M73R4l67
7338a28m26J052l91j049R85R9o96N89j427J622o53Q20j159L62O30o64P86j226
7356h74P59O70j610M74k20l03L23Q34P35o02J031j228p08K19K13r02R50j77K16
7375b00o10Q62k98K74r8m1O27p50p1K85K9l19L04l10K23k23M62J1L54K25r57J14
7397a07J71k61J65n17J67l9j79R69q51P73m97j11k42lK45l24J137k2j3l93J07
7418A75n8r09J374o14n85N26k94K62L98q41P34j86N76k38j33J72L65j553L60L64
$$ plain form
7438 -105 -508 491 -21 -424 -625 -341 -113 383 -508 -636 130 -533 172 -461 365 828 274 626 -60 500
7458 500 366 -1053 411 306 -542 -298 505 -231 -436 187 184 -167 24 45 46 -18 -232 29 -16 -174 53 -349
7480 -349 123 -388 -95 -83 844 587 283 87 163 754 -341 -458 -397 99 288 -203 -360 -194 -340 -467 -662
7501 -662 -257 415 440 594 -4 -787 -108 354 435 1516 -1822 -384 -629 -617 -620 -97 303 -313 -252 55 -315
7522 -315 300 -155 -600 315 83 -373 -4 172 238 174 -472 -534 153 312 -652 -530 -306 -479 494 -17 -153
7543 -153 -213 110 -519 -545 51 694 171 443 -409 -437 74 613 209 -248 -76 543 513 -378 214 474 389 409
7565 409 541 -290 -14 -395 -623 -386 382 -422 314 -318 -67 116 162 -874 285 -29 -804 -443 219 57
7585 57 -28 -572 84 -455 -251 -3 -83 -161 -370 -551 -1151 15 -528 -902 172 -573 -254 551 -295 455 -23
$$ packed form
7438a05m03R99n12m03k01K84K28M96q91j28P66o63P05o33Q26M63n54L52o86N60
7458E00j34j419J464j05q48K44Q03p36k05O23ll51J91K1Jo4k14K61m5j58K27m02
7480c49M72n11K93J2R27k57l04j96P6N91j095j17O1M96J89m91j57J66j46j27j95
7501f62M05O72K5J54n98p83O79M62Q1J081l338J438k45J2lN23M00o16O1L07l70
7522c15O15m55m45R15k32m56L69J76O6o4o46o2O87J59r64J22K24j73R73n11j36
7543a53o0L23o29k6N96O43n23K72q52k8N11N39m04m57J72O19l0q91N92K60q5K0
7565D09J32q31K76l81k28K37P68q04P36o32K51J83M6j036J159l14p75L61O62j62
7585E7q5n44O56n39K04K48q0p8k09j81o00J166n43l74J074p45L19Q05q46P50m78
$$ plain form
7606 -23 -548 -645 -442 67 398 242 866 -100 577 852 -411 350 403 -621 -547 52 499 784 325 329 -306
7627 -306 50 -109 -989 -407 44 -96 351 -370 -53 344 708 -17 -947 -1305 156 1263 234 -252 -573
7646 -573 309 409 -500 714 1188 608 -60 -704 -514 -1219 -322 527 450 -924 322 -712 -59 200 -238
7665 -238 300 -1132 195 -167 -225 -607 -428 -466 323 409 637 100 -545 -125 240 -557 -790 371 -439 -497
7685 -497 567 -106 75 536 -520 -331 -56 -1057 -1447 -810 -414 158 -186 171 -603 -1215 -490 -178 275
7704 275 383 356 1414 72 -173 -395 -1185 -162 -28 -88 -164 -610 -394 81 -348 -395 -619 -1068 510 844
7724 844 -151 -551 -1222 431 929 -836 618 1082 262 549 374 -48 493 5 -343 411 -342 203 -265
7743 -265 435 -538 721 -587 -46 -880 -557 -522 195 1608 -624 -403 -495 285 -1467 1342 388 195 303
$$ packed form
7606b3n25r7K03N09L31j56O24r66O77K75j263P61N3j024P4N99M47K85m59Mo35
7627c06L56j59q80N82M51j40M47p21L17L97L64p25r30l58J461J107j029m86l21
7646e73Q82J00r09J214M74n80o68o44J90p05Q97Q49p7j374J246j034O53K59m38
7665b38N38j432J327l62n8l82J79l8P89Q6K28n37o45M20L65p97k33J161q10n8
7685d97J064o73J81M61j056J89K75j001l90O37L96N72l44L57p74o12P25L12M53
7704B75J08k7J058j342k45k22p90J023J34o0p6m46K16M75m29m7k24m49J578L34
7724H44r95m00o71J653M98j765J454M64q20K87j75m22N41m88l48P54p53N45m68
7743b65P00r73J259j308N41q34L23L5P17J413k232K21r2P80j752K809r54j93J08
$$ plain form
7762 303 -943 -597 -476 -1180 1075 842 -154 -644 -417 -511 -596 -128 -369 -73 -19 -226 -385 -629 1851 -158
7782 -158 535 843 232 -396 -392 -1007 -914 1132 -199 -1012 -170 80 -267 -40 -1 177 -170 644 -690 -919
7802 -919 262 608 -461 -725 533 331 -330 -60 -571 173 582 -163 -256 -284 65 58 89 -276 58 640 -151
7823 -151 282 -197 72 1045 -344 -179 -249 -191 -889 123 -429 34 498 113 189 -369 -438 -618 425 -351
7843 -351 -23 597 18 543 -1109 -258 296 -175 101 -238 -67 -160 -754 391 -130 -197 -211 463 276 -913
7863 -913 -61 -134 221 388 95 74 -852 -1048 -840 296 -437 130 -849 309 378 492 -69 -280 210 -651
7883 -651 -34 -294 1020 186 -468 687 353 103 604 -139 322 828 -861 -690 663 -208 -413 -230 801
7902 801 -275 -1294 -105 380 -213 1020 275 1157 -326 -320 -134 946 468 232 364 -274 -375 -89 -34
$$ packed form
7762C03j246L46J21p04K255k33r96m90K27r4q5M68k41K96N4k07j59k44K480k009
7782a58O93L08o11o28Mo15R3K046j331q13Q42K50l47K27L9J78l47Q14j334k29
7802i19J181L46j069k64J258k02o61K70n11P44M09p45r3k8L49pL1l65L34N82p91
7823a51M33m79K69R73j389J65p0N8o98J012n52M63M64l85P6n58o9j80J043p76
7843c51L28O20n79N25j652Q51N54m71K76l39J71r3n94J145n21o7j4O74j87j189
7863i13Q52p3L55J67k93k1r26j96K08J136p33N67r79J158O9J14n61k11M90q61
7883f51O17k60J314q34o54J155l34k50N01p43M61N06j689J71J353q71k05J83J031
7902H01j076j019J189M85n93J233p45Q82j483OJ86J080m78k36J32o38j01K86N5
$$ plain form
7921 -34 386 602 -117 299 -102 -252 -265 59 1003 396 489 481 43 -808 -229 633 287 -631 -1471 -706 -81 -129
7943 -129 339 -1263 -591 -401 -1771 -193 -216 353 -1716 -229 -423 -429 -867 -127 427 939 464 -718 -484
7962 -484 -9 -509 -1017 -202 841 -115 -19 -1041 -997 -777 -218 -341 2 275 116 -679 -199 228 638 710
7982 710 596 29 121 -381 920 281 229 662 444 281 394 -565 -624 -396 -317 -1246 -21 1344 58 -310
8002 -310 933 266 98 753 556 -613 -666 -91 -1143 544 -40 -582 -123 -444 1226 -881 -669 -293
8020 -293 -238 714 -81 169 200 544 664 -384 143 -396 -62 54 248 141 67 -479 -210 579 -13 -157 304
8041 304 441 -21 613 252 61 -62 -148 -163 -842 358 55 134 -35 -120 7 233 315 117 -234 154 271
8062 271 242 655 304 274 59 285 -343 520 -642 -332 -389 -308 -643 210 -192 264 245 -253 475 -665 -140
$$ packed form
7921c4M20K16p19M16m01j50j3L24R44o07R3qm38q51N79Q62l46r18q40P65O25m8
7943a29M68j602O72J90j370J578k3N69k069J487j94om38P40N54N12m75j182K34
7962d84M75n00n08Q15J043r56R6j022M4K20N59j23L43K73j59p95M80M27M10P2
7982G10j14n67R2n02J301o39n2M33k18j63J13r59n9K28P9r29J225J365j286l68
8002c10J243o67j68O55j97j169n3N75j052J687n84n42M59l21J670k107K12L76
8020b93N5R52p95K50L1L44J20j048N27n39L34J16J94j07p4n46K69P89n92j44M61
8041C04J37m62O34l61j91j23q6j5o79J200l03P9j69q5J27K26Q2j98l51L88J17
8062B71k9M13l51l0k15K26o28Q63j162L10n7Q1l35Q53m02M56j9m98P28j140N25
$$ plain form
8083 -140 -718 -1183 -1169 120 532 119 97 -177 959 326 -329 -227 -118 522 752 370 -605 -819 168 -783
8103 -783 -214 -371 -355 -108 -108 384 528 -499 247 787 110 270 -576 279 -359 528 274 -245 -306 254 146
8124 146 432 -178 445 368 -137 327 1125 253 -67 56 -1400 52 -670 -957 -76 48 38 659 -550 -246
8144 -246 1111 731 496 -1221 -967 -251 -860 375 -91 731 -1099 948 717 -609 121 -1191 582
8161 582 199 -200 -553 1902 5 621 -225 -76 346 302 -92 -1819 326 -653 568 130 -432 -234 286
8180 286 -815 -517 -193 -189 844 214 -1181 -650 550 -801 345
$$ packed form
8083a40n78m65J4J289M12m13k2k74J136o33o55J02J09O40K30l82r75k14R87r51
8103g83N69j57J6K47%M92J44j027P46N40o77J60q46Q55o38Q87k54n19o1N60j08
8124A46K86o10O23p7n05M64P98q72l20J23j456J452p22k87Q81J24j0O21j209L04
8144b46J357l80k35j717K54P16o09J235m66Q22j830K047k31j326P30j312J773
8161E82l83l99l53K455j897O16q46J49M22m4l94j727K145r79J221m38n62J98N20
8180B86j101K98L24MJ033o30j395N31J200j351J146
8191C45
$$ Imaginary data points
##PAGE= N=2
##DATA TABLE= (X++(I..I)), XYDATA
$$ plain form
0 0 0 0 0 0 0 0 0 0 0 0 0 0 0 0 0 0 -47 47 -48 48 -48 48 -95 96 -96 143 -143 186 -191 239 -257 289 -335 383
34 383 -432 484 -549 619 -690 770 -858 956 -1058 1174 -1302 1440 -1588 1749 -1933 2125
50 2125 -2339 2579 -2837 3133 -3462 3821 -4240 4713 -5262 5898 -6662 7589 -8732 10198
64 10198 -12156 14904 -19057 26229 -42057 176787 -196041 -110303 260322 -135465 78201
75 78201 158382 -83441 28930 64895 -32423 58842 -34898 -16777 35369 -29003 2730 1484
87 1484 -52093 29920 -22826 -94581 -25793 7377 -19098 -2033 -13630 -83777 -86488 41814
99 41814 37465 -84445 -50334 724 -34532 3674 -7433 -63560 -27130 -5791 390 -11036
111 -11036 -78841 -4161 49091 -63450 -17759 19149 -81334 23913 48969 -82959 16617
$$ packed form
0@%%%%%%%%%%%%%%%%m7R4r5R6r6R6j43J91j92K39k86L29l77M30m96N46o24P18
34C83q15R16j033J168j309J460j628J814k014K232k476K742l028L337l682M058
50B125m464M918n416N970o595P283q061Q953r975J1160j2560J4251j6321J8930
64A0198k2354K7060l3961M5286o8286K18844l72828Q5738L70625l95787K13666
75G8201Q0181k41823J12371L5965r7318R1265r3740J8121N2146o4372L1733j246
87A484n3577Q2013n2746p1755O8788L3170k6475J7065j1597p0147k711J28302
99D1814m349j21910L4111N1058l5256L8206j1107n6127L6430K1339O181j1426
111a1036o7805P4680N3252j12541M5691L6908j00483J05247K5056j31928R9576
$$ plain form
122 16617 37054 -44254 52698 11875 -56271 37382 24436 32943 51070 -39849 30976 81125
134 81125 -24798 14795 39662 -11969 65129 66913 -25567 -9003 10632 13923 38911 2711
146 2711 -12293 13522 3808 15539 -11578 -49159 13960 16011 -23819 12334 -9972 -31027 4951
159 4951 -16044 -22364 -19565 -11486 29785 -13413 -40526 -14431 -40528 4109 23233 -48617 -28049
172 -28049 -13111 -15240 14684 -45343 -44181 4373 -34625 5621 9465 -74822 -6759 29530 -47186
185 -47186 -13125 7650 -24210 8903 -2158 -19797 11321 -2599 12246 25513 -28070 890
197 890 29627 -4978 42498 24543 -48177 25384 48157 -7299 14978 8055 -190 34720 24510
210 24510 11315 -5852 -5562 36408 14393 -5297 31814 16168 5537 16003 -2865 -1811 18280
$$ packed form
122A6617K0437q1308R6952m0823o8146R3653j2946Q507J8127r0919P0825N0149
134H1125j05923L9593K4867n1631P7098J784r2480J6564J9635L291K4988l6200
146B711j5004K5815r714J1731k7117l7581O3119K051l9830L6153k2306k1055L5978
159D951k0995o320K799Q079M1271m3198k7113K6095k6097M4637J9124p1850K0568
172b8049J4938k129K9924o0027J162M8554l8998M0246L844q4287O8063L6289p6716
185d7186L4061K0775l1860L3113j1061j7639L1118j3920J4845J3267n3583K8960
197H90K8737l4605M7476j7955p2720P3561K2773n5456K2277o923q245L4910j0210
210B4510j3195j7167K90M1970k2015j9690L7111j5646j0631J0466j8868J054K0091
$$ plain form
223 18280 31573 19445 -12220 4866 15705 -4552 16879 9331 -27209 8683 27605 -6735
235 -6735 -5612 -12485 -24293 4186 6697 -6494 -13186 -27509 8678 5569 -57994 -9684 22796
248 22796 -34136 -3315 -1104 -45496 2147 5441 -26147 -5555 -17803 -14319 9571 -7205 -6142
261 -6142 -18911 -19938 25075 -157 -31589 12945 5817 -18112 16655 11025 -22184 986 25404
274 25404 5988 -7393 -69 13458 18393 11866 4606 -3732 7003 27486 15376 2148 12110
287 12110 14798 13240 10482 6813 10229 9864 24740 20962 -8379 9459 19238 -4603 15824 12370
301 12370 -13547 10687 22709 6723 -9709 -18042 8985 10754 -9259 10926 -6971 -24751
313 -24751 15297 -398 -31505 2589 379 -15614 3507 -13829 -24792 1730 -4173 -15355
$$ packed form
223A8280J3293j2128l1665J7086J0839k0257K1431p548l6540L5892J8922l4340
235f735J123o873j1808K8479K511j3191o692j4323L6187l109o3563M8310L2480
248B2796n6932L0821K211m4392M7643L294l1588K0592j2248L484K3890j6776J063
261f142j2769j027M5013k5232l1432M4534p128k3929L4767n630l3209K3170K4418
274B5404j9416j3381P324J3527M935o527p260q338J0735K0483j2110j3228R962
287A2110K688j558k758l669L416l65J4876l778k9341J7838R779k3841K0427l454
301A2370k5917K4234J2022j5986j6432q333K7027J769k0013K0185j7897j7780
313b4751M0048j5695l1107L4094k210j5993J9121j7336j0963K6522n903j1182
$$ plain form
325 -15355 -12332 -18610 3189 3238 -23772 -5512 -11050 -27105 15052 9633 -27098 -7977 131 -4757
339 -4757 3932 -2841 -10172 -4912 5053 8038 -8345 -2554 11894 1940 -214 1468 2061 8247 16074
354 16074 11531 -5396 104 27604 16314 -1023 12823 6196 5204 30388 19777 -2149 6254
367 6254 9647 10508 19097 6738 2504 8324 4632 12319 1507 -14525 14667 10135 -18705 6498
381 6498 2409 -16609 11308 -3227 -27047 -2801 3480 -2754 -2588 -18206 -15740 -5199 -5814 -2758
395 -2758 -14341 -23154 -1577 -1990 -17367 -8974 -8252 -22070 -5646 2290 -19212 -14646 -3545 -7310
409 -7310 -10650 -11480 -8252 -5983 -2941 541 -12809 -13054 7879 7486 -6033 -5131 3151 8013 3282
424 3282 8237 3478 -6754 15586 16616 -3599 10867 6286 -2674 21430 12583 -6620 4239
$$ packed form
325a5355L023o278K1799M9k7010J8260n538j6055M2157n419l6731J9121Q108m888
339d757Q689o773p331N260R965K985j6383N791J4448r954k154J682N93O186P827
354A6074m543j6927N500K7500j1290j7337J3846o627r92K5184j0611k1926Q403
367F254L393Q61Q589j2359m234N820l692P687j0812j6032K9192m532k8840K5203
381F498m089j9018K7917j4535k3820K4246O281o234J66j5618K466J0541o15L056
395b758j1583q813K1577m13j5377Q393P22j3818J6424P936k1502M566J1101l765
409g310l340q30L228K269L042L482j3350k45K0933l93j3519R02Q282M862m731
424C282M955m759j0232K2340J030k0215J4466m581q960K4104q847j9203J0859
$$ plain form
437 4239 6899 10858 8073 -5732 8436 5691 -5278 17677 3727 -16738 14519 14387 -9701
450 -9701 4517 3964 -1705 9861 -1828 -7765 4657 5199 6897 -1644 -13896 2731 1894 -3834
464 -3834 7348 -8875 -18579 3715 4129 -8934 -9444 -8632 -8646 -4671 2137 -7917 -18255 -670 1181
479 1181 -12766 -5665 -1791 -1813 -1053 -5128 -4804 -4573 2143 10516 -6061 -11739 6838 4365 320 8564
495 8564 -3686 -12968 11496 12874 -4764 827 1879 -507 9081 4561 335 3519 98 15009
509 15009 7123 -8590 15348 12103 -419 16123 4591 -3120 22271 14352 -545 8495 5427
522 5427 10372 14017 5081 4674 -1293 4244 17443 -959 -9009 6019 4162 -2095 2319 -3810 -5444
537 -5444 -89 969 -3887 -11863 -3406 2236 -7962 -3019 -5454 -14561 2 2671 -9924 -8755
$$ packed form
437D239K660L959k785j3805J4168k745j0969K2955j3950k0465L1257j32k4088
450i701J4218n53n669J1566j1689n937J2422N42J698q541j2252J6627q37n728
464c834J1182j6223r704K2294M14j3063n10Q12j4L975O808j0054j0338J7585J851
479A181j3947P101L874k2P60m075L24K31O716Q373j6577n678J8577k473m045Q244
495H564j2250r282K4464J378j7638N591J052k386R588m520m226L184l421J4911
509A5009p886j5713K3938l245j2522J6542j1532p711K5391p919j4897R040l068
522E427M945L645q936m07n967N537J3199j8402q050J5028j857o257M414o129j634
537e444N355J058m856p976Q457N642j0198M943k435r107J4563K669j2595J169
$$ plain form
551 -8755 -9150 -1344 -672 -14283 -4471 -7092 -11801 6929 -7479 -20852 2799 -3322 -7815 -1466
565 -1466 -13195 -7438 5172 -3510 -3155 -5950 -4734 7473 635 -1877 7137 -4137 -408 18571
579 18571 4310 -6529 11132 11481 2028 8787 6441 4193 10887 10444 5187 -627 4613 16151
593 16151 4791 -2610 6156 2142 3089 10922 1421 -5815 1522 5282 4202 25 1379 -4209 -1922
608 -1922 8290 -1896 -10882 2093 1512 -5306 -3119 -6689 -3738 -757 -5337 -3840 -9957 -10610 5416
623 5416 -3968 -16656 -3424 -8027 -10191 5800 -10643 -16817 1175 -5716 -6145 561 -9669 -4957
637 -4957 -2124 -3460 2396 -8171 -5056 10839 -969 -7431 5589 444 1596 7358 289 -1463
651 -1463 2049 8631 6708 -1047 2641 5190 3676 9089 7126 -625 3307 7969 6688 3181 3677
$$ packed form
551h755l95P806O72j3611R812k621m709J8730j4408j3373K3651o121m493O349
565a466j1729N757J2610q682L55k795J216J2207o838k512R014j1274L729J8979
579A8571j4261j0839J7661L49r453O759k346k248O694m43n257n814N240J1538
593A6151j1360p401Q766m014R47P833r501p236P337L760j080m177J354n588K287
608a922J0212j0186q986J2975n81o818K187l570K951K981m580J497o117o53J6026
623E416r384j2688J3232m603k164J5991j6443o174J7992o891m29O706j0230M712
637d957K833j336N856j0567L115J5895j1808o462J3020n145J152N762p069j752
651a463L512O582j923p755L688K549j514N413j963p751L932M662j281l507M96
$$ plain form
666 3677 6849 5159 5366 7587 -928 2778 14165 2955 -3506 7096 2531 1929 9188 -621 -4691
681 -4691 2261 2156 3958 -2469 -6591 2315 -2350 -5632 4350 -9055 -9541 7237 -5900 -11335 -242
696 -242 -5665 -6347 -1312 -7569 -8842 -5544 -841 -551 -10196 -8605 255 -6206 -3503 814 -8662 -6916
712 -6916 4569 -1853 -6649 -1194 -1031 -1456 1203 59 -2872 -706 6732 2816 -3216 2642 4220
727 4220 3266 6556 1939 799 3609 4285 9515 1866 -1064 9063 4860 3571 9421 -527 2077
742 2077 10721 3131 1426 5340 3816 6030 3615 1540 3016 474 5401 8788 -4184 -4386 7251
757 7251 497 -1420 4611 -4251 -5212 4552 355 -4479 -3080 -3641 -1587 -2743 -3664 -3332 -5466 -1848
773 -1848 -996 -9048 -5376 -83 -4079 -4980 -3549 -6169 -4781 512 139 -8867 -7003 1854 -1481 -2203
$$ packed form
666C677L172j690K07K221q515L706J1387j1210o461J0602m565o02P259r809m070
681d691O952j05J802o427m122Q906m665l282R982j3405m86J6778j3137n435J1093
696b42n423o82N035o257j273L298M703K90r645J591Q860o461K703M317r476J746
712f916J1485o422m796N455J63m25K659j144k931K166P438l916o032N858J578
727D220r54L290m617j140K810O76N230p649k930J0127m203j289N850r948K604
742B077Q644p590j705L914j524K214k415k075J476k542M927L387j2972k02J1637
757G251o754j917O031q862r61R764m197m834J399n61K054j156r21L32k134L618
773a848Q52q052L672N293l996r01J431k620J388N293l73r006J864Q857l335p22
$$ plain form
789 -2203 -151 -4393 -3598 1572 1217 -1313 -3336 -372 3750 -157 521 3086 -418 3363 6690 -2261
805 -2261 473 8878 3434 2609 6812 426 2767 9906 6547 3044 2100 5522 8461 3240 2548 5451
821 5451 873 5070 8687 -996 -1050 4638 1911 423 309 -553 185 3474 1827 -2697 -4278 273
837 273 475 -2953 -3434 -3140 -4334 -1118 -56 -5031 -7993 -2065 -1355 -7524 -5300 -2559 -5802 -3741
853 -3741 -2246 -7788 -7910 -1181 -2335 -5519 -5846 -4789 -2683 -2155 -1181 -2680 -6846 -1115 3410 -2886
869 -2886 -206 1586 -2483 1557 6093 -630 -1100 5223 3102 1857 2125 3910 4125 4320 5340 2309
885 2309 499 5068 8711 873 -533 5070 1681 3263 7576 61 -2068 5057 4304 875 2318
900 2318 649 1429 2117 2113 252 -1504 1601 2540 -1720 -3181 -150 -42 -2153 -358 -3427 -6917 -548
$$ packed form
789b203K052m242P95N170l55k530k023K964M122l907O78K565l504L781L327q951
805b261K734Q405n444q25M203o386K341P139l359l503r44L422K939n221o92K903
821E451m578M197L617r683n4N688k727j488j14q62P38L289j647m524j581M551
837B73K02l428m81K94j194L216J062m975k962N928P10o169K224K741l243K061
853c741J495n542j22O729j154l184l27J057K106N28R74j499m166N731M525o296
869b886K680J792m069M040M536o723m70O323k121j245K68J785K15J95J020l031
885B309j810M569L643p838j406N603l389J582M313p515k129P125p53l429J443
900B318j669P80O88mj861j756L105R39m260j461L031J08k111J795l069l490O369
$$ plain form
917 -548 1804 -5278 -5409 -2034 -3832 -3125 -1162 -3569 -5748 -2033 413 -2121 -5662 -1845 105 -2629
933 -2629 -1431 -1058 -4084 -380 3045 -3240 -2684 980 -534 259 2075 -1375 -2547 1542 3213 1102
949 1102 -1987 731 3355 943 1973 2535 45 1711 6637 1392 -970 5157 4842 2742 4299 2767
965 2767 159 5618 4891 2874 2210 2605 4166 1883 1887 2968 805 924 5329 1213 -2388 2046 1910
982 1910 -791 -89 -239 -3013 -354 1749 -1044 -5610 -1178 1255 -1375 -2071 -3416 -2847 -1157 130
998 130 -1203 -4979 -3672 234 -4186 -1918 -874 -5671 -4282 594 -4121 -5363 -1525 -1404 -2720 -2268
1014 -2268 -2512 -3050 -1891 2204 -1388 -5434 -1010 2276 -400 -362 510 -427 1718 4020 1019 -1398
1030 -1398 1859 3561 2106 2083 2425 1316 3030 5103 2936 -44 2387 6164 3424 1303 3165 1788
$$ packed form
917e48K352p082j31L375j798P07J963k407k179L715K446k534l541L817J950k734
933b629J198L73l026L704L425o285N56L664j514P93J816l450j172M089J671k111
949A102l089K718K624k412J030N62k490J666M926n245k362O127l15k100J557j532
965B767k608N459p27k017o64L95J561k283MJ081k163J19M405m116l601M434j36
982A910k701P02j50k774K659K103k793m566M432K433k630o96j345N69J690J287
998A30j333l776J307L906m420K268J044m797J389M876m715j242L838J21j316M52
1014b268k44n38J159M095l592m046M424L286k676L8Q72r37K145K302l001k417
1030a398L257J702j455k3L42j109J714K073k167k980K431L777k740k121J862j377
$$ plain form
1046 1788 2158 5465 2452 -2077 1777 4872 1561 -230 688 970 235 1518 1126 -2514 -502 971
1062 971 -1317 -1687 -1327 -1328 -1452 -1309 -1284 -5087 -4295 624 -2508 -4603 -2174 -3610 -1505 -205 -3718 -4855
1080 -4855 -3210 -1210 -947 -3824 -2897 -1088 -3280 -952 237 -3763 -1176 2237 -1316 -2314 534 -305
1096 -305 224 654 603 -1536 -314 4422 1963 -546 1002 1947 957 3350 2232 383 2239 3523 3646
1113 3646 1168 2147 4387 2 2854 3685 -1071 1857 4893 1587 771 1616 1931 1740 1053 1501 -316
1130 -316 -1424 2291 1106 -3122 18 -150 -762 -583 759 -2634 -1725 858 -2247 -2795 -1619 -2715
1146 -2715 -2313 -2138 -1819 -3446 -3318 -471 -27 -5674 -3875 410 -2096 -1859 -1061 -3664 -2611 780 -564
1163 -564 -2618 -1690 631 26 -2007 214 -1239 -969 2418 1164 -1406 542 2044 1362 1206 1373 608
$$ packed form
1046A788L70L307l013m529L854L095l311j791R18K82p35J283l92l640K012J473
1062I71k288l70L60jj24J43K5l803P92M919l132k095K429j436K105J300l513j137
1080d855J645K000K63k877R27J809k192K328J189m000K587L413l553r98K848q39
1096c05N29M30n1k139J222M736k459k509J548R45r90K393j118j849J856J284J23
1113C646k478R79K240m385K852Q31m756K928L036l306q16Q45L15j91o87M48j817
1130c16j108L715j185m228L140j68o12J79J342l393R09K583l105n48J176j096
1146b715M02J75L19j627J28K847M44n647J799M285k506K37P98k603J053L391j344
1163e64k054R28K321o05k033K221j453K70L387j254k570J948J502o82j56J67p65
$$ plain form
1180 608 809 4127 3715 -133 193 3400 1567 2552 3061 1126 755 2367 2473 1263 1905 3043 2718
1197 2718 853 1576 1150 -276 3086 1442 -1682 -479 1660 497 16 475 -1465 -1418 582 1639
1213 1639 -1397 -2196 928 -881 -2123 -1679 -408 -2462 -1182 -655 -2782 -2821 -586 -416 -1970 -1794 -1809
1230 -1809 -2991 -353 -1206 -2970 -2974 -518 -845 -1648 -865 -1318 -2419 -87 -296 -903 -1724 169 1577 -1893
1248 -1893 -8 739 -1141 1654 2359 -212 -247 2234 1998 1207 806 1663 1755 2683 3700 1001 -82 2539
1266 2539 3556 1809 1696 2606 532 1876 2606 1389 106 2936 1675 861 1226 1138 238 1505 1553
1283 1553 -678 -1478 863 992 -1295 -595 -701 -1910 -1343 -255 -1374 -3072 -549 -842 -3164 -1800
1299 -1800 -1583 -3046 -1991 -693 -3802 -3299 -1407 -1636 -2519 -3132 -850 -1267 -2019 -53 -901 -2276 153
$$ packed form
1180F08K01L318m12l848L26L207j833R85N09j935l71J612J06j210O42J138l25
1197B718j865P23m26j426L362j644l124J203K139j163m81M59j940M7K000J057
1213A639l036p99L124j809j242M44J271k054J280N27k127l9K235J70j554J76j5
1230a809j182K638q53j764mK456l27q03P83m53j101K332k09o07q21J893J408l470
1248a893J885P47j880K795P05k571l5K481k36p91m01Q57R2R28J017k699j083K621
1266B539J017j747j13R10k074J344P30j217j283K830j261q14L65q8r00J267M8
1283A553k231q00K341J29k287P00j06j209N67J088j119j698K523k93k322J364
1299a800K17j463J055J298l109N03J892k29q83o13K282m17p52J966q48j375K429
$$ plain form
1316 153 128 -1075 -1135 -313 -312 31 1836 366 153 1461 2275 588 691 1888 1336 1055 2349 2038 500
1335 500 2609 2788 1113 1067 2032 1992 763 3578 1139 923 1616 2291 1120 733 849 1344 744 2662
1353 2662 832 138 1076 2377 -242 -1786 270 -76 -429 -1250 -1009 -2280 -1425 348 -3001 -2195 -1792
1370 -1792 -1324 -3179 -1177 -1249 -3355 -3028 -1158 -1308 -2427 -1523 -1780 -1877 -673 -1984 -2389 283 513 -1485
1388 -1485 -1498 -219 415 138 -270 -147 -1511 -37 1831 -233 -809 1081 1153 780 1816 775 -146 965
1406 965 2094 1099 329 1955 2268 1468 1517 1933 617 1847 1937 1958 412 1035 2569 1087 1780 1596 168
1425 168 620 2421 1006 80 1272 1234 574 243 390 -1123 -268 317 -745 -1911 -116 357 -971 -1352
1443 -1352 -981 -1166 -1581 -89 -1334 -2549 -1432 -24 -1694 -1494 -1168 -3204 -1180 540 -1655 -2272
$$ packed form
1316A53k5j203o0Q22JL43J805j470k13J308Q14j687J03J197n52k81J294l11j538
1335E00K109J79j675m6R65m0j229K815k439k16O93O75j171l87J16M95o00J918
1353B662j830o94R38J301k619j544K056l46l53q21K41j271Q55J773l349Q06M03
1370a792M68j855K002p2k106L27J870j50j119R04k57r7J204j311m05K672K30j998
1388a485j3J279O34k77m08J23j364J474J868k064n76J890P2l73J036j041r21J111
1406I65J129r95p70J626L13q00M9M16j316J230R0K1j546O23J534j482O93j84j428
1425A68M52J801j415r26J192l8o60l31J47j513Q55N85j062j166J795M73j328l81
1443a352L71j85m15J492j245j215J117J408j670K00L26k036K024J720k195o17
$$ plain form
1459 -2272 -1115 -568 -1289 -1618 -381 -1228 -1015 825 499 -2292 -985 1116 396 -45 -36 140 663 1929
1477 1929 1525 -335 424 1834 591 976 1174 981 1560 2073 1545 444 855 2775 1364 560 1553 862
1495 862 450 1698 1924 -442 738 1642 1344 26 896 325 -619 998 441 -997 -310 956 -209
1512 -209 -1232 -832 -1006 -1061 -742 -470 -2545 -1137 694 -2091 -1475 -719 -1928 -1617 -933 -1111 -1958 -1702
1530 -1702 -447 -1435 -2391 -1470 -1041 -1526 662 176 -2382 91 -101 -841 -426 -602 397 -443 -278 1200
1548 1200 -395 -263 1438 245 -125 2009 465 878 1933 369 527 -247 1895 1733 28 492 1753
1565 1753 204 1025 1595 199 639 1571 771 332 -394 1266 531 1367 2012 -129 181 995 320 -512
1583 -512 -841 -711 -593 -272 537 -817 -1750 -1105 -523 -1595 -1441 -1345 -624 -2011 -391 -1678 -2156 736
$$ packed form
1459b272J157N47p21l29J237q47K13J840l26k791J307K101p20m41RJ76N23J266
1477A929m04j860P59J410j243L85J98j93N79N13n28j101M11J920j411q04R93o91
1495H62m12J248K26k366J180R04k98j318Q70n71r44J617n57j438O87J266j165
1512b09j023M00j74n5L19K72k075J408J831k785O16P56j209L11O84j78q47K56
1530a702J255r88r56R21M29m85K188m86k558K473j92p40M15j76R99q40J65J478
1548A200j595J32J701j193l70K134j544M13J055j564J58p74K142j62j705M64J261
1565A753j549Q21N70j396M40R32q00m39p26J660p35Q36O45k141L10Q14o75q32
1583e12l29J30J18L21Q09j354r33O45N82j072J54R6P21j387J620j287m78K892
$$ plain form
1601 736 -1286 -2011 -302 -661 -1998 -1568 -1193 -1542 -1390 -750 -719 -1797 -1607 257 -308 -629 -293 -237 -440
1620 -440 727 455 -512 -42 221 732 642 178 -328 12 1062 1420 461 594 1529 888 1196 1927 818
1639 818 -144 1814 1975 468 997 1820 1567 194 2670 539 785 109 -422 -174 281 473 -198 -133 316
1658 316 -599 -1615 236 931 -625 -475 427 -1303 -982 -351 -1637 -1156 -544 -873 -1107 -1900 -900 -87
1676 -87 -2032 -951 -472 -1637 -371 262 -1139 -2682 521 -577 -1386 -553 -311 -1472 -1081 -247 -1010
1693 -1010 -255 458 702 -74 465 642 1014 279 977 400 320 122 1299 766 -49 1061 1219 30 1245
1712 1245 473 733 1504 1656 1089 870 1327 324 1216 2146 752 -405 530 1723 292 252 751 722 318
1731 318 382 -180 -250 446 1077 -1032 -1060 112 -1186 1074 -309 -347 -1343 -316 -659 -498 -1486 -1724 -1130
$$ packed form
1601G36k022p25J709l59j337M30L75l49J52O40L1j078J90J864n65l21L36N6k03
1620d40J167k72r67M70K63N11r0m64n06L40J050L58r59J33R35o41L08P31j109
1639H18r62J958J61j507N29Q23k53j373K476k131K46o76n31K48M55J92o71O5M49
1658C16r15j016J851O95j556J50R02j730L21O31j286M81O12l29k34p93J000Q13
1676h7j945J081M79j165J266O33j401j543L203j098q09Q33K42j161L91Q34p63
1693a010P55P13K44p76N39J77L72p35O98n77q0j98J177n33q15J110J58j189J215
1712A245p72K60P71J52n67k19M57j003Q92R30j394j157R35J193j431m0M99k9m04
1731C18O4n62p0O96O31k109k8J172j298K260j383l8r96J027l43J61r88k38N94
$$ plain form
1750 -1130 -869 -824 -1345 -1127 -189 -208 -455 -494 -56 -385 -1058 -718 -863 -1808 299 -1160 -614 -352 234 -652
1770 -652 146 -31 -600 -823 401 -533 -500 -1001 902 1696 682 1760 563 621 1152 988 1253 -21 1227
1789 1227 1027 808 1956 1544 -447 364 1962 288 234 461 1070 241 163 811 -201 561 475 -46 -402
1808 -402 367 -458 -291 -694 -168 409 -279 -273 -1683 -298 -225 -372 -799 -1304 -836 -1868 -1118 -803 -1274 -1841
1828 -1841 -859 -1463 -499 -1493 -191 -1934 -977 -673 -597 -1022 -521 -513 -433 -120 -894 -506 90 749 -137 -352
1848 -352 -163 958 76 315 -501 806 1388 999 -153 -307 1096 1221 912 1460 394 -477 1126 1023
1866 1023 117 588 943 1718 -262 389 606 196 778 1230 1576 -39 387 846 627 615 379 -176 236
1885 236 524 3 -1566 -390 110 -342 -1914 374 -94 -995 350 -1192 -1180 -607 -875 -341 -238 -707
$$ packed form
1750a130K61M5n21K18R38j9k47l9M38l29o73L40j45r45K107j459N46K62N86q86
1770f52P98j77n69k23J224r34L3n01J903P94j014J078j197N8N31j64K65j274J248
1789A227k00k19J148m12j991Q11J598j674n4K27O09q29p8O48j012P62q6n21l56
1808d02P69q25J67m03N26N77o88Oj410J385P3j47m27n05M68j032P50L15m71n67
1828a841R82o04R64r94J302j743R57L04P6m25N01QQ0L13p74L88N96O59q86k15
1848c52J89J121q82K39q16J307N82l89j152j54J403J25l09N48j066q71J603j03
1866A023r06M71L55P75j980O51K17m10N82M52L46j615M26M59k19j2k36n55M12
1885B36K88n21j569J176N00m52j572K288m68r01J345j542J2N73k68N34J03m69
$$ plain form
1903 -707 -1417 -1734 -785 -122 -1980 -1146 -209 -714 -1479 -81 -345 -390 -101 -260 -898 -94 900 233 -618 -19
1923 -19 835 -86 1496 562 303 413 1305 694 994 1430 945 1018 1264 520 782 304 1720 1800 348 524
1943 524 1830 1505 -22 -920 892 43 727 503 -138 439 1327 127 -78 -866 665 248 1071 222
1961 222 -278 -1328 -577 -831 -957 -314 -181 -610 -98 -1067 -231 -569 -138 -1344 -251 -1295 -2118 -1170 144
1980 144 -579 -1289 -1557 -350 -179 -819 -590 -1010 54 -987 -251 -51 1449 -274 -386 899 1513 -1346
1998 -1346 214 600 351 -377 480 287 476 664 1656 -375 -249 1798 63 276 900 143 -419 822
2016 822 -75 1412 838 954 -171 -132 327 21 -4 874 291 12 722 462 616 471 486 565 -629 867
2036 867 1262 -694 427 397 -149 -586 404 -1342 -180 639 -165 -984 -1697 -259 -1131 -1008 -588 133 -801
$$ packed form
1903g07p10l17R49O63j858Q34R37n05p65J398k64m5K89j59o38Q04R94o67q51N99
1923a9Q54r21J582r34k59J10Q92o11L00M36m85P3K46p44K62m78J416Q0j452J76
1943E24J306l25j527q98J812q49O84k24o41N77Q88j200k05p88J531m17Q23q49
1961B22n00j050P51k54j26O43J33m29N12r69Q36l38M31j206J093j044q23R48J314
1980A44p23p10k68J207J71o40K29m20J064j041P36K00J500j723j12J285O14k859
1998a346J560L86k49p28Q57j93J89J88R92k031J26K047j735K13O24p57n62J241
2016H22q97J487n74J16j125L9M59l06k5Q78n83k79P10k60J54j45J5P9j194J496
2036H67L95j956J121l0n46m37R90j746J162Q19q04q19p13J438q72J23M20P21r34
$$ plain form
2055 -801 -108 -540 597 -189 -1702 -671 -1507 -125 400 475 -1837 1251 -630 18 604 883 531 -1003
2073 -1003 105 -281 52 783 913 -735 -586 1680 -114 338 2105 21 312 -822 1156 701 1298
2090 1298 946 720 -160 1064 -86 846 37 538 331 313 227 855 298 906 1512 -851 204 -255 -1
2109 -1 1770 -583 -315 -428 -981 577 -1050 -873 -1752 -624 -1175 -270 -239 -1776 -549 -907 -25 -194 -1462
2128 -1462 -978 -658 -292 1040 -288 -939 416 -1045 -551 -764 20 36 -5 551 -255 480 139 -361 -611
2147 -611 -792 207 -250 -473 -803 250 598 45 315 554 436 1067 921 1368 881 -846 267 1029 16
2166 16 166 -17 490 55 767 -87 1275 1074 9 86 494 576 -573 593 876 -912 -1738 402 54
2185 54 808 -903 -919 123 26 1401 -582 -1014 -505 -560 -300 100 -598 -563 -112 -748 -500 -1083 -549 -32
$$ packed form
2055h01O93m32J137p86j513J031q36J382N25P5k312L088j881O48N86K79l52j534
2073a003J108l86L33P31J30j648J49K266j794M52J767k084K91j134J978m55N97
2090A298l52k26q80J224j150R32q09N01k07j8q6O28n57O08O06k363J055m59K54
2109aJ771k353K68j13n53J558j627J77q79J128n51R05L1j537J227l58Q82j69j268
2128a462M84L20L66J332j328o51J355j461M94k13P84J6m1N56q06P35l41n00k50
2147f11j81R99m57k23l30J053L48n53K70K39j18O31j46M47m87j727J113P62j013
2166A6J50j83N07m35P12q54J362k01j065P7M08Q2j149J166K83j788q26K140l48
2185E4P54j711j6J042r7J375j983m32N09n5K60M00o98L5M51o36K48n83N34N17
$$ plain form
2205 -32 -457 -716 -256 -628 -864 -557 -428 925 116 -96 21 -520 -579 756 557 156 702 -420 63 111
$$ packed form
2205c2m25k59M60l72k36L07J29J353q09k12J17n41n9J335j99m01N46j122M83M8
$$ [...]
8191C51
##END NTUPLES=NMR FID
##END=
