##TITLE=1H_SL63(20.10)
 CDCl3, 8 sc, 
 22.10.2020
##JCAMPDX= 6.0         $$ Bruker NMR JCAMP-DX V2.0
##DATA TYPE= NMR FID
##DATA CLASS= NTUPLES
##ORIGIN= UXNMR, Bruker Analytische Messtechnik GmbH
##OWNER= root
$$ XWIN-NMR		Version 3.5
$$ Thu Oct 22 10:12:37 2020 Russian Standard Time (UT+4h)  she@DPX200
##.OBSERVE FREQUENCY= 200.1315066352
##.OBSERVE NUCLEUS= ^1H
##.DELAY= (6, 6)
##.ACQUISITION MODE= SIMULTANEOUS
##.ACQUISITION SCHEME= undefined
##.AVERAGES= 8
##.DIGITISER RES= 18
##SPECTROMETER/DATA SYSTEM= spect
##.PULSE SEQUENCE= zg30
##.SOLVENT NAME= CDCl3
##.SHIFT REFERENCE= (INTERNAL, CDCl3, 0, 15.7039)
##AUDIT TRAIL= $$ (NUMBER, WHEN, WHO, WHERE, WHAT)
$$ ##TITLE= Audit trail, XWIN-NMR		Version 3.5
$$ ##JCAMPDX= 5.01
$$ ##ORIGIN= Bruker BioSpin GmbH
$$ ##OWNER= she
$$ F:/spectra/data/she/nmr/H-F/1/audita.txt
$$ ##AUDIT TRAIL=  $$ (NUMBER, WHEN, WHO, WHERE, WHAT)
(   1,<2020-10-22 10:11:36.04 +0400>,<she>,<DPX200>,
      <created by zg, POWCHK disabled, PULCHK disabled
       configuration hash MD5:
       00 E9 B6 7A A2 85 ED C7 34 08 36 98 17 FE 4E 26
       data hash MD5: 16K
       EF E5 A5 04 B4 B8 86 B9 D6 E3 BD 8C 00 27 31 AB>)
$$ ##END=
$$ 
$$ hash MD5
$$ A2 28 9E D3 3C AE F6 5A 90 C1 D1 7E C9 72 C4 7D
##$RELAX= 
##$RELAX= 
##$RELAX= 
##$RELAX= 
##$RELAX= 
##$RELAX= 
$$ Bruker specific parameters
$$ --------------------------
##$DU= <F:/spectra>
##$EXPNO= 1
##$NAME= <H-F>
##$PROCNO= 1
##$TYPE= <nmr>
##$USER= <she>
##$AMP= (0..31)
100 100 100 100 100 100 100 100 100 100 100 100 100 100 100 100 100 100 
100 100 100 100 100 100 100 100 100 100 100 100 100 100 
##$AQSEQ= 0
##$AQ_mod= 1
##$AUNM= <au_zg>
##$AUTOPOS= <>
##$BF1= 200.13
##$BF2= 200.13
##$BF3= 200.13
##$BF4= 200.13
##$BF5= 200.13
##$BF6= 200.13
##$BF7= 200.13
##$BF8= 200.13
##$BYTORDA= 1
##$CFDGTYP= 0
##$CFRGTYP= 5
##$CHEMSTR= <none>
##$CNST= (0..31)
1 1 145 1 1 1 1 1 1 1 1 1 1 1 1 1 1 1 1 1 1 1 1 1 1 1 1 1 1 1 1 1 
##$CPDPRG= <>
##$CPDPRG1= <>
##$CPDPRG2= <>
##$CPDPRG3= <>
##$CPDPRG4= <mlev>
##$CPDPRG5= <mlev>
##$CPDPRG6= <mlev>
##$CPDPRG7= <mlev>
##$CPDPRG8= <mlev>
##$CPDPRGB= <>
##$CPDPRGT= <>
##$D= (0..31)
0 1.2 0 0 0 0 0 0 0 0.06 0 0.03 0 0 0 0 0.0002 0 0 0 0 0 0 0 0 0 0 0 0 
0 0 0 
##$DATE= 1603347095
##$DBL= (0..7)
120 120 120 120 120 120 120 120 
##$DBP= (0..7)
150 150 150 150 150 150 150 150 
##$DBP07= 0
##$DBPNAM0= <>
##$DBPNAM1= <>
##$DBPNAM2= <>
##$DBPNAM3= <>
##$DBPNAM4= <>
##$DBPNAM5= <>
##$DBPNAM6= <>
##$DBPNAM7= <>
##$DBPOAL= (0..7)
0.5 0.5 0.5 0.5 0.5 0.5 0.5 0.5 
##$DBPOFFS= (0..7)
0 0 0 0 0 0 0 0 
##$DE= 6
##$DECBNUC= <off>
##$DECIM= 32
##$DECNUC= <off>
##$DECSTAT= 4
##$DIGMOD= 1
##$DIGTYP= 9
##$DL= (0..7)
0 120 120 120 120 120 120 120 
##$DP= (0..7)
150 150 150 150 150 150 150 150 
##$DP07= 0
##$DPNAME0= <>
##$DPNAME1= <>
##$DPNAME2= <>
##$DPNAME3= <>
##$DPNAME4= <>
##$DPNAME5= <>
##$DPNAME6= <>
##$DPNAME7= <>
##$DPOAL= (0..7)
0.5 0.5 0.5 0.5 0.5 0.5 0.5 0.5 
##$DPOFFS= (0..7)
0 0 0 0 0 0 0 0 
##$DQDMODE= 0
##$DR= 18
##$DS= 0
##$DSLIST= <SSSSSSSSSSSSSSS>
$$ [...]
##$SUBNAM2= <"">
##$SUBNAM3= <"">
##$SUBNAM4= <"">
##$SUBNAM5= <"">
##$SUBNAM6= <"">
##$SUBNAM7= <"">
##$SUBNAM8= <"">
##$SUBNAM9= <"">
##$SW= 16.880792210976
##$SWIBOX= (0..15)
0 0 2 0 0 0 0 0 0 0 0 0 0 0 0 0 
##$SW_h= 3378.37837837838
##$TD= 16384
##$TD0= 1
##$TE= 0
##$TE2= 300
##$TE3= 300
##$TEG= 300
##$TL= (0..7)
0 120 120 120 120 120 120 120 
##$TP= (0..7)
150 150 150 150 150 150 150 150 
##$TP07= 0
##$TPNAME0= <>
##$TPNAME1= <>
##$TPNAME2= <>
##$TPNAME3= <>
##$TPNAME4= <>
##$TPNAME5= <>
##$TPNAME6= <>
##$TPNAME7= <>
##$TPOAL= (0..7)
0.5 0.5 0.5 0.5 0.5 0.5 0.5 0.5 
##$TPOFFS= (0..7)
0 0 0 0 0 0 0 0 
##$TUNHIN= 0
##$TUNHOUT= 0
##$TUNXOUT= 0
##$USERA1= <user>
##$USERA2= <user>
##$USERA3= <user>
##$USERA4= <user>
##$USERA5= <user>
##$V9= 5
##$VALIST= <valist>
##$VCLIST= <CCCCCCCCCCCCCCC>
##$VD= 0
##$VDLIST= <DDDDDDDDDDDDDDD>
##$VPLIST= <PPPPPPPPPPPPPPP>
##$VTLIST= <TTTTTTTTTTTTTTT>
##$WBST= 1024
##$WBSW= 4
##$XGAIN= (0..3)
0 0 0 0 
##$XL= 0
##$YL= 0
##$YMAX_a= 378470
##$YMIN_a= -331733
##$ZGOPTNS= <>
##$ZL1= 120
##$ZL2= 120
##$ZL3= 120
##$ZL4= 120
##$ABSF1= 10
##$ABSF2= 0
##$ABSG= 5
##$ABSL= 3
##$ALPHA= 0
##$AQORDER= 0
##$ASSFAC= 0
##$ASSFACI= 0
##$ASSFACX= 0
##$ASSWID= 0
##$AUNMP= <proc_1d>
##$AZFE= 0.1
##$AZFW= 0.1
##$BCFW= 1
##$BC_mod= 2
##$BYTORDP= 1
##$COROFFS= 0
##$CY= 11.3945322036743
##$DATMOD= 1
##$DC= 2
##$DFILT= <>
##$DTYPP= 0
##$F1P= 16.9975609425685
##$F2P= -3.02152046262296
##$FCOR= 0.5
##$FTSIZE= 0
##$FT_mod= 4
##$GAMMA= 1
##$GB= 0.15
##$INTBC= 1
##$INTSCL= 1
##$ISEN= 128
##$LB= 0.24
##$LEV0= 0
##$LPBIN= 0
##$MAXI= 10000
##$MC2= 0
##$MEAN= 0
##$ME_mod= 0
##$MI= 1.114404
##$NCOEF= 0
##$NC_proc= 0
##$NLEV= 6
##$NOISF1= 3.799351
##$NOISF2= 2.8
##$NSP= 1
##$NTH_PI= 0
##$NZP= 0
##$OFFSET= 15.70392
##$PC= 1
##$PHC0= -10689.41
##$PHC1= 12.60089
##$PH_mod= 1
##$PKNL= yes
##$PPARMOD= 0
##$PSCAL= 0
##$PSIGN= 0
##$REVERSE= no
##$SF= 200.130013532006
##$SI= 16384
##$SIGF1= 3
##$SIGF2= 2
##$SINO= 400
##$SIOLD= 16384
##$SREGLST= <1H.CDCl3>
##$SSB= 0
##$STSI= 0
##$STSR= 0
##$SW_p= 3612.71676300578
##$SYMM= 0
##$S_DEV= 0
##$TDeff= 0
##$TDoff= 0
##$TI= <>
##$TILT= no
##$TM1= 0
##$TM2= 0
##$TOPLEV= 0
##$USERP1= <user>
##$USERP2= <user>
##$USERP3= <user>
##$USERP4= <user>
##$USERP5= <user>
##$WDW= 1
##$XDIM= 8192
##$YMAX_p= 0
##$YMIN_p= 0
$$ End of Bruker specific parameters
$$ ---------------------------------
##NTUPLES= NMR FID
##VAR_NAME=  TIME,          FID/REAL,        FID/IMAG
##SYMBOL=    X,             R,               I
##VAR_TYPE=  INDEPENDENT,   DEPENDENT,       DEPENDENT
##VAR_FORM=  AFFN,          ASDF,            ASDF
##VAR_DIM=   8192,          8192,            8192
##UNITS=     SECONDS,       ARBITRARY UNITS, ARBITRARY UNITS
##FACTOR=    0.000296,      1,               1
##FIRST=     0,             0,               0
##LAST=      2.424536,      0,               0
##MIN=       0,             -331733,         0
##MAX=       2.424536,      378470,          0
$$ Real data points
##PAGE= N=1
##DATA TABLE= (X++(R..R)), XYDATA
0 0 0 0 0 0 0 0 0 0 0 0 0 0 8 -8 8 -16 16 -16 24 -32 34 -40 51 -61 72 -84 97 -115 132 -154 176 -202 228 -260
34 -260 296 -335 377 -422 474 -529 592 -659 732 -812 897 -995 1101 -1213 1338 -1473 1621
51 1621 -1786 1968 -2169 2391 -2640 2920 -3237 3602 -4021 4512 -5098 5807 -6684 7806 -9289
66 -9289 11338 -14339 19056 -45690 378470 -27453 -145373 337757 -184882 -167548 203226
77 203226 -17341 -49987 65516 -70613 -37480 -5271 34313 57031 -63074 -22130 60442
88 60442 -53780 75010 118755 -83705 -20628 384 -102420 35522 51126 -30071 21355
99 21355 24808 -15579 13306 43196 -20268 -26425 60450 -23238 -38293 64194 -55789 -61521
111 -61521 75988 -43009 -32780 105377 -18949 -1422 85832 -77640 -29984 37935 -88763
122 -88763 35455 45783 -92138 56764 17535 -85081 82852 7001 -66808 81548 -13880
133 -13880 -45122 62900 -54513 -42800 26295 -73798 19760 64087 -36061 58119 19646
144 19646 -74168 43430 -2085 -54069 43351 -21859 -32889 45356 -22961 -20282 20459 -21275
156 -21275 25349 46688 234 9981 -8454 -22993 -11719 -13396 1052 -18495 7761 41647
168 41647 -9039 31163 25096 -53404 21264 9357 -32726 62730 -7586 -54732 32412 -48184
180 -48184 -23833 84132 -26737 2161 68387 -55015 18150 47301 -81602 9116 1963
191 1963 -59261 67205 3897 -39149 52497 -43077 -17860 70195 -37815 4349 51245 -62484
203 -62484 -2627 27125 -68529 5877 22953 -42089 36456 32292 -16372 23240 -11819 -32963
215 -32963 1038 -2737 4674 2702 -8001 -12021 -15251 8998 5189 3152 22137 -1926 6721 19252
229 19252 -23987 -5987 -3157 -43517 14959 18665 -22804 50548 11043 -40172 46749 -16508
241 -16508 -28917 63758 -32749 -18720 47658 -54189 2449 35527 -58610 30154 41048 -32383
253 -32383 57036 11755 -60762 35925 -17289 -44567 55526 -23710 -24747 54209 -31973 -1221
265 -1221 42598 -37925 11295 23964 -29678 19326 6320 -29853 -795 -16740 -19825 13870
277 13870 15332 13201 8622 -3930 -6687 -11492 1028 1202 -16374 3106 -4097 -12878 16368 -11909
291 -11909 -7634 16547 -21542 20107 26549 -28298 26448 -7951 -59020 32189 -7219 -35576
303 -35576 60272 -11789 -33397 60945 -19945 -21673 49519 -41029 -10546 45402 -32502 11659
315 11659 12987 -49818 21397 9870 -13572 48369 -4510 -15032 33970 -24939 -12358 23395
327 23395 -34002 -813 28417 -21261 15521 20847 -26294 7526 11168 -9885 15139 10797 -10947
340 -10947 -14212 -1655 -4691 -14592 15771 2315 -15954 29044 7366 -15143 18542 -18607 -25312
353 -25312 20743 -12161 -6134 24007 -26034 -3316 17518 -31858 18659 19511 -26570 33182 -6576
366 -6576 -37098 30915 -26125 -19097 38996 -34840 -213 42136 -33710 14294 30666 -46618
378 -46618 9832 19125 -37132 28371 17403 -36154 14172 -9459 -20070 36434 3377 350
390 350 16852 -21292 4472 15617 -13729 1436 -6372 -14715 14708 16665 4101 -644 -9012
403 -9012 -6073 7026 16585 7744 -9753 -5925 -8936 -6292 18950 -4271 -13382 14025 -12977 7587
417 7587 37608 -22512 -8318 7109 -39890 18694 29689 -29187 12922 -5468 -37494 35372
429 35372 8110 -21749 27259 -22679 -16540 39179 -21450 -9690 14147 -40752 9424 26394
441 26394 -20703 21213 1209 -30660 22003 -3684 -16527 26054 -14277 -14680 23670 -15369
453 -15369 -5852 17742 -17301 428 17314 -3123 4862 3518 -6573 -5406 1340 4512 -7100
466 -7100 4513 8847 -6512 11346 3180 -14692 10529 2880 -4975 18674 -6066 -14209 15254
479 15254 -10451 -2822 22597 -20162 1566 22222 -20143 17349 10464 -33492 16524 317
491 317 -20277 31300 -7293 -20393 23283 -16877 -8560 29749 -18655 -5901 21839 -25242 5326
504 5326 19333 -30987 5975 5998 -21242 23047 2836 -17612 10639 -10077 -4849 13357 -6400
517 -6400 -5230 298 -3494 2210 3981 -1205 -6935 -3461 3829 1777 4271 5191 -9006 -4195 5005
532 5005 -6721 8738 7193 -13904 10727 -1986 -10714 24486 -11159 -9687 23413 -20620 3218
545 3218 27326 -25072 4233 17111 -25192 13430 15334 -22896 14735 5028 -18112 20717 -5287
558 -5287 -12642 22083 -14852 -922 21680 -22491 4857 13841 -24198 10269 10885 -18644 8797
571 8797 5900 -15182 6139 6942 -8967 1367 1802 -7177 200 2959 -1952 -3992 -2229 -117 -1767
586 -1767 3034 1399 -4182 -131 -3259 175 2345 -6158 2367 -1797 -9283 9820 -245 -7935 13957
601 13957 -6814 -9573 18659 -9116 -6362 18290 -18616 -3241 20003 -17799 6726 15387 -22345
614 -22345 11882 11754 -17301 17770 1843 -19253 16947 -3378 -11778 19294 -7646 -5049 17812
627 17812 -9782 1734 12863 -10098 4452 3833 -9272 6282 -180 -3472 3904 -5138 -240
640 -240 5350 -1317 3750 3622 -4150 -1274 39 -4504 -2845 804 -1168 -5021 2894 5219 -8856
655 -8856 5634 6235 -16765 9530 6082 -19626 13163 -1923 -22236 14904 -2963 -11244 18488
668 18488 -5407 -6621 14395 -9565 -2372 8731 -14961 2772 6268 -14867 11118 2205 -15245
681 -15245 17094 -1019 -10216 19946 -5249 -7551 14518 -10107 -7684 8902 -7803 -781 10898
694 10898 -1214 2558 6826 -2483 1829 1839 -1642 3024 -2456 -1693 1629 -2812 1169 1368 145 1611
710 1611 4209 7519 -2053 111 2355 -12521 732 4647 -13020 5846 7376 -10937 10023 5270
724 5270 -14932 9431 3838 -11750 12445 -3816 -15820 7834 -9167 -5949 13218 -8552 1985
737 1985 10914 -8580 8089 4386 -16721 1724 -2220 -11169 12426 1268 -11293 6087 -4172
750 -4172 -2874 15050 -489 -1031 3832 -7671 2177 1997 -8114 -1184 -3296 -1403 9910 8660
764 8660 1572 -345 -8 -3452 1339 7947 -3756 -6040 2816 -4589 -1852 10367 -3255 -3398 12287
779 12287 -541 3350 12919 -11639 -6476 2484 -12228 5200 6626 -8286 6870 1672 -2756
792 -2756 11309 -3909 -5335 7290 -7538 502 8728 -16208 -4954 4413 -12828 8602 11748
805 11748 -8850 7606 3770 -8422 4491 -4282 -10643 -353 -3434 -392 5682 -2986 -3205 1976
819 1976 -1654 3728 8426 -1819 -3162 -345 -5678 -4781 -580 -3489 -4604 5889 8089 2846 7011
834 7011 -526 -8032 2950 -600 -964 5709 -6792 -3947 4214 -4592 3706 7663 -4625 6963
848 6963 10356 -3274 5952 -1178 -15941 1152 -1493 -5355 13548 -14 -4121 11347 -3114
861 -3114 -292 9534 -6689 -1561 5357 -6070 -153 -1160 -10656 373 1071 599 12876 2627
875 2627 -2654 5271 -6951 -6684 2940 -8003 -5896 4331 -1057 -1078 4476 -679 -5087 3499 5149
890 5149 -1563 4181 652 -10990 -3771 -2560 -8390 3406 3658 -1887 9515 4319 -2139 4929 -5676
905 -5676 -5507 3347 -4854 1782 2982 -7950 1695 214 -4009 10713 4698 -871 11118 -1515
919 -1515 -6856 4531 -9376 -8461 6928 -3410 2496 12588 -2004 1710 4884 -4922 2331 4863
933 4863 -3138 -195 -352 -6406 -2490 317 -3479 2846 6885 3824 6280 3127 -3673 -4952 -5760 -4351
949 -4351 -2432 329 930 -827 444 -87 1802 1269 -404 4384 -715 -1905 3228 -9073 -9515 316
965 316 -6932 -623 11700 865 781 8818 -5222 -4682 4788 -7979 -3493 4066 -5681 1989 1192
980 1192 -5502 2751 -669 3078 11037 534 2279 2608 -9740 -3276 862 -7957 1237 7281 -1142
995 -1142 6376 7652 -3720 373 2304 -2013 2155 2943 -1342 -4084 -2820 -2020 -2458 3733 4666 3019
1011 3019 6700 3376 1221 -2266 -7507 -3274 -4276 -2984 5890 21 -2522 4985 -1882 -2929 7055
1026 7055 250 -2518 5580 -2948 -6746 -1055 -7479 -6241 1327 1652 5331 5615 1609 1247 -3159 -4513
1042 -4513 -254 -4039 -3766 3449 -2479 -3611 4058 -3771 -2863 7477 1642 1815 7755 -1843 -5355
1057 -5355 -1485 -6367 -5437 1633 2115 3030 5752 3546 1531 -82 -117 162 -148 980 1319 -1530 -1850
1074 -1850 -1872 -2128 -1235 3438 5863 4001 6513 3122 -4692 -2100 -3195 -6181 984 1401 -1332 4193
1090 4193 1654 -1930 3062 -933 -1091 5283 195 126 1083 -7998 -4959 -2696 -4784 3859 4686 1750
1106 1750 4937 1988 -1913 -997 -3949 -5480 -1071 364 -442 538 -1879 -3281 -594 1676 3604 4152
1122 4152 2528 53 -2341 -3244 -4888 -4340 -2921 -979 4521 4755 3755 3906 -2340 -2116 1596 -522
1138 -522 1227 1378 -2449 -2369 13 -1602 -619 2406 1115 4932 7279 2204 1481 -3063 -7104 -1724
1154 -1724 -780 -372 3901 1201 -468 3042 1287 -556 1975 238 -1120 4177 559 -3329 -2294
1169 -2294 -6303 -3739 1947 2824 4276 3065 1309 -260 -1522 -1256 -3738 -3819 -1089 -751 751 776 -1399
1186 -1399 -2992 -1433 2014 2600 3464 2426 -2384 -3762 -2582 -3831 -3995 -361 533 1095 6303 3600
1202 3600 -1167 699 -2778 -2804 2794 637 -680 -161 -2732 -2713 434 1266 1194 3677 3897 3378 2696 -758
1220 -758 -3742 -4592 -2648 536 1547 3626 2709 61 1206 1155 20 1357 1753 -242 354 957 -2522
1237 -2522 -3087 -1931 -2470 899 4822 4029 2485 1060 -1736 -3451 -1667 -1067 -1972 -41 821 -719
1253 -719 -114 -234 -1537 -1061 1223 2291 1375 1780 -1616 -4448 -3560 -3397 -1915 978 1880 1260 1542 1614
1271 1614 -446 -1449 -772 -2333 -837 1383 206 -1034 -1743 -1894 -1921 1377 3336 3061 2940 1018 -700
1288 -700 -1147 -2005 -1828 -1614 -375 1860 2783 2749 1466 -78 -676 346 2115 1626 453 -1 -1757 -2159
1306 -2159 -750 -107 -203 1569 3116 2482 2588 1394 -2753 -2805 -1669 -1433 1122 1220 158 -616 -1051 447
1324 447 -161 67 926 -245 391 1742 -1440 -3460 -2204 -3576 -1473 3389 1844 784 1460 -1264
1340 -1264 -1959 136 -694 -1779 -339 -64 -370 822 -922 -2423 -1669 -195 2859 3169 1601 343
1356 343 -1949 -2413 -463 -999 -576 1186 1133 1387 2819 1067 -1082 -196 -313 756 3267 1190 -361
1373 -361 -1042 -2317 -466 1085 701 1667 2226 1393 1573 1254 -2135 -2304 -315 -1157 1785 2913 -1222
1390 -1222 -167 100 -2350 1384 1562 -792 1068 826 -1672 -153 -1757 -3624 -134 -655 874 3735
1406 3735 -793 -722 182 -3625 -469 691 -2067 380 427 -1858 -194 86 -2353 -997 1237 -142
1422 -142 1521 1735 -1897 -970 -848 -1896 672 616 -436 1664 893 -472 1159 -940 -1801 1784 282
1439 282 347 2818 -1232 -1097 1590 -1988 472 2922 -510 1764 2747 -1440 287 929 -2926 1118
1455 1118 2218 -1255 2278 1550 -2405 1279 -113 -2065 1977 779 -253 1769 -452 -1722 -260
1470 -260 -1259 -701 2047 -565 691 1364 -2574 523 220 -3589 1041 957 -2089 2372 272 -3790 -87
1487 -87 -503 -2229 1237 1393 -1852 248 218 -2086 -153 578 -1829 189 1369 265 565 -715 -1923
1504 -1923 -574 -254 892 2456 -936 347 1929 -2500 843 1899 -3235 1622 2136 -2188 2378
1519 2378 1804 -3345 1127 1303 -906 3209 883 -1190 1477 -682 -324 1429 -1187 261 1594 -265
1535 -265 941 1459 -1852 -419 1203 -785 528 1258 -1757 -864 870 -1427 112 771 -1100 463
1551 463 1007 -601 645 -903 -1998 -266 -853 -984 1944 -1745 -1307 1955 -1563 -163 2345 -2245
1567 -2245 -1167 1829 -1689 -1370 1354 -2282 -2155 2019 -558 -63 2748 -1418 -374 1111 -1686 682
1583 682 182 -2015 1000 20 -438 2561 -547 -674 3172 -45 -372 3558 -1408 -1226 2274 -2429 -225
1600 -225 2509 -1645 793 2137 -167 1833 1489 -564 -157 -56 -587 620 -148 -1714 359 126 -633
1617 -633 2284 647 -880 1996 -404 -1863 1569 -1508 -3186 960 -1114 -2373 3096 -548 -1857
1632 -1857 2843 -1086 -985 2609 -1738 -2304 -162 -2223 -517 830 -1368 249 -15 -473 2115 58
1648 58 -850 1212 -1994 -1924 2282 -2190 -2226 2029 -1807 -580 4985 -211 -729 2795 -1145 -1129 2961
1665 2961 -1376 -2555 1302 -1339 -298 3074 367 32 1647 590 1572 1673 -641 -996 -1531 -1368
1681 -1368 1292 342 -882 1495 267 10 3889 846 -1967 1075 -676 -2228 2175 -837 -3098
1696 -3098 569 -818 -355 3378 123 -287 1337 -1400 204 253 -3587 -1025 -895 -2686 2562 825
1712 825 -2542 2018 602 -1706 3600 469 -3399 247 -1272 -3016 1448 -765 -2498 1464 1417 864
1728 864 2576 451 -1071 -255 -697 50 503 -1684 -541 208 -907 2490 1774 -902 2151 1957 -940
1745 -940 2167 171 -4353 -291 61 -1892 2990 1588 -1348 2891 1097 -268 3033 -737 -2072
1760 -2072 1438 -1809 -646 1776 -2973 -1291 2327 -714 2215 3572 -1729 -9 778 -3064 -272
1775 -272 -470 -3601 -314 469 -838 1701 544 -1635 1059 263 -172 1556 -1604 -2721 -607 -2774
1791 -2774 -1291 1454 -1608 434 3292 -410 949 2317 -2775 -1931 1095 -2867 -380 1986 -2668
1806 -2668 -754 2066 -1463 1882 3180 -532 1730 1282 -1794 -231 -1322 -3131 739 402 -4 3748
1822 3748 1203 97 3089 -751 -792 2208 -1819 -712 1474 -2373 -739 1258 -1746 1327 3261
1837 3261 -378 2376 2440 -2249 187 -529 -4059 303 71 -1690 2373 532 -1438 2130 343 -867
1853 -867 2298 -252 -2032 600 -2139 -3276 102 -1853 -1140 2892 433 1112 2925 -1246 -1106 368
1869 368 -3382 -831 678 -2794 95 1225 -2308 1223 1608 -1351 2957 1868 -1381 1456 -1655
1884 -1655 -3750 300 -1940 -1452 3375 371 811 4140 -589 -220 2289 -1919 -492 2039 -2399 -657
1900 -657 1306 -3111 116 2695 -638 2663 3706 -396 1196 484 -3347 -925 -833 -2295 1184 997
1916 997 -411 2518 -338 -750 2523 -1001 -138 2107 -2286 -2084 642 -3874 -1995 2210 -1391 993
1932 993 4195 -484 468 1326 -3198 -1835 53 -2677 -232 603 -2310 1071 483 -1699 2349 1031
1948 1031 -969 3143 -271 -2412 643 -3419 -3320 1824 -621 547 4032 -71 441 2591 -1435 -329
1964 -329 1218 -2111 -136 1082 -1669 -201 250 -1636 1759 2609 1258 3292 1233 -2000 223 -1813
1980 -1813 -3212 1251 -125 -1783 3047 978 -752 3200 -248 -1991 2619 -448 -786 2070 -2733
1995 -2733 -3014 102 -2075 708 3267 -118 1954 1872 -1725 475 -707 -3945 -470 -716 -2006 2051
2011 2051 304 -2528 1250 229 -636 3372 632 -1902 942 -1679 -2954 180 -2682 -1864 2686
2026 2686 766 1780 3421 -2008 -880 1204 -1950 672 1675 -3358 -56 1114 -2158 1160 1377
2041 1377 -1167 2382 2802 567 2103 -452 -3480 -922 -1152 -978 2838 328 -518 2855 101 208
2057 208 2694 -1277 -1018 2469 -1119 -402 927 -4065 -1351 1804 -1232 2955 3893 -1626 1052 1146
2073 1146 -3509 -21 -707 -3506 703 937 -988 1331 -554 -1591 1232 94 818 2180 -1933 -1772
2089 -1772 -35 -3008 -1675 1211 -1906 428 3939 107 628 1544 -3158 -989 1433 -1565 821
2104 821 447 -2975 534 551 -1498 2403 1077 -686 3227 1389 -968 457 -2428 -3082 998 218
2120 218 724 2892 -457 -114 2346 -856 398 1980 -1665 155 2192 -1849 -618 350 -2825 721
2136 721 3282 752 2650 1210 -2399 424 -461 -2311 1051 -929 -1879 2446 114 -1363 1960 -1416
2152 -1416 -1635 2783 297 -208 1083 -2388 -2572 -170 -2055 -330 1584 -657 1698 2151 -1612 2
2168 2 -32 -3132 72 1120 -2186 765 195 -2787 896 682 -960 2696 975 -905 2272 -1377 -2563
2185 -2563 295 -1900 -970 3062 -83 196 2773 -1035 -296 1875 -1611 334 1884 -1309 522 1075
2201 1075 -2562 21 1085 -1185 2880 2510 -603 1965 96 -2958 907 -476 -1726 1817 -47
2216 -47 -1139 2238 -957 -1350 1794 -1082 -18 2661 -1224 -1115 602 -3053 -1494 1126 -1619 937
2232 937 2612 -1120 691 662 -2791 106 178 -2152 1239 178 -2081 1191 -880 -1949 2047 109
2248 109 -547 2910 -350 -1820 993 -2184 -2365 1530 -965 257 2813 -594 -52 1624 -1818 94
2264 94 1388 -1245 753 1060 -1738 461 -81 -1993 1636 1365 -379 3121 619 -1796 1273 -936
2280 -936 -2077 1728 -297 -914 2567 -488 -768 1828 -985 -531 2081 -759 31 1459 -1965 -670
2296 -670 452 -2332 59 1602 -807 1316 1178 -1972 296 -484 -2484 1330 350 -1730 1481 -424
2312 -424 -2200 1232 -622 -1329 2115 -563 -705 1599 -1248 -1328 400 -2144 -782 1493 -613 473
2328 473 1572 -1420 20 822 -1767 1020 1157 -1510 954 564 -1898 961 32 -1740 2157 1346
2344 1346 -601 1921 -156 -1782 881 -494 -623 2329 -427 -186 2015 -706 -98 1468 -1503 318
2360 318 2154 -824 599 809 -2368 201 912 -1392 1859 1421 -1426 1231 381 -2227 566 -533
2376 -533 -1977 1674 472 -1315 1033 -1447 -2074 1431 -486 -578 1740 -1272 -799 1071 -2000 -677
2392 -677 574 -1754 463 1860 -1164 115 411 -2610 861 887 -1128 1479 319 -1781 1056 173
2408 173 -1651 1161 -210 -757 2062 519 -900 1226 -1368 -1020 1957 -162 173 1527 -1276 -257
2424 -257 1663 -1067 280 1300 -1668 1230 1730 -1285 589 -93 -2155 1367 1229 -957 1517 40
2440 40 -1744 1175 -21 -1368 1227 -806 -911 2014 -200 -1080 324 -1501 -985 1929 -403 -576
2456 -576 1092 -1566 -697 1491 -1324 -284 1045 -1855 363 1290 -1672 5 -110 -1830 1368 707
2472 707 -1016 991 -373 -1577 1393 -667 -1332 1175 -664 -313 2024 -730 -756 1037 -1077 183
2488 183 2472 -608 -201 999 -1380 138 1361 -974 140 1318 -868 911 1610 -1342 217 389
2504 389 -1017 1641 757 -947 1200 -657 -1155 1797 -183 -624 1911 -926 -377 1591 -1479 -810
2520 -810 640 -1497 97 1654 -902 -89 678 -1714 229 1124 -1173 119 197 -1567 557 39 -1775
2537 -1775 482 102 -902 1531 -159 -910 1070 -1272 -1347 1491 -1213 -1004 1332 -1089 -217 1424
2553 1424 -1185 150 1256 -709 586 1002 -1006 -133 68 -1308 458 608 -772 1109 822 -558
2569 -558 1398 580 -757 886 -166 -876 1317 -317 -780 1448 -574 -588 2183 -349 88 1342 -968
2586 -968 -380 796 -1835 -286 1094 -1083 677 957 -838 874 766 -1187 748 -70 -1436 393
2602 393 -311 -1575 595 -78 -948 1310 49 -482 1614 -691 -918 919 -1086 -804 886 -1415 -51
2619 -51 1195 -893 341 1061 -849 613 1096 -1110 380 176 -1369 573 225 -1072 1218 518 -359
2636 -359 1653 388 -785 1379 -246 -1116 747 -908 -1065 1287 -514 -139 1748 -360 201 1759
2652 1759 -574 210 919 -1365 -249 619 -1402 260 1026 -893 1188 816 -696 1217 360 -944
2668 -944 881 -573 -1348 609 -512 -956 992 -439 -546 1221 -257 -97 798 -1222 -844 296 -1634
2685 -1634 -549 559 -1190 139 1039 -780 721 805 -942 289 20 -1467 121 -51 -1770 671
2701 671 92 -443 1394 181 -126 1264 -33 -967 749 -927 -951 691 -864 -259 1274 -118 538
2718 538 1667 -131 405 1073 -1292 97 605 -1259 336 522 -966 1104 1033 -421 1572 505 -442
2735 -442 1144 9 -910 67 -1241 -925 1038 -257 -139 1234 -357 119 1296 -733 -172 483 -1293
2752 -1293 -410 441 -1320 -622 368 -874 1139 1307 -527 463 -69 -1510 309 -395 -1506 -135 -532
2769 -532 -809 1122 227 -304 987 -166 -38 947 -648 -948 -10 -1750 -363 996 -402 393 1209
2786 1209 -515 983 1474 -937 -32 363 -1513 470 52 -1174 541 232 -236 1538 821 57 1209
2803 1209 18 -606 581 -987 -812 315 -615 216 1362 -29 82 862 -117 660 785 -1213 -303
2820 -303 -100 -1298 -138 163 -1250 386 770 -289 1325 562 -1139 92 -643 -1197 125 -416 -780
2837 -780 553 -419 -107 1240 -259 -97 1003 -396 3 613 -1335 -1060 -76 -1090 422 1072 -157
2854 -157 421 925 -183 425 213 -1260 -13 -172 -815 732 -95 -774 856 113 562 1747 330 -288
2872 -288 765 -562 -681 357 -964 -508 620 -268 1000 1563 -418 235 753 -451 -90 526 -887
2889 -887 -487 -102 -707 49 553 -121 1024 758 222 951 -396 -1048 -21 -1118 -847 651 -779 -577
2907 -577 942 -372 -136 1189 -716 95 558 -1181 -437 -223 -1568 -265 -59 -167 1033 917 122
2924 122 1004 64 -668 326 -279 -823 308 -361 -539 608 201 -150 1208 469 410 1067 -163 -656 201
2943 201 -1297 -642 488 -744 371 1111 170 544 907 -575 339 348 -397 471 -151 -1026 179 -251 -591
2962 -591 1099 677 446 1156 256 -470 133 -520 -1347 -44 -322 -541 529 104 114 638 -303 82 574
2981 574 -397 111 -128 -1192 -402 -442 -1109 354 175 -65 1113 247 -541 324 -366 -1058 -1 -436 -599
3000 -599 129 -273 -133 373 110 -41 997 393 303 247 -779 -701 -408 -953 -15 731 -184 1012 915 -516
3020 -516 378 421 -552 323 133 -841 360 52 -1014 447 184 110 1219 460 -67 471 -623 -340 -20
3039 -20 -836 -151 207 -215 146 460 -73 -122 612 -321 238 528 -802 -248 -395 -1274 -182 27 -195 846
3059 846 691 337 368 -279 -664 -403 -848 -573 66 -428 -338 286 -514 -252 710 7 476 669 -457 -566
3079 -566 212 -912 -666 272 -285 292 1059 216 523 480 -399 364 168 -148 487 47 -665 -53 -219 -47
3099 -47 756 368 135 928 -62 80 91 -886 -791 64 -419 220 873 44 176 283 -109 347 675 -536 87
3120 87 231 -689 -308 -328 -617 137 502 417 898 176 -624 -208 -747 -846 -31 -386 -465 160 -331 -402 411 -253
3142 -253 -141 484 -176 201 467 -841 -673 -557 -903 -43 508 46 524 673 -199 168 -145 -462 377 293
3162 293 -70 235 -278 -368 170 -91 441 1074 280 318 515 -249 -73 18 -587 -10 503 346 417 593 -250
3183 -250 128 352 82 282 239 -240 -79 -343 -460 -54 -171 -201 575 417 504 473 -422 -570 13 -379 -179
3204 -179 188 -391 -347 294 -505 -59 33 -215 122 614 -300 -381 -286 -1237 -589 49 -4 533 284 -127 265 -204
3226 -204 -73 319 -249 -256 198 -111 -39 317 -291 -405 400 66 419 573 -69 -93 -17 -369 78 -87 128 363
3248 363 605 210 346 46 -218 36 271 130 573 58 -498 34 -102 -494 292 122 42 724 145 -269
3268 -269 90 -336 -298 -91 -155 -87 310 -257 -43 43 19 30 -82 -191 -159 -26 -442 -302 -372 -380 57 167 153 563
3292 563 10 -378 44 -167 -333 374 -131 -24 456 225 -301 109 -175 -183 437 -172 183 35 -147 -296 -59
3313 -59 -210 32 46 141 361 265 -164 217 130 -199 193 265 115 192 -29 -216 -134 90 240 529 183 321 204
3336 204 -29 -186 77 -232 -13 351 -28 57 186 -391 87 87 -319 263 35 12 -137 -414 -499 -353 -290 -220
3358 -220 67 49 -122 151 -315 -426 81 71 24 182 -129 -68 187 -328 -223 229 -175 -85 252 -469 -29 -31
3380 -31 -333 -63 -60 73 403 192 -233 211 215 -276 380 244 207 329 89 112 98 -182 -190 18 -109 350 335 72
3404 72 16 -120 -23 223 276 77 330 367 -20 -69 -44 -359 -195 191 235 297 140 -206 -150 -280 -75 177 -114
3427 -114 -30 61 -467 -273 -286 -301 -154 145 -17 129 272 -54 -286 -118 -309 -117 -46 -9 131 12 -290 -236
3449 -236 181 -180 117 338 -130 -41 61 -156 157 97 -83 280 446 631 213 149 -63 -124 174 -65 121
3470 121 -159 205 -33 212 320 219 16 490 411 442 -148 -76 -195 -234 -193 81 133 143 94 28 -67 68 103 -7
3494 -7 -25 439 -241 -348 152 -505 -97 -174 50 413 197 -276 -124 -111 -290 -294 -354 -421 -111 -217 179 -93 -102 59
3518 59 32 128 -190 -32 -270 58 -131 -93 -349 -150 91 296 194 170 200 -81 -364 -412 13 -143 128 231
3540 231 10 170 44 33 390 495 461 158 -73 -110 -147 -289 -396 -188 197 107 287 243 176 306 -238 4
3562 4 41 17 -39 43 32 -241 197 27 -65 452 -48 341 44 -85 -20 -330 -161 -338 -323 23 88 -14 88 94
3586 94 346 -146 -10 -59 -127 -254 -298 -373 -413 -205 -108 -140 -114 106 178 -100 -118 -152 -141 -250 -265 -292 -56 -194 -342
3611 -342 166 234 211 326 -77 -173 70 45 -231 -239 41 -65 174 452 209 216 205 176 -139 17 189 -357 -247
3634 -247 -326 -231 129 146 258 156 343 222 184 353 41 -374 -394 -104 -213 74 -77 -81 -163 510 76 228 342
3657 342 -100 -165 -153 -206 -239 -398 -149 62 176 83 51 162 -148 -235 -12 -440 -367 -144 -103 -94 126 -4 250 154
3681 154 363 156 109 -44 -39 -159 -166 -153 -181 -418 -19 203 360 657 365 305 173 37 -161 33 -22 -323 -153
3704 -153 -288 166 247 87 421 248 212 47 -150 -151 -231 -337 -281 -25 45 163 118 90 68 311 21 -217 -143 -130
3728 -130 -205 -311 -344 -196 -65 34 24 252 417 162 136 -72 -370 19 -384 -555 -189 -61 123 54 29 -85
3750 -85 211 12 164 -8 -287 -274 -169 -13 3 -107 196 171 -24 166 382 361 63 69 -139 -219 -233 -320 -13
3773 -13 3 87 491 270 219 13 36 -59 47 -171 -233 -165 -234 -26 133 259 509 231 249 326 196 72 -315 -441
3797 -441 -291 -225 -245 27 11 227 -95 -41 393 213 63 -254 -64 -253 -352 -456 -264 99 -128 59 367 194
3819 194 84 57 -286 -180 -106 -339 20 -195 -352 -12 209 86 469 110 283 339 -134 58 -118 -447 -505
3840 -505 -104 127 201 379 121 402 469 63 78 32 -214 219 -256 -224 -11 -25 8 364 408 289 221 309 -124
3863 -124 -229 -232 -306 -156 48 73 26 81 14 153 13 -73 201 -212 -104 -212 -504 -323 -282 -135 150 86 111 33
3887 33 157 -129 -87 -159 -133 -96 -280 -277 215 51 151 252 -119 -78 479 165 188 -160 -264 -81 -48 -179 -315
3910 -315 252 474 470 260 146 201 -41 24 217 161 -128 -28 104 -80 -158 233 274 358 320 290 181 204 -120 -176
3934 -176 -36 -349 204 -108 -14 298 207 244 323 220 206 -68 -316 -117 77 -406 -293 -456 -27 143 122 -94
3956 -94 187 129 -278 -163 -313 -298 -191 8 -15 158 105 -47 -138 -14 -59 -82 -136 -22 -108 -250 -121 -137 1 -93
3980 -93 408 300 312 239 1 69 -27 -50 -167 -7 -99 -281 134 -13 276 215 280 327 406 -60 -83 -356 -278 63
4004 63 -210 130 199 284 16 280 -10 58 411 -52 -17 57 -225 1 -152 -45 42 128 267 -37 21 -234 -80
4027 -80 93 -399 -202 2 -189 -193 -129 -138 10 -17 2 29 -237 -128 47 -523 -308 -402 -220 -226 -102 89 74 208
4051 208 33 275 234 -214 60 -59 -93 -131 -154 -21 44 -8 137 379 229 14 134 96 -146 85 -95 -265
4073 -265 103 225 314 442 339 329 56 -29 249 -5 -1 -100 42 -223 132 27 -2 378 278 -97 14 -147
4095 -147 101 -56 -222 -239 71 -4 -156 112 58 64 99 51 97 81 -453 -174 -267 -572 -136 -210 -166 178 182 -146 36
4120 36 135 82 11 13 -237 -8 171 -191 58 -348 8 211 89 244 373 93 -64 -172 -188 -71 74 -70
4142 -70 156 20 301 287 349 97 211 -47 301 37 -83 -26 -247 142 14 223 7 -33 129 317 16 -302
4164 -302 -106 -24 -169 -85 254 337 -166 54 214 50 -84 260 -69 53 -98 -121 -159 -162 -353 19 -22 -137 313
4187 313 70 -85 -252 -130 -415 -60 6 -179 -113 15 77 67 -34 -159 136 -62 -72 -56 -185 80 -244 -109
4209 -109 216 297 -37 345 371 -128 199 26 36 171 147 -48 -47 58 -130 -76 201 452 51 194 58 -84
4231 -84 -90 45 100 49 -209 30 325 38 -60 -95 -259 16 -50 -135 236 -20 -157 -198 -125 -114 10 -44 7 -9 -32
4256 -32 81 -90 -255 -203 44 -121 68 163 -356 140 -206 11 -123 12 -183 -154 -93 -14 145 -6 -197 -146
4278 -146 -116 212 120 1 -32 -84 -127 173 -34 -15 346 -256 75 43 -168 79 165 275 194 -167 115 86 83 63
4302 63 -3 318 294 178 171 329 -16 277 -5 150 204 -69 196 43 -235 -2 -121 -220 103 -66 -2 143 -227
4325 -227 75 93 -122 -87 -50 -31 112 290 5 -196 -126 -104 209 -25 -44 -97 82 -324 210 240 -304 377 155
4348 155 -293 49 -199 -43 -78 96 -191 156 44 -54 50 160 75 -113 -82 -93 -15 114 -113 -100 -100 -92 194 -206
4372 -206 46 98 65 228 -7 -70 -197 41 -264 -142 134 -15 248 132 -74 19 218 -131 208 159 -236 51
4394 51 -97 -248 -200 -21 48 19 148 14 -225 -400 -110 -4 -226 23 174 -168 115 -76 -177 -248 -144 24
4416 24 -50 85 -216 -32 -55 -30 -77 57 -106 124 358 -156 -123 -273 -156 107 -98 68 -13 -113 85 -101
4438 -101 -132 43 180 19 55 297 -8 -89 -114 20 92 354 0 365 293 43 -29 76 -130 -45 154 -26 92
4461 92 131 -97 1 -151 134 192 112 88 99 -303 128 29 49 27 34 -147 151 229 -172 -6 3 -111 -9 172 -76
4486 -76 -218 -444 -28 -66 -61 -103 80 36 -160 71 -9 -200 -36 -42 -278 40 110 -84 -53 83 222 97 118 286
4510 286 132 -48 146 -74 -168 141 -145 -202 -9 102 -21 190 65 -117 103 37 -127 111 -1 -95 17
4531 17 -23 61 46 127 55 -6 -41 96 292 -122 53 206 -287 202 -19 80 -154 14 -177 90 105 -158 -145 -507
4555 -507 -21 -84 -103 -268 -88 -163 347 167 -90 14 -151 -99 -193 -16 -327 -143 -74 -149 -1 -121 -83 119 421
4578 421 222 -9 -85 -62 -174 225 -104 135 140 18 239 172 360 -56 -14 -103 42 25 24 -134 -173 84 242 -50
4602 -50 234 74 66 115 317 -21 26 13 -519 79 210 -26 154 101 14 287 -38 -59 -27 -17 17 -56 -296 -275 -67
4627 -67 -54 -6 68 14 141 116 -10 -74 -26 -46 152 57 114 -46 -9 91 301 134 -147 -115 255 10 29 -189 -253
4652 -253 123 -24 -140 152 -50 99 190 43 58 262 -3 -114 153 -11 -98 40 -52 36 358 282 294 152
4674 152 227 -162 41 133 -165 -180 -78 45 166 61 276 223 -77 142 104 8 70 -2 -13 143 -134 -192 -47
4697 -47 -76 51 201 -29 -104 -94 103 -245 -133 -240 -143 -15 -18 -197 46 9 132 -39 -175 136 -29 -142 -144
4720 -144 -57 -307 35 -236 -53 58 88 46 36 -118 -142 -1 -122 -13 -84 -75 152 128 43 22 359 164 148 204
4744 204 -145 15 -39 -62 111 212 251 172 80 2 210 4 -40 -34 -28 -176 199 -200 -70 19 -165 40 227 135
4768 135 94 155 -389 -28 -155 -275 -156 -306 -228 123 -271 -26 37 75 -107 33 61 -292 -146 -211 32 302
4790 302 -153 -403 156 8 232 124 86 76 -215 -235 -98 -115 -479 -193 77 -190 -5 100 -49 88 128 -61
4812 -61 -142 -73 -6 -18 107 184 138 45 -2 107 349 169 28 -58 -221 -92 -101 -189 -75 -179 -99 75 104 116 155 20
4838 20 -50 81 -228 -105 -84 48 -203 16 -52 91 81 40 -82 5 -112 -161 -246 -305 296 -21 -78 15 -89 136
4862 136 -44 -260 -87 80 68 -218 -20 -175 -189 169 -95 29 23 164 393 124 -230 145 15 -368 -97
4883 -97 -126 -110 113 165 -41 -14 17 121 448 29 132 -24 -182 -30 20 250 85 -194 16 22 105 369 11
4906 11 134 -5 159 72 -77 -24 -203 -311 336 155 10 141 131 -163 -19 24 -165 -134 -61 -130 59 -5 24
4929 24 -59 111 -99 18 -85 -214 221 -211 -187 -221 -25 -239 -55 -167 -51 118 -238 120 -115 -31 -50 -8
4951 -8 77 108 -55 -68 57 184 -77 290 39 -32 27 -97 115 -149 253 46 -199 -15 249 -69 -76 83 163
4974 163 110 38 -14 -71 -80 -56 -12 178 -1 -140 -105 292 133 295 -204 -161 31 -105 -97 219 -165 -65 90 266
4998 266 -9 44 55 -90 185 61 28 -276 -174 38 -266 -352 -40 166 230 -32 -6 -234 -40 27 -326 103
5020 103 104 -183 10 145 2 189 46 85 -98 -12 -101 -102 117 -117 -99 212 133 -7 62 118 128 -134 17 -19
5044 -19 -11 -126 105 -119 -112 -193 -55 29 236 -27 53 -80 12 11 -90 -40 126 206 -29 107 -54 -97 8 -206 -63
5069 -63 -31 87 24 -39 142 -137 -31 -48 -164 3 -71 -19 -29 90 -374 -126 -315 112 -131 -160 -5 -34 -167
5092 -167 -317 -63 -95 159 -14 84 12 229 37 97 -77 -74 -97 -69 80 41 -90 20 161 -25 -61 140 -73
5115 -73 -20 -51 44 -187 62 179 162 194 -116 25 38 -115 142 -84 -22 94 -407 -34 -126 112 -13 21 -65 -16
5139 -16 0 72 97 -140 -81 -43 -49 -55 107 92 -83 38 -181 -119 17 -186 -77 62 -193 -1 -29 -131 78 270
5163 270 105 -105 113 -181 -91 -99 43 70 -88 -150 -75 14 54 -51 59 190 127 -150 -149 -93 -60 39 -7 -266 -144
5188 -144 125 49 55 241 119 -68 142 -128 -160 -1 189 111 26 96 37 -49 153 22 -21 154 69 -24 -95 -18 120
5213 120 86 89 47 215 -80 181 -253 -49 -53 -68 85 167 101 -103 -88 52 -274 -294 224 136 -224 -185 216 -164
5237 -164 31 -7 17 -137 77 -18 5 91 77 2 213 119 -190 -43 208 152 138 38 -191 242 -38 -111 -197 -204 249
5262 249 213 172 -221 -134 332 189 52 -155 27 9 -66 145 -69 -119 177 -67 -120 83 -104 -156 -108 -150 92
5285 92 150 57 -86 -197 -119 -146 61 -185 3 -307 -202 -4 161 -103 -45 78 -112 -21 204 82 135 147 -205
5308 -205 100 -88 160 -167 43 -165 -110 -162 125 36 -60 -54 -222 1 161 10 -200 -128 -36 42 35 59 -87 -47
5332 -47 -82 -112 143 149 -18 94 -90 141 153 -16 -52 -79 95 98 -54 85 196 5 -180 0 85 -152 -163 39
5356 39 -68 53 -103 -83 202 123 48 -258 48 -51 -32 16 43 -28 192 -180 -77 -66 61 -43 -202 153 -10
5379 -10 83 -35 -105 148 -67 141 -138 11 5 60 -68 -41 -41 -187 -81 -128 -34 -184 -59 199 144 -239 -107 -182
5403 -182 20 20 -170 181 -96 -45 35 143 -14 -220 67 125 42 -13 -45 -311 -20 164 350 139 -139 -34 -42
5426 -42 -24 140 -232 -15 316 -103 223 16 -106 -45 98 10 23 32 -47 -26 -12 123 5 219 -29 13 -165 45
5450 45 77 107 244 -159 3 51 -14 -39 -130 -100 9 45 25 -233 128 40 -113 139 214 -170 236 -26 -66 40
5474 40 152 -20 -293 179 -275 -225 70 95 186 -68 44 252 182 62 -39 264 10 -135 23 251 64 -83
5496 -83 -35 -94 99 215 -139 78 31 -167 74 248 178 24 -50 10 30 215 88 -56 88 -125 122 16 3
5519 3 -106 -97 144 64 16 147 119 -50 -77 -93 -56 -85 157 -2 -2 -109 161 141 79 165 -15 -35 -161 -59 -103 -204
5545 -204 -197 151 -110 61 158 113 120 315 -69 102 176 -133 -139 -90 -81 -30 -182 -217 -111 62 29 159 -81 126 155
5570 155 91 105 -12 5 61 -100 -21 116 -6 65 -11 41 120 277 79 -205 -54 72 115 41 17 -118 -103 28
5594 28 -54 301 -19 -148 -49 224 -103 -68 -154 149 235 -129 -140 -61 -70 -190 -125 86 -154 -80 -169 -191 -19 181 -6
5619 -6 55 -2 55 271 28 7 87 -39 78 8 -117 -64 -10 307 169 121 105 162 -99 241 -55 145 129 -94 -133
5644 -133 171 80 -91 -129 -41 131 161 222 137 -11 32 -105 53 -119 32 -116 90 -167 17 -43 76 -165 -78
5667 -78 6 103 19 -37 168 -217 -34 20 162 -216 38 -98 -36 -37 -121 -55 -129 -49 70 72 24 36 78 29 -175 163
5693 163 -181 -216 264 20 -83 69 -148 12 -183 -4 111 213 213 6 82 -43 -37 -14 -50 -117 21 15 102 -23
5717 -23 -20 103 185 -44 76 225 17 -89 45 -272 -14 65 181 179 -158 321 73 -60 202 88 133 47 70
5740 70 -186 21 -11 275 135 90 180 -76 -196 97 -125 -220 -432 20 176 -52 47 257 28 -49 -19 -190 -177
5763 -177 11 219 -25 -27 -72 -18 223 57 288 -209 -81 -121 -270 -12 90 -148 -143 -6 217 85 -236 -2
5785 -2 22 -63 65 -140 -90 -277 -43 42 -233 14 -185 73 11 -184 28 42 74 65 -107 -154 -160 -153 -3 -107 123
5810 123 -31 -9 172 15 131 -309 -2 -13 -124 -212 -16 -170 108 123 349 10 -94 59 228 91 111 33
5832 33 -222 -254 -121 17 -39 -148 23 425 120 57 -143 210 -16 -259 57 -118 -136 143 -151 141 -27 172
5854 172 40 260 61 -220 -25 27 54 -25 -69 -6 178 71 135 -20 -24 40 -67 -30 -296 -123 -301 134 326
5877 326 25 -27 -44 11 175 134 108 72 -45 91 56 -86 88 60 162 -31 -252 94 -63 215 75 -122 134
5900 134 -107 -166 -158 -164 7 47 -161 -46 39 -27 38 6 67 19 6 -32 -218 -111 25 26 -81 20 -42 3 -86 -141 -28
5927 -28 34 165 -116 87 74 -27 64 -39 -27 52 419 138 47 18 -114 395 -109 -134 -114 201 152 66 -38 -138
5951 -138 -41 -31 -41 65 -4 -16 -81 31 -81 104 -138 -35 -206 113 -58 -97 -68 -125 201 -13 120 56 -282
5974 -282 274 -200 36 -95 -46 -254 -76 -198 -6 -26 -122 -46 -152 96 -232 120 14 120 -53 -145 -348 -138
5996 -138 146 190 40 183 -101 19 -56 131 -81 291 12 99 159 102 -216 296 -137 171 118 -20 82 -111
6018 -111 209 86 125 -211 71 -16 -298 -51 292 -15 72 -76 -246 83 -161 129 63 -84 -134 124 -114 69
6040 69 116 -93 283 -47 22 64 111 -44 -89 99 38 31 52 -27 -15 89 -111 60 -100 49 3 15 96 -45 100
6065 100 -301 27 -119 98 -134 -158 179 -243 -149 -37 254 -41 68 14 28 -125 -81 13 -224 191 -142 -56
6087 -56 -47 56 83 24 -126 112 150 -57 -96 -74 96 -74 -128 -176 177 -226 -150 -34 -75 2 18 -78 52 -189 99
6112 99 298 -43 118 -7 -6 -489 134 -29 76 -107 64 -37 -14 -6 5 94 -245 3 -239 11 36 -3 68 105
6136 105 44 -137 43 16 -175 6 222 17 -109 37 290 -13 -45 -40 13 227 -241 50 53 -304 2 29 -68
6159 -68 -84 257 286 -100 -23 -157 52 -46 -71 164 28 138 -61 -119 -91 -89 191 -79 170 241 -138 72 185 -148
6183 -148 -68 -310 -150 110 160 -36 -120 -19 -73 -234 -119 -91 4 -52 -108 -58 46 -75 106 -23 163 147 27
6206 27 91 1 81 -103 253 10 -62 -267 7 -59 -90 -39 -182 14 118 86 111 -153 58 -68 63 37 -121 95
6230 95 21 -42 -14 153 -168 76 -163 -129 198 -138 -113 15 -57 -14 -14 -9 38 59 -119 236 153 -44 7 -133 -107 150
6256 150 3 229 21 -228 251 -13 -258 171 206 -10 -73 -10 -149 30 -113 153 -5 -48 220 31 -113
6277 -113 -287 171 -22 217 -9 93 150 -235 -13 -89 -299 16 63 -19 99 36 -136 -47 -104 -59 -58 -17 67 -75
6301 -75 51 22 31 -140 -200 -130 84 -61 175 14 106 53 -27 -214 -42 -129 136 -8 -149 322 -391 21 -179
6324 -179 -38 -183 -61 -257 -77 4 26 153 -157 51 337 -10 -65 75 58 -58 105 142 -96 52 132 -104
6346 -104 -39 -144 -97 53 63 -97 91 80 -155 44 165 132 -57 -102 -16 -164 -33 211 41 -249 79 -58
6368 -58 146 -237 -9 -35 36 -39 35 52 -14 115 60 21 -89 69 -105 -46 -17 -21 -353 67 -62 170 73 178 -17
6393 -17 -177 -21 -30 -89 -119 -25 252 110 -45 25 -59 15 22 172 -51 -210 -171 -96 -161 246 -86 -215 -192 -252 241
6418 241 141 -40 136 -81 -16 -66 -47 208 65 -180 -252 108 199 269 -37 -163 5 8 36 73 -112 -286 -13
6441 -13 -133 64 33 -35 -98 -8 -163 -202 18 49 -322 -139 60 39 96 213 -92 89 178 159 44 133 182 361
6465 361 123 77 144 6 -240 74 76 75 391 -35 -228 134 -133 159 -47 20 -59 79 -77 192 147 110 102 -165
6489 -165 275 25 -29 -264 169 -214 -13 -298 -88 -66 -147 95 -27 363 119 218 26 135 113 -6 -69 56
6511 56 29 -100 89 -127 168 116 204 14 -93 -18 148 -35 176 44 -189 174 -316 15 54 -10 -34 248 -195
6534 -195 -69 185 -181 50 -9 -112 32 -94 102 57 -167 1 -117 85 -217 -46 -252 -67 1 -147 147
6555 147 134 238 116 52 -122 40 9 -111 7 -22 177 173 59 -58 13 119 -39 -159 129 -210 57 -169
6577 -169 -18 -70 200 -19 67 -59 45 -93 31 -77 31 159 71 -202 -119 -31 141 186 -224 -39 25 -77
6599 -77 -34 -201 -171 -16 82 -159 -67 -58 -32 217 90 5 33 31 -71 37 -57 -2 87 -2 83 91 49 50 68 24 29 24 42 -22
6629 -22 -137 -184 97 -156 42 -22 69 119 -54 -78 -198 66 453 -265 37 60 -154 -128 89 38 19 0 95 1
6653 1 -121 -70 -30 -35 -79 18 -108 102 42 -186 37 34 -192 -113 123 293 65 39 -12 -123 -127 63 -117 9 35 83
6679 83 35 -48 -139 -53 -136 78 -119 199 58 41 -22 198 -71 -96 94 38 159 40 -108 148 121 -170 -40 192
6703 192 166 65 -78 -7 70 27 -354 94 -55 -108 93 152 85 34 134 -106 144 120 -33 -207 180 -142 -224
6726 -224 -133 -327 -65 -429 -137 162 35 -82 3 214 265 225 122 65 -60 -149 -87 -230 81 97 -85 87 -37
6749 -37 -12 2 -111 -119 -192 -57 152 223 36 52 1 76 -148 80 -22 94 83 133 37 -31 195 -319 68 -28 82
6774 82 -85 -87 -38 -6 150 -146 -17 -43 86 -1 -77 -43 -90 204 -127 300 21 -243 9 240 42 -3 -272 -104
6798 -104 40 -176 36 -107 192 -144 -177 67 -220 -284 -127 -27 -248 -9 23 57 -24 -191 -42 -196 28 -2
6820 -2 -46 -70 14 66 90 21 30 -5 -31 133 -67 145 -24 84 -208 139 104 26 64 -99 -64 28 -76 186 -150 -65
6846 -65 175 -172 23 48 30 -80 -78 -46 28 -40 3 38 -41 55 -9 31 -71 50 28 51 108 -18 11 65 -86 249
6872 249 -4 -41 -162 -99 0 -165 -112 89 -328 73 48 11 -86 -95 394 -71 -62 123 -89 166 8 -100 254 -67
6896 -67 -151 -164 -177 41 -23 69 82 -113 34 -178 80 80 22 58 42 -53 -118 130 17 22 41 26 98 -52 170 255 -140
6923 -140 1 253 50 98 94 -70 -181 164 168 -67 -238 2 27 53 122 12 34 165 -88 -67 96 217 -33
6946 -33 71 -72 2 -96 -104 192 75 26 -68 -47 165 3 248 -38 6 -187 32 -118 90 33 -29 -41 -80 -131 80
6971 80 88 -15 91 144 124 -150 -125 25 -64 -110 1 -132 78 -65 26 -26 126 288 -81 -178 230 15 -86 14
6995 14 -253 -90 12 134 0 229 -252 -86 196 -22 -221 116 92 -54 95 -76 -188 38 -100 111 1
7016 1 -164 178 -181 -23 42 144 73 -230 -359 -81 -39 72 56 102 79 30 150 -1 54 60 107 -101 45 179
7040 179 37 16 -100 -300 -145 -62 68 2 -18 -128 4 -124 155 -39 119 -44 -85 -107 -332 28 52 -167
7062 -167 89 7 69 -72 -10 -107 36 -90 -30 -64 59 -270 88 272 54 134 -139 103 0 -3 143 -23 -4
7085 -4 39 78 174 63 -111 83 -186 -38 130 -32 38 -78 5 163 181 53 -197 148 -157 20 133 -76 100
7108 100 -110 -61 -131 65 -237 136 -22 -170 36 120 64 109 -45 77 250 -240 33 168 33 -153 -87 -116
7130 -116 -145 61 248 -148 91 -7 224 -2 -174 -174 263 71 -294 -54 -95 54 -149 -121 -71 228 269 -53 -110
7153 -110 3 58 135 218 96 -87 138 43 15 -78 -239 49 8 -205 13 -212 -107 -128 -9 15 -43 -9 -37 67
7177 67 71 -110 72 104 -107 107 139 -7 -103 88 -165 162 129 215 -126 -32 233 -193 -72 57 -97 77 78 276
7201 276 78 9 104 173 57 -158 160 63 293 -2 -198 -112 237 -33 130 -89 3 6 -27 38 46 192 87 -47
7225 -47 55 146 -234 122 107 95 -103 54 123 10 -278 -230 68 71 216 -25 79 78 75 -61 97 -154 46 30
7249 30 -22 -54 -3 103 -127 -20 31 -4 124 265 -5 -90 -28 71 -79 -255 170 -164 31 -32 150 61 1 225
7273 225 -168 59 164 -53 -180 -22 54 -37 88 105 -159 27 64 148 229 27 103 94 -57 -91 -9 210 -32 -14
7297 -14 -83 163 -4 85 -121 -14 -72 -94 38 -127 -213 28 -176 7 107 57 80 -15 -124 -199 135 -103 -147 -64
7321 -64 -120 48 82 149 18 172 57 -80 168 165 -348 -143 -87 119 81 -70 24 102 -114 -124 50 -45 66 104
7345 104 -222 -155 190 33 -58 41 191 -79 47 -131 204 123 12 -58 3 29 -268 -94 -86 -42 -116 -130 -192 438
7369 438 -12 4 -239 -40 67 -8 -13 -121 118 -196 141 -74 28 135 -151 91 106 133 99 -213 -127 59 106
7392 106 -41 33 142 -187 -2 43 29 -3 -405 134 18 -143 -103 27 -58 53 -68 28 6 -129 -62 12 -72 -209
7416 -209 -139 -375 -233 -137 16 -45 117 -53 69 -182 90 -123 6 121 -94 -56 -17 34 48 193 211 -16 -27
7439 -27 32 -143 260 -127 138 180 -84 -114 -41 -61 -36 -129 -93 178 46 -18 100 -137 -266 61 -40 -21 137 -44
7463 -44 -88 -193 227 -86 -162 -105 -83 -136 103 129 31 -269 98 38 66 -42 -197 -144 15 100 -39 -80 -59 145 -82
7488 -82 153 -156 73 -148 141 132 146 -151 -209 130 -35 -103 -136 110 -138 84 155 22 48 142 128 109 -60 -78
7512 -78 151 114 5 157 -31 -269 55 46 -263 138 30 -80 -126 -75 -170 -55 -67 -8 -121 457 -204 -72 134
7535 134 15 74 46 81 111 -117 147 -182 -44 -49 -69 39 -35 -91 -127 327 117 114 -82 31 -42 40 -113 66 49
7560 49 -154 -25 -37 112 49 50 38 97 125 -137 289 -93 -75 42 80 27 120 -370 0 11 208 -19 -170 -158 75
7585 75 429 82 -56 -143 12 -9 57 93 -97 47 86 -136 3 -198 107 -33 127 230 277 7 -151 -20
7607 -20 -186 -49 -89 336 -39 122 -1 -74 94 -32 -24 -87 133 -88 -63 -29 -29 -36 134 43 15 36 29 -143 -125 78
7633 78 102 -183 115 -240 -75 134 22 99 176 228 -45 56 110 329 -32 -26 29 -38 -320 -220 -205 6 25 -32
7657 -32 183 28 -23 0 77 3 -6 -114 -299 -169 -93 -27 292 133 48 93 18 82 -81 124 172 74 -165 -14 -43
7682 -43 122 -161 -157 190 -287 -111 218 -33 -211 31 -119 -212 -238 56 105 234 71 186 -110 -236 91 -96
7704 -96 137 -24 88 95 -95 162 115 -51 46 -159 -38 12 -65 -10 203 -162 -82 127 -51 54 -168 52 -77
7727 -77 55 69 9 -190 93 -220 98 -19 110 166 99 -225 -22 -56 58 -28 -112 213 110 68 161 -42 -302
7750 -302 139 -191 36 -188 96 -29 101 90 -124 -29 -153 68 159 -161 95 -73 55 -99 207 106 -113
7771 -113 -60 8 -45 37 -100 138 18 37 -35 22 118 198 4 -27 -51 -306 -145 -97 -192 -79 135 -41 86 -15
7795 -15 7 -14 103 -43 290 22 121 -67 -129 -130 -32 -168 -48 24 -189 -160 -5 -136 17 -8 149 -221 208 -64
7819 -64 -69 -121 -146 100 30 95 27 -17 -92 -100 -57 -180 346 -50 -15 -75 -91 132 147 -219 64 27 6 24 -61 -100 -49 -68
7847 -68 38 -151 150 -37 -97 107 162 11 58 -289 -201 104 153 3 121 112 73 45 53 -22 -229 -58 -168 -28
7871 -28 -64 -276 -22 -78 -183 30 5 0 -107 -153 -118 150 -138 -117 80 -7 100 -77 64 -8 49 -24 -21 103 -100
7896 -100 25 66 -46 126 -124 55 -96 -17 -50 39 90 31 210 -63 -88 118 36 15 164 185 25 -126 -124 -164
7920 -164 124 -49 89 55 -112 47 -215 -128 203 198 -195 103 -223 -49 -105 -14 35 87 -22 -6 -31 70 185
7943 185 -58 154 -10 35 -182 -59 21 188 19 113 101 -82 10 -75 53 -85 -32 -2 -41 132 210 -91 112
7966 112 -99 53 150 -103 23 138 92 -234 -199 -59 -82 138 106 -79 171 68 110 -114 -30 182 -86 -64 159
7989 159 50 -228 -35 -272 -198 -283 27 -80 -72 -128 206 -56 77 9 -205 -121 10 93 -116 -48 -18 -78 -169 77
8013 77 205 -157 33 73 -2 -61 -54 217 -31 44 -78 -10 35 -17 97 37 9 210 68 -174 -71 157 -123 -33
8037 -33 74 -70 -59 116 -149 13 -95 -178 64 -126 -195 126 229 -12 -74 -149 -210 -96 -46 -58 65 -19 -130
8060 -130 120 64 -21 -143 132 -32 -29 15 25 63 27 -214 -312 72 -103 148 -46 80 -154 -151 -55 -7 -76 23 1
8085 1 252 -252 43 164 159 -139 -85 10 171 -24 -155 103 7 -42 -70 14 179 -137 -8 4 194 138 51 177
8109 177 -70 15 73 1 -7 -109 -10 41 -265 -23 196 22 207 -110 -115 -4 154 -98 129 43 -28 -27 -108 -88 -285
8134 -285 -240 -142 -68 -189 -99 215 113 -4 -90 52 23 21 35 35 -156 131 61 -248 94 42 -3 -85 -49 93 13 -167
8160 -167 -126 200 -177 -13 17 46 27 26 -70 101 280 -25 -12 71 253 -74 -10 -42 177 6 185 -174 -140 -179
8184 -179 -21 4 88 -166 13 319 49
8191D9
$$ Imaginary data points
##PAGE= N=2
##DATA TABLE= (X++(I..I)), XYDATA
0 0 0 0 0 0 0 0 0 0 -8 8 -8 8 -16 16 -23 24 -32 40 -48 56 -64 80 -96 112 -130 152 -176 203 -235 270 -307
31 -307 350 -395 450 -506 570 -640 714 -798 891 -989 1098 -1218 1348 -1490 1645 -1814 1999
48 1999 -2204 2426 -2672 2944 -3247 3582 -3960 4387 -4871 5433 -6089 6863 -7795 8947
62 8947 -10402 12317 -14942 18784 -24926 36268 -63891 264032 197174 -331733 261606 -62472
74 -62472 -273270 219384 68310 -144766 66483 -38472 -44787 43579 39482 42781 -37012 -47812
86 -47812 85305 -12390 8485 96169 -100565 -92799 43618 -59079 28448 94306 -30774
97 -30774 -3738 32389 -20927 -4003 25449 -17729 -45938 36948 -1237 -66156 42820 -11161
109 -11161 -75806 78743 17446 -56996 92782 9080 -69058 55571 -56335 -80955 65093
120 65093 -41755 -5059 86528 -75463 8920 70295 -84756 41779 56399 -91291 45079
131 45079 25661 -83409 43103 -13260 -68170 55206 -13901 3130 95599 -28683 -237
142 -237 35845 -84674 10904 38452 -62362 30370 19621 -44393 45899 7541 -32721 36710
154 36710 3942 8798 44581 -17904 -22633 -11180 -28473 -2403 2334 10844 7698 7577 43909
167 43909 -3849 -8686 22182 -53632 -6902 37391 -37950 28192 13466 -75249 23880 6642
179 6642 -33140 84371 3785 -48412 58198 -39529 -39569 55665 -69350 -27018 51507 -45432
191 -45432 42296 41590 -65422 33454 -2737 -45506 69015 -14442 -42415 49842 -46675 -36996
203 -36996 50101 -41358 -8768 59691 -24481 16079 47051 -33450 -4504 -2898 -38279 8413
215 8413 13880 3442 6498 -7760 -4022 -1428 15285 18821 543 14579 -501 -11645 10170
228 10170 -21694 -19911 12838 -19506 13296 45494 -16375 21730 26200 -55038 20022 15093 -49885
241 -49885 47516 -3305 -53128 49666 -23627 -28297 58494 -34187 1313 64330 -38294 7803
253 7803 23291 -77601 8817 21983 -52692 45083 14030 -47802 50640 -5326 -34263 46073
265 46073 -26514 -19493 35430 -30859 -4200 16339 -35148 -4471 6003 -9308 23632 22715 1944
278 1944 -2695 -13792 -12232 -7625 -274 6878 -10168 746 9689 -9456 14118 4505 -13768 21973
292 21973 -5187 1009 31917 -30946 -4669 12862 -53071 23558 35562 -36696 45399 20058
304 20058 -53298 45489 7922 -50724 42831 -12908 -36597 53576 -16631 -19771 30779 -37761
316 -37761 9013 40585 -20100 27441 6245 -41125 20630 -11077 -31695 27964 -14091 -13347
328 -13347 39343 -11486 -6632 25121 -26738 -6761 20482 -13512 2362 6830 -19049 -15894 -247
341 -247 5280 -6172 11497 13743 -17108 14840 13161 -29498 3221 -5053 -29144 22305 7434
354 7434 -16642 22929 -10796 -17083 29041 -15704 1450 34429 -28729 6855 12157 -46556 22397
367 22397 7499 -30831 44018 -6301 -20950 50074 -18888 -15940 39075 -36949 -11703 39485
379 39485 -28462 6821 32977 -39272 1533 18432 -19451 32319 14893 -21232 10662 -15696
391 -15696 -9391 20864 -13863 -7155 5597 -8474 15013 18178 -5851 -9024 -8922 -3727 8751
404 8751 11067 -834 -17028 -11183 -481 -2384 14761 2952 -19404 11861 1850 -6904 28296
417 28296 -19670 -31511 16540 -20848 4421 41511 -29422 -9911 15369 -31337 24350 28094
429 28094 -34868 13009 -974 -29578 36537 -4907 -30911 23631 -18567 -1288 43311 -17551
441 -17551 -571 14598 -32277 13091 16386 -23524 19467 2491 -23868 24323 -55 -15944
453 -15944 22681 -5838 -7216 22392 -2796 -5020 3423 -8007 -3968 3198 7033 -2240 685 11359
467 11359 -5560 1172 6668 -15737 4198 10603 -10564 8210 -770 -21087 11676 2425 -12325
480 -12325 20360 -9368 -13996 26320 -14643 -5887 18208 -33311 2124 19662 -24618 18483
492 18483 7174 -32386 18318 1094 -20154 27430 -6677 -22259 23882 -12912 -11552 26028
504 26028 -23073 -7953 23326 -17635 11673 14651 -25594 6837 3207 -9636 15266 -2132
516 -2132 -9436 4902 568 2946 4651 -1485 -4691 -616 7568 4807 1188 2779 -6686 -5421 9151
531 9151 16 2348 10667 -12526 2026 9249 -13919 16308 1594 -21347 22133 -5427 -12707
544 -12707 29360 -17121 -13757 25414 -18398 -2268 24104 -22551 -96 16576 -21678 9300
556 9300 7698 -22186 16998 -1843 -15933 22149 -14626 -11536 21195 -19396 -2062 19900 -18750
569 -18750 -617 13019 -15211 -35 11163 -9617 -3093 4879 -5652 -707 4440 -1837 -3372
582 -3372 -551 2745 1035 2076 2695 -4477 -621 710 -739 4306 -3214 127 4289 -6028 7449
597 7449 7363 -9653 9135 2702 -13486 15383 1527 -15226 16969 -5966 -12499 24947 -7663
610 -7663 -6833 21739 -17325 -1311 21422 -18091 3848 11437 -22781 9354 9172 -17370 14787
623 14787 2477 -14708 16141 -3407 -9729 13739 -9518 -5778 7722 -10285 1721 4394 -7600
636 -7600 2912 -1912 -2825 6072 -1438 -1263 1565 -6392 -4642 527 -3428 -2340 1821 808 -2342
651 -2342 1643 6362 -6167 -1582 9180 -13188 390 13852 -18241 2946 10889 -21076 11090
664 11090 12623 -14616 15117 3910 -14588 12657 -2672 -10254 11947 -7939 -3470 14749 -9658
677 -9658 3937 12493 -15109 10339 10011 -15784 13626 2806 -16554 11794 -2828 -12927 12224
690 12224 219 -3367 12513 374 -3904 5285 -3956 -3381 2510 -3737 -94 -1084 -3683 2153 -1043
705 -1043 260 2968 -520 1217 1523 2233 -4169 -7418 776 -9042 -3335 9886 -7686 795 12833
720 12833 -9737 1046 9038 -15499 1479 10451 -14407 3457 3588 -18622 6932 4392 -8048
733 -8048 15713 -218 -5878 12851 -7312 -2672 6909 -16058 -1978 8799 -7244 9813 8470
746 8470 -12624 4762 5705 -4331 13059 1707 -9677 2973 -5359 -1634 5548 -6065 -13
759 -13 4878 2102 10220 6917 -3804 -5050 -1803 -1996 -159 5436 -3052 -8079 3420 1020 -2185
774 -2185 9674 557 -7139 9639 1691 -7249 6070 -11235 -13997 7383 -4853 1804 12363
787 12363 -7806 1270 6199 -6933 5052 -1359 -11743 5584 -3049 -6440 8097 -10970 -8671
800 -8671 13027 -3376 3792 15898 -10231 -2387 6189 -12043 -1069 858 -9731 2945 4673
813 4673 1048 6588 -311 -3616 4197 2041 1739 6272 -3443 -7569 -425 -2536 -2513 3682 2878 854
829 854 8027 9602 -215 -605 -2035 -9473 1411 4032 -3229 3988 -2448 -5213 7925 877 778 9149
845 9149 -3590 -249 8605 -7463 -5090 -746 -14842 535 8716 -3547 10428 4529 -10091
858 -10091 7248 -407 -8310 6502 -5607 -8157 5170 -5024 -4593 2822 -6630 1572 8808 749
872 749 7689 1348 -10736 -134 -4837 -9740 4529 -1694 -4780 7765 3507 -1725 3926 1000
886 1000 -4455 2509 5654 -3313 -1767 -320 -9808 -3421 5112 -1360 5638 9968 -712 5001 4831
901 4831 -7097 -17 -2781 -7238 5481 480 -739 5744 -4942 710 7330 -1855 8027 6475
915 6475 -6511 3023 -1872 -12547 1745 -2078 -7826 10841 4660 -607 11513 -2531 -6486 3665
929 3665 -5286 -2712 4393 -4950 -4343 -68 -4663 -1751 4546 1031 2805 7027 710 -1240 -2310
944 -2310 -8612 -7337 -3798 -857 1837 2971 3139 -87 437 658 527 1326 -1749 1172 -729 -5448
960 -5448 411 -4968 -7979 5987 3318 2191 13179 2851 -5365 4137 -4252 -8849 4902 -2683
974 -2683 -5002 8208 -785 120 5874 -3654 3323 4731 1076 8270 -1692 -6343 17 -8884 -4530
989 -4530 6291 -1557 2273 11126 810 616 5502 -6166 -4892 2442 -2789 -483 1615 -3515 -4756
1004 -4756 -1837 1568 971 4493 5691 385 1388 -1233 -5891 -5599 -7972 -2375 1488 13 6420
1019 6420 2927 -4445 3136 423 -4987 4512 1335 -6765 1581 -2169 -8975 218 -852 -2076 7246
1034 7246 6315 4176 3892 -2336 -3187 -4164 -4930 710 288 -1835 5120 1814 -3133 5127 1645 -2522
1050 -2522 8096 3686 -3034 3579 -3210 -8871 -802 -1060 -1070 6587 6458 3187 3929 1090 -2495 -2453
1066 -2453 -2019 -136 -489 -185 412 -2230 -2007 97 805 1941 4603 5477 828 -665 -1966 -8453 -5327
1083 -5327 -734 -3173 2484 5141 -679 2142 2093 -3912 431 270 -3319 2765 -521 -4996 -997 -6545
1099 -6545 -4422 3458 749 5423 6924 -658 655 -759 -5624 -3423 -2620 -3116 1576 3751 1000
1114 1000 907 7 -1190 2169 3909 3453 1856 -717 -3314 -4089 -2938 -2192 -531 2559 3725 6531
1130 6531 5602 801 206 -3467 -3800 1635 278 -629 883 -2254 -1897 1615 1271 748 3697 2232 2147
1147 2147 3796 -2918 -4880 -4539 -6692 -84 3704 1138 3496 1549 -2078 1044 770 -2591 -407
1162 -407 1 -2741 841 -567 -5817 -2755 -2108 -676 5952 4826 2328 244 -2552 -3017 -3274 -2094
1178 -2094 -2273 -2002 1637 1859 1394 1158 -729 -1100 797 3945 3012 642 -735 -4375 -4664 -1184 -180
1195 -180 -259 3283 4851 2284 4380 2389 -4259 -1514 -1306 -2558 3244 1750 -1856 253 -991 -621
1211 -621 3139 3276 1817 2862 2293 -473 -1462 -3573 -4767 -2957 225 3318 3546 2993 1461 -1676
1227 -1676 -1009 521 -1091 -659 229 -1824 -1460 -647 -2598 -2956 514 710 2589 4897 1685 -1778 -2884
1244 -2884 -4179 -4123 -1505 719 -520 341 1476 -227 -8 -13 -551 -79 1619 1844 -374 -986 -2870 -4694
1262 -4694 -1613 497 1743 3969 3465 1718 440 104 -1289 -1990 -399 -430 474 2247 900 -765
1278 -765 -647 113 972 3077 3840 1894 67 -1050 -2875 -2140 -1458 -603 940 1867 3051 2835 926
1295 926 -639 -1636 -1388 5 1306 789 -1452 -1596 -2269 -1991 468 1392 1057 1532 2316 536 -828 -1606
1313 -1606 -4465 -3648 -569 95 1949 1299 -841 -1170 -1029 451 447 -326 297 -505 -1122 306 -1811 -3772
1331 -3772 -607 -40 1048 4668 2479 -728 268 -1603 -2198 696 535 -1027 474 1369 393 810 265
1348 265 -1399 478 2191 3274 2613 -541 -1377 -2250 -2166 885 1404 631 2135 2122 960 1385 -130 -2316
1366 -2316 -782 659 739 2126 147 -2435 -1327 -1572 265 2412 1448 745 836 -353 -1204 -890 -2804
1383 -2804 -3085 719 516 933 2634 -1982 -2252 390 -1520 553 2236 -1725 -919 110 -2446 -1080
1399 -1080 -471 -2434 1061 1806 523 2810 -1009 -2775 94 -2221 -519 2400 -1024 -88 1638 -1030
1415 -1030 -232 1124 -836 -206 2584 1053 492 1141 -1929 -1370 780 -516 1574 2328 -81 1164
1431 1164 1051 -968 636 525 -1369 1749 1688 -786 1943 -1033 -2497 1863 18 -146 3410 -419
1447 -419 -122 1764 -2137 -1710 964 -1816 -112 2862 -1513 -241 1174 -3439 -476 1490 -2256 1002
1463 1002 1298 -1708 -13 -722 -2767 -275 -76 -574 1842 -296 -1121 949 -2194 -1155 1157 -2652
1479 -2652 229 2458 -1699 890 1084 -3492 -220 1621 -1202 1379 2238 -1378 -750 1632 -1041 -267
1495 -267 1785 -631 240 1899 124 -225 -211 -1237 595 1224 1176 2233 -322 -935 1797 -1288 -681
1512 -681 2873 -2166 189 3581 -1995 60 2197 -3555 192 2573 -1394 1424 811 -2987 236
1527 236 -211 -1268 1324 -689 -835 1806 -332 -438 435 -2259 -1638 997 -858 -834 1059 -1876 -1885 1066
1545 1066 -803 -495 1252 -908 -351 1020 -825 -799 -964 -2036 362 913 -642 1660 -32 -1827
1561 -1827 2019 155 -1254 2485 -1199 -1799 2345 -433 -1813 2213 -38 -1379 2926 1119 -621
1576 -621 2504 -600 -1480 1781 -751 -116 1339 -1329 1026 1836 -810 2101 898 -1434 2414 710
1592 710 -1771 2149 -1218 -3159 2134 -715 -1300 2986 -471 -657 2274 -620 -190 544 -2035 -1317
1608 -1317 21 -1072 -81 60 -1425 7 999 -770 1306 552 -2081 203 -171 -2671 675 -84
1624 -84 -3445 929 1151 -1956 2562 1292 -3190 1946 533 -2881 1886 -1155 -3250 1022 -475 148
1640 148 2226 -197 288 1381 216 1444 839 -1946 245 -501 -1793 2475 443 -2051 2983 869
1656 869 -618 4198 439 -2611 1897 -215 -2340 2258 -340 -3140 2179 1125 -324 2977 589
1671 589 -1223 1109 207 -66 187 -1820 -1889 -966 -513 1561 1023 -1083 519 749 -917 1758 77
1688 77 -3797 -491 -331 -2604 1375 110 -3260 1021 1457 -427 2512 430 -2772 380 -1423 -1757
1704 -1757 657 -2706 -1017 2082 -674 2386 2582 -2727 907 1923 -2105 1799 795 -4192 -130
1719 -130 825 -2218 2140 2257 -1488 2243 2788 -42 1275 -207 -2409 -347 69 -162 1028 -522
1735 -522 -214 1963 494 1662 2517 -1132 449 2120 -2077 -603 82 -3998 -478 2690 -763 2094
1751 2094 2444 -2217 876 1343 -2458 748 -995 -3883 884 -353 -2051 1815 -1255 -1808 3399 869
1767 869 112 2213 -2902 -2983 275 -2700 -1574 1135 -2290 232 2505 -204 1025 1052 -2186 508
1783 508 1136 -1111 555 -1563 -3069 572 203 98 3466 585 22 3580 -162 -1512 1570 -2550
1799 -2550 -2798 2071 -572 -831 3414 -555 -824 3712 305 473 2805 -1145 -721 843 -2695 -1220
1815 -1220 259 -1537 1787 2900 286 2916 946 -2169 1024 -790 -2640 974 -1163 -2390 1567
1830 1567 -1314 -1582 2609 -198 577 3144 -1105 -811 831 -3641 -2307 40 -3468 312 2187 -870
1846 -870 1925 1481 -2157 916 796 -2374 600 -110 -3221 -128 -669 -2452 1513 1197 -428 3505
1862 3505 1853 -880 1598 -1604 -3018 723 -1554 -972 2666 -686 74 3339 -780 374 3180
1877 3180 -1343 1244 1817 -3127 -672 -856 -3621 1352 1364 -387 4181 1871 -669 2587 -777 -2988
1893 -2988 1358 -1592 -1923 2055 -1530 -1669 2393 -1120 -265 3668 -79 152 2563 -2235 -2213 -329
1909 -329 -3156 -1545 1216 -991 1385 2408 -801 1132 243 -2031 1374 -727 -2144 1056 -1997
1924 -1997 -3459 1265 -1324 -1213 3909 1094 -70 3483 -988 -2357 651 -2806 -2292 1506 -801
1939 -801 -80 2383 -845 801 2447 -758 1854 1984 -1672 1204 154 -3937 335 -575 -1895 3831
1955 3831 2465 225 3800 246 -1731 1611 -1520 -2251 1289 -1143 -1073 1940 -789 -215 1818 -317
1971 -317 1412 2915 -317 521 -453 -3999 -1486 -409 -2162 1412 1952 -1231 2571 1902 -2388 1206
1987 1206 -185 -3778 1147 307 -2895 564 -1699 -3506 1782 548 570 3928 -216 -767 1155 -2969
2003 -2969 -1748 -209 -3338 95 2064 -735 1915 1568 -2295 921 1937 -675 1880 763 -3241
2018 -3241 -38 -340 -2653 1395 1000 -147 4183 2557 85 2022 -1887 -2895 1813 -966 -375 2716
2034 2716 -2254 -843 2765 -871 1137 3013 -578 1195 2522 -1225 -584 -1452 -3820 -603 1492
2049 1492 72 2654 1282 -1750 1640 199 -1905 1246 -1152 -2761 1618 -1056 -2309 742 -2172
2064 -2172 -1354 3771 329 768 2792 -3054 -1859 991 -3684 -1235 1284 -2410 881 2472 -725
2079 -725 648 139 -1377 1289 1180 -953 984 -1989 -2920 666 -887 -1019 3010 568 465 4105
2095 4105 244 -1906 641 -2485 -2003 2326 -243 -299 1551 -1799 387 2830 -547 1753 2362 -1284
2111 -1284 1470 1045 -3016 -601 -981 -2212 2481 2463 596 2195 -276 -1453 1488 -827 -1440 1604
2127 1604 -1672 -1284 1928 -1590 -1911 1013 -1118 365 4094 200 -453 -2 -3645 -1439 471 -2485
2143 -2485 404 878 -1659 2284 1350 -2177 1210 -257 -1957 2155 625 -2254 -17 -1990 -2455 1405
2159 1405 613 421 2779 181 209 1685 -1974 -1509 488 -2050 70 2565 -987 377 1636 -1600
2175 -1600 1116 2617 -433 1864 1575 -1955 770 -557 -3083 1156 511 -604 3858 1325 -1165
2190 -1165 1822 -744 -1764 1549 -915 -1202 1835 -982 -903 1521 -1763 -276 2212 -639 1164 2192
2206 2192 -2383 -784 -291 -3546 0 1057 -1598 1228 1304 -1962 1150 151 -2170 1192 -147 -1568
2222 -1568 2024 -1205 -2828 811 -1638 -1437 2877 -81 269 2576 -1158 -1145 706 -2142 -637 1442
2238 1442 -1288 867 1656 -1753 553 924 -1440 2050 1615 -1076 1892 31 -2961 979 -403 -1743
2254 -1743 2390 1166 -69 2923 -4 -1440 1382 -960 -968 2090 -628 -245 1584 -1505 -548 1239
2270 1239 -1173 1134 2508 -1113 823 339 -3391 -418 -134 -2049 1773 1045 -1412 1910 193 -2315
2286 -2315 1199 -72 -1591 1678 -405 -1438 926 -1538 -1767 1080 -891 -61 2371 -668 -20 1057
2302 1057 -2358 -836 557 -1971 848 1406 -1451 742 495 -2125 1219 1193 -1303 1806 326 -1513
2318 -1513 1157 -720 -1917 1253 -243 -263 2779 417 -331 1258 -1618 -1112 1571 -587 92 2137
2334 2137 -1351 155 1285 -1505 248 1820 -1017 1219 1880 -1657 448 -89 -2401 830 864 -867
2350 -867 1583 276 -1260 1348 -559 -1595 1437 -1008 -650 1819 -1205 -1064 505 -2421 -620 1896
2366 1896 -947 398 1543 -1840 -312 603 -2312 -51 766 -1457 1477 1121 -1668 258 -346 -1640
2382 -1640 1368 974 -950 1312 -614 -1641 1728 -471 -1048 1871 -717 -11 2332 -1060 -647 1083
2398 1083 -1547 232 2296 -610 137 1356 -1940 646 1405 -1244 913 1212 -1013 1432 640 -1761
2414 -1761 527 -173 -1207 2006 914 -1100 1208 -1190 -1253 1547 -700 -866 1327 -735 -453 1792
2430 1792 -1550 -991 818 -1735 295 2013 -1409 -119 273 -2231 600 674 -1595 830 305 -1362
2446 -1362 1277 87 -1986 282 -377 -1000 2088 604 -1311 635 -925 -1114 1800 -570 -1032 1379
2462 1379 -860 -412 1594 -1126 -505 1051 -1108 1175 1971 -1146 -140 178 -1689 931 745 -1428
2478 -1428 1489 335 -609 1787 -158 -1391 1357 -41 -522 2129 -275 -1608 849 -553 -599 1984
2494 1984 -442 -530 1649 -527 -104 1186 -1583 -639 690 -889 817 1158 -1701 232 309 -1381 1370
2511 1370 378 -1606 1058 -277 -1473 978 -821 -1633 1075 -495 -382 2137 -681 -1078 847 -867
2527 -867 -478 1243 -1295 -720 805 -1248 -134 907 -1067 327 1130 -743 1389 886 -1496 338
2543 338 228 -1531 1379 71 -1107 1820 407 -649 1639 -128 -749 1426 -171 -202 1466 -955
2559 -955 -518 790 -516 594 1706 -497 586 989 -1033 317 625 -1530 255 446 -1265 917
2575 917 401 -1017 952 176 -950 1423 31 -1376 938 -1055 -1615 697 -853 -767 1496 -502
2591 -502 -101 1266 -819 -91 1052 -1294 -137 367 -1728 -203 452 -1491 528 611 -1032 926 874
2608 874 -860 786 -228 -1681 681 -185 -1183 1246 -277 -804 1726 -348 -201 1879 -687 -313
2624 -313 1021 -998 -306 1064 -888 411 1073 -499 1257 1424 -429 673 486 -1154 662 223
2640 223 -1693 605 -15 -881 1349 506 -548 1327 275 -677 1021 -529 -1416 649 -1000 -1034 1169
2657 1169 -763 -48 1569 -821 222 1057 -1202 196 64 -1851 -221 -10 -1605 657 714 -736
2673 -736 1127 242 -708 923 -175 -963 485 -749 -1378 877 -485 -576 1368 -38 -322 1264 -180
2690 -180 -73 902 -1143 -267 389 -1116 -3 1076 -846 690 1258 -626 946 882 -858 701 25
2707 25 -1506 223 -4 -828 1159 405 -457 1429 354 -79 1248 -545 -1038 636 -1134 -618 776
2724 776 -897 -324 844 -351 914 1216 -944 373 411 -1602 42 -119 -1884 -111 -382 -994 1307
2741 1307 522 -609 871 -98 -520 840 -860 -1478 -4 -1050 -807 1111 -474 -554 1222 177 550
2758 550 1199 -939 -567 -32 -1124 246 393 -898 309 958 -215 1287 897 -720 466 109 -685
2775 -685 649 -364 -1190 430 -478 106 1995 520 113 1724 -364 -179 1051 -1091 -616 711 -1106
2792 -1106 189 747 -628 411 1201 -252 923 1005 -795 310 -306 -1146 -46 -474 -1230 783 418
2809 418 -105 1285 -312 -1001 640 -557 -541 268 -1212 -1038 386 -1126 -5 1050 -784 293 1204
2826 1204 -264 191 437 -1931 -880 154 -1004 51 595 -435 754 771 -150 892 24 -804 763
2843 763 -295 -904 233 -954 -857 831 468 552 1785 29 -29 999 -592 -211 246 -1225 -157 390
2861 390 -611 826 699 -629 762 994 -130 1021 -72 -1416 -295 -462 -1089 710 -438 -369 1225
2878 1225 412 90 1057 -557 -843 375 -812 -575 381 -970 -949 373 -245 73 971 82 200 682
2896 682 -668 -168 -704 -1583 46 -139 -698 954 223 -410 987 91 -733 826 -421 -840 393 -726
2914 -726 -691 464 -572 89 1317 504 879 1094 -252 -291 115 -873 -109 160 -504 244 573 -222 695
2933 695 764 34 1210 627 -458 489 -572 -1408 282 -250 -379 854 491 184 1213 262 -206 -38
2951 -38 -885 -370 223 -845 -371 109 -720 66 166 -138 1004 958 -651 73 -171 -1678 -214 -217 -886 55
2971 55 608 -301 667 338 -185 490 -92 -547 435 -608 -640 118 -1020 -157 303 -207 775 1034 33 741
2991 741 433 -1005 -185 -242 -721 538 365 -188 394 639 26 872 649 -131 497 314 -561 -313 -505 -794
3011 -794 237 164 499 1379 316 394 680 -588 -252 546 -747 -115 395 -758 -205 178 -738 620 980
3030 980 -81 704 186 -784 -535 -711 -999 -527 -261 -135 758 85 -47 437 -613 -393 228 -559 -665
3049 -665 66 -992 -656 203 -708 -278 782 154 515 672 -278 13 -377 -970 -102 57 -248 640 310
3068 310 -115 710 -28 189 898 402 -241 413 -490 -872 24 -359 -107 772 355 235 1154 60 -103 123
3088 123 -648 -324 95 -304 101 170 -413 164 402 -122 1122 515 -311 379 -604 -1139 -351 -692 -395 247
3108 247 363 277 552 -331 -505 309 -241 -283 -44 -529 -335 31 -754 -346 -72 -284 732 557 150 369
3128 369 -204 -952 -426 -229 -705 380 -110 -166 554 278 -99 888 175 -95 546 -213 -549 -70 -660 -228
3148 -228 241 109 882 864 120 390 417 -678 56 39 -303 340 248 -102 526 154 -193 574 560 390 598
3169 598 -191 -309 36 -478 -406 92 -342 156 548 144 59 -49 -429 -545 375 -1 -62 -254 -594 -354 -281
3190 -281 -362 37 400 40 504 205 -398 -305 -709 -836 8 98 90 320 -45 -153 138 -152 42 445 -40 -113
3212 -113 201 -36 -379 -31 -492 71 873 373 414 415 -450 -166 -200 -223 230 -85 -144 348 274 -270 386 -100
3234 -100 -6 731 274 -14 227 -362 -560 -48 -220 -111 409 125 129 272 -190 -70 84 -324 -205 245 -18
3255 -18 -34 -103 -552 -154 147 -363 358 375 -198 52 -309 -486 -88 -275 -121 356 98 -233 162 -423 -295
3276 -295 225 114 -180 118 -203 -136 157 -423 -428 -75 -106 415 553 145 398 -196 -736 -276 281 -86 524
3297 524 506 48 182 155 -122 345 310 134 611 423 -256 5 -143 -254 169 145 345 396 194 131 117 -454
3319 -454 42 -233 -151 230 43 -259 -106 -219 -297 106 239 107 143 76 -392 -199 -517 -394 133 -199 -168 81
3341 81 -61 -283 3 -282 -307 125 -393 95 291 -246 -62 -148 -412 165 -6 -61 213 164 19 79 -20 -224
3363 -224 138 143 116 345 -110 -349 196 -1 0 253 244 27 503 83 -18 -43 -94 87 307 0 179 249 -211
3386 -211 188 99 -292 184 146 96 62 57 -39 32 -72 63 133 169 -41 167 -80 -212 -9 -477 -52 52 -144
3409 -144 -271 49 -347 -486 51 -2 -47 191 -102 -122 -189 -520 -369 1 -141 -35 -50 -401 -122 -83 -353 -128
3431 -128 -77 172 351 23 280 -14 -229 -228 -111 36 7 512 146 -77 69 -140 56 52 -129 -60 337 -115
3453 -115 -60 -137 -6 1 352 247 463 347 -58 66 -238 -91 -55 122 13 214 77 -7 123 60 -82 80
3475 80 188 142 -82 -2 -440 -268 -304 -240 -24 1 32 363 30 -311 -95 -336 -334 -303 -311 117 -6 -173 -130 -159 46
3500 46 41 14 -83 285 -466 -449 -168 -419 -196 63 -74 273 -1 291 -81 16 466 -65 145 71 -228 -123 -114
3523 -114 -73 326 65 442 53 223 446 301 -62 -228 -367 -64 277 -247 -87 88 106 223 175 119 -70
3544 -70 -7 -265 -78 -105 -80 -321 -506 64 -32 143 261 242 -69 -164 -1 -145 -365 -290 -126 -236 -220 -112 -284
3567 -284 -18 -204 -8 265 161 -261 -331 -268 -282 -168 -278 -183 -74 329 217 214 185 214 21 75 48 -40 -194 -171
3591 -171 149 253 16 227 212 129 172 271 143 24 -384 -195 -36 4 -131 122 129 290 299 141 194 89 250
3614 250 266 -193 -155 -77 -272 -39 -46 203 111 249 263 187 -39 -291 -238 -152 74 -126 -59 6 -18 255 208 -11 13
3639 13 -152 128 -343 -226 -430 -421 -239 -31 98 142 103 99 326 -90 116 -53 62 -184 -201 -94 -204 -202 20
3662 20 82 234 349 330 77 -42 -45 -264 -154 -171 -76 95 98 383 461 188 397 216 -163 -13 112 -298 -295 -77
3686 -77 -240 -16 -11 99 293 381 365 365 -3 -2 -80 -354 -130 -99 -62 -30 91 333 84 264 265 68 -246 -340 10
3711 10 -462 -571 -62 -74 -120 34 278 279 67 370 -36 -316 -317 -585 -245 -240 -175 124 -36 29 154 276 161 190
3735 190 -10 -421 -191 -308 -59 -233 -233 -26 152 308 300 483 478 276 31 -69 -62 -153 -242 -166 20 105 261 536
3759 536 187 330 305 92 166 25 -300 -312 -124 -275 -22 -138 88 344 114 328 3 -295 82 -228 -151
3780 -151 -198 -261 -366 -181 -48 44 173 389 120 32 -179 -127 -270 -382 -406 -420 -58 -165 257 350 398 119 528
3803 528 116 -40 -353 -307 -112 -154 -238 -27 -192 185 373 245 207 15 186 -3 -242 -18 -132 -203 -78 -132
3825 -132 132 154 1 245 299 236 49 -43 75 216 -135 -306 -185 59 407 92 447 287 133 -412 -25
3846 -25 -300 -98 -254 -215 -216 -156 88 183 91 76 -62 351 -13 -180 -368 -39 -523 -1 -215 -209 146 -103 333
3869 333 139 -56 -8 56 -389 -177 -159 -318 -178 -62 -306 80 165 221 376 3 25 124 -152 -43 -248 -140
3891 -140 -94 -107 -76 392 316 56 97 258 156 77 52 -65 -63 -76 64 186 -93 -16 453 582 133 104 -43 -76
3915 -76 56 -142 -293 53 -50 -1 171 237 376 106 3 371 -214 -290 -195 -347 -316 -253 94 130 248 -42 -64
3938 -64 201 -117 -152 -196 -179 -105 -162 -497 -181 -61 -39 122 -60 148 185 246 -76 -52 87 -475 -118 -75 -182 -127
3962 -127 221 -45 184 352 126 273 -240 -248 328 -96 -90 57 -425 -130 301 417 381 150 197 37 -77 -331
3984 -331 -113 -139 -193 52 196 129 60 390 7 358 426 -23 -121 -14 -536 -148 -143 -338 56 35 290 239 -93
4007 -93 -22 124 -178 -98 -169 -400 -436 -15 -316 -162 32 -336 -196 111 -162 -84 -138 -503 -376 -146 -280 -82
4029 -82 -154 130 -103 91 -74 340 10 -247 -120 -186 -66 198 -120 -519 18 -70 375 108 203 161 225 30
4051 30 -190 -19 -149 -305 36 -126 127 319 -30 292 232 166 391 251 -264 178 -64 -149 161 -69 -95 20
4073 20 87 241 175 -374 -69 195 -123 -253 -323 -174 -281 63 42 57 93 -61 273 23 -74 -270 -155 -278 -236
4096 -236 154 -268 297 -143 -190 186 67 -24 132 -1 -189 73 -226 -87 -38 -126 133 348 328 162 117 -105
4118 -105 -114 129 -406 -8 117 -119 143 151 302 85 115 199 88 328 92 60 22 -56 50 12 -34 95 -32 -123
4142 -123 142 -113 15 86 -448 -73 190 -70 190 70 -209 113 106 3 80 27 90 85 40 -420 -65 -233 -78
4165 -78 127 -178 -288 -139 -195 -35 -34 47 -160 50 60 -329 81 -103 -236 -106 41 315 479 -62 -135 -15
4187 -15 -275 35 -237 -160 253 160 45 274 -102 -62 133 273 -29 194 -99 252 241 -86 -217 150 199 -3
4209 -3 391 146 152 -37 -13 -142 43 -96 13 112 -201 -55 214 -109 -31 147 -237 282 362 -287 -15 -191 -389
4232 -389 40 194 -61 185 9 -229 152 -20 -116 113 -100 -270 -71 -84 -80 28 33 146 103 165 -80 16 -142
4255 -142 -121 -161 -87 -220 85 12 168 53 -60 45 -116 -73 329 157 -100 -13 -130 -148 -50 188 -47 404 -73
4278 -73 153 69 -37 -89 345 -77 171 -9 -148 -39 -69 -103 -19 6 101 92 -69 -41 -32 60 -47 -60 -117 -176 228 -171
4304 -171 97 213 -66 -156 4 -165 -9 -34 -214 59 -1 -212 -188 -147 101 21 11 -248 -160 7 34 23 -231
4327 -231 -41 267 70 -3 86 -150 -385 -17 135 -172 151 219 275 130 2 -109 202 -18 -13 193 -112 208
4349 208 82 -152 -68 355 -134 34 176 116 144 -141 273 -74 57 125 31 8 31 162 -125 108 220 197 -76
4372 -76 252 -11 -219 -72 -134 -15 136 -11 -63 83 -191 -230 98 -260 -22 70 -280 -61 -59 -134 177 49 140
4395 140 -138 -157 -99 -217 -174 -338 -89 -123 -118 147 -284 276 222 -81 -153 197 -139 -106 104 -54 -272 -46 -83
4418 -83 -116 29 -180 53 252 -5 29 202 -180 -166 -189 25 41 22 193 222 177 89 121 152 -49 20 135 75 -112
4443 -112 110 -327 52 -338 70 160 110 37 10 -143 -91 235 -204 -184 -181 -205 -128 105 -183 99 -28 2 89 -217
4467 -217 52 39 -441 -359 -117 -89 -87 227 -37 50 278 26 -201 -236 7 249 -21 -155 35 -164 -134 74 -5
4490 -5 48 148 42 121 133 -127 -80 -97 -44 -159 177 186 -181 -13 440 -220 130 139 3 156 -307 -186 123 62
4514 62 166 -8 153 341 18 252 85 -2 -329 -36 19 -10 71 -219 -42 -2 2 -206 60 58 25 -32 -199 -283
4538 -283 -135 -20 -93 304 -31 -147 208 -35 108 58 -153 -90 133 9 -190 -48 -160 198 -105 182 17
4559 17 69 162 107 -221 -218 20 -266 -43 94 -11 -46 -30 401 82 88 -83 122 159 36 -27 -113 -60 167 315 -43
4584 -43 208 209 262 241 139 140 152 91 26 195 94 -126 -53 -6 30 271 279 -122 76 -111 61 71 -297 35 -141
4609 -141 -67 -21 47 -219 85 15 193 -70 28 -34 -121 -144 -372 -128 -217 34 195 -1 -4 36 -138 49 19 23 -8
4634 -8 43 -14 -391 131 217 167 -45 61 47 -60 46 -204 -61 -44 7 236 -136 59 69 23 63 295 178 217
4658 217 188 -138 -36 37 -31 83 -14 30 117 -16 46 203 112 41 -163 -280 -132 -298 -155 21 -239 13 -65
4681 -65 262 178 103 240 -201 -82 88 -127 -101 -8 -49 239 -230 -54 -49 192 -125 -25 -373 -107 -267 -186 -154
4704 -154 -31 79 -45 145 45 241 73 94 -182 -27 -121 68 -238 -124 -141 90 -25 180 3 303 343
4725 343 -36 -136 -25 -358 -105 89 -1 222 241 140 -22 146 223 243 118 -23 -175 22 -93 -234 -171 69
4747 69 383 335 -111 292 104 104 213 -56 9 -192 -128 130 -137 -91 -197 69 0 38 23 -207 84 -47 -264
4770 -264 -39 -174 95 110 119 133 141 15 -167 121 63 14 174 -30 -267 -57 -72 -21 118 -19 32 53 -89 89
4794 89 -30 -232 -151 183 -51 266 63 96 75 194 107 20 272 -17 121 200 37 11 64 -25 115 -46 173
4817 173 47 137 -22 -151 -129 -30 263 -121 -269 -335 23 -132 141 43 1 99 27 -245 -92 -53 18 -132 -212 -164
4841 -164 -308 16 347 171 327 54 63 87 -24 -108 -270 -207 -146 -80 -2 -7 -9 45 116 13 25 -64 -65 -103 -125 -30 -64
4868 -64 -29 -165 147 405 224 55 -44 97 289 -64 208 0 -47 323 57 5 271 327 48 253 99 69
4890 69 268 -55 -217 117 -138 -210 11 -87 79 175 119 -262 15 -63 -69 -167 197 -17 -81 -64 -150 174 11 -109
4914 -109 250 165 -129 -44 -236 -5 -106 -39 -152 74 173 153 141 16 199 231 -141 -169 -34 -389 145 -137 194
4937 194 178 -142 236 91 109 262 216 42 30 -102 -91 -115 -200 42 95 11 133 176 189 -4 44 272 237 -250
4961 -250 -257 154 -71 66 -49 196 28 469 488 150 -51 -152 -80 89 -122 146 -55 -18 34 72 164 77 -66
4984 -66 202 155 -220 -7 -111 96 -91 -122 -218 62 2 136 -156 -88 147 5 44 58 -63 20 -71 -204 275
5007 275 -176 -92 151 228 -28 -133 125 87 180 68 44 -187 -41 -52 23 -163 119 191 1 -97 151 53 40 207
5031 207 -85 69 32 29 -25 168 45 231 114 -33 95 253 102 -95 67 54 -49 342 -223 -16 52 183
5053 183 143 186 -159 -167 -259 -315 150 306 -284 -155 -236 64 6 -114 -60 -7 -139 127 -226 -141 -163 120 -106 80
5077 80 179 9 51 -14 14 -96 93 46 -87 63 23 1 -48 -102 -4 227 -132 176 -25 15 -92 -10 -265 -19
5101 -19 -244 97 71 75 162 172 264 15 110 -130 64 15 -28 168 125 -193 148 -170 161 40 87 -65 195 36
5125 36 20 22 -112 -12 34 -140 -133 118 -120 48 160 -82 -81 -281 165 -142 -211 -239 -108 -53 66 -3 97 84 -145
5150 -145 43 -32 -7 65 -184 42 106 -2 -14 -160 -92 86 87 27 182 100 -146 -95 -363 -8 24 -21 38 131 230
5175 230 340 -3 62 2 -48 138 37 -30 31 -163 128 -43 140 82 11 118 -256 -139 6 203 96 -18
5197 -18 -305 -228 29 -174 -85 148 -153 -220 -84 -82 43 -28 -142 -131 -155 -8 11 87 47 -172 18 131 -22 -138
5221 -138 -91 -143 184 35 -7 44 120 55 -50 -44 -117 86 24 3 182 -34 -65 -5 -127 221 -215 142 191 60 117
5246 117 35 118 206 121 232 46 43 -160 -270 61 -101 239 106 -47 122 233 -102 61 -38 95 231 36
5268 36 172 83 -168 -51 -15 -52 239 344 80 102 29 200 79 -25 45 0 -48 51 -5 66 156 -11 81 161 -115
5293 -115 -46 141 -6 -58 -107 -45 7 141 143 3 -107 -32 -39 38 -16 -30 132 156 -125 -124 15 95 121 37 -9 203 -142
5320 -142 -268 16 0 149 -65 -71 47 108 121 277 -41 20 158 28 195 117 43 -314 136 -42 -46 -152 83
5343 83 35 113 78 128 -354 -133 -145 94 33 153 89 84 -73 101 211 43 -187 -2 127 -14 -69 -95 97 -153
5367 -153 -192 -251 196 -85 -150 -172 57 -142 -70 -62 163 -6 51 -85 51 184 133 -88 137 -66 -73 176 178 -56
5391 -56 99 61 89 221 40 70 39 27 53 62 -94 15 117 -91 6 83 -21 29 338 1 185 -102 210 249
5415 249 -152 64 147 103 -5 -47 -228 -55 -6 -84 236 142 -173 161 -85 112 106 136 -285 41 144 -191 229
5438 229 -182 -33 79 -68 57 35 -48 13 -73 74 -5 -46 -28 -263 -6 -16 -184 90 -192 -38 113 36 105
5461 105 -65 53 73 57 -105 184 115 -125 -33 -43 -79 0 21 -144 -117 77 -152 -33 247 97 -165 -115 32
5484 32 47 -39 -69 24 -1 -184 55 174 -252 166 28 -40 118 3 -69 -228 -4 -111 -192 -118 -45 46 145 -25
5508 -25 123 -16 -8 -261 69 6 29 -122 -138 -121 37 -121 87 -44 124 214 98 111 -22 28 53 -130 16 -221
5532 -221 130 20 -111 69 -78 196 27 81 43 -129 -175 -45 70 -43 -18 171 16 166 -118 71 -39
5553 -39 -33 89 -69 -221 12 230 44 125 86 178 -76 -4 -8 -91 -125 -31 110 -49 -333 -60 28 244 81 -112
5577 -112 -17 200 -207 -21 134 -87 -40 30 -8 86 -16 85 -217 -116 48 216 201 -1 -271 -32 -259 -161
5599 -161 58 -207 30 -198 119 186 18 59 52 -101 90 -136 23 -108 -72 133 125 195 96 275 -56 118 -152
5622 -152 -32 -198 164 -45 -43 212 40 153 226 94 166 140 -52 -43 -66 203 -59 4 65 11 -81 95 -131 79
5646 79 -54 -213 15 -54 -141 -82 45 -3 -21 80 -119 -118 137 -40 -296 -221 -260 25 34 42 -2 -103 173 -31 -31 -2
5672 -2 216 170 0 19 39 -149 -6 -123 -238 0 -150 -89 5 -18 212 -7 123 -21 -52 -168 -40 86 34
5695 34 23 192 247 -50 289 -16 -52 86 -138 -143 -69 76 -116 17 -76 231 345 151 12 -126 -228 48 48
5718 48 91 -214 -206 -184 -40 49 97 -105 239 -173 95 29 -24 44 59 -141 -156 112 -78 -122 -162 47 -99 134 -11
5743 -11 -187 -181 1 -157 -266 -61 -204 237 14 -70 -85 216 82 -50 -57 65 -63 157 -101 -116 137 -144 202
5766 202 -222 -69 -232 -46 -65 33 30 45 -130 151 -141 66 136 158 -35 93 131 2 131 -46 91 113 10
5789 10 41 59 79 209 80 198 -214 58 9 12 -70 51 -42 6 88 -212 -77 28 -98 102 -1 -209 156 -2
5813 -2 142 -217 -305 -121 78 63 -67 88 170 277 307 5 -248 -54 -108 -8 38 -253 24 52 215 -58 70
5836 70 184 182 -85 -23 -30 -38 113 -120 186 185 -10 32 25 146 -123 -128 -133 -11 168 -83 3 247 -209 152 -199 -58
5862 -58 -101 -80 185 -147 -234 -36 44 -59 -142 30 108 -362 172 47 68 151 13 -99 4 -111 -32 53 -466 30
5886 30 -19 24 -118 83 77 -101 -36 -78 -123 42 -99 12 80 71 -27 15 84 65 -140 -18 -36 -74 -80 -292 -43 29 -32
5913 -32 139 67 -35 187 115 368 222 101 -112 146 27 191 226 -74 -63 235 13 133 113 148 115 5 12
5936 12 49 -120 75 83 -115 -54 145 175 121 -43 -130 -180 -257 -43 -263 122 -24 21 -36 -139 -26 105 -133 168
5960 168 -186 37 -33 51 99 71 2 -1 -155 81 -40 -16 -17 38 -71 -238 2 -84 153 73 -143 -202 59 -45 -3
5985 -3 76 152 104 162 -102 -205 -72 2 -89 -151 99 -25 -81 105 -110 -166 -49 -83 294 -81 108 -91 -139 -175 -125
6010 -125 175 -262 -212 -12 57 256 -54 -2 -128 -103 112 24 -66 -40 40 -221 -4 45 85 -184 -226 -57 41 134
6034 134 -92 -157 39 -30 -90 26 77 -28 -130 -61 -28 -208 -108 42 -265 46 129 74 -206 -76 205 122 -187
6057 -187 -218 -221 -70 37 22 -69 -159 -110 227 15 88 -126 179 -109 206 0 4 -142 81 46 12 -50 152 22
6081 22 -247 95 11 -187 157 -8 -91 -301 -102 30 119 51 120 310 -162 203 -83 -170 -85 10 152 -46 -130
6104 -130 -233 7 -5 -148 109 -304 -30 128 -71 184 -40 -16 -138 -175 283 -87 100 -90 -97 -70 20 8 -200
6127 -200 -5 -90 -396 -229 -105 67 -135 -287 -12 -15 -35 195 -110 -167 -1 -64 -44 -227 -112 -15 157 -364 145
6150 145 147 116 -9 71 -106 -24 -50 -141 -65 -125 186 160 30 33 -149 -75 -136 105 32 -38 -148 49 99 -128 -66 -115
6176 -115 5 -117 230 27 -76 -7 62 -112 -72 -186 -113 129 -303 -272 -45 -42 240 99 44 -8 -125 -91 165
6199 165 79 -134 67 -75 86 -19 -88 -94 -15 36 -72 -59 -143 60 -258 30 -271 60 40 -192 91 80 4 163
6223 163 103 25 -174 -12 146 11 -45 95 97 21 28 -106 -114 135 133 5 219 -142 5 46 16 -71 124 106 -393
6248 -393 -179 176 240 109 108 156 -197 40 -138 -144 86 -32 2 -121 61 -152 116 75 -88 -39 215 208 -107 -149
6272 -149 -36 80 -131 -68 37 -294 -21 -2 24 264 62 -81 41 -88 130 -208 101 -211 -96 169 44
6293 44 -61 300 -92 141 99 40 99 115 115 -95 0 -118 -125 19 204 167 117 -106 -49 -16 -76 -39 -125 10 217 3
6319 3 -106 -133 -32 -3 106 76 -29 -59 20 -98 -105 -64 -93 17 1 67 89 -70 85 -148 -191 -102 -88 95 -74 270
6345 270 132 68 61 207 11 -167 -27 157 -216 -283 -167 -22 -343 -87 390 126 156 11 73 118 16 93 306
6368 306 -235 -130 -98 104 112 11 -24 54 87 159 22 -60 136 43 -170 41 -77 -1 159 -23 65 41 78 62 100
6393 100 52 30 -123 218 -154 -101 -22 -121 263 -47 13 -187 12 -13 54 144 -354 29 5 -63 -61 49 30 84 -258
6418 -258 -37 -64 217 190 -147 204 -82 40 -54 -120 -271 -66 -266 -4 217 240 -208 -56 62 -42 -57 15
6440 15 -56 -16 154 -155 21 -35 -279 -252 45 71 -185 -45 71 14 -134 124 43 93 118 52 258 18 38 -27
6464 -27 79 168 6 146 -82 -17 69 123 160 -8 -204 -185 -17 -28 129 333 117 121 -25 -59 62 104 -15 -280
6488 -280 -276 177 3 -150 -102 160 -136 -159 -120 237 -113 -18 299 41 36 -71 94 -126 215 1 136 57 -29
6511 -29 156 -199 67 -37 -106 -312 88 -147 -83 108 -7 -48 6 -46 67 144 77 53 96 -9 -36 -11 60 48 -23
6536 -23 -86 65 339 -128 -226 -22 158 -35 -74 -154 -177 -29 57 46 -22 -176 1 -114 27 -38 -94 -163 -278 54
6560 54 74 37 -211 -145 135 77 -283 156 167 -47 -137 25 135 -112 192 -10 141 -257 -119 79 -117 153
6582 153 -14 -100 -196 69 -201 -113 85 -84 41 127 -318 -9 60 -139 -235 216 58 -269 -50 -73 -20 168 203
6605 203 -255 50 -19 249 26 -375 -21 247 48 -144 -15 25 122 -49 -57 -18 35 125 113 -5 40 -49 134 -98
6629 -98 15 175 -180 -47 114 95 179 73 -84 0 -92 -236 -245 -34 219 135 84 125 178 319 -12 -180 90 80
6653 80 -135 -49 -71 85 -50 -32 -51 -102 199 -164 109 -466 103 101 -65 -188 -124 100 309 25 219 47 81
6676 81 -43 194 76 123 92 -103 -106 -147 117 -115 57 -29 65 134 198 125 -46 37 -67 -184 139 -17 -51 -34 134
6701 134 161 250 138 95 56 90 -122 2 85 -96 10 -51 -22 125 173 -144 -58 -125 30 -63 -25 107 -226 -77
6725 -77 0 215 174 92 -148 18 122 267 216 259 -145 -59 40 152 1 -56 76 -69 58 -26 -169 -26 -126
6748 -126 -53 -19 25 36 62 -169 -272 66 -206 -184 -48 -90 -169 67 70 149 50 -108 -101 132 50 -97 -62 100 -58
6773 -58 137 -208 -9 -210 -4 -95 57 -162 -103 -16 -196 -268 15 80 -300 46 -23 -190 27 96 30 96 60 -177
6797 -177 94 36 112 76 171 -41 -64 -195 -63 95 10 -73 -83 -45 -100 -136 -169 141 106 -33 196 30 69 -74 -21
6822 -21 -6 -27 -26 -124 -111 -111 -37 -99 144 -123 -295 -96 193 221 12 167 37 290 97 -153 -265 -136 45 -81
6846 -81 -46 154 -34 55 -129 -168 46 89 32 142 40 108 -51 166 168 -157 -173 -100 -138 276 -42 41 -140 -37
6870 -37 -134 7 63 -78 -143 -113 -91 -112 85 217 -167 -26 4 -88 -180 -129 161 -55 -16 -13 344 105 -40 -37 125
6895 125 -33 -64 -21 -46 -260 94 289 239 -199 -425 -197 4 140 -63 43 -51 135 94 -107 -60 129 319
6917 319 -68 50 245 -66 126 -5 206 -90 -14 140 174 135 -245 11 7 76 1 72 33 232 188 -120 41
6940 41 86 44 -8 22 47 28 -54 -30 -114 189 5 14 -141 188 37 -54 -41 24 2 -180 -148 111 124 -139 29 -4
6966 -4 92 -172 125 193 -42 49 170 61 87 100 179 82 232 -160 51 -213 80 18 -175 45 -172 152 -234
6989 -234 -29 25 12 72 -31 -104 -268 -26 5 -191 -4 -18 -273 247 -27 78 -67 26 50 -230 128 -29 -32
7012 -32 -13 -45 247 -28 151 -166 -91 69 8 -80 -123 -109 -139 -54 -86 86 -43 16 -34 -157 -113 76 -100 -43 97
7037 97 195 1 5 56 283 -79 166 -85 -169 -33 -157 -78 -187 23 -45 -237 -115 3 88 16 -374 -264 129
7060 129 175 76 -96 -63 165 -88 -131 88 126 115 -128 74 -232 16 126 -56 -108 -142 -71 197 53 8 289
7083 289 5 111 -303 140 39 -124 13 -32 95 -125 97 -30 0 60 66 -65 -224 121 -10 158 123 -40
7105 -40 -65 -111 135 -20 -90 -37 233 -37 285 118 167 -83 80 13 -12 -91 248 6 -72 -9 -83 234 68 189
7129 189 -163 98 -279 -116 -86 24 -118 -51 -144 32 74 101 -131 98 -171 -63 -53 -178 -30 56 3 -26 -18 -8
7153 -8 -107 193 60 -95 -116 218 94 -131 89 47 -290 -3 -189 -93 123 -240 -94 -54 198 -212 189 228 236
7176 236 1 136 -136 94 67 -59 -113 -12 -43 -243 103 205 30 37 12 -3 -164 -181 -5 289 -76 154 18
7199 18 21 -156 28 -74 136 -35 -221 34 103 213 23 205 -112 192 -81 214 35 250 -57 70 167 -44
7221 -44 27 20 -94 -133 -3 95 17 35 -269 -83 -50 -6 55 10 104 190 -258 72 -48 -272 117 -6 -179 180 -64
7246 -64 172 248 286 -52 79 301 112 95 -188 -84 3 326 -53 3 71 231 77 -92 -82 -55 33 -318 166
7269 166 -87 211 -52 -92 114 120 -44 66 -68 -40 33 -88 141 46 -106 12 93 32 56 -80 -202 22 -65
7292 -65 -249 107 307 132 217 -1 48 -106 -170 -16 -268 70 -73 -199 275 137 -104 336 78 222 18
7313 18 -48 -22 -34 74 231 -3 -30 147 71 145 -71 -136 76 -78 136 -209 -17 42 386 210 -116 125 50
7336 50 32 -59 -184 -24 62 -21 -123 -87 -107 77 -155 -154 30 24 -32 150 -27 88 35 204 45 318 52 93 -22
7361 -22 -33 -61 -190 154 -97 -19 106 -230 -161 -58 161 93 -38 52 -84 123 -144 112 94 -3 -88 -42 -23 24
7385 24 -14 -124 -1 -16 219 211 -17 -118 160 36 -245 69 43 -26 -13 208 -131 23 74 92 132 100 92 -51 -3
7410 -3 -97 -232 -67 -159 107 313 187 -51 -160 -43 144 74 -43 -167 219 161 -158 -331 -214 -42 -61 -138 14
7433 14 119 -80 61 -78 -119 10 -115 216 146 3 -89 44 34 -225 128 -195 207 104 186 239 -137 -84 68
7456 68 -82 170 100 8 -108 43 -132 -56 125 58 29 -312 136 216 167 -27 -28 189 -64 -141 -14 173 172 107 48
7481 48 54 97 192 -63 13 40 61 -97 34 68 -248 -124 -55 -225 58 -118 -22 -2 -63 202 -106 -31 -75 -51 -41 118
7507 118 8 1 -71 211 -241 -42 -109 -216 199 -175 201 -7 66 -260 3 71 -30 30 -97 66 -47 -12 -121
7530 -121 18 41 -156 98 -20 120 -28 38 -7 4 -124 12 -5 -97 235 17 -1 -139 99 -159 -35 20 215
7553 215 38 155 -16 -17 121 -18 -69 32 -223 -121 57 206 -125 90 -89 104 118 -121 -55 60 -18 123
7575 123 202 113 -13 107 137 201 -159 162 1 -7 174 -79 160 -155 -30 51 -236 -41 -245 35 -123 209
7597 209 122 -58 -34 -69 38 63 132 -142 -155 98 -156 136 -98 210 188 82 155 144 -136 70 -106 -155 -26
7620 -26 -127 2 -52 78 -90 29 126 44 39 -116 -73 -144 6 -9 -143 314 131 -164 -191 -93 68 73 -49 64
7644 64 -44 36 104 -183 49 48 -139 -171 55 -109 166 -85 -46 -3 -244 17 101 -189 -90 38 46 -19 -93 100 -204
7669 -204 -48 -34 36 -80 -6 57 -137 83 -197 -183 -104 -68 -85 -120 -38 97 -16 -198 -46 -239 -119 7 -245
7692 -245 134 -26 -20 -60 -207 31 -134 -76 -218 -255 -40 90 153 -24 204 -72 -163 -58 -226 313 -71 -58 -70
7715 -70 -136 78 -7 187 143 139 -116 49 109 -124 85 -118 -169 -172 287 -95 -49 -69 47 -25 -222 -5 -187 -188 52
7740 52 187 37 47 201 -42 -15 75 174 57 -153 -76 47 117 -387 -58 4 85 134 11 -33 -200 -55 16 266
7764 266 37 -104 -48 101 -44 120 -6 113 -133 -170 269 52 -38 31 -113 -118 -118 98 -41 307 65 127 -39
7787 -39 -56 -82 125 171 183 176 60 206 -85 -10 87 28 137 -108 -11 -105 168 -258 255 -162 -157 -58 66 10 11 -97
7813 -97 -14 0 118 40 -230 -90 -239 104 -52 -76 160 117 -52 70 0 48 -50 38 74 42 90 -167 44 23 310
7838 310 25 -157 134 127 47 -3 46 -35 98 -113 -114 -119 -144 -119 56 82 23 -111 15 6 38 -195 65 47 32 36 103
7865 103 368 -136 115 183 -35 109 163 -3 -81 109 -233 129 -33 242 -178 -86 -48 46 68 -46 149 142 31
7888 31 -6 -16 -103 -28 -57 -140 -236 226 -52 46 -380 124 -251 -42 -5 101 -124 -252 -108 75 81 -110 -98 -44 -79
7913 -79 -124 38 -252 -51 -75 253 -274 101 68 5 -86 33 -12 -63 16 27 -175 -69 -88 -47 -24 -221 75 -59
7937 -59 -76 260 -58 -68 145 -64 47 -52 -29 -16 -96 -61 -42 -22 -115 34 185 78 -45 79 -92 -139 192 -105
7961 -105 -77 5 30 69 -52 153 170 -30 76 -154 -92 -171 -106 -134 -105 -107 -10 78 -40 -47 39 61 93 92 51 19 -197 -224
7989 -224 190 -170 187 -2 104 -60 -80 -14 4 8 174 237 241 71 -133 -48 -168 -47 -16 98 -44 57 47 153
8013 153 -7 -12 98 -30 91 -44 -254 110 113 36 228 -15 -43 176 32 -137 -73 -157 34 18 147 -98 -156
8036 -156 191 -100 95 -22 -88 -275 66 45 0 -111 15 0 44 -174 -94 82 68 -66 -103 185 161 57 -12
8059 -12 122 -48 48 218 -102 -195 169 -3 91 33 -178 -77 -123 134 88 -234 142 -30 58 -22 -51 -97 41 278
8083 278 49 76 3 281 -68 29 -128 -61 93 35 -20 18 149 111 -32 81 -167 113 209 -33 -19 372 181
8106 181 113 -129 -222 204 -77 -9 -121 127 -33 -109 -102 -71 -161 0 -113 -26 -45 36 -32 4 77 -30 -75 32 172
8131 172 -146 58 -293 -26 -13 -81 56 -312 62 98 -338 77 55 22 77 -271 -134 57 -57 -76 -62 -102 -146
8154 -146 -31 101 -48 -152 -38 14 222 -27 86 224 -88 131 109 99 -208 -4 -141 90 45 100 -81 128
8176 128 -2 -47 -38 -112 -27 -66 -80 -148 297 -65 -115 12 122 63 149
8191A49
##END NTUPLES=NMR FID
##END=
