##TITLE=1H_SL62/SL63(Ag-fmix)
 CDcl3, 8 sc, 
 26.10.2020
##JCAMPDX= 6.0         $$ Bruker NMR JCAMP-DX V2.0
##DATA TYPE= NMR FID
##DATA CLASS= NTUPLES
##ORIGIN= UXNMR, Bruker Analytische Messtechnik GmbH
##OWNER= root
$$ XWIN-NMR		Version 3.5
$$ Mon Oct 26 10:45:13 2020 Russian Standard Time (UT+4h)  she@DPX200
##.OBSERVE FREQUENCY= 200.1315066352
##.OBSERVE NUCLEUS= ^1H
##.DELAY= (6, 6)
##.ACQUISITION MODE= SIMULTANEOUS
##.ACQUISITION SCHEME= undefined
##.AVERAGES= 8
##.DIGITISER RES= 18
##SPECTROMETER/DATA SYSTEM= spect
##.PULSE SEQUENCE= zg30
##.SOLVENT NAME= CDCl3
##.SHIFT REFERENCE= (INTERNAL, CDCl3, 0, 15.7039)
##AUDIT TRAIL= $$ (NUMBER, WHEN, WHO, WHERE, WHAT)
$$ ##TITLE= Audit trail, XWIN-NMR		Version 3.5
$$ ##JCAMPDX= 5.01
$$ ##ORIGIN= Bruker BioSpin GmbH
$$ ##OWNER= she
$$ F:/spectra/data/she/nmr/H-F/1/audita.txt
$$ ##AUDIT TRAIL=  $$ (NUMBER, WHEN, WHO, WHERE, WHAT)
(   1,<2020-10-26 10:43:54.26 +0400>,<she>,<DPX200>,
      <created by zg, POWCHK disabled, PULCHK disabled
       configuration hash MD5:
       00 E9 B6 7A A2 85 ED C7 34 08 36 98 17 FE 4E 26
       data hash MD5: 16K
       46 63 10 7C 71 71 75 66 BB DB 1E 52 52 0C 8E B4>)
$$ ##END=
$$ 
$$ hash MD5
$$ 8F 40 BD C7 AC C4 89 31 17 C7 08 83 A2 85 E3 7B
##$RELAX= 
##$RELAX= 
##$RELAX= 
##$RELAX= 
##$RELAX= 
##$RELAX= 
$$ Bruker specific parameters
$$ --------------------------
##$DU= <F:/spectra>
##$EXPNO= 1
##$NAME= <H-F>
##$PROCNO= 1
##$TYPE= <nmr>
##$USER= <she>
##$AMP= (0..31)
100 100 100 100 100 100 100 100 100 100 100 100 100 100 100 100 100 100 
100 100 100 100 100 100 100 100 100 100 100 100 100 100 
##$AQSEQ= 0
##$AQ_mod= 1
##$AUNM= <au_zg>
##$AUTOPOS= <>
##$BF1= 200.13
##$BF2= 200.13
##$BF3= 200.13
##$BF4= 200.13
##$BF5= 200.13
##$BF6= 200.13
##$BF7= 200.13
##$BF8= 200.13
##$BYTORDA= 1
##$CFDGTYP= 0
##$CFRGTYP= 5
##$CHEMSTR= <none>
##$CNST= (0..31)
1 1 145 1 1 1 1 1 1 1 1 1 1 1 1 1 1 1 1 1 1 1 1 1 1 1 1 1 1 1 1 1 
##$CPDPRG= <>
##$CPDPRG1= <>
##$CPDPRG2= <>
##$CPDPRG3= <>
##$CPDPRG4= <mlev>
##$CPDPRG5= <mlev>
##$CPDPRG6= <mlev>
##$CPDPRG7= <mlev>
##$CPDPRG8= <mlev>
##$CPDPRGB= <>
##$CPDPRGT= <>
##$D= (0..31)
0 1.2 0 0 0 0 0 0 0 0.06 0 0.03 0 0 0 0 0.0002 0 0 0 0 0 0 0 0 0 0 0 0 
0 0 0 
##$DATE= 1603694633
##$DBL= (0..7)
120 120 120 120 120 120 120 120 
##$DBP= (0..7)
150 150 150 150 150 150 150 150 
##$DBP07= 0
##$DBPNAM0= <>
##$DBPNAM1= <>
##$DBPNAM2= <>
##$DBPNAM3= <>
##$DBPNAM4= <>
##$DBPNAM5= <>
##$DBPNAM6= <>
##$DBPNAM7= <>
##$DBPOAL= (0..7)
0.5 0.5 0.5 0.5 0.5 0.5 0.5 0.5 
##$DBPOFFS= (0..7)
0 0 0 0 0 0 0 0 
##$DE= 6
##$DECBNUC= <off>
##$DECIM= 32
##$DECNUC= <off>
##$DECSTAT= 4
##$DIGMOD= 1
##$DIGTYP= 9
##$DL= (0..7)
0 120 120 120 120 120 120 120 
##$DP= (0..7)
150 150 150 150 150 150 150 150 
##$DP07= 0
##$DPNAME0= <>
##$DPNAME1= <>
##$DPNAME2= <>
##$DPNAME3= <>
##$DPNAME4= <>
##$DPNAME5= <>
##$DPNAME6= <>
##$DPNAME7= <>
##$DPOAL= (0..7)
0.5 0.5 0.5 0.5 0.5 0.5 0.5 0.5 
##$DPOFFS= (0..7)
0 0 0 0 0 0 0 0 
##$DQDMODE= 0
##$DR= 18
##$DS= 0
$$ [...]
##$SUBNAM2= <"">
##$SUBNAM3= <"">
##$SUBNAM4= <"">
##$SUBNAM5= <"">
##$SUBNAM6= <"">
##$SUBNAM7= <"">
##$SUBNAM8= <"">
##$SUBNAM9= <"">
##$SW= 16.880792210976
##$SWIBOX= (0..15)
0 0 2 0 0 0 0 0 0 0 0 0 0 0 0 0 
##$SW_h= 3378.37837837838
##$TD= 16384
##$TD0= 1
##$TE= 0
##$TE2= 300
##$TE3= 300
##$TEG= 300
##$TL= (0..7)
0 120 120 120 120 120 120 120 
##$TP= (0..7)
150 150 150 150 150 150 150 150 
##$TP07= 0
##$TPNAME0= <>
##$TPNAME1= <>
##$TPNAME2= <>
##$TPNAME3= <>
##$TPNAME4= <>
##$TPNAME5= <>
##$TPNAME6= <>
##$TPNAME7= <>
##$TPOAL= (0..7)
0.5 0.5 0.5 0.5 0.5 0.5 0.5 0.5 
##$TPOFFS= (0..7)
0 0 0 0 0 0 0 0 
##$TUNHIN= 0
##$TUNHOUT= 0
##$TUNXOUT= 0
##$USERA1= <user>
##$USERA2= <user>
##$USERA3= <user>
##$USERA4= <user>
##$USERA5= <user>
##$V9= 5
##$VALIST= <valist>
##$VCLIST= <CCCCCCCCCCCCCCC>
##$VD= 0
##$VDLIST= <DDDDDDDDDDDDDDD>
##$VPLIST= <PPPPPPPPPPPPPPP>
##$VTLIST= <TTTTTTTTTTTTTTT>
##$WBST= 1024
##$WBSW= 4
##$XGAIN= (0..3)
0 0 0 0 
##$XL= 0
##$YL= 0
##$YMAX_a= 265306
##$YMIN_a= -224035
##$ZGOPTNS= <>
##$ZL1= 120
##$ZL2= 120
##$ZL3= 120
##$ZL4= 120
##$ABSF1= 10
##$ABSF2= 0
##$ABSG= 5
##$ABSL= 3
##$ALPHA= 0
##$AQORDER= 0
##$ASSFAC= 0
##$ASSFACI= 0
##$ASSFACX= 0
##$ASSWID= 0
##$AUNMP= <proc_1d>
##$AZFE= 0.1
##$AZFW= 0.1
##$BCFW= 1
##$BC_mod= 2
##$BYTORDP= 1
##$COROFFS= 0
##$CY= 11.3945322036743
##$DATMOD= 1
##$DC= 2
##$DFILT= <>
##$DTYPP= 0
##$F1P= 16.9975609425685
##$F2P= -3.02152046262296
##$FCOR= 0.5
##$FTSIZE= 0
##$FT_mod= 4
##$GAMMA= 1
##$GB= 0.15
##$INTBC= 1
##$INTSCL= 1
##$ISEN= 128
##$LB= 0.24
##$LEV0= 0
##$LPBIN= 0
##$MAXI= 10000
##$MC2= 0
##$MEAN= 0
##$ME_mod= 0
##$MI= 1.114404
##$NCOEF= 0
##$NC_proc= 0
##$NLEV= 6
##$NOISF1= 3.799351
##$NOISF2= 2.8
##$NSP= 1
##$NTH_PI= 0
##$NZP= 0
##$OFFSET= 15.70392
##$PC= 1
##$PHC0= -10692.57
##$PHC1= 17.80088
##$PH_mod= 1
##$PKNL= yes
##$PPARMOD= 0
##$PSCAL= 0
##$PSIGN= 0
##$REVERSE= no
##$SF= 200.130013532006
##$SI= 16384
##$SIGF1= 3
##$SIGF2= 2
##$SINO= 400
##$SIOLD= 16384
##$SREGLST= <1H.CDCl3>
##$SSB= 0
##$STSI= 0
##$STSR= 0
##$SW_p= 3612.71676300578
##$SYMM= 0
##$S_DEV= 0
##$TDeff= 0
##$TDoff= 0
##$TI= <>
##$TILT= no
##$TM1= 0
##$TM2= 0
##$TOPLEV= 0
##$USERP1= <user>
##$USERP2= <user>
##$USERP3= <user>
##$USERP4= <user>
##$USERP5= <user>
##$WDW= 1
##$XDIM= 8192
##$YMAX_p= 0
##$YMIN_p= 0
$$ End of Bruker specific parameters
$$ ---------------------------------
##NTUPLES= NMR FID
##VAR_NAME=  TIME,          FID/REAL,        FID/IMAG
##SYMBOL=    X,             R,               I
##VAR_TYPE=  INDEPENDENT,   DEPENDENT,       DEPENDENT
##VAR_FORM=  AFFN,          ASDF,            ASDF
##VAR_DIM=   8192,          8192,            8192
##UNITS=     SECONDS,       ARBITRARY UNITS, ARBITRARY UNITS
##FACTOR=    0.000296,      1,               1
##FIRST=     0,             0,               0
##LAST=      2.424536,      0,               0
##MIN=       0,             -224035,         0
##MAX=       2.424536,      265306,          0
$$ Real data points
##PAGE= N=1
##DATA TABLE= (X++(R..R)), XYDATA
$$ [...]
1980g15J232n3M56M40r01l3N16j545M13Q44j603L65l73j043J710J03M29J354j087
1999E09K61j76j623n24q2J24M32K22O59l51K37N69r90P34O56n38L79j155j164
2018a821Q35j150P28J681k22J286N93j458M64q97j197J557p25m94J500p65j29
2035b14R65m64M33N85J10O03p05o76r15j010P05O5J815P02q52N75O2j648J180
2054A316q35o10R74j142O65K37j646J023K37k78J850K7o43J53j652j260J102q80
2072a362N4J403q7L05J36l9r98n3N78k06j48L31r79p09J0L2R81M84P04P47j192
2093hk43k85j522M71N36j24J594o00n24J068j043L06R94n48L93K16r72j8p20k91
2113a320O37L54R51O94M90l63j157k38l40p6O47j56K84N88j183M86L16j212J350
$$ y = [-715, 517, 464, 920, 1360, 459, 426, 942, -603, -190, 654, -949, -584, -957, -2000, -290, -187, 242, 1596, 509, 770, 594, -1029, -1553, -1635, -1511, -1079, -857, -198, -549, -312, 257, -733, 1, 657, 119, 498, -657, -1821, -986, -2136, -1408, 273, 51, 1337, 1930, 472, 936, 39, -1158, 399, -326, -820, 680, -85, -214, 751, 287, 720, 1305, 1415, 2018, 1313, 637, -278, -1288, -583, -518, 1297, 1999, 1147, 1722, 1784, 136, 1316, 481, -129, 845, -297, 368, 605, -1041, -18, 219, -59, 1791, 1818, 1175, 1328, -324, -1584, -482, -1362, -1308, 95, 8, 313, 449, 410, -588, -641, -63, -269, -417, -86, -1065, -1774, -1764, -1732, -751, -267, 437, 1184, -8, -251, -536, -2058, -1587, -1051, -1175, 419, -181, -705, 363, -680, -374, 620, 72, 465, 681, -291, -309, -1029, -1320, -683, -329, 622, 1316, 1806, 1443, 286, 48, -292, -368, 279, 123, 407, 995, -188, 298, 614, -598, 752]
2132G52R92j360J119j149j662O53k87k62K150m47m0R79j563J88r4p60J49P18l02
2151b26M16k33n87m79M51K74P53P79j53r62j68j139m15O22q3J188O05l75K32l75
2171A25r64P06j52L10L40K7l21P0j214P33N70j30J318J71r02J35p03n51j85N37
2191h0P68J19M04l65k57L00p56l0Q82m98P05k20j518J27n1k62J205j00N39N58
2211A470p61j030j20o60K35J097n79O02K57o74j54j65l49N42O23o11j03J2q92
2230a260j8j95j3Q80J103m38J46k84p84J02k29n93R37O66m56M98j301K95P58j58
2250c44M99L66m31K06k79j027q8O05K04P49O39q24Q32k43j016j40K41K28R19l32
2270G64o95L58l03n30Q10L99N35L82p59q38N0o56%Q17j16j34R50r1n92Jn17J77
$$ y = [752, 1744, 384, 1503, 354, -1308, -655, -942, -1204, 946, 499, 459, 1438, -125, 63, -31, -791, -642, 76, -226, 190, -43, -630, -1109, -658, -384, 369, 1148, 995, 33, -135, -1274, -1689, -1067, -1150, 38, 643, 268, 500, 125, -839, -133, -285, 25, 365, 392, 71, 141, -1073, -340, 230, 100, 1418, 1589, 687, 822, 119, -432, -617, -80, 688, 807, 1211, 846, 589, 889, 133, 103, 985, 487, 1192, 972, -546, -419, -470, -732, 473, 373, 912, 1470, 709, -321, -441, -1101, -866, 231, -348, 254, 511, -163, -317, -482, -831, -289, 334, -277, -380, -368, -1260, -1278, -1473, -1486, -606, 497, 59, 205, -79, -863, -761, -990, -1583, -646, 20, -436, 62, -1239, -944, -186, -344, 155, 521, 90, 296, 17, -1010, -1098, -493, -289, 460, 1099, 275, 1107, 864, -152, -292, -51, 177, 1096, 764, 69, 427, 124, -406, 404, 803, 1338, 1720, 961, 123, 173, -483, -483, 334, 218, 84, 1034, 943, 351, 352, -165, 12]
2292A2L88j28L8J68q13j70M7n77J078Q25q7k80k90q11O42q41k65P37m0J63L66
2313A62k81l45J72k5K33J23n9K12j73r99r2M01J41Q67N79o66M74J8j357L68J87
2334f0k37N55M23r72N94j54l87N24L2n5R76o10j92l65n24j04M98K42K19N09l6
2355H76n97j40k88j01N75n34J57K48m83L27j48q69P95O23p73J009m57r65N62q66
2375a049k51J126k39Q8N82r74L11n6l32M49j83o2R37o98m51J39l86K20R45R9l8
2396A77K09l7q82M4K63m28O78M89q07Q80j38r66Q25p0m31J379k94l30J90q76k1
2417a46M51j47M84L72K00n67O2k99j98K77J00QL74n81j36K15o93M57N32q71R01
2438G95r2j053J115r05q74J632n11k93J131j050l32L18q26O40K17k80M87m52k12
$$ y = [12, 400, 272, 310, 478, -335, -505, -458, -1035, 43, 868, 781, 501, 211, -600, 42, -799, -1064, -327, -367, -204, 162, -119, -464, -292, -317, -84, 39, -20, 192, 19, -980, -1072, -671, -530, 337, 916, 250, 724, 742, -615, -247, -60, -297, 258, 681, -291, 303, 149, -238, 286, 318, 263, 1239, 629, 437, 72, -452, -556, -58, 184, 403, 912, 876, 279, 139, -149, -250, 325, -209, -52, 196, -287, 40, -108, -977, -182, 441, -332, 677, 220, -745, -183, -1049, -1300, -174, -413, -325, 257, -717, -406, -462, -794, -345, -528, -590, 347, -351, -802, -663, -1049, -829, 116, 215, 177, 386, 349, -533, -489, -226, -654, 24, 513, -294, 586, 448, -518, 307, 237, -194, 1185, 891, 561, 751, -125, -146, 305, 158, 642, 1014, 1214, 647, 709, 410, 212, 489, 589, 597, 971, 390, 254, 469, -224, 233, 765, -106, 795, 703, -350, 765, -140, -1014, 618, 107, -186, 945, -105, -437, -119, -945, -305, -88, -368, 119, -333, -545]
2457e45M47o38J32q2J9Q29k05l93J17n57J36K00O5N00j62k40K75n84K89L93p21
2478g25J015j18n92J021r36l99J127r27L65Q78o49J80K75o48K68n88N54N37l4
2497F04j78J18m15l21K86mJ28J71J64p90M83J29p58P99r3q58J117k09p74P15p51
2518d37k46M99k07P95P2p85J34k25k48M58O6j68N08n41J4r9l92L41J26K75Q5k95
2540b70M34l34k25j9k22N59L52l70N63p0j094J041o25M9J083r71L48K54r40L19
2560a38O69k88P08m77k34P04n94j76J1O2j68L46N01j48k83O3n34J13M71l33L01
2581E76R6q22N09j8o12O77l75kO50o53j51M99p87K18j91l70J045n3n62L63p83
2602g46J92K67l98N01m7m34R7m6%l28P06k9k34K75K7l02L41p47k95R19j42r7J012
$$ y = [-545, -98, -736, -604, -686, -667, 162, -43, -436, -319, -876, -740, -540, -475, 25, -137, -377, -102, -686, -397, -4, -725, 290, 172, -420, 601, -335, -734, 393, -534, -169, 709, 60, 240, 515, -133, 135, -453, 101, 638, 604, 426, 544, 129, -192, 94, 90, 218, 389, 553, -237, 246, 375, -383, 416, 323, -535, 582, 373, -401, 314, -437, -683, -184, -391, 404, 476, -309, -175, -400, -648, -190, -124, -292, 216, -325, -311, -410, -802, -461, -335, -60, 25, -270, 164, -170, -395, -414, -636, -77, 275, -95, 468, 398, -696, 345, -280, -231, 852, -119, 229, 483, -457, -138, 531, 243, 951, 474, 240, 944, 350, 174, 185, 247, 79, 425, 926, 778, 495, 558, 24, 137, 608, 275, 576, 672, -150, 359, 341, -271, 406, 31, 29, 679, 26, -125, 374, -413, -195, -386, -756, 289, 236, -326, 37, -746, -554, -287, -685, -184, -231, -665, -568, -614, -614, -942, -236, -265, -499, -224, -197, -499, -158, -905, -1200, -281, -423, -520, 492]
2625D92j201K71O45l62J23L08m53K28j2n89N42o9m3M91j40J20O17n01m56L10n72
2646b51L23K03J77l31J84K34m47M02K23l58L25m72k35L45l93oM21q87O31R18p65
2667B41M68l10n21K83k68OJ98k66k03K14O3nL68O3k46l10K21j21o9k35l26K6J60
2690e69J16O76l71P4M12l46r4K09m57L78k97q11R22K95k36N88K4l20M38k25l00
2711A06J21k12p1o8m1L60M85k65q7K25j47J53M39o53l14o8m95N28K83l36L34M35
2733G12n72K59Q8m21k0k56o38N58j73l62P82l34J07M02l6l41L77o53k83k33O9
2754i68K05M6J08J55J45j9L18L61m84l90j50L1j22K01m09M84K16P8J26L22N8Q
2776C20p9l56k53K35m43M88j68k7L93J67L26M57o29k03K9l47K03K1n59N96j5L09
$$ y = [492, -709, -438, 207, -155, -32, 276, -177, 51, 39, -550, -8, -77, -120, 371, 231, 351, 968, 467, 11, 321, -251, 72, 275, 452, 121, 305, 539, 92, 494, 717, 359, 684, 212, -23, 322, -71, -77, 344, -543, 88, 1006, 241, 709, 399, -122, 161, -107, -101, 97, -169, -372, -158, -95, -100, 268, 331, 85, -225, -4, -125, -194, -429, -755, -729, -569, -453, 223, -148, -74, 338, -8, -102, 107, -350, 28, -269, -1080, -158, 137, -99, 489, 513, 193, 631, 406, 106, 227, 15, -56, -124, -165, 195, 680, 415, 328, 553, 406, 559, 998, 345, 31, -37, -532, -4, 279, -57, 277, 712, 140, 399, 487, 66, 46, -210, -848, -290, -463, -825, -43, -377, -270, 132, 96, -245, 132, -521, -804, -1037, -968, -763, -717, -609, -454, -309, -328, -10, 351, -133, -523, -673, -642, -764, -563, -972, -488, -272, -194, -68, 254, 312, 320, 241, -115, -368, -133, -576, -88, -256, -283, 110, 277, 603, 1060, 431, 228, 257, -90, 113, 134, -425, 171, 156, 465]
2798D65O06k33k09M61k93m21K50l24j70m8k52j18M32O94n13M28N3n16J16om37
2819c5k61j57k24P10m18L05N85m73m3L45m89M15j42p70l2o3l9M51k16L38P59n17
2841B9K82m41K2j1k04r7k82O53l98M0m9M32K5N22K41q24K0l39pK29l05M53j24
2864a33j16Q04J63m84N19l13n50K26k28j33N25m18r6K86R4N08J5j40j86n18j5
2885a90j9L6J52n69N29j98K27J63o7k34O45m57j63j50k80K31p8k76L96k42L33
2906b11R02n03o36O87n51m08M35j66j27R2N29j67j03L93k9l50M81J3l06K11p09
2927e23J16K45q7P43J2O9P0n31O0J97j74J09O4n29J21N05l61N56k12J16K28m7
2949G47j85k5k24j47m65R7K87J85N25m0o64J77k50K52j42N3J00o86R3J74m25Q14
$$ y = [465, 1071, 838, 629, 1090, 797, 376, 626, 302, 132, 84, -168, -286, 146, 840, 327, 755, 808, 292, 408, 402, -35, -296, -453, -677, 33, -385, -80, 505, 32, -11, 334, -155, 260, 118, -652, -684, -747, -786, -335, -551, -213, 546, 29, 311, -130, -108, -119, -323, -420, -702, -49, -447, -407, -456, -24, 1, 523, 764, -60, -40, -379, -386, -157, -462, -9, -133, -249, 555, 718, 234, 753, 440, -110, 116, -112, -245, 280, -138, -234, 52, 146, 654, 669, 529, 343, -175, -190, -209, -173, -21, -590, -61, -259, -32, 131, 64, -170, 475, 18, -145, -295, -575, -344, -422, -698, -302, -544, -211, 691, 188, -448, 239, -312, -720, -285, -451, -578, -486, 43, -124, -227, 166, 137, -213, 268, 281, -25, 186, -523, -407, -162, -249, 494, 506, 575, 645, 114, 174, 371, 197, 306, 370, -159, -38, 467, 106, 662, 450, 566, 794, 747, 562, 537, 313, 166, -299, -202, 85, 270, 795, 755, 91, 268, 18, 270, 128, 181, 281, -405, -312, -138, -563, 251]
2971B51J42p48N89K34r77M64K72j110K69r3J57M25j78J07J04n8k23l14M66J71
2991e0m00p2O5l88K60M8M54K60rN94p79l82k4n48O63Q6j49L74J71m73P43J25o02
3014c3Q10m15k80j0m55K88j20n5M60m4M33L38m46o9k36l67K48j65k3M28M8j85
3036A50k84n5N21J12J59K20n78k66k56n83L41K70K4Q50m63k31O52o38m09N76n16
3057d04L05k82J39O6j89L53j61k05O57N2K56m29m99o2n50O3O38M24L71L17p54
3078A06O5j58p5N55L10n94j21m94P9L66k03N67N28k18L02k44o36L38l02m37j64
3099d30L89J57M78j69K61l59j78K4K98qQ5n55k30o13L65N71l75M14N12m46M27
3120F18o36k34j86l27J47L44J99j67m99N9M09n3M61L58o05l76O6n90JJ64K65J72
$$ y = [251, 393, -355, 234, 468, -509, -45, 227, -883, -614, -707, -550, -125, -303, -196, -92, -150, -373, -687, -221, -50, -450, -522, -457, -845, -585, -537, -83, 177, 168, 762, -17, -399, -423, -971, -308, -222, -371, 3, 174, -299, 444, 569, -33, 777, 362, 82, 72, -383, -95, -215, -270, 190, 146, 579, 917, 471, 402, 166, -201, 47, -118, -141, 287, 335, 150, -134, -189, 332, 444, 603, 823, 245, -21, -277, -860, -519, -249, -225, 625, 162, -69, 583, -55, -464, 112, -404, -99, -381, -242, -176, -365, -12, -173, -378, 279, 331, 587, 158, -341, -403, -953, -890, -252, 172, 543, 860, 106, 171, 13, -62, 493, 803, 209, 88, -406, -327, 39, -164, 403, 931, 713, 1015, 771, 135, 473, 171, -266, -430, -41, 116, 594, 425, 686, 327, 149, 173, 471, 463, 548, -7, -237, -850, -485, 86, -289, 125, 637, 191, 618, -18, -252, -438, -765, -618, -274, -75, -242, -741, -682, -273, -326, 135, 493, -112, -488, -422, -1012, -1011, -847, -582, -410]
3142d10r9O25j87p6K97m76l79L58M4L78Jl82J41m64K12O69M26L33k82k74n15l38
3164c98l5N03j85J45N49j39J19J47l66L6K58k83K44p0j15m09l23M38l46O92N84
3185A046n76QK51q12n3K62j99P1L24o3J21n42J26K6k58N12K02k34j13l60j68n30
3207i59N54K62L07J32J04k11j0l45k37r4n1M07k4J41j97L8l49L04K9P25J70l24
3229C72l65o78J47L9l9N24M64J18J9n10n5k47P5J80J95J56k61j71k41L86j32L94
3251C70k9Q9m8K67p15K6k49R2m6K63J14L16o02M04j47o28L37j21K81J06r2m54
3273d66m00L24P1M4N97M1o1l11m56J55k36K83R5J35P1K8l85J36j4j41N7L43N3
3296c7O4m06M7k02K09j00P79j71lJ36l47j36O2l9j3K90L69k04r1P0k93K03M96
$$ y = [-410, -509, 116, -71, -147, 150, -326, -705, -347, -303, 75, 76, -306, -165, -629, -417, 252, 678, 1011, 729, 455, -60, -398, -433, 70, -115, 30, 579, 440, 559, 706, 340, 376, 634, 351, 595, 525, 410, 1, -322, 116, -230, 462, 1046, 470, 478, 729, -83, -136, 126, -73, -2, 322, 259, 380, -162, -36, -10, -268, 244, 446, 212, 99, -261, -429, -959, -405, -143, 164, 296, 400, 189, 179, -166, -403, -497, -548, -141, -165, -24, -221, -183, -532, -228, -199, 526, 696, 372, 7, -671, -524, -485, -524, 0, 464, 582, 601, 91, 36, -211, -136, 44, 239, 395, 134, -37, -278, 108, -24, 370, 341, 430, 382, 649, -66, -40, -289, -197, -243, 20, 134, 450, -152, 252, 105, -523, -186, -307, -26, 80, -12, -466, -866, -542, -471, -427, 170, 211, 150, -161, -617, -462, -698, -415, -320, -185, -114, -86, -471, -335, -349, -490, -433, -90, -37, 27, -379, -332, -534, -325, -425, 354, 183, 180, 316, -31, -167, -105, -144, -157, 133, 502, 298, 207, 277, -16, 187, 683]
3319F83j13J73k65l5k69j77J44L82J03j09m4k9r6k20J66J50l45O1K81l7J19o47
3341a24K06k82j67N30j22P5N34q12p9j70j42N01L02k44Q1n53j09K92q4J43k8M0
3363b12j2j72n2K09k77K28L26q4J70r8l62K15l27o5L33k40M15P3R0j71j7j37K05
3386C8j19N25k00j80M1l95J77j03K08J45K22Kk2l66p7K38J89r3L41l85k20L51
3408C17l12j24PK60N0p5p8J6k97M49j68n50M91O3J95K08o35L19l91l54M66j61
3430c04L35N2o3l08j08j35L19M0L19J41q53K34J21j98M19j57m3N18l55m2J77k57
3452a48L3M40j67J32J7Mj41j38J14J34l33N92k01l8L1k21n0L02k94N57M7m34J85
3475D23m40J6L27l68L19K52ol31m66L05P1k13L59K73p00K21n9r5m5l1K63r4j27
$$ y = [683, 570, 743, 478, 443, 174, -3, 141, 523, 626, 517, 473, 444, 348, 128, 294, 444, 99, 160, 441, 404, 523, -124, 82, -200, -367, 163, 41, 116, 650, -162, -241, -411, -553, -52, 250, 6, 87, -466, -575, -283, -367, -224, -252, -212, -224, -396, -448, -239, -516, -288, 38, -46, 124, 26, -336, -121, -448, -513, -180, -420, -5, 68, 158, -13, -30, -167, 38, -81, 444, 244, 64, 105, -290, -113, -216, -8, 137, 359, 361, 339, -27, -104, 134, 323, 230, 571, 186, -34, 317, 5, -119, -112, 148, 198, 123, 45, 61, -236, 213, 45, -505, -14, 49, 244, 452, -183, 136, -255, -609, -143, -304, 31, 83, 20, -288, -396, -531, -212, -172, 147, 288, -565, -331, -210, -408, 11, -146, -189, 329, -26, -68, 109, -148, -115, 325, 158, 290, 307, 311, 170, 32, 146, 280, -53, 539, 338, 300, 331, 110, 60, 362, 68, 625, 672, 238, 423, -17, -1, 326, -42, 277, 529, 523, 192, -274, 31, 102, -111, 248, 521, -179, 42, -17, -112, -157, -188, 75, -19, -146]
3498a46M45l06j93m0l29j01P19m57K90J00l89l4K14k44n4K48K59K8n15J89j89
3519e05K0L31j44N01j52m75N41m68M5K26j74J3K85k42K60j53N7J84o6N7O2k62
3541e9K28p3l29J38J5J06L99K25j89l4o05M61o4k30M15J47l87L80l50k77J88j12
3563gM54o8j67L4j37k52j8k1J11p3J08K22k09K30l5k06j73p4M4J55L8k03m5J34
3587a58o0L6m2M77n8n3n2k49J13k08j86K71J04J57K58l66l8J80k4K69n71J7K07
3610B4j63J0K46k30K20N28l02L56l61Mq2l32J26k41M21L9k51l9O6j75J46M25o9
3633C66J16m47n4j76j00O2K17J35k18M15m07k1N9j77K52l44k25K14j2O9j18L34
3655f0pj04K14k04j20O6k68K09n0l61N75j35n7J15m3J31k90j7J62J61J89l45P8
$$ y = [-146, 299, -7, -200, -240, -569, -670, 49, -408, -118, -18, -407, -441, -227, -471, -525, -277, -18, 10, -505, -316, -505, -485, -154, -298, 203, 51, -424, 117, -351, -306, -80, -254, -241, 44, -198, 62, -91, -34, 150, 84, 141, 203, -59, 169, 96, -233, -95, -80, 26, 425, 650, 461, 427, -178, 283, 219, -11, 404, 551, 164, 544, 194, -83, 105, -7, 447, 379, 212, 246, 109, -143, -161, -182, -71, -144, -36, 186, -23, 207, 172, -34, -207, -281, -237, -82, -44, -247, -292, -158, -218, -182, -224, 253, 195, 142, 90, -159, -46, -254, -440, -169, -65, 92, 350, -16, -54, 126, 102, 371, -200, -183, 24, -139, -129, 117, -113, 107, 635, 333, 689, 328, 332, 250, -82, 44, -197, 224, 263, 12, -27, 39, -136, 10, 435, 366, 482, 35, -19, -195, -295, -233, -16, 119, -99, 316, -91, -112, -53, -230, 22, -322, -547, -333, -345, -276, -394, -60, -67, -171, 43, -161, -281, -215, -483, -274, -324, -685, -110, -245, -302, -187, -230, -99, -389, -406, -244, -83, 106, -239, -161]
3678a61n6J10J90J49M1j4n4j03M4r7J47j92L60k04j18J80J12K76k38j82J9K28
3700D37j44Q1j91O8P8k75j1K22K50j64L0r8j98q3K64l50j20J25K92m0N3k95L11
3723B42J8q7j28j99K7pJ52m28Q1K88J02l08L6J93n4m9j32k19J3J24M2K4J21j44
3747b92J24k5J59P2J16qm41M13q5j98M2J30k69K75K42k69R5K7J72j20J09k30j46
3770a07J97j72L02N7j39N09k40j92j38O7k34q8j98L78K19k23j16J46L34j93j03
3791F6j0j71k6j38O0M1j72M02j8L6j32L65l06r7R2j89k05O5K57j23j3n1M78j30
3815H1Q5j87o2J86l57k31K38j45K99P8J80L14l23j01K64J8q9J55k20r4j04j79
3837a94K21J70r6K43L6J65Rl21j5j77o3J67r6K1L43j45J29o1J82r6m9k55j32J34
$$ y = [-161, -217, -107, 83, 232, 273, 259, 205, 102, 146, 49, 196, 4, 364, 160, 42, 222, 334, 610, 372, 190, 209, 437, 293, 374, 183, 251, 329, 54, 43, 265, 515, 351, 381, 283, 85, 2, 266, -84, -204, -79, 213, 173, 226, -69, 242, 260, 173, 45, -154, -127, -134, 18, -410, -329, -41, 61, -247, -211, -18, -72, -121, -253, -472, -459, -335, -293, -269, -148, -292, -168, -193, -34, 38, 154, 146, -295, 118, 33, -165, -123, 7, -262, 13, 255, -14, 81, 108, 280, 160, 269, 39, -107, 90, -82, 220, 277, 138, 647, 407, 215, 77, 144, -90, -178, -376, 2, 221, -2, -118, 28, 362, 169, 66, 56, -115, -141, -279, -219, -178, -350, 52, 34, 70, -62, 303, -3, -100, -8, -197, -402, -337, -80, -203, -216, -267, 211, 81, 166, -21, -83, 103, -254, -485, -247, -392, -93, -15, 165, 479, 156, 55, 319, 337, 248, 403, 183, 89, -15, -194, 27, 197, 101, 344, 380, 545, 554, 233, 218, 41, -22, 145, 49, 70, 413, 268, 397, 336, 518, 422, 373, 118, -14, 120]
3861A20k81J45J3N8K50k2Q3k71J60k05j64q2j31l2L2k1K92j7L0Qj68L77J10o56
3885c72J45k88l71N82j49j01K18K17K6j40m0L30P5j67l68j77P3K66m32O49m9J50
3907G7j48K51j26K96j15m52M03n10K58K4m1K60l40L71J72o0M26j41p87L22l25
3928a85J37n4j98M10j30O20l98K54o2qn13j4K52k48K76k89KL95m04J32L53k54
3950G4Q3k03k67M4j17O6K62j76O2L19m4K12k09m4q5k35qJ90k17M2n0kM93j37J21
3975A74J39k05q7J4l37L49k26j12J93J28J43J89o7J03Rl39L78j5l75j57J14k1
3997hj29K08J77K15P2j43m55K95p8l50L38l03l6K67j26L93k34P2J33k90j05J00
4019A3l82J76k80J5L95k17J94K90j37j63j85J64J02j89r3j7j9k45R2K59N2J60
$$ y = [120, -161, -16, -3, 55, 305, 283, 366, 95, 255, 50, -114, -196, -327, -359, -327, -348, -56, -73, -43, -35, -203, 174, 284, -372, -227, -515, -886, -304, -453, -554, -336, -119, -93, -233, -273, 57, 132, -35, -403, -580, -507, -241, -673, -24, -73, 77, -71, 180, 54, 350, 235, -217, 186, -324, -66, -42, -83, 177, -163, 208, 380, 320, 746, 605, -182, 140, -185, -48, -102, -300, 110, -20, 600, 202, 456, 394, 386, -127, -141, 111, -137, 139, -150, -148, 247, -157, -25, 328, 74, 157, -46, -313, -269, -386, -320, -58, -234, -172, 147, 103, 315, 106, 62, -23, -258, -266, -76, -293, -251, -301, -303, 190, 53, 174, 313, 108, 21, 35, -302, 47, -179, -291, -98, 30, 173, 362, 295, 398, 407, 68, 446, 431, 56, -101, 13, -8, -137, 71, 248, 463, 535, 392, -63, 232, 154, -196, 142, -161, -197, 70, -56, 337, 103, 175, 308, 18, -87, 13, -369, -193, -473, -458, -63, -280, -86, 204, 67, -96, -281, -117, -15, -204, -297, -314, -333, -578, -486, -227, -175, -15]
4041a5J1k25L1M2J35m75K42m9R7K49j05r6K76l30L95Rm69L44J28j84k21K36j01
4064g5J99Q0K33N5l6k21j86J2J39k88L99j94J30Q1j64J44J08l58P9K81m04L74
4086C88k63j71L1j96J77Q2o9L82j09l37J78j52k6kK12r5L8j90Q7j05J90l86K19
4109a17J70J5k65r5j10l1J31NL19j51P6L29n15Q8J4j44K73j40l2J60l09K61J71
4132A03J12q0j02K22j97L7j98k06J2J44J32M99l12K5J74m17K27p7L7k5j60J19
4154F9Nk0k14P6J03R0lO9j69J13k64j96j54K88J3L96k93J21k20p2r3M18p0j63
4178a70K12m14K9j35M25k99K19J16J01j47J05k27q2P6Pp6R9J93p3j13j5o2K02
4201b9K05k23L0J82l81q2K6J26N2K80L52k57J96K5l96jqMJ98j50N0J2l6O3K88
$$ y = [-15, -4, -229, -198, -156, -21, -496, -254, -303, -206, 43, -62, -158, 118, -212, 183, 192, -277, 67, 195, 11, -210, 26, -75, 124, 204, 437, 492, 456, 235, 49, 61, 200, -88, 311, 117, 247, 328, 164, 308, 416, 58, 137, 418, 14, 388, 125, -46, -15, -211, -34, 48, -21, 361, 252, -85, 93, -59, -85, -87, 125, 30, 68, -122, -35, -140, 50, -336, -117, 53, 68, -197, -292, -402, -433, -302, -297, 22, -129, -53, 276, -239, -151, -137, -281, -8, -148, -180, -20, -329, -68, 103, 215, 135, 33, 255, 58, 95, -103, -309, -297, -153, -21, 478, 166, 191, 365, -52, 175, 98, 135, 110, -50, 69, 74, 54, -160, -84, 19, 109, 106, 175, 6, 119, -145, -341, -495, -207, -194, 202, -91, 30, -190, -262, -355, 63, -7, -170, 42, -372, -343, -478, -53, -352, -133, -17, 84, -63, 42, -185, -267, -191, -184, -260, -161, 32, -41, -154, -169, -231, -29, 176, -47, -17, 165, -216, -298, -272, -146, -94, 186, 538, 281, 477, 502, 106, 105, 97, 101, 299, 149, 199, 211, 175, 238, 526]
4226E26j39k06K77K51n06k57J12p7K18m6L43j40l78M62l25j51J60j21J98q1k75
4247a55Q6m5j51Q0O1J84l33L93q6p7nm27qL33o0J77r4k11J59j20J29o7L32l32
4271b37J35j40J45j75L75j94L3J89k89K09Q7l48J39l6n2J56J56M5k10m0J26L2
4293A06J32m7j69J70j25m4J3J15k01j44J74K40J07k58J37K8l74R8j00N43N0m79
4315b8K33j82k22K81O7kk0n4j12r5j65K74Q7l20L45k77P6K83k45l7q2k6J90K20
4339A89m0k99OR4k97J24L82Q2j93J15l72J02O2o0O6J61j19J68k8K18l08k8k43
4362b18N00r9K21j35j67K57l53r0M30m6p6o3k75L29n6j1j82k3R5K11j98j81J69
4385C9M0pj23J42J96l02j27k4k9L00n0p4L1kk7j86j50J37k66J06N0J55k1J18j83
$$ y = [526, 387, 181, 458, 709, 203, -54, 58, -19, 199, 153, 496, 356, -22, 440, 115, -36, 124, 3, 201, 120, -155, -69, -114, -265, -185, -124, 60, -273, 120, 34, -43, -48, -475, -483, -150, -210, -33, -127, -338, -179, -299, -170, -237, 95, -237, -102, -242, -97, -272, 103, -91, -58, 131, -158, 51, 138, -210, -71, -107, -159, -3, 153, 198, -12, -52, 74, 106, 238, 191, 22, 192, 67, 23, 36, 151, -50, -194, -20, 220, 327, 69, 206, 234, -140, -42, -142, 401, 451, -28, 205, 23, -199, 82, 149, 147, 127, 73, -39, -134, -299, -25, 62, -258, 87, -190, -114, 169, -76, -113, -195, -221, -31, 189, 149, -150, -144, -50, -347, -223, 159, 241, 48, 163, -209, -107, -45, -105, -39, 122, 3, 171, 143, 361, 53, 25, -218, 282, 183, 404, 269, 102, 359, 6, -84, 346, 300, 224, 161, -114, 215, 159, 148, -34, -57, 38, 249, 51, -130, 39, 79, 72, -51, 91, 287, -15, -142, -166, -195, 105, 55, -19, 12, 10, -17, -203, -353, -216, -482, -376, -326, -171, -192, -74, -257]
4410b57J17k55K33J96j13j17on8k8r2J9M33k11k18L33k46r9L02J7K7K86j81P8
4433A60J19lm21NL02l0J6rj92J25M3N4j15J25J3K97j83k0o2p6J62k5k23L39k6
4458C75p4j58j43J74j44J87j78k1j25K28Rn9O2j53o7L36l72K02m5j58J86k35J2
4481a61O5j09J23K8N0p4j80O5J41o2L37l57k20J20J32O2R5J35o1P0m34L69K7k31
4505g0J15j62J98K06p9l24L5K3J34j12L03N8l87P8n0k5J90M6j22M30l13jj71J15
4529A15p7k19R9J39j06L19k30k15O5k11L15M0J04l46j91J66J78K2J52k9j68J9
4551e9j06P0r9K73j78m7K00l82k3L09m27J62K9J8K12Q4j08k57k21K34Q5M20j75
4574A4j46J51O4q5r7pj12K67j35L6N8JJ49k24K39K84m27M28k17qN5k06P8k1J44
$$ y = [-257, -140, -395, -162, 34, -79, -196, -202, -260, -288, -380, -361, 72, -139, -357, -24, -270, -369, -67, -50, -23, 263, 82, 160, 279, 276, -145, -140, 162, 132, 148, 139, -53, 72, 115, 169, 54, 179, 192, 489, 306, 286, 224, 148, 310, 285, 62, 401, 375, 301, 143, 0, 174, 30, 217, 39, 18, -107, 121, 130, 71, 133, -20, -87, 249, -123, 79, 34, -124, 62, -173, -161, -96, -205, -82, -54, -4, -78, -258, -193, -52, -114, 223, -134, -354, -234, -102, -40, 55, 190, 129, 199, -235, 134, 161, -70, 45, -117, 81, 287, 208, -116, -81, -58, 76, -36, 267, 325, -62, 16, -34, -59, 131, 177, 55, 485, 172, 171, 0, 115, 38, -181, -82, 57, -49, 270, 40, -175, -110, -321, -6, 34, 138, -208, -399, -233, -55, -33, 119, 90, -78, -59, -165, -95, -194, 79, -99, -146, 54, -328, -351, -42, -469, -307, -278, -260, -48, 36, -72, -329, -550, -316, -231, 189, 14, -132, 19, 83, -2, -99, -106, -218, 49, -86, -50, 8, 9, 158, -66, 173, 457, 30, 458, 241, 233, 288, 82, 160, 139, 283]
4599B83qJ85l34K64l16J05nl7K0M6l10K87l07K58lk62M31k0j69rJ12l04J11l13
4623b95K74n9K12Lk35j65J21J56Q5NK2k73j10r6O7j62J41k2J43J0Q2k12M72l12
4647a48n5J33j29K52k34J06j45m8L67R9J7p6J9j50q0P4k44K76k53J81K15L4k1
4670A90O9q4j50J47q7j01n2j15J62k20L86l94M25j48N2K39j43k43J40j74J3J17
4692B9j7k23j5K42m7K06q5J01p3j94j92M08p39N51M1k42J86R2j21q6K78k79J28
4715e1k32J06J15j75j23M7K22K14MK57n53L41l26P8K77k35l00J69J87L9M4M3K07
4738C55r7k17P4l1j42R0J05j33o7K53lM4J05kj48k6o4K76j55k86J35l3J06J61
4762C00j93J71j60r2l7K5j43K3j76R2j35kQ0Q5K31r6O6k11j8M3R6m47J59r3J47
$$ y = [283, 275, 460, 126, 390, 74, 179, 174, 137, 157, 203, -107, 180, -127, 131, 128, -134, 297, 277, 108, 99, 211, -93, 18, -295, -21, -80, 132, 135, -100, -265, -144, 12, 97, 102, 124, -149, -259, -355, -288, -450, -309, -331, -188, -178, -96, -308, 164, -148, -203, -70, -199, 53, -181, -75, -220, -268, 99, 198, 215, 139, 158, 8, -72, 2, -242, 34, -219, -38, 177, 211, 190, 259, 175, 25, 172, 85, -16, -68, -183, -21, -241, 145, -249, 176, 28, 80, 319, 176, -67, 73, -101, -88, 29, 12, -211, -226, 16, -31, 175, 90, 191, 118, -76, -268, 140, -599, -48, -7, -249, -63, 29, -92, -178, 100, -179, -51, -283, -177, -62, -237, -360, -313, -91, 123, 127, 384, -169, 172, -154, -76, 201, -34, -334, -165, 22, 61, 105, 148, 355, 258, 41, 115, 84, -58, 32, 137, 4, -63, 190, 187, 231, 336, 334, 186, 160, 96, 372, 217, -69, 66, 33, 139, 300, 107, 278, 118, 26, -11, 14, -129, -106, -282, -190, -325, -327, -247, -162, 69, -27, 39, -172, -190, -147, -51, -498, -339, -432, -285]
4787b85KJ76JP2l25J96O5l8k48K8J19j65K15Q5N3p3P5m5R7j38K06r2P1k75L43
4812A20j39j11L56l03J25O5j58N26l99%k5k16M15l27J25m4R2QN0J08j50K97l18
4835I7p3j33J21o6L27l2l51K71r8J63j35k13R9p3J66l49l0K64K0n3m0j75M16r5
4859B8q7l5q6jJ00o8J53k41J38J66P0k34J67L8k97j03J64J32N8k95K06m5K31R1
4883B50l21Q7J30k1O9K8p1j18j9J62L9k35O5o5K71J5l93K33k2k24K44q4j39M0
4907g9m4m6N8L60j34j15p3O5k60L48L0j07Q7k26n8M06l42Q4J23n68L53o8O3j3
4931a56qJ04L4k61K27J83j54K3P6m18L7k08L45q3j17M31l12K56j04J06O4k80l8
4954b53P0n5K15J35k74L09q7L67l83J56j80j91R5j42K59n8J46l9j60oM13k04K62
$$ y = [-285, -283, -107, -106, -34, -359, -163, -98, -136, -384, -356, -237, -402, -187, -102, -49, -122, -47, -92, 5, -133, 73, -19, 52, -223, 120, -19, -130, 226, -77, 48, 113, -45, 481, 82, 82, 57, -159, 256, -71, 54, 10, 102, 110, 160, 268, 118, 415, 97, 24, -109, 12, -54, 273, 241, -110, 161, 63, 226, 91, -122, -23, -96, 70, -279, -309, -45, -25, -78, -118, -293, 123, 28, -59, -94, -180, -181, -81, -149, 4, -237, -99, 67, 137, -97, 70, 108, -189, -292, -128, 4, 62, -233, -27, -72, 159, 250, -71, 16, 146, 125, 194, 222, 151, 33, 14, 176, 215, -20, 45, -20, 251, 266, -127, 106, 84, -140, 104, 20, -119, -79, -123, -169, -111, 249, 115, 0, -73, -8, -268, 80, 110, 3, 90, -136, -194, 212, -130, -46, 77, -491, -138, -206, -143, -156, -164, -60, -26, -287, -60, 123, -31, -8, 68, -350, -313, -521, -176, -259, -376, 55, -257, -1, -105, 1, 65, -215, -253, -183, -238, -23, 112, -162, 147, 60, 427, 44, 200, 20, -171, -76, -218, 41, -17, 129, 90, -70, -76, 337, 133, 395]
4977C95l23Q2j7J22j65J28j37J79K83n27L89l49J00R8l47M43n2k95K7k53J69n7
4999a07K2J22K0P4k02K55k12Pj10j24J07n7J53l21RM65j68J6J09m20L62k37K80
5022D3l88M8L02R0j56J61J70k57R6l66J46L6k21K58q7J38j01J07M7MM5J47j2j79
5046G1M2j60K27j73J58k36J54N6j56K47j0lk94R8k56J23mj2L18j98K69k31K4R
5070F3K27j31n48L70k60J50J57j39j13J0K4J2Q1K9j68L10p3k87Q2Lp0r7L50j54
5094a72M74n65K24L2J3k58K57k35K44J36m60N93m2j71J36j15M2jn7l9J14QRO8
5118B35Om0J6j85L42k10M5Np5m9Q%J24k4J7J11k07Q4k33N4Q2r5P1j30q3L20j53
5145C6j15M17l61J09Qj60MJ1P5J0l38J15j90L24N8j84L36k27k28L33j14o2k35
$$ y = [395, 72, 154, 137, 259, 94, 222, 85, 264, 547, 20, 409, 60, 160, 258, -89, 354, 302, 7, 34, -219, -50, -107, -85, 37, 57, 131, -71, 184, -28, -21, -131, -255, -148, -205, -52, -373, -364, 101, -67, -51, 58, -362, 0, -237, 43, -345, -297, 5, 95, -61, 100, 270, 13, 109, -257, -111, -75, -296, -38, -125, 13, -88, 19, 66, 70, 115, 262, 250, 71, 113, -47, 180, 7, 165, -71, 83, 139, -17, 230, 220, 217, -77, 21, -235, -112, -116, -128, 190, -8, 261, 30, 54, 63, 290, 159, -389, -19, -279, -129, 28, -111, -224, -214, -190, -178, -97, -68, -236, 74, 1, -286, -204, -201, -271, -368, -18, -172, 302, -263, -39, -7, 6, -252, 5, -230, 14, 150, -310, 283, 241, 70, 206, 91, 133, 132, 75, 36, 150, 158, 167, 235, 241, 201, 217, 32, 374, 164, 209, 214, 139, 90, 98, 98, 222, 198, 215, 326, 119, 203, -30, 24, 106, 11, 82, -48, -131, 189, 36, -79, 338, -23, 86, 94, -66, -62, -51, 24, 34, -304, -189, -379, -55, 3, -181, 155, -72, -300, 33, -81, -143, -378]
5168c78P5L36j97o7j46M54k01k82L49q5P5K77k78q3l4K91j05j42K64J18k8m2k71
5191a00L96p01K99l23L04K07l6k22J47r8J34J01R2k6j37j23J82k85J50r3J6K04
5213H8j80O2L2O5J21k38k8j13J32L39j17j25j31K0O7l2m1J60k2n9l39L75j60P5
5237d9m4j19M1K13n3j19kq2K62j50J76L8lL7l20M46k56K21j70K09j35K3k81J93
5261G6N6j65M24o42L45N2k48n1K63O3Q0j08j79L6Q8J39j59O5p4L49J5m24j7K09
5285A93j76j72kL93k98K7oj08O3O8J97j14m7j66K46l69O7m6R5k0Jj1J0K73j20
5310b2k42q4N2J27J78r7p9k2J57o2l3j8J38o8P7JO7k32L3p8Q4J51mm2j69M7K60
5337A20p6n1K60k10K12k7j37k07K41p6J78j67K11k13j36K38J06j52L7j37O3J05
$$ y = [-378, -303, 33, -164, -231, -377, 77, -124, -406, -57, -142, -67, 210, -68, -151, -185, 106, 1, -141, 123, 241, 213, 171, -100, 296, -405, -106, -429, -125, 82, 46, -176, -29, -127, 7, 108, 200, 174, 37, -86, 96, -189, -39, -132, -116, 88, -92, -30, 2, 67, 188, -50, -78, -191, -59, 280, 163, 38, -93, -73, -6, -38, -79, 81, 59, 0, -339, 36, -124, -49, -93, -212, -171, 42, -11, -130, -132, -214, 48, -102, 74, 112, 109, 146, -174, 272, 16, 237, 67, 276, 141, 164, -117, 76, 132, -33, 391, -251, 94, 146, -102, -153, 110, 173, 253, 145, -34, 2, 90, 229, 70, 135, 61, 410, 425, 1, -16, 193, 17, -155, -157, 236, -62, -35, -41, -149, -86, -18, 179, 65, 18, -148, 98, -271, -204, -250, -155, -175, -174, -185, -175, 98, -22, -264, -348, -296, -169, 9, -88, -167, -189, -32, -94, -127, -145, -7, -75, 2, 3, 70, -162, -129, -207, -123, 28, 24, -18, -187, -140, 120, 44, -7, 253, 43, 255, 228, 91, -116, 125, 49, 227, 60, 271, 58, -78, 160, 266, 114, 151, 14, 77, 182]
5359A82j53K94m40N37l5Nl86J58j14j27J63R6k24O4L06k76j85R8j6o8K01K2j25
5382b3m5j87J81l2q2q5J25K15o2l7j17Q8m0j6j22n9M21n7q5P1l12L32k4j67K06
5407H7Q9j58P6j97J4MJ62N3k68P8j01M33m56J03L19p1j24K53k29K0j17K78M2j89
5431A01K53k2k92K40l9k58l7k93M90j75L5r9K55j95j37J41J3n7K29p3k42J20l39
5454c81j2L57j37P8p1Q2k9M4%R0j53j33J41O2r4o4O1M6M3K80l20J65j7k12P4N0
5480e0r3mK73L9RmP5O2n52L06K91l77J47J92m34P6J16j10J67K87j37%j20K2j45
5505C6q8M87l31l9K13j78Q2j39r2oK29m7j34J78k39P9n3M6j13L97l15L0L18m37
5529a16M22l69q8J50J28j73J42j99r7K09j67M5qj5j36M64m91r1K35K5L13j37l63
$$ y = [182, 29, 323, -117, 420, 385, 390, 4, 162, 48, -79, 84, 180, -44, 20, 326, 50, -135, -37, -53, -121, 80, 102, -23, -68, -255, -74, -106, -188, -273, -148, 67, 5, -32, -149, -61, -101, -117, -239, -298, 123, 66, -19, 52, -260, 72, 48, -119, 87, 176, 18, 94, -103, -89, -85, 77, 130, -138, -60, -161, 272, -184, -81, 238, 167, 43, 296, 67, 87, -30, 248, 290, 101, 354, 332, 40, 280, 241, -17, -54, -347, 143, -32, 3, -96, 159, -36, -173, -32, -19, -76, 153, 80, -162, -42, -381, -393, -36, -173, -95, -166, -84, -113, -69, -69, 21, -132, -265, -124, -62, -156, -220, -159, -113, -70, 210, -110, 55, 38, -174, -100, -50, -143, -147, 126, 165, 174, 170, 245, 307, -245, 61, 352, -25, 122, 314, -120, -44, 72, -38, 129, 416, 279, 279, 159, 181, 36, -52, 435, 104, 65, 278, 100, 182, 43, -49, -55, 174, 127, -7, 171, -68, 11, -42, 4, -109, 288, -27, 3, 321, -116, 306, -63, -151, -1, 127, -46, 96, -103, -200, 9, -158, -113, -121, -136, -272, 192, -299, -390, -155, -130, 183, 46, -317]
5552c17L93k06J96k1N7Q2j18j57j14J31K01q0j66L63n3k45K53k2L8l18k7N7j06
5575a79N05j28j82k89M30j65K26p0j98M31j50l37K04l77J16O1P3m0j51K98K07
5596B85k89j62J35o2J18j82j61K11j84J94K01j07N3Q5k03j8Q2K9j11P4K9r1J09
5619C5J6J17j76J29j05l9J45k29J60J0m4j64j17K78J80j3O3q0J22k27J80j05P8
5642B14l44M73k73l2J79q3R7n12L36K4q4OR7l3Q1jM9j54J57o1j25M9k06J22N7
5667C3l7M0p8L4o4P4P8l7k3o2lL5r1k84L31j96j18M51m23K74J48j31j83n3K66
5692a9j94J45J06p5M5o6K2j7J49mk89K2JJ4J25o0J68L2n0j04n7J18j13r4K88n6
5718C7K16n1m9j74J83q2p3K39o3o4P2O5l08J36m3k56K19j78K62J92J1k64Q2k02
$$ y = [-317, 76, -130, 66, 45, 102, 184, 66, -91, -205, -74, 127, 47, -119, 244, 191, -54, 199, 177, 215, -103, -130, -73, -179, 326, 198, 16, -273, 157, -8, 218, 148, -50, 381, 231, -106, 98, -279, -163, -102, -29, -69, -220, 78, 285, -4, -166, -31, -93, 25, -157, -318, -107, -291, -97, 104, -3, 50, 135, -68, -86, -4, 25, -86, -12, 17, -74, 35, 51, 168, -8, 121, 16, -23, 122, -107, 53, 63, 19, -145, -262, 16, 196, 183, 246, 166, 288, 61, 241, 136, 214, -130, 343, 70, 38, 217, 134, 231, -281, 55, 79, -5, 1, 98, 65, 146, 145, 194, 40, 197, 136, 11, 60, -146, -24, 33, -4, 36, -42, -8, -72, 2, 80, 43, 20, -42, -45, -10, -101, -385, -54, -250, -368, 83, -340, -66, 82, -49, -232, -285, -19, -213, -68, 38, -37, 8, -58, -36, -53, 96, 92, -197, -175, -174, -160, -35, -95, 73, 105, 55, -49, -106, 12, -101, -195, 93, 37, 253, 202, 153, -21, 162, 80, 7, 246, 183, 119, 191, 256, -52, 84, 41, -215, 4, -174, 88, 280, 291, 27, 109, -93]
5742i3K04k91K56k50n3K48l02K11L42k07p0k8J16J10l83J64%K20k04j85J56M0
5764AM2J42k20j73J80o7l1K4J30R8j86J20k87L43L5j87J18p8k72K38l28L48n5
5787f5L01k62J03P7Pl1j71K03j39r5j24N77l66R1j78K05R7k93J48o7p4p2L82j89
5811F5k37K26l0M1n5j38J42R2q6J98l45N7J06j42O1Q2n3j4k75L55J8p6j30N5m9
5836a32K9j68K37k7p2j59J40Q3k1J48M7k05R7Qj70J27J2P4J0k37K0K16NL1r9J95
5862A89k93RJ48l1k8j71MJ56M2J76pKM0k57L19q3j73LJ48j18p4P1JJ49P0k93l1
5889c2P0R9pJ61l07J71j78j53L88K8J9m26K38j53m4K6J43j8k49J48R5Qj49J61
5913C9NlK13k41n5O6j82n6J31OL1l6J83l2K4J7j98j18N0J13k02L16Nk04K80n6
$$ y = [-93, 111, -180, 76, -174, -227, 21, -281, -70, 272, 65, -5, -33, 83, 193, -190, -26, -26, 194, -10, -195, -39, 1, 43, 185, -35, -208, -28, -95, -126, -102, 28, 126, -60, 60, -227, 116, 151, -36, 82, 4, -268, -30, -358, -10, -65, 236, -26, 77, 154, 161, 130, -41, 162, 23, -72, -196, 381, 15, 106, -72, 133, 230, -63, 85, 18, -56, -128, 254, 65, -172, 54, 24, 65, 10, -128, 14, 106, 20, 218, -127, -70, 36, -106, -45, 37, -16, -30, -305, 50, 68, -8, -138, -83, -132, -103, -271, -34, -61, -133, -292, -152, -69, -90, 58, 105, -100, -3, 5, -165, -38, -26, 48, 58, -179, -159, 57, 62, 93, -6, 189, -104, -95, 53, 22, -6, -177, -173, -17, 25, 201, 194, 196, 236, -21, 298, 215, 42, 45, 193, 75, 1, 72, 73, 222, 292, -1, -32, 38, 137, 130, 291, -16, 155, -23, -176, 212, 240, 259, -167, 71, -82, -126, -100, 43, 25, -224, -76, 19, 27, -122, 39, 44, 41, 254, 13, -42, 24, -158, -214, -83, -77, -46, -82, 101, 69, 93, 110, -88, -206, -156, -43, -245, 71, 76, -128, 152, 96]
5939I6j09K34k55J92j47k16p9L78K97m98R5J76j78J22R4J24m42J90J2%K1j99J10
5962A8k58K13J49j86M11j52P5k08k19K74j75m7r1P8M7J1J12o7O2K2k25R2j72J14
5986a22N1L5N2l05J95K5j37J01J53k27J32l0NK31k92J8O1P3J37p5l11K75j30p
6010i2L05k30p1j71K75K18j89N3Q1J99m03M18l24M4J26p9k9r7rK99n9l37K71l3
6034A66j41K19o0j27K67l39K94p8k9k86J93r3m2j3K43n13L94r4Q4o8J87l02J06
6057c2k92L55N6k15J08k41J51Nj72k2K26j39MN8O3J08pj92J13k9P0M3m2j40J52
6082a1l7l9J57j78R1m2K5J22k23J9J65J66l31J69J9l27M11k94J60N4k21J59J91
6105B05o7k87J17j8J22k50K22J3Q9k53J85rk54L77k50O2j55J84Jq4K23k59J18
$$ y = [96, -13, 221, -34, 158, 11, -205, -284, 94, 391, -107, -12, 164, -14, 108, 202, 326, -116, 74, 86, 86, 107, -92, 18, -240, -27, 122, -64, 347, 195, 270, 62, -157, 117, -58, -105, -196, -118, -71, -60, 52, -15, 47, 69, -156, -64, -236, -122, -71, -36, 16, -289, -94, -69, -206, -105, 48, -179, -47, -77, -72, 159, -133, -115, -54, 19, 156, 81, -230, 45, -85, -92, 213, -17, -88, -259, 16, 234, 45, 98, 179, 378, -25, 393, 69, 113, 239, 160, 131, 34, 25, 324, 265, -72, 199, 166, 25, 244, 184, 57, 324, -15, 279, 201, 172, -114, 79, -14, -56, -69, 174, -339, 55, -39, 45, -23, 164, -138, -32, -324, 31, 87, -128, -20, -261, -110, -105, -277, -299, -73, -212, -208, -150, -87, 21, 14, -178, -65, -94, -24, 19, -23, -163, -11, -48, -87, 70, -108, -17, -59, -34, 88, -135, -116, 49, 215, -116, 53, 72, -255, 156, -138, 22, 76, -145, 14, 205, 138, -149, -32, -50, 72, -178, 44, 57, 146, -107, 78, 69, -185, 192, -58, 4, -151, 33, 34, -50, 173, -86, 32]
6128C2j7j34p7M31j75j91o0O8J99j71L9j8K17j89m65L03K95j90J92k08J11n6k3
6151h7k8J70j94J18J59k70K23l10J70L1J76P7l70K28j69QL40j73K3J01j69k5J50
6174A79j39j09L66k77J18J02j5j99p7J42j50L1K34J78j19k2j86l59J66J58n5Q4
6196E1j88K54m22Q3M32j65l21M50l02Jj16J30n7q6K49n9J15k47Q0m5p8L12j58
6219h7N5k81L76j71n1L5q8J29K56q7j89K33K44l70L90o8l12l5J12KLp0j25L3L7
6244b9o0P2Mn9J90L2K11k48p4L9K4J68k46K3J19rk3J1J71j66J4k25J54J85p6O5
6270B67k29Q2q2j84J29J71k33n2K68k15J44Q0n3j87n8J3K14j2j85J30j95L82k60
6293f5J21P1r6p1K52r2n7L1l69K59j76K01J18J2j24j41L0K65m85L74K02j71j72
$$ y = [32, 15, -119, -196, 235, 60, -131, -191, -123, 76, -95, -56, -74, 143, -46, -511, -208, 87, -103, 89, -119, -8, -64, -87, -115, 55, -139, -21, 138, -132, 91, -219, -49, -18, 158, 235, -135, 93, -76, -68, 272, 99, 122, 223, 54, 29, 179, 40, -69, 297, 20, 138, 240, 225, 26, -51, 91, -59, -28, 206, 384, 265, 243, 57, -302, -136, 22, -33, 51, -137, 117, -305, -222, 210, 45, -276, 174, -128, -127, -243, -113, -170, -256, -7, -66, 49, -198, -118, -163, -241, 71, -87, -32, -313, 63, -108, -159, -124, -212, -83, 173, 86, -103, 130, 374, 4, 394, 326, 14, -21, 91, 93, 96, 26, -99, -66, -29, -89, -17, -13, -72, 118, 150, 361, 113, 39, 78, 102, 270, 24, 47, 166, 157, 134, 145, 316, 150, 164, -61, 93, 278, 202, 267, 38, 120, 38, -146, -17, 154, -79, -131, 137, -78, 66, 146, 93, -94, -152, -139, 75, 63, -122, 8, -187, 195, -65, 56, 127, 31, -40, 212, 120, 63, 94, -275, -16, -192, 9, 127, 139, 15, -126, -96, 169, -316, 58, 260, 89, -83]
6316h3K46j57K04k03P0l30J89J1mL37l95K78k61K30j83L1p2j09L29j31Q1Qk5N8
6340A19j28J0J50Nj69P7j27p0J58j66P1n6L02l05O5j9Q0m8l1N7N5q1l27J20J63
6365i5M5o9rK07k42j3R7p7K82O6l66J8J36N8Q7k33L48j31n7l9J87k16K3J20J44
6390B71m99L23j2J43k05k7R1Mj39M0J32O8q7j05K55n69M17k53K38P2k87J73k0
6413B4Q6j9k66K03o2n5J98r4O7J77k79J09j05K3l4J45p4k64L2o3N02m48J05n8
6437a50J05R5j12q7K9k17L35J04k50l4O7K12K7k59M7p0J98j18K9N3M8j43J17l4
6461hJJ7l6K1K43j21j15j00R0k8p3J60k88L39J88N4k06j26K0J03k41K83k03J01
6485G5j30J84l84L11j08K2l3L1j67n2K69l2r8r2J70%n5j36K95j93j32J44j41L90
$$ y = [-83, 163, 6, 210, 7, 77, -253, -64, -53, -57, 280, -115, 163, -98, 132, -51, -20, -92, -201, 128, -3, 78, 86, 61, 119, -9, 1, 151, 156, -13, 64, -63, -133, 25, -141, -70, -126, 176, -129, -64, -83, -3, -51, -82, -25, 30, -51, -378, -258, -95, -50, -119, -128, 79, -163, -176, -79, -156, 126, 192, -174, -156, -20, 38, 125, -108, 240, 109, 52, 13, 200, -16, 7, 127, 271, -228, 95, 83, 226, 21, -6, 85, 89, -50, -10, 122, 190, 103, -2, 253, -316, 101, -152, 86, 158, -129, 44, 24, 110, 91, -175, 28, -34, -89, 109, 15, 82, 259, -20, 89, -16, 7, -27, 118, 44, -220, -188, -251, 251, -197, -92, -150, -45, 50, -62, -149, -120, -337, -2, 102, -148, -182, -115, 97, 124, -135, -88, -158, 40, -78, -49, 4, 52, -91, 26, -8, -7, 10, -26, -5, 238, 117, 2, -98, -8, -36, -109, 51, -237, 102, 290, 344, 138, 12, 32, 135, -106, 177, -26, 75, -55, 129, -255, 56, -52, -30, -63, -32, -199, -251, 18, -14, -112, -204, -34, -34, -89, -225, 70, -123, -255, -111, -252, 138]
6509A38n1J52p6l39R9p4L5Q6K39k97J66J01l42M1M2L4jr0r6K49n5Q9k01M8K49
6534A46j35K6j21J90j03J47n4j31K52k8j85Q7N6q2P2pN8L5j38J45j65J07k01K16
6558A87k16J85J11j60K0q1r1N6K1K99k64o9R8j87j26mJ76m4p8o2L00J85k61k1
6582b6K57k19n7l4O6%j45l2l8R9J29m1l8o8R8k9Mj01N9K41l52L15k69K47j57J06
6608A5j12R7l9J59j04Q6L4p1Q8k89O5L95k82j19J06K15m84K04K19j47O2j8o3j31
6632a14L6J54o6p6J87j54L43k03l9o4n8m2L37k59K25q1J09j51l22J23J23q3J19
6655D4k08L31l34K05mN5l6J06j84k2L4j19K03l11L58kN6j64R5l89M52N8m16N8
6679a34p7K79j46K06j72J36j26j76N97l73Q2l5mK1l22K71k39L06k23j27M02j38
$$ y = [138, 87, 239, 163, -176, -77, -151, -116, -30, 209, -88, 78, 179, -163, -122, -80, -46, -47, -137, -233, 16, -39, 50, -151, -103, 146, 11, 37, -84, 106, 3, 150, 96, -35, 217, 189, 4, 91, 147, 65, 137, 130, 188, 223, 85, 230, 65, 172, -29, 187, -29, 156, 267, 107, 127, 46, -45, 11, 32, 331, 67, -2, 96, -91, -217, -221, -45, -89, -167, -229, 71, 256, -5, -26, 231, 12, -45, -79, -13, -13, -158, -190, -228, -129, 0, -41, -79, -147, -49, -78, -74, -175, -116, 125, -227, 88, -181, 66, -91, 15, -97, 0, -39, 120, 16, 102, 136, 65, 153, -136, -71, 324, 42, -77, 29, 244, -240, -36, 183, 36, 98, 80, 17, -114, -78, 76, 10, -66, 121, -33, 310, 107, 68, 4, -54, -96, 241, -18, 207, 126, 235, 84, -238, -115, 8, -75, 44, -164, 167, -167, 38, 34, 89, 53, 159, -25, -47, -13, -132, 71, -240, 118, 116, 172, 8, 103, -286, 166, 224, -192, -134, -211, 68, -78, 128, -44, 92, -34, -210, 387, 14, 96, 61, 57, 78, -244, 27, -212, 94, -129, -256, 146, 8]
6701Hn1K26j12J18k07J60Ok05n5O0K10J36k51K7J29k21L4K23l56PO4k1l7j13R9
6726a22L26l12J01p8J9p1k06M52k14K36m21j47J00L45j30J35J38j10k68J39J22
6747C4j28J42L0j8p1p9J50j9J25J65j33j25r3j54L46l9l27J79J39J73k82q9J41
6770F7M0j32J48r3j71M60l07p5J12K73k99%J24j37k2K4j29%L51j48J5O6J05p9
6794A93k3J1j12N8J8j30l25L15o5P5j50K60r8j50L62k15p5l3L4J34k8r4k50J71
6818a17r8J65J42j65l12L76j7J09k57K90q6o5K1R0P1M8l46P6J25j9j92KK42j05
6842b2m5J55J3m4k72J61j3K5L6J11Q5r9J9P4j33M0k28K96j22k95J33J30K5j38
6866a08k9J16L28m99K23p4n3k09L78j21J3K0J23k00l0K33j93J00j32N0j15K42
$$ y = [8, -43, 183, 71, 189, -18, 142, 148, -57, -112, -52, 158, 294, 43, 70, 199, -22, 12, 235, -121, -114, -50, -71, -108, -221, -122, 204, -108, -7, -85, -66, -137, -343, 109, -105, 131, -290, -437, -337, 8, -122, 13, 151, 41, -227, -88, 34, -94, 48, 78, 60, -11, -90, 60, 41, 166, 331, 198, 73, -20, -174, 172, 133, -194, -15, 124, 297, 15, -74, 67, 107, -25, 123, 30, -141, 319, 12, -63, 49, 322, 23, 23, 147, 10, -12, 12, -117, -117, 234, 86, 101, 167, 272, 193, 170, 181, 69, 127, 145, 15, -310, 5, -60, 15, -135, 125, 27, -123, 239, 24, -51, -84, -50, 84, 56, -38, -288, -117, -215, -50, 92, -73, -385, -9, -26, 83, -174, 116, 30, -35, -14, 76, 147, 195, -151, -75, 50, 31, -161, -159, 83, -22, -67, 88, 101, 57, -215, -54, -67, -42, -6, 105, 190, 91, 110, 184, 51, 91, -137, 159, 37, -258, -125, 5, 30, -108, -137, -21, 307, -192, 31, -43, -96, -305, 73, -48, -35, -15, 108, -92, -122, 111, -82, 18, -114, -64, -179, 63]
6888F3j81J48J68j17k00J56N8k52K77j58M9o6K45k94J60j49J3K61j62m0k7J74
6910A26k63L95p5l38K27m8o7J73o0J09j86l5K56J0k08J51L1O1k16J04k26K13l6
6933I8j49K52r1k20K88O2o2k37J33Q8m1k83P9J25N6r2j79M25m02K96k66R1k78
6956c07K80p2m8m8J50K23k83o1K06p8o5J53Jj38ok09M13k12j9j46J39R1J57k25
6980a04J34j57K70l79L09J96m45l3J69K74j39J12k70p5N2r0L15j35QJ41j06n8
7002a1k42L04J64j33QJ07k30L4K1R9j02R1k70K23m3m8J1k92K57n9J06j20K38l05
7026a92J92R8l53M87j72k18J68n6n5L81l66r1K01N1l34k7J20J02m0J40n4Q4M3
7049A09k7O4j74j28J07j01J97R8m2k32K74o9J9J27l25J53n5J79o9n3j2k10K56
$$ y = [63, -118, 30, 198, 81, -119, 37, 95, -157, 120, -38, 11, -55, 190, -104, 56, -93, -80, 181, 19, -21, -48, 126, -137, 258, 183, -155, 72, 24, -43, 130, 70, 179, -7, -42, 214, 224, 16, 167, 198, 259, 43, 147, -79, 134, 98, -51, 201, 110, -110, 178, 240, 178, -59, 74, 162, 121, -162, -83, 42, 98, 6, -173, 252, -150, 146, -120, -29, -307, -27, -99, -147, -195, -45, 178, -105, -166, 40, -38, -103, 50, 51, -87, -93, -302, 111, -101, -120, -266, -127, -36, 121, -104, 30, -127, 143, -236, 73, 269, -176, -209, -40, 234, 95, 207, -63, -138, -86, -176, 139, 4, 12, 153, 47, -11, -253, 51, 215, 82, 90, 197, -33, 1, 22, 121, 19, 110, -160, 63, 20, -28, -17, -309, -52, -111, -5, -125, 113, -192, 0, 98, -255, 232, 60, -158, 10, -46, -101, 280, -86, -177, 24, 75, -259, -286, -166, -64, -104, 36, -18, 66, 109, 82, 146, -28, -156, -49, -150, 47, 145, 103, -129, 145, 76, 95, 222, -103, 50, -5, 174, 105, 52, 40, -170, 86]
7072H6J45j96j45O6J12k93L94j50k7J08Lr0L11m06PK8j66L47k29J09l7J47l88
7095b64L83k2k02Q7j5k23K16o3O7J62j97j62J23m3o3L08j6j99O3m8J82k16j11
7118b53K86k45J12P2J87J23o07L93j97K21k57J20K72k77L50m82K86j78K26m2r1
7139A9pN0q9p1P5JL43k09n8l59N19j76J0K9J52k13J1O1k70L41j33l32N28l26P4
7164c0J00k3M7k41K9L01l91l4K89K8k88K29j01J00l2l8J42OK9j57j7m4L1L69l19
7189a5m4Q4j1q5J30K2o2J10k69J04j54N71m84J60j1o2R6k6k54J24R3r7k36L95
7213G9j44J42k99J87J05k24J55J15j76J27r6j06K92M6j69j94J04K79j08j63N3
7234EM1K20l04K23j68K5J81j40p4K3K00k05n2M5k45K8J53j80L96j47n4J03j23
$$ y = [86, 231, 35, -110, -44, 68, -225, 169, 19, -8, 100, 103, 13, 324, -82, -75, -47, -213, 134, -95, 14, -23, 124, -264, 119, 97, -105, -18, -33, -256, -40, -103, -36, 126, -71, -233, -110, -153, -216, 92, 76, -123, -60, -108, 74, -142, -253, 33, -212, -100, -28, 159, 282, -325, 68, -129, 92, -165, -45, 227, -50, 300, -182, 104, -74, 152, 110, 19, 12, 62, -27, -98, -23, -22, 321, 112, 54, -305, 214, 38, 48, 77, 229, 16, 27, 88, -182, 159, 26, -306, 222, -104, -30, 70, 47, 94, -147, -118, 183, -208, -242, 47, 75, -213, 16, -85, 15, -17, -55, 87, 93, 122, -35, -52, -96, -65, 304, -15, -59, 25, 14, -71, 59, 81, 19, 129, -140, -36, -190, 381, -103, 57, 46, -16, 80, 54, -200, -76, 17, -80, -316, 79, -65, 77, -222, -35, 70, -154, 1, 116, -60, 67, -29, -135, 157, 203, 34, -160, -56, 223, 115, -48, 5, 46, 266, -38, 185, 17, 42, 223, 83, 9, 32, 232, 27, -25, 20, -225, -197, -44, -224, 172, 25, -29, 74, -49]
7257d9k0M4Rn1J20o7J0l0R3j51L29l70J53L01l49q4J91p2k23Q7J96o4k42J16Q7
7282c6R0n7p8J97q2P5l4k03J25OK33Kl94L13j88J56J6N2l7k21J00J59P5jk30k56
7308b18L36j58J11Q6l39K44j45L2J11p2L4L33n35J04K19Nj66n9J00l38K96K4J85
7331A90l29Q6l0j23J41J30R3k46Q5j45o5r0L81l18L04l01K35m20M45j92QJ58J2
7354Ij25J05K15k83K46j86j63R3J71k70rM7K99m18L71k02M9l0K37Nk37M4K4k95
7378c03M50j59q1J13j9q0K8o4K4L03j31K54k61p8j53L68k29r1J39O1k25K38k19
7401a15Pl6K05r0j06J21j61K26R6o5j20J48M0m36J24M40n19K89m15L43J77j53
7423@j6M6p3K31j96J20K1j20M6J77n38L52j02j02P0j14K87NP7k94J90O7j69P5
$$ y = [-49, -69, -25, -16, -67, 53, -14, -4, -34, 59, -92, 237, -133, 20, 321, -28, -112, 79, 7, -216, -129, 67, 3, -239, -123, -36, 54, -3, -81, 116, 34, 109, 75, -128, -3, 3, 236, 238, -156, 157, -31, 125, 141, 193, 156, -65, 35, 194, 269, 268, 38, -218, 118, -40, 71, 157, -182, 62, -83, -51, 60, -12, 22, 355, -180, -76, 143, 148, -18, -77, 23, -315, -19, 5, 190, -139, -53, -83, -206, -65, 65, 158, -88, -3, -148, -213, -303, 78, -240, 64, -237, -2, -422, 23, -169, -161, -3, 9, -116, -11, 204, -79, 167, -19, -182, -89, 82, -188, -197, -150, 149, -269, 102, -100, -51, -81, 156, 161, -76, -32, -8, -303, 147, -12, -93, 20, 1, -79, -51, -115, -91, 212, 81, 335, 74, -4, -157, 211, -18, -109, 30, 91, -134, 104, -115, -108, -144, 61, -29, -135, -14, -175, 51, 147, 82, -38, 110, 150, -286, -162, 278, -241, 48, -367, -24, 153, 0, -16, 30, -43, 188, -8, 112, 133, 13, 59, 236, -302, 50, -52, -154, -84, -198, 89, 94, 171, -123, 67, 134, -35, 40]
7447D0K0L5R7j08P0o4Q8j10j88J94j67J03K7k4%k6M24m74K92k01mQ4n9j17J6O0
7473HJ59k67l6Q5M9j63M51j42k95L63j85R6K8k15l6K0Q4r5j00O5K25j80L5k3j33
7498b02M1J31K28k67P8J09l39m1K12J79N8j64J00j47p2q9K44J3j93P1m2J41r8
7521d9J93j28P4J0Kj0J54l91L36q1j91O3J77J29l25K21K4j17j93K05j33J11j22
7544d1J65j99m9J59n8J60J53m96J77J8J46l11J59J77m69M96k1m10Q8rk4J77j54
7567a66K26k90K85j00J43r5j28J14r5O6M3J0J19j71K63j40l42J36J95Nl14N9K28
7590E1p0K5PR6p9J11o7o6J13M4k88K67M7o7l40J17J85j54K82p8m3J04L2l46K79
7615A62j35j05J16K3Ml06L40k67M11j13p7r8k47M14k87K06kN4k61K52M4j74R9
$$ y = [40, 60, 95, 192, 84, 154, 90, 178, 68, -120, 74, -93, 10, 37, 13, 13, -13, 411, -63, 229, 28, 24, 108, 49, -68, -52, 8, 167, -100, -136, -51, -2, -165, 286, 144, -151, 212, 27, 123, 151, -64, -100, -80, 4, -91, -191, -126, 99, -81, -46, -69, -202, -161, -30, 198, -69, 9, 118, -221, -262, -50, 129, 187, 23, 123, -24, -96, -185, 59, 72, -121, -50, -92, 49, -49, 144, 16, 90, 100, 102, 92, 246, -145, 191, 110, -81, -18, 159, 288, -37, 184, 208, 91, -102, 103, -30, 81, -41, 124, -75, -124, 35, -23, 137, 290, -206, -29, -11, 135, -176, -17, 160, -309, 187, 166, -244, -156, -165, -189, -12, -166, 60, -230, 55, -45, 98, 3, -125, -11, -106, -40, 3, 13, 132, -39, 224, 84, -258, -122, 73, 78, -236, -177, 51, -19, 6, 13, 109, 30, 141, 74, 8, 121, 165, -123, 144, 191, 124, -216, -99, 86, -68, 214, 136, 93, 197, 229, -117, 162, 27, -78, 38, 61, 65, -241, 99, -168, 243, 130, 53, -45, -292, 122, -165, 41, 39, 93, -168, 84, 128, -46, 53]
7638E3j82Q8p4l1k14K69J50k22PM51j83k02J18o6j70kK48l4Q8k31J68N6k52K82
7662A15qpj75J83l3j95J73J68m24M06l60J95j25J52K50qk13L4k32J17J14L0k80
7685a23L22N0q3k25J29k3J39n1k67K85k72L05l06J55J72k57L8q4k46N92l76K35
7707A09j72j48J33j1j26m9K3M73l17K94k05j47j47K69j22j40K61j55N3j86M71
7728A61j68P6j65j14L75roq3j35Jq5J29K41k81K72k00l5j06J6L10j61r7N7J18
7752A11o7k9Q2l3j0K33l32J58k46Q4q5N8P7K5K9j66M24r9q0k08O5j68j74L17r6
7777a30l2k86K45K11j39P5lj7R6P0k06J05l7L02l58J50l9j2L2k03R3K0J91m6J8
7802A00k32K01J4r2j53J64M4J54M2m9o1j63JK2j20j66M58r6L4k51M75k44k51J35
$$ y = [53, -129, -41, -115, -146, -360, -91, 59, -163, -156, 295, 112, -90, 28, -38, -208, -210, 38, 4, 92, -139, 29, 85, -167, 115, 107, 100, -75, 108, 75, -120, 53, 221, -203, 203, -157, 38, -87, 65, 315, 307, 94, 128, -104, 13, 127, 157, -123, 199, 249, 166, -59, 70, 47, 186, 135, -132, 153, -119, 186, -120, 35, 207, -50, -12, -96, -342, 250, -126, 109, -63, -211, -78, -89, -215, -264, -241, 232, -85, 209, 4, -143, -290, -21, -143, -283, -22, -177, -124, -310, 161, -7, 69, -96, -210, 165, 156, 150, 67, -68, -67, -152, -23, 218, -63, 209, 9, -26, -132, -116, 194, 33, -64, -7, 111, 44, 15, 97, 64, 54, 287, -45, 113, -133, -49, -134, -76, 1, 26, 55, -111, 313, 214, 134, -74, -9, -177, -351, -34, -130, -162, -448, -203, 8, -131, -56, -59, -76, 20, 90, -116, -11, -48, 254, -104, 46, 7, -5, 27, -176, -83, -63, 128, 82, 100, -132, 69, 83, -9, -162, 2, 46, 200, 242, 193, 132, -31, -30, -8, -128, -294, 164, 68, 102, -149, 326, 82, -169, -34]
7826c4L51m73K0R2K69l99K42J50m2k6m8m08L34Q1O4j95J29J01j98k66K55J57k34
7849g8R0j45K02o3j22R8j14J14K17Mk14j45J62M2n6J49nj20J23j78J05l55L54
7872F5o5J09r1n5l2J34l1k04L36L4Op7j26J70k19M1O3J23k45k7k37K46J13O0r9
7897hO1k59M2J18J82Q3l24j07K75L1j45pJ03k69q7N18k45J04K3k08N9J29J3O2
7921A44m30J19K84j06j35J02m9q0J10M8N5l60Q6K28J64l18j0L2m9K06r6k5J80
7944A00q7qM9j36Q7o3K44K5k69K4J49Kl2p9P0j2j98K65j20Mj84P9J7J31n4J48
7970A52k51o3J54J89l7j76j24J48l9J12J07p4j11M1l4J57JO5o4j11k8P6J65l43
7994h8J34l8q0j6k23K74k2k08M21j41l31M17j00j7r9j03J10J15j12%L5m9L11l5
$$ y = [-34, 317, -156, -136, -44, 225, -174, 68, 218, 176, 150, 102, -306, 28, 109, 173, -22, 107, 208, 10, -256, -1, 156, -78, 12, -133, 69, 6, -116, -18, -132, -18, 199, 203, -11, -156, 6, 48, -8, 141, 136, 16, 139, -39, 66, -289, 65, 0, 109, 18, -37, -69, 65, 34, -170, 166, 200, 206, 129, 3, 173, -46, -5, 58, 181, -64, -91, -328, -82, 31, 91, -8, 53, -206, -164, -46, 136, 219, -105, -212, 63, 94, -51, -58, 45, -224, -311, 207, -38, 66, 89, -119, -60, 69, 82, 144, -286, -167, 117, 11, -124, -22, -71, -151, -41, 7, 62, -298, -212, 16, 180, -138, -148, -116, -165, 41, -55, -80, 100, 13, 5, 54, -82, 5, -58, 186, 211, -58, -34, 115, 117, 85, 6, 76, 64, -134, 131, 11, 15, -169, -90, -73, 58, 4, 152, -99, -162, -8, 181, 144, -32, -156, -8, -47, 65, 172, 98, -13, 28, -6, 151, 152, 217, 153, 42, 14, 90, 255, -88, 46, 8, -72, -88, -311, -37, -59, -267, 154, 13, -318, 99, -1, -18, -117, -220, -110, 5, -107, -107, -72, -121, 190, 155]
8018A55m10J44m5N8O4k50J68O0KK9m1q6K44k83k1J13o7J28P3j46J1Qo9K38k48
8043a71O1O8J00N8J56k86m3jJ95j61J29j23L1J27k64K56k07m6J35m1q0j18K44
8066A9J54l73L20O3k58J69j16j88L35j89r9K23O9k14J80j00M3LJ99m84L24k25
8088a45q5L6L95k38k5M8j95K82k05n4J04J39J11l10L10j95J32k67L59k23J42k29
8110a13j23K48k3o1L3k55K90J4J18k6o9j72R4J68k17J37k15K81j9P8k47p9J78
8133B0L4k7l12K48o8J40N7p5j56P5r1L8K16j30m1l03L35K81j22mk55r6J48K65
8157A77l72K96j49p2J16j51K82j83j73Q8K07L4k99M23j21l24K00k02K23mK4k35
8179b15J94J55j60r1j6K87j64M6m5K40j36k85
$$ y = [155, -255, -111, -156, -98, -34, -284, -116, -56, -54, -25, -66, -152, 92, -191, -212, -99, -166, -38, 35, -111, -100, -92, -161, 77, -171, -110, -42, 58, 116, 272, -14, -57, -58, 137, -24, 105, -18, 13, 140, -124, 132, -75, -121, 14, -27, -107, -225, 19, 173, -200, 120, 183, -75, 94, -22, -210, 125, -64, -163, 60, 129, -85, 95, -5, 38, 41, 240, -244, 80, -145, -230, -194, 201, -37, -62, -14, -209, 73, -132, -186, -82, 57, 168, -142, 168, -27, 105, -162, 197, -26, 116, -113, -236, 12, -11, -72, -39, -294, -4, 10, 128, 102, 33, -139, -45, 123, -94, 43, -172, 109, 90, 168, -79, -158, 20, 54, 27, -285, -37, -105, 35, 92, 17, -139, -64, -155, -117, 99, -31, -72, -375, -40, 241, 119, 115, -140, -236, -88, 177, -195, 101, -48, -120, -4, -155, 127, -56, -229, -141, 66, 100, -199, 224, 103, -221, -21, -223, 0, -4, 20, -215, -21, 134, -26, -117, -133, 154, -10, 36, -9, 231, 95, -190]
8191a90
$$ Imaginary data points
##PAGE= N=2
##DATA TABLE= (X++(I..I)), XYDATA
0@%%%%%%%%%%qJ6j6J6k4L2m0N1n9P2q8J04j28J52j76K08k40K78l20L66m21M80
32B55n45O17o97P86q81R86j103J231j371J524j692J872k068K286k526K786l068
49a608L378l723M103m521M986n506O093o760P525q412R456j0704J2226j4130J6593
64H996j9914K4651l1978M4870p3881K49481j2956m13304L59411j53898j45956
75a64478K34269k27o9186J2741l6305M2049o6614L6722Q7946m7465k0305q665
87D82l0547P1809l1212n1790M4456k9550n43P8713l5938J641l647n1421O5356
100B7809k2422n6312R2293k8399n2975J5908N716N3859n0983q624R2692j05060
112c6498n862J17386p6363m1496L2658M083p025m2150P3742M5916j06785L2167
$$ y = [0, 0, 0, 0, 0, 0, 0, 0, 0, 0, 0, -8, 8, -8, 8, -16, 16, -24, 27, -32, 40, -48, 56, -72, 80, -96, 112, -128, 150, -170, 196, -225, 255, -290, 327, -370, 416, -465, 521, -582, 649, -722, 802, -890, 982, -1086, 1200, -1326, 1460, -1608, 1770, -1953, 2150, -2371, 2615, -2891, 3202, -3558, 3967, -4445, 5011, -5693, 6533, -7597, 8996, -10918, 13733, -18245, 26625, -47256, 202225, 189269, -224035, 135376, -18522, -164478, 69791, 69564, 378, 13119, -23186, 18863, -47751, -11029, 76917, 29452, 9147, 482, -30065, 41744, 10532, -41258, 3198, -26352, -26895, 51818, 15880, 17521, 13874, -37547, 27809, 5387, -50925, 41368, 12969, -40006, -24098, -18382, 35477, -15506, -24130, 68562, -36498, -42360, 75026, -1337, -42833, -10175, -6092, -13117, -55267, 18475, 64391, -42394, -10227]
124a0227N6844q3021J7184O5917n5705l3828M4623M413j4283J0865j1099p286
136a5603K0804L525J653K0555j0678l4836q298r645J2627M0981l317R250j4657
149A2361n9133N2979K2410n7621N7004J3590n9885J2709r031o554J6036L581L4516
162C2962k0816l3078L6167k462k0446Q229L332m830j9854J1024J9345k2149J7472
175D896J9257l7946J048J8325j2459K0500M859l3482N725l819j5579K5583R263
188F171M170M737k0229P449q119j4070L4721j1128k0420K1020j3642l25J7412
201G747j0232R000k199j7290K0946R086j4834M538l919k4194J904K2417P507M073
215A4550K982q875j1570q040J0213J1567l306L406n006j2359Q00L175N051L079
$$ y = [-10227, 46617, -36404, -19220, 46697, -9008, -42836, 1787, 6200, -8083, 2782, -8317, -15603, 5201, 8726, 10379, 30934, 20256, -14580, -22878, -32523, -19896, 21085, 17768, 27018, 12361, -46772, 6207, 28617, -29004, 28000, 41590, -18295, -5586, -14617, -21171, -5135, -1554, 32962, 12146, -20932, 15235, 12773, -7673, 556, 3888, -942, -20796, -9772, 9573, -12576, 4896, 24153, -13793, -12745, 5580, -6879, 13621, 18480, -15002, -9277, -13096, -28675, -3092, 6171, 10341, 15078, -5151, 2298, -5821, -19891, 14830, 3702, -16718, 4302, -9340, -9665, 7747, -2485, 6515, 4316, -12974, 7972, 17058, 2224, 6762, 2843, -21351, -19447, 2970, 10477, 14550, 17532, 8657, -2913, -10953, -740, 10827, 7521, 10927, 5921, -6438, -5638, -2463, 2588, 5667]
229E667J151P298k398j687n041j8299M784Q991m400J7634K455k3087K761R55m802
244h018K0203L145j0094k519k1671R07K2726o067P575M299k8074M312J4178o90
258B12J6630r473k0259K263j1024P966K4738p206m302J47j4179L513J2983L401
272E410K25p200q509j733O045P709l834k521k30l311J0463J1781n346q570p550
287g171o697K931R836J5151j76j6982r90j757o834K1489J2830j4239k73p172j5940
302a5994J0400P761j324Q770k056p916M710O10o056K853K359l997K207R89l929
317f13j416k684J314P112L52N207J462j3142m030J403K6J0843j552j1317L364
332c671l281P76J7403k240j0783L779o591p899R505Q132q59m252p034m031L087
$$ y = [5667, 6818, 14116, 11718, 10031, 4990, -13309, -8525, 466, -3934, 13700, 16155, -6932, -4171, -3216, -8018, 12185, 15330, 5236, 2717, -18954, -18047, 4679, -1388, 6187, 10486, -17588, -13276, 902, 212, 16842, 7369, -12890, -10627, -21651, -13685, 11053, 3847, -455, -308, -14487, -10974, 2009, 5410, 5635, -1565, -10074, -11807, -5762, 1947, -1887, -4408, -4638, -7949, 2514, 14295, 8949, 379, -7171, -13868, -10937, -1101, 14050, 13874, -3108, -4098, -5855, -12689, 8800, 21630, 7391, 7118, -54, -15994, -5594, 2167, 843, 9613, 7557, -359, 4351, 4961, -1095, 1758, 4117, 120, 2327, 3316, -613, -2029, -4713, -3399, 3713, 4065, 9272, 10734, -2408, -6438, -5035, -5009, 5834, 4282, -7035, -3671, -6952, -6176, 11227, 8987, -1796, 1983, -4608, -12507, -3002, 5130, 4271, 19, -7015, -11046, -7959]
347g959J3088O562n682l950n826j155M209n021L914N658n185L340l457m06J1175
362I305q721m31O595j3171J1446P777k1617O004K958q457J6832k234p074J5511
376A4723r663r361P384p970M162Q711p423Q78m687J592J0429j4746J841J6770
390A2640r225R76k3j4725L065M240K595K640o159O250j19q979N509J542M075N37
406D839j6841K855O731l430J3502p781j7333J5097K935k694J0058j0182l317Q167
420B606j3312J071J1448m151K806l307o100J1807L166m543r74q639m94J5871M512
435A1767j6905k659J1072j0733J497J9071q054k142P793j2507p348P144J0843
448H839J252j3443J627K749l261J3315l730j3006J0885r87o423J0614m072l371
$$ y = [-7959, 5129, 11691, 6009, 2059, -3767, -4922, -713, -5734, -1820, 3838, -1347, 1993, -1464, -1870, 9305, 584, 153, 6748, -6423, 5023, 12800, -8817, -2813, 145, -8312, 8520, 6286, -788, 14723, 5060, -4301, 3083, -4887, -725, 7986, 563, 1441, -3246, -1654, 8775, -5971, -4130, 12640, 3415, 4391, 4368, -10357, -7292, -3052, -457, 2183, -3976, 2274, 2155, -6824, -1315, 227, 4302, 4839, -12002, -9147, -2416, -5846, 7656, -125, -17458, -2361, 574, -2120, 7938, -2244, -5561, 2606, -10706, -9635, 1813, -2338, 468, -2839, -8939, 2868, 6034, 1491, 517, -8122, -8616, 7255, 11767, -5138, -7797, 3275, -7458, -5961, 13110, 5056, 2914, 10707, -1800, -9148, -2004, 8839, 10091, -3352, -1725, 1024, -2237, 11078, 7348, -5658, 5227, 4240, -2183, 8431, 4359, 988]
462I88M819j2892j890J1728N179Q115j0743j6254P372K896L398N742o537k717
476g96o254K101Q066q417J1548M990k2043M940N514n21J1765j3487o551O618q646
491a1173J4225P758j9216P750M667j4227R150M597p774P221k184j0008O875N296
505B957k230j646k523O10K747N681j9q552OQ10j100N675j426L032K833j1348L26
522d167M950r16O068q0n851l921J548P571m773j975P185p165j005P057m316j8
538A92L438m718l636L908L979j436k68j516o062M044M784k870J041l009j066M545
554A350o135K319P523j1808M304P740j5192Q057Q722j5076P043K303q535J0057
568B672k522o392P651k735K07K836m138m53n36L949J882l080M026l608n137P424
$$ y = [988, 5807, -7085, -8975, 2753, 7932, 16047, 5304, -10950, -3578, -682, 2716, 8458, 1921, -796, -7050, -4949, 3117, -5300, 6248, 11238, -10805, -5865, -351, -872, 10893, -2594, -9145, -2527, -11173, 3052, 10810, -8406, -656, 4011, -10216, -1066, 3531, -4243, 2978, 794, -9214, -2339, 2957, 727, -919, -3442, -2832, -85, 5596, 5577, -2975, -2969, -2159, -3259, 2416, 990, 4022, 6855, -4493, -4167, 783, -133, 5935, 5855, 4, -3917, -2369, 5202, 429, -1546, 5639, -1526, -2531, 4526, 210, 192, 3630, -1088, -4724, -816, 3163, 1727, 1459, -57, -6119, -2075, 2709, -161, 880, -2129, -3195, 1350, -4785, -2466, 5057, -6751, -2447, 5293, -9899, -1842, 6880, -8196, -1153, 1150, -7385, 2672, 150, -6242, 1409, -1326, -1119, 1717, -2421, -2874, -3410, 539, 2421, -659, 3367, -241, -5378, 2046]
584B046j767Q85O083p456k478L293j953M383K538l479j55l528K721N034n371K968
600C764Q64r252O328L370m040N193m018m274M002j345M021J816o049k90j777L30
616a357M274L74o43k939j797Q02M80N625k446m357J919m914J622O549m369J506
632C29j664n652P963n08k847O910p960n911Q804j769J022M608o105k346K2K123
648b981O077j481j238j117o480L211L053K26M692n592j859L227l104O032R16m802
664a220K943o216J567Q768p114K682J827j0437O762M857k977N770n883m486M221
679A064n640M855P277p788R39Q05n790N631L375k102k4l512j018K530J18j25j271
696f76k10m00j688O279N40l992K661m436l772N084Q42R98j068m570K994K36m39
$$ y = [2046, 279, 1164, 7247, -209, -2687, 606, -1347, 3036, 5574, 2095, 1940, -1588, 1133, 6167, 796, 3764, 4628, -4624, 1704, 5074, 1034, 6227, 2209, -2065, 1937, 592, 4613, 6429, 380, 90, -1687, -1357, 2917, 3291, 2648, -291, -2088, -1286, -806, 4819, 2373, -1984, -65, -4979, -3357, 3192, -1177, 329, -1335, -6987, 976, 468, -2379, 4531, -3429, -9340, -536, -2305, -1283, 3325, -2780, -5126, -5104, -2981, 3096, 1615, 377, -740, -7220, -4009, -956, -730, 3962, -1630, -3489, -262, -3366, 2666, 3582, -1220, 1723, -4493, -2926, 5842, -1272, 1410, 3237, -7200, -438, 4419, 1442, 7212, 1329, -3157, 1064, -4576, 279, 7556, -232, 707, 1512, -4278, 1353, 4728, 2626, 2602, -910, -1928, 602, 720, 595, -676, -886, -1286, -2974, 3305, 3845, -147, 2514, -1922, -5694, -610, 232, 1230, 162, -4408, -1414, -1178, -1617]
713a617N267k895j873J610l240M55K165j155L88m83l056K567N504j82k556O2j939
730i78j373K729k17p03J793j980k27J232q29M519K104n838n2J694J7J931n322
747a500j352L727k546N407K715p390M671K068p398K012J152j645L845k959m093
762c286K164J336J016m74J102J247p07R41l601n741L468K660j803n3j114L100
778B55K016m162J875L94m209N088L83p980L213K230m566J008P82K678N008k468
794A545k456p75k225L388j108l774L576J22j140K685k714m2P210p45m000O19k0
811A46k17m98k344k46J046J849K869M29j469K523Q39n630j741M383R07j705j000
828A41k930o24N269L242j405j597P43R83j139k065J95j484j568J434j178J091
$$ y = [-1617, 3650, 755, -1118, 492, -2748, -2293, -128, -1283, -895, -1378, -4434, -1867, 3637, 3455, 899, 961, -978, -2351, 378, 161, -542, 1251, -729, -956, 276, -553, 3966, 6070, 232, 180, 1874, 1891, 3822, -1500, -2852, 875, -1671, 3736, 6451, -939, 3732, 5800, -1598, 414, 1566, -79, 3766, 807, -3286, -1122, 214, 1230, 756, 1858, 3105, 2398, 3339, -262, -6003, -2535, 125, -1678, -1731, -2845, 255, 2271, -1891, -16, 378, -3831, 1257, 1640, -6340, -3127, -897, -5463, -4455, -3673, -995, 4013, 1545, -911, -1686, -3911, -523, -1631, -5405, -1829, -1707, -2847, -162, -2876, -2918, 4292, 3547, -453, 166, 146, -71, -569, -2913, -3159, -2113, -264, 2605, 3034, 1565, 4088, 4927, -703, -2444, 1939, 2846, 1141, 141, -2789, -3413, 1856, 5098, 3693, 2096, 2839, 3822, 2683, 618, 813, -671, -2239, -805, -1983, -892]
844h92O972q98n880J350J47j823N178n28q237Q07L409l360N43M998l87K84J152
861B835k220j106R14K47k801l853J919K726J367J825k192j060K188r90J428K394
877C621l606K27j338o380L040M983j105L328M0m028L366J801k969n27j186j888
893b621P22K406M0r89K050j761j322M892J168J62Q0o477k388K326j456M354J437
910B623m342M068O78l810L368l26k776Q35j145j020J613j396m42k95j170K797
926g40M504m85j601r16l042k796J753J059o52K640l09j594J406R6KJ544p92j393
944a316L41P38k019k492J546L10k84N279J062k352K431k058l464J138j360J531
960i69K036j130J26j07l2J233k5K144m52j336L016l725k535K484l714J919L756
$$ y = [-892, 6080, 5182, -698, 652, 799, -1024, 4154, 3626, -4611, -3804, -395, -3755, -3212, 1786, 1399, 1683, 2835, 615, -491, 423, 670, -2131, -5984, -4065, -1339, 28, 1853, -339, -1399, 789, -201, 1227, 3621, 15, 242, -1096, -7476, -4436, 547, -558, 2770, 2810, -1218, 2148, 3949, 980, 453, -733, -2621, -1899, 507, 547, -442, 1608, -153, -1475, 3417, 4585, 4747, 4827, -1650, -4038, -1712, -3168, 1186, 2623, -1719, 2349, 3027, -783, 2585, 2259, -517, 318, -827, -1847, -234, -1630, -2072, -2367, -3537, -740, 3764, 3279, 1678, 762, -2280, -5076, -3323, -2264, -2916, -276, -585, -2179, -773, -677, -675, 869, 77, -1316, -975, -237, -2256, -4748, -3202, -2892, -3176, 2103, 3165, 813, 3244, 1186, -2278, -1140, -2500, -969, 1067, -63, 63, -44, -76, 1157, 1132, 3276, 2824, 1488, 4504, 779, -1756, 728, -2986, -1067, 2689]
977B689j571M300n86m211K940k933k277M735k979L13K789m403J251J297l088L770
993B036J399n70J520k529k254j717k130K632N79J107K568k483J078k30l448K977
1009E35j487j666M059k202r03R28l131R21J161O09M141j124o98k16n051L66R83
1026b775r87L893M82j315J925j428o79L83l30J665r43N02J138l433l94J240j722
1043b778J881K903K185m51k195K57l857k175N063p55j342N107k748j966L497l455
1059h29N03K856j310l4K2n83j364k754J658K38p72O849J47m177J815l176k643
1076c554J843k36J589O28n87P27k868O32K349j359J910K99k034K923l681l609
1092e028L065k434J533N021q32R09Q76l067j655j331J424K305n69O82j674j641
$$ y = [2689, 1118, 5418, 4832, 621, 3561, 628, -1649, 3086, 107, 420, 3209, -1194, 57, 1354, -1734, 2036, 3435, 2865, 4385, 1856, -398, -2115, -4245, -1613, -1034, 73, 2641, 158, 1236, 1006, -2442, 535, -952, -2618, 1441, -761, -1664, -736, -3867, -2946, -1785, -1176, 2965, 1841, 1143, 927, -4124, -3758, -2775, -3762, 131, 613, -702, 1223, -205, -884, -501, -831, 834, -109, 393, 1531, -1902, -2296, -1056, -2778, -897, 2006, 4191, 3740, 1545, 1802, -2055, -4230, 833, 78, -1264, 3843, 1095, -871, 2626, -829, -326, 2530, 1220, 1186, 1208, 625, -739, -3493, -1835, -1597, -2369, 4480, 4627, 450, 2265, -911, -3554, -1711, -1947, -358, 270, -317, 410, -2458, -1826, 523, -836, 1074, 1373, -661, 2262, -1419, -5028, -1963, -4397, -2864, 2157, 1325, 2234, 3110, 43, -1612, -2943, -1519, 786, 217, 899, -775, -2416]
1108b416L264j226o10L016J113M97M57k761k702j463J805J5q02N019J542k695
1124B053J527k736k620M298o20j210R81p13J28k190j785K670J163K267K243l090
1140B366p77j69k677p22j981J699L722j027P37l15k488K245l14j952K789m08l56
1157C72q51m416R42J603l29L021n75j29M245l191k671K4k514R04K791j163J89
1174a748R22R84p24k515K532J800m10R69j673k191m7q99m1K68K247M101K87j973
1192A889j335m76N6q16J60P88m31J526m59k701N01K590N89J472m4j124L80k236
1210C29k982m06J754K329O9J167M15k590J477M95l463Q63K341r89p17j595n12
1227b015K92j02K485O72p86K669j071k913p34j044R83M75j485K205J144q57O65
$$ y = [-2416, 848, -378, -988, 2028, 3141, 3638, 4095, 1334, -1368, -2831, -1026, -1011, -1813, 3206, 4748, 2053, 3580, 844, -1776, 2522, 1902, 692, 1673, 960, 1088, -1102, -2887, -217, 946, 3213, 5456, 2366, 1589, 1420, -1257, -1979, -3960, -2261, 1461, 434, 1171, 856, -1632, 613, 299, -1653, 1136, 728, 372, -479, -4895, -3953, -2350, -2679, 342, -233, -362, 3883, 692, -1979, -1955, -4469, -3565, -774, -1937, -1748, -826, 158, -566, -3081, -549, 1251, 841, 1810, 137, -2054, -2101, -3000, -3041, -2773, -526, 3575, 3862, 1889, 554, 78, 134, -682, -522, 266, -165, 1361, 902, -1799, -1298, 1292, 1881, 3353, 3309, 2185, 2565, 329, -2653, -3059, -1305, 1024, 1093, 2260, 2675, 85, 1562, 2057, -1406, -543, 1798, 809, 92, -1503, -2015, -1723, -1825, 660, 1332, 546, 3215, 2144, -769, -1503, -2547, -1564, -1089, -2574, -369, 775, -82, 583]
1244E83r64o37J358L95O65q50k076O30k42j610J036J473J951Q76l37o24j074j364
1262h11l9p9R4J255N93m8j526k91K302J56n84J899j81k231L04j083j873P55J578
1281A90O43O83N62l87j40r00j255J95P23k84K35p05n39J01O0J62P73M81Q61j01
1301A358j450j646o56K64j63Q87J436k22o92J004j065o31J284j47n65j50q6p7
1319a317p36q3K90J97J286J115J51m02j87j744l18J01J2J260J017j34N8n57j54
1338a45L84l32J131J107r49n29p55j645R39J076Q20J469j92p73O23j540n53J024
1356A160l58p5J266j065p19K24J06k26P51J131q35j90M59j799o73J254j791Q95
1374d85K261j098K56M05k326N20L83n14J527o07j394J62m94j13J125M89K5n24
$$ y = [583, -381, -1018, 340, 735, 1400, 550, -1526, -896, -1138, -2748, -1712, -239, 1712, 2588, 2251, 1627, 553, -811, -850, -929, -835, 420, 1013, 965, -561, -852, 1450, 1606, 1022, 2921, 2740, 509, 813, -270, -2143, -1388, 190, 833, 1516, 2078, 1691, 1551, 651, -604, -409, 314, 30, 265, -440, -979, -878, -818, -656, 117, 598, 1459, 1358, -92, -1738, -2394, -2130, -2293, -1406, 30, -192, -884, 120, -945, -1576, -292, -439, -1004, -1154, -1240, -1317, -2053, -2136, -1846, -1649, -363, 752, 903, 501, 314, -1430, -1748, -1647, -1635, -375, 642, 508, 566, 9, -145, 239, -93, 1038, 2145, 1196, 667, -88, -1733, -794, 282, 1102, 2571, 2379, 1606, 2229, 689, 136, 1160, 802, 727, 1993, 928, 209, 433, 539, 313, 1064, 2195, 1360, 1170, 1629, -170, -843, 411, -1380, -485, 1776, 678, 934, 1339, -987, -467, -84, -598, 929, 322, -1072, -910, -1404, -1517, -392, 97, 122, -402]
1392d02M46l94j063J343q82j444K060o13k14J740l42p88N03o47j22l53J421K74
1410E23q82J093j422j622J799N02Q5J912l79q88n23j527Q83K88r2K561j293r78
1428D0J235j879n31K783j510P51J192k384k78Pj78J000n8P82p79j03J068j640
1446d82k10O06j119R62O2q64K084j321j073J009j539J088K293j682R8l00j412
1463a800Q00l19o8J416l89J03O8j123J035K48p53j22j84J047J67J74j81r80L05
1482e56J230j421J528J079j500J159j716j189J703j11P66P42j318J217j40k259
1498g86J391l54J164J266j316j65p25n29J134n76Q7J317k67k7j345p00J393l7
1516I25j89Q1j080J025K40j698M80l25o4J746j830K1J201o48L66j736p09K442
$$ y = [-402, 44, -350, -1413, -70, -952, -2396, -336, -949, -1163, 577, 235, -553, -50, -697, -819, -1172, 249, 523, -359, 734, -688, -2310, -511, -9, 76, 1988, 1609, 721, 198, -1329, -446, -158, -250, 2311, 1018, 40, 1275, -604, -1135, 1648, 138, 889, 2081, -303, -581, -574, -752, 248, 190, 972, 193, 90, 1158, -482, -692, -86, -1205, -243, -181, -1045, 1039, -282, -1355, -346, -1885, -797, 1496, -186, -88, -388, -1800, -1000, -1319, -1387, 29, -360, -257, -189, -1312, -277, -29, -782, -904, -1088, -41, 126, 300, 119, -861, -556, 674, -747, 781, 1860, 360, 1519, -197, -1386, 317, 206, 972, 1714, 396, 1613, 1473, -786, 605, 251, 1415, 2681, 1365, 1200, 475, -54, 1080, 504, 591, 1908, 1641, 1614, 269, -431, 962, 925, 736, 817, -263, 762, 1002, -696, -216, -541, -605, 1141, -689, -668, 533, -115, 251, -1485, -2194, 248]
1534B48p89R7J451l088O24J697k315J166N85k58J096j553n35P64m14Q75r89o59
1552a997J933L4k01J94j444J507J27q72Q45j051R97J247k320L72P87j516K601
1569A243M86j993J883o02j719P20j247J087K151j268m24l99o7R49OM7p2j69P30
1588A342j875k36Q23l41J188n49q30J506m42j54L82k060J033O00r19M36m36l58
1606h90J374j264J96Q12j92N02m59j265M69l1p8P85j146M62J261p34N39j91n25
1625c75P98q90j73P01l86N27m46j56N57m35J776n08j893K377o88q59J480j804
1643c97o50K033j099O49J042o20K50o72m57J051j47K51n26j259p2N04R01j8q3
1662F81N39o41p30J119p56n40J456j776o08J279j191J028J135j390Q72k33j156
$$ y = [248, -541, -444, 1007, -2081, -1457, 240, -2075, -909, -324, -582, 514, -1039, -1574, -810, -1224, -349, -1338, -1997, -64, -30, -231, -37, -1481, 26, 153, -719, 126, -925, 72, 1319, -1001, -629, 158, -1358, 1243, 1729, -264, 1619, 1017, -702, 18, -1229, -142, 2009, 741, 317, -82, -149, 800, 806, 853, 781, 612, 1342, -533, -769, 54, -287, 901, 352, -478, 1028, 586, 432, 814, -1246, -213, 387, -532, -96, -532, -890, 484, -780, -584, 228, 36, 538, 79, -1186, -717, -748, -826, -41, -1187, -725, 536, -198, 341, 150, -375, 423, -467, -640, 61, -325, 202, -244, -400, 157, -278, 1498, 990, -903, 1474, 786, -73, 1407, -397, -1047, 986, -113, 536, 1578, 958, 1208, 536, 79, 1130, 983, 1234, 708, -551, -623, -119, 782, 764, 681, 1220, 579, -151, 968, 212, -328, 1128, -648, -1256, 23, -1168, -140, 995, -395, 477, 244, -912]
1679i12J159j352o8R77j050m46P10l21R37r9K13k57n85J350o90j285M39p3n86
1698a939J013J88K03J25L22J4l19P19M1j689Q22J60o83J473n49m99J314m12N67
1717H71P57j313M37l21j409J136M92j222J194J83k48P39L96l14m34l12L73o82
1735C23k88L07l15L70m8K94L76m16O44J48r75J65m89j093N60Q3J77N08j24k27
1755b0K73k30J30M90r36J69j45j147P53R5p48J168M67m55M17J15q10R5k40m00
1775i59M46r9k56P75k75J89O01p34Q9P90m56J68j63j082L70J52j83J134M73n30
1795D50K97J1n56K45N14j578O07N59p40O51J65p91O24J68m37Q98o23j34k72j028
1815i70k33P91N5J62O08k09J3M39q85j58K22l05m48J99m1l1m2K47R7j54O24O71
$$ y = [-912, 247, -1105, -1173, -196, -1246, -1692, -982, -1303, -366, -465, -252, -509, -1094, 256, -434, -1719, -1280, -1353, -1939, -926, -738, -535, -410, -88, -74, -393, 326, 367, -1322, -500, -340, -1023, 450, -99, -598, 716, 304, 871, 1628, 315, 752, 431, -978, 158, 650, -572, 622, 805, 557, 1296, 1692, 1378, 944, 632, 1005, 323, 35, 342, 27, 397, 349, 643, 1019, 603, 1247, 1395, 420, 585, 96, -997, -437, -354, -177, 331, 207, -20, 253, 23, 153, 643, -293, -124, -269, -1416, -663, -568, -1316, -148, 319, -136, 281, 396, -414, -319, -559, -959, -513, -612, -868, -93, -368, -179, 422, -312, -223, 567, 111, 279, 116, -966, -596, -444, -627, 507, 980, 450, 747, 758, 202, 447, 961, -617, -10, 549, -191, 460, 625, -166, 458, 626, 189, 1087, 464, 330, 58, -970, -1203, -412, -357, -195, 413, 204, 217, 656, -229, -387, -165, -470, -918, -719, -760, -791, -833, -586, -489, -643, -19, 652]
1837F52q12j091K26J08j029Q65M07o49J622l25j204J328r5Q9L05j410J31J82J23
1856e77j88l8M13M49J245j16l87K43o86k88l16p63J036J232j064L63K20k96J145
1875A627R9j045Q25p51o06M92j167J39J333m38J15J154l99N49n51j365O31j107
1893d65M76O25j251K40N92k7j37K39O60l20K49O6k262j91J179j759R57O52m22
1912h99K016n11j143O07p11l8L33j167N72K73j256R52kl75J899O19j021o1J30
1931B17r51p24J06j33Q7J691Nm73P52K4k26J018j586M21P18j369J14q65j39J363
1951E0rN96J232j309J078k04j778o7J57m14P55k43j86N68J61O8J43K56J98J79
1971A231m55j615n93O21l72K9R91J26Q50M12j013J35o70o14R28j184K23R96j217
$$ y = [652, -160, -1251, -1025, -917, -1946, -1081, -674, -1323, 299, -26, -1230, 98, 3, 92, 397, -1013, -882, -700, -577, -765, -803, -390, 59, 1304, 1188, 801, 1044, 358, 70, -246, -1009, 27, 1259, 195, 558, 778, 482, 1627, 1726, 681, 1506, 755, 149, 641, -526, -387, 946, 508, 623, 1777, 1378, 1927, 1376, 11, 642, -465, 11, 636, -615, -375, 217, 190, 53, 292, 952, 632, 881, 947, -1315, -1506, -327, -2086, -1129, -477, -899, 1117, 606, -537, 70, -641, -679, -346, -1513, -941, -668, -1924, -972, -974, -1349, 550, 1169, 148, 87, 217, -734, -1458, -1352, -1485, -1398, 293, 298, -175, 577, 601, 375, 1393, -193, 228, 946, -423, -309, -1174, -1313, 50, 41, 637, 1869, 560, 1638, 1434, -344, -411, -254, -668, 87, -156, -342, 226, 387, 455, 598, 854, 1052, 1231, 776, -839, -1432, -811, -1183, -1154, -163, -37, 813, 1225, 212, 347, -323, -937, -9, -1193, -970, 26, -1191]
1990a191L3P89q65J729R91j064N57o51j160M06j227J62O54N80N76L96L86m69k30
2009D02K82n58J73N77j032K99p28o07J280K62J73J751m36q9K56k159j65M19j214
2028a114J617M48j335J738K1j245J300m84k28P81n44p33r3r57l36j18J314N86
2046F18P90O14j770k76K60j798P64M01j163J302k71o22J100j225N64J141p31J086
2064G84k1j986M2p33o09J495K93j0J215N2m72J2o76m08J87N19j33m96O09n13l96
2085a245N79N54J189K17l99P5j143r10L68p90O33J853p98J333j60j611J093k69
2103E69n02R82m13n06N21j084j90N28M1P64N79K86L66r41r03o78l03L24N17P77
2123G34l55q3M78p05p54J261n29K68J105j713l96L93j907J073P91l42J873K4j403
$$ y = [-1191, -1158, -369, -1234, 495, 1486, 422, 979, 328, -832, -426, -1653, -1491, -837, -257, 319, 715, 1101, 632, 402, 684, 126, 299, 876, -156, 143, -585, -1192, 88, 350, 523, 2274, 1838, 1749, 2005, -154, -319, 100, -1114, 503, 951, -384, 1354, 1375, 130, 1430, 946, 718, 1499, 955, 222, 129, -828, -1164, -1282, 32, 618, 1408, 2022, 252, -24, 236, -1562, -798, -397, -1560, -258, -529, -1151, -51, -1276, -712, 429, -302, 784, 763, -1223, -1181, -1914, -2523, -1028, -735, -745, 470, 522, 50, 62, -614, -1022, -835, -316, -449, -945, -336, -849, -1245, -666, -112, 1077, 1294, 895, 970, -173, -1083, -715, -1505, -872, 981, 183, 1516, 1356, -255, 838, 569, 67, 1049, 636, 130, 651, -433, -623, -95, -54, 710, 1289, 1575, 1941, 1000, 97, -581, -884, -560, -43, 734, 379, 296, 774, 69, -685, 576, 47, 315, 1420, -293, -689, -296, -2203, -1130, -339, -681, 1192, 1216, -187]
2142a87O63r61o05O30n82K76R71J26n61pl45j66Q54N23r4O37r19j295m0L5R9J208
2164B60O8Q47L31j068k00j25o99M83R41o27N93q2j062L8mJ36J417j96J44j54j171
2185a30k19l50l81P64N71M38J26k97m51m54K74k31n9N56j79l37J31q73J37O19
2205c45m59J274K46q42N08j076j292N42L24K85Q80q9m27P44q76l75M44k81P56
2224e9N07j001ok76m89L30P82L23M48R31r39n45l31k97N7P17m52R40N88q68q6
2245B74j27k69J157k4k33J98n30k25P3p98K30J074N44m0J67m92p62L22j017J58
2265c20Q25k59M37j1q98J06N26n56O11K79j03Ln60j347K93L06O5P75K5j27N22
2286E92l70j059N11o45K85O79j96m50K01o29k4N66j18R11O07m20p72o0q29M33
$$ y = [-187, 476, -485, -1090, -460, -1042, -766, 205, 331, -230, -237, -582, -748, 106, 629, 535, 1172, 253, -1042, -1082, -1047, -948, 260, 328, 1175, 1506, 438, 238, 113, -586, -103, 838, 211, 804, 722, -340, -302, -306, -170, 1247, 1051, 1195, 1041, -130, -349, -699, -1080, -316, 255, 693, 819, 522, 71, -383, -109, -340, -399, 157, -22, -359, -228, -1101, -964, -345, -804, 470, 716, -126, 382, -694, -1986, -1444, -1120, -835, 45, -44, -471, 273, -603, -978, -534, -815, -59, 448, -553, -559, -835, -1324, -994, -212, 111, 559, 1490, 551, 6, -325, -622, -565, 152, -300, 640, 1228, 360, 274, 147, -122, 1035, 1011, 778, 976, 446, 221, 294, -504, -274, 800, 1344, 1304, 1471, 979, 217, 539, -478, -320, 505, 246, 683, 672, -226, -120, 406, -150, 461, 740, 637, 640, 80, -1267, -974, -668, -603, 172, 197, 70, 592, 222, -837, -326, -971, -686, -7, -203, -653, -452, -1081, -1105, -539, -657, 254, 861, 441, -331, -391, -1220, -787]
2306g87M67n02J022J17m78N91l79m24L01j26j21N32j06p9k35m68J35Q34N25j36
2326F83N23q36l15K15p97Q7P86l84L32N25j215N21M00p88N68J93k80N12n61q95
2346g26P7m09K77P19K26L23l08k62m70j37J5J21N99l53l18N60m93l47Q40m98K98
2367b66Q29r57O57k46j391O10L57l63J065J53o57N86p11L2N93n11M55K09m11M80
2387E13j52r48O36K4J51N68K03j65m35o0l85j2P91m02M4J001p56k5N31j230M69
2408C61P26o87O08m5j001K54n9r4J36L86k54L39m20l91k14J86j75L95J00l03J87
2429C5k40m09J85J66l36P07p43N18L54j188L32K65j218J209Q22j080N24m05n76
2448a078M75pJ22M87o42M57m1l86O10m93k43O16j66P06P4j127M32m77L52Q40k99
$$ y = [-787, -320, -822, 200, 317, -161, 430, 51, -373, -72, -198, -319, 213, 107, 28, -207, -675, -540, 294, 819, 683, 1206, 370, 55, 270, -527, -440, 346, -38, 294, 819, -396, 125, 525, -263, 305, 498, 218, 730, 169, -726, -649, -1058, -781, -62, 164, 487, 179, -83, -553, -690, -675, -554, 45, -308, -626, -66, -559, -906, -66, -564, -266, 563, -394, 263, 17, -1374, -764, -407, -770, 295, 448, -209, 377, -334, -302, 291, -220, 235, 444, 33, 513, 361, -587, 49, 73, 224, 792, 995, 830, 395, 335, -50, -62, 729, 327, 371, 1372, 616, 591, 1122, -108, 361, 1087, 400, 1008, 963, -38, 216, 157, 63, 199, 585, 331, 670, 250, -141, -355, -169, -344, 51, 151, -152, 35, -205, -614, -429, -263, -599, 108, -635, -117, 237, -951, -619, -354, -1572, -363, 459, -621, -97, -502, -1078, -603, -610, -488, -1, -643, -186, -227, -613, -3, -496, -739, -123, -289, 417, 491, -636, -204, -681, -329, 511, 212]
2469B12M19l18n09N36p12L1J063q13O08O45j369Q78k50j027J079kk90N89m45m41
2489a16M61n53L08J37p1P16m39o12M06m65k02L40K01j05K74k8o03q6O12o11q5
2510e21J063q37Q9N85j200M16m3l44J162j51k86N76j058j6L48m41O12J80l41K08
2530AL8j0R0m58N13O7J12J14k01O8k10m12N98k28K95O78p85j21M98j121Q06J09
2552D41n32J195n66n51M31o85M03Q69j049M61L14p90K56k87m44M92o7N4L10k44
2572A1K31m75m3l80l6P03j03l20J60m78K81M49r44O47n4m15N48m71k34N06k60
2593f77j52K51L1L35O89r79J58k60l27Q72k70k21N58m5l89J76K8L49R4Q8l40J96
2615A65R0n44P1K06m00R77K51n04M47m84l92J004n49k74Q03p96N47j32o74P38
$$ y = [212, 631, 313, -196, 340, -372, -341, 722, -91, 517, 1162, -207, 671, 421, -606, 473, 471, 181, 770, 325, -116, 345, -208, 100, 237, 166, 882, 443, -169, 237, -228, -430, -90, 111, 6, 280, 252, -351, -437, 175, -436, -521, 542, -295, -206, 379, -821, -405, -448, -792, 370, 219, -67, 509, -549, -565, -217, -658, -46, 134, -207, 1, 39, 29, 119, -339, 174, 241, 353, 467, 266, 334, 124, -288, 310, 82, 377, 1055, 270, 149, 647, -474, 332, 441, -91, 1104, 538, -13, 418, -267, 136, 1005, -44, 417, 731, -59, 197, -90, -534, -42, -109, -55, 255, 11, 242, -233, -276, -656, -692, 11, -92, -412, -252, -730, -449, 0, -944, -297, -351, -766, -218, -689, -923, -417, -677, -829, -578, -547, -212, 477, -502, -344, -604, -931, -59, -329, -550, 8, -37, -426, -250, -222, 127, 221, 309, -31, 165, 255, -289, -218, -12, -412, 565, 816, 312, 759, 275, -117, 887, 338, 64, 867, 71, 618, 486, -188, 550]
2635E50P1l97O39k79J01J60o60m66L63K7M9L19j75l38L51J81m40m4N17n84o4j00
2657b19m83M36j00N0M29n89M72N99j124L71jp31L44R4k25N96j63m3Q5J17L14J59
2679C88j06n28p1K62j30j59O3j14L46K67j02L93K47o99J57l69k57M99Q4m93K76
2700d6n12O59Q49m91K73R4j002M89j86n29M22m19Q6K10J92P5M63n9n34O8k41k35
2722c74L26n64j67L20j68M49M17l12O2L92n93m5N8o51K7M19m48L01K86q3Q6J72
2744i0k31L20L74q62L45k19o57K23L62nM33L67k82J03J02N2k2j81l09J48m10J43
2766b96N45l37N67J47n3M15k65K63p36O7l56k38P73n1M9k8j75O55J61l40L49o38
2788D78n08J30m77N9N26l92L43N62j98P7K63p36N9n06k27J20q0l87N15K42j58
$$ y = [550, 621, 224, 863, 584, 685, 845, 185, -281, 82, 109, 158, 477, 302, -36, 315, 496, 56, 12, 529, -55, -119, -219, -702, -266, -366, -316, 113, -476, -4, 595, -529, -158, -159, -890, -546, -452, -677, -81, -244, -287, -202, -85, 229, 388, 282, -246, -317, -55, -185, -344, -281, -395, -49, 218, 116, 509, 756, 57, 214, -155, -412, 87, 171, -322, -46, -558, 101, 950, 459, 732, 826, -176, 313, 127, -402, 20, -399, -313, -103, 89, 164, 627, 568, 34, 102, -139, -374, -48, -612, -779, -459, -627, -178, 239, -73, -11, 381, -212, -257, -199, -850, -823, -404, -852, -551, -265, -348, -262, -90, -321, -1, 373, -489, -144, -363, -1020, -797, -435, -440, -7, 360, 78, 181, 283, 335, 313, 132, -177, -29, -439, -296, 249, -88, 479, 626, 573, 988, 723, 986, 250, 317, -39, -277, 496, 445, 494, 466, 291, 946, 1107, 767, 1116, 478, -30, 100, -377, -318, 208, -184, 159, 721, 523, 600, 863, 127, 186, -320, -547, -427, -507, -894, -379, -137, -295]
2809b95N73J56j37n41K51l89l54o0k2j48M26R3M18O1k06O90m82n03M47m90k22
2830g34N12o65m3N20J4O41P3J39K17m26l58l9r6j09O6J03j13N88j04Q3K4M42j12
2853F23j08p5o43k52L88k4K65K27j78L52j63K00Q0l55k06J34p74K94J69m50N83
2874H7l07k76O37lL12k09m48o3k98q4L4M94j92j62K69M18m09J15K96n71K14j18
2896b64k89N13m95K30N57n33N11K28n84R99k02j168Q07m51n53P98K81k42m8L20
2916D15K76m79L90j56k20OM0l32J02O8k42N15J12L65J01n66K55n83k41N14n85
2937b45L29K38l73kP59n19N77m20l23K66k63l01Q1l60N2o2Q8P28r5J38j88o14
2959e09Q0o5j12J39j16J34l66J71L75l30L94O52o99k32L90m77j03L62m97L98K32
$$ y = [-295, 278, 434, 297, -244, 7, -382, -736, -796, -818, -966, -540, -447, -29, 32, -174, 516, 34, -469, -22, -512, -734, -222, -887, -930, -410, -396, 245, 318, 457, 674, 248, -110, -149, -245, -354, -288, -185, -298, 290, 186, 269, 293, 735, 623, 515, 440, -203, -455, -67, -91, 174, 401, 223, 575, 412, 612, 692, 337, 131, 265, -509, -215, -46, -496, 87, -220, -496, 141, 138, 450, 241, -207, -270, -568, -652, -618, -124, -316, -478, -209, 209, -200, -85, 211, -360, -146, -264, -553, -40, -535, -305, 252, -281, 230, 458, -126, 873, 671, -497, 310, -141, -694, 104, 385, 143, 95, 415, 691, 212, 602, 446, 226, 232, 272, -60, 42, 110, -132, 383, 495, 860, 961, 395, 650, 67, -174, 340, -245, 84, 322, -51, -53, 706, 187, 764, 344, 21, 287, 24, -277, -196, -556, -504, -566, -478, 250, 155, 293, 105, -509, -429, -494, -606, -467, -583, -449, -815, -644, -269, -599, -205, 447, -252, -484, -94, -571, -674, -312, -809, -411, -179]
2980a79K1K96P8n9m05O6Q7j60J40L47k80j18Q3J66j4N01K70J2k30l85j56m75J04
3003b90L48K02P03n80Q1L38q82J79O76o22L20n3r18M77j72L42K38j39L34K7j58
3024D51J09o09k36J9n9n7M62k14M50kl16j47Q1L74j19l77p0K4m58L61n64M05R76
3047D84k01Q2J2o77L22j50p16P45j78M7J15J23p6K87M4P4j40J65M29p21P2o08
3069d66Lk20N52Q43K03l4j00n35n33L83q1J73L20o01m02N36l25K50N36J84R1n48
3091B29j42m3p94M85j78k16M25K55l8L19k19j18k69j08L30O1j60j70n34J61n1
3112g75M9P95j93K15J75m81k79M6p28K07N77kO17o3n42K0R2K81L7M0R6m13l19
3135e48K10l39M58K52M24Qj07K93P0n79n9k21j49N59K46j73M55o27o7K69K46N16
$$ y = [-179, -158, 138, 216, 157, -248, -182, -95, -255, -115, 232, -48, -166, -83, 83, 69, 570, 840, 852, 622, 237, 81, -394, -290, 58, 260, 963, 383, 464, 802, -80, 99, 775, 153, 473, 420, -498, -21, -193, 149, 387, 248, 582, 609, 451, 560, -49, -285, -266, -325, -382, 80, -134, 316, 314, -2, -149, -68, 306, 187, -190, -260, -236, -694, -333, -897, -492, 484, 283, 365, 377, -300, 22, -128, -844, -99, -277, -230, -115, 8, -68, 219, 263, 337, 197, 362, 791, 70, 142, -466, -463, -683, -131, 712, 915, 881, 781, 246, -287, 96, 15, 188, 508, -93, -495, 41, -284, -34, 502, 686, 777, 229, 87, 44, -750, -265, -443, -659, -234, 21, -17, 302, 83, -35, -304, -412, -82, -21, -181, -351, -885, -724, -775, -726, 69, -124, 91, 266, -215, -494, -448, -1176, -969, -392, -394, 223, 160, -382, -362, -270, 11, 48, 88, 184, -229, -548, -338, -677, -219, 33, 457, 465, 358, 651, 721, 142, 83, -138, -287, 272, 518, 345, 800, 173, 106, 375, 621, 1137]
3157A137j5l71k49m89n88M00J21L56K98M0l40K05m2p8ol19J20j10k22K6m1l73
3179e40L08K5J53N02L24l14o70j65m23N4K69J99K19r0L39r5n55R7K24l6o7M65
3201B23o44Q1p1l48L51N64k2k2J76k08k79j81O8j86j4O06K07j17j9j14j06k87
3223c42K88L28J88L2j48m70n04M15K55K09M74r3p0l15j90j34p9p8M76k77j6l3
3245h4j27j27M16K58k56K01k42l01j74%P1Rm4K79r7J71R1k06l42K65j85J19M39
3268A34p5k19k20r2m06N15L85J91K79j33l24l18n19M77L52j69K21J18n2K4k68
3289i9K02K61j63J54QQ7j70m25J40j02M24K97j65K04j95k59j28J52J3j08K72K21
3311F21m7j12k60j29J20j9R9J55j32j61l81J41k26j35R73l50Q2l24j84O1l35L96
$$ y = [1137, 1122, 751, 502, 13, -575, -175, -54, 302, 600, 640, 300, 505, 463, 385, 379, 60, 180, 70, -152, -126, -167, -540, -232, -207, -54, 448, 772, 458, -212, -377, -800, -746, -477, -278, -59, -149, 190, 95, -460, -363, -139, -175, -242, 223, -421, -340, -411, -759, -408, 156, 134, 112, 288, 80, -199, -380, -312, -498, -512, 94, 301, 184, 165, 51, -55, -342, -54, 274, 462, 494, 346, -124, -628, -213, 42, 251, 725, 632, 562, 247, 57, -77, -156, -234, 242, -35, -51, -84, -211, -338, 78, 336, 80, 281, 39, -262, -436, -436, -365, -356, -400, -121, -218, -47, 44, -162, -504, -239, -424, -305, 134, 59, -160, -380, -472, -878, -363, 22, 213, 492, 359, 35, -283, -802, -325, 27, -142, 79, 197, 145, 169, -99, 103, 364, 201, 355, 363, 450, 280, -145, -5, -107, 317, 614, 449, 653, 458, 199, 71, 223, 236, 128, 400, 621, 574, 462, 202, 73, 193, 174, 273, 428, 296, 135, -246, -105, -331, -466, 507, 157, 239, -85, -269, -208, -543, -147]
3333a47Jj31j33L46j42K2l22R4m2J33J91N8l81K53m54j93K40rK83N87k59k69L8
3356b36m80M76J63K0J42n6m71J35J52o9L49p2L83k64m7K55n21k28L88k08N31K54
3378E96k9j6m90m0J09j85L17M3q5M19n62K18p9l29L33L24M6l33J23k35j53m28
3400d36K24M61L3K3k9o17N5k9j51O06M9nl70p1L63l62m5J93k30L26L8M3K11l45
3424f5p1J09n41P20L63l05k8l86l70M11k60Q74J9k87j07K6j92Q3k3K53J78l6l1
3447C34r9k82L74J7j64J08j53J04K61n05K69l72J76L93m43L93k79k6j32j31l74
3468e31N21j0M7K84m19k4l28j27N65L8P7J30m31j08L9l98L72O1l05J69j60O0J0
3491d68J6L6K11j69J98k32OK90m12J5L25l42M19J04p4J98m09N3K1P1J49k5K58
$$ y = [-147, -146, -277, -410, -64, -206, -184, -506, -412, -454, -321, -130, -72, -453, -200, -654, -847, -607, -616, -333, 254, -5, -274, -236, -716, -240, -77, -57, 85, 29, -442, -307, -155, -224, 125, 53, 436, 172, 125, 380, -141, -369, 19, -189, 342, 596, 567, 551, 61, 21, 130, -55, 262, 305, 220, 639, 77, 295, 216, -113, 220, 544, 590, 257, 380, 145, -8, -436, -212, 249, 282, 305, 276, -341, -286, -315, -466, 140, 189, 184, -186, -257, 106, -256, -301, -108, -338, -12, 26, 69, 280, -65, -136, -27, -568, 152, 515, 210, 182, -204, -574, -163, -423, 451, 470, 183, 76, 102, -90, -7, -30, 223, 401, 365, 334, 235, -47, 327, 344, 180, 288, 135, 239, 500, -5, 264, -108, 68, 461, 18, 411, 132, 106, -26, -157, -531, -10, -20, 27, 311, -108, -132, -460, -587, -22, 16, 93, 223, -208, -316, -277, -675, -303, -242, -547, -378, -538, -478, -468, -452, -416, -205, -374, -176, -408, -402, -112, -524, -509, -184, -526, -107, -3, -77, 121, -288, -235, -214, -143, 6, -19, 239]
3514B39n2m93Q9J59j25Q18j57j18K00m34k22j27KM99j52J72K17m39L1L87m80N38
3536E52j07l88O40o50q9J58J1j18J76m1L42J2k70n0j27l03M37k57L98k15k05K9
3558f5j11k68N98j93J44l00m50M43j47k20K86j80M96P6r3j49k63J68J28k72J58
3579b14K09l2k20rj09M21m32P20p7J63k08l62j29J76l62M84j2J79M46k26m46J79
3601A39mP6j38o1J56j43k35J78j34R9J89j36J74L47m84n9J58m17Q4L6J85j3n2
3624e5Q8k96l6J35j6l4J44k68K87m7k99j30R6J51O7K04k39L88j72l16J22l00K29
3647b97l2N1J14j33K27K18j98L6M7K03k0m03j77J14J11J7K30K8K10J65j31l28
3669E2KK67l6m86N52rr3k5M4M1j8Q3J44k31j80M56n29K43r3J10j00K84k86K08
$$ y = [239, 187, -306, -217, -58, -183, 635, 478, 360, 560, 126, -96, -223, -221, 278, 126, 298, 515, 76, 107, 494, 14, 552, 445, 57, 697, 47, -42, 116, 127, 9, 185, 144, 486, 498, 228, 178, 51, -252, 185, -72, 326, 111, -94, -65, -176, -444, 154, -39, 105, -195, -645, -202, -349, -569, -283, -463, 33, 109, 16, -133, -396, -228, -100, -372, -214, -5, -37, -257, -266, -375, 46, -386, 334, 257, 420, 212, -150, -279, -103, -465, 19, 7, 186, 632, 406, -40, 139, 135, 211, 73, 12, 168, 25, -210, -32, -166, -67, 122, -14, 160, 507, 23, -36, 122, -295, -211, -175, 10, -3, -55, 33, -263, -299, -164, -180, -214, -70, -338, -51, -98, -397, -527, -431, -280, -213, -9, -248, 140, -32, -348, -226, -526, -297, -329, -278, -164, -297, -70, 148, -50, -14, 33, 236, 216, -187, -364, -250, -139, -122, 108, 136, 346, 511, 380, 52, 54, 321, 285, -201, 351, 342, 249, 224, 268, 309, 291, 374, 518, 287, 107, 563, 34, 277, 184, 294, 194, 478, 192, 400]
3693D00j99j23j46L48q4j20n9K44l73k1K70k71R7j5J38m2k51j44j5k44K53O5M9
3716b43O8r1k5L11L0j24j31j09k9J05j94K26l6j54K50J12j03L03l60J06J5j77
3738b50j1K7K68j19P8m9O9K24j66J53j6l20K02l44K56j63k1K28R4K59Jk42K40
3761C98k14r7n0K1K26l40J97k57J48O3j05L44j44j16j0k57J60j40k31O1M15m7
3783B5l22K44O2k10%M0l78M04j60q8L49j15L07l41J11L18k54N6l14K71kj64j65
3806c26M01j0j51N1L67j85K94k59J27j61k99K34R2l59L60M24k92J69j0k28L44
3827E83k21r5l14J3R6j99K82K55q5K13l25L12j24o4k18q1q2k06P7M2j6K54j28
3850c1KK28l15M65l62j01j95J31k65M1p5L19k38N54j41j57K67l08o7J40l89p7
$$ y = [400, 201, 78, -68, 280, 196, 76, 17, 261, -112, -133, 137, -134, -37, -52, 86, 44, -207, -351, -366, -610, -357, -292, -243, -175, -266, -291, 20, 50, -74, -205, -314, -343, -238, -432, -206, -242, -396, -146, -34, -137, 166, -194, -88, -73, -250, -261, -234, 34, -85, -7, -56, 13, 237, 71, 224, 208, -112, 90, -254, 2, -161, -182, 46, 140, 399, 400, 158, 398, 184, 87, 37, 58, 284, -56, 141, -116, 32, 95, -10, 334, 190, 74, 64, -193, -33, -173, -404, -343, 72, 25, -297, -53, 9, -201, -201, -161, -539, -135, -295, -383, -34, -149, 158, -183, -72, 246, -8, 48, -266, 5, 3, -161, -326, 75, 65, -86, -35, 332, 147, 441, 182, 309, 148, -151, 83, 175, -184, 176, 600, 308, 477, 467, 239, 583, 362, 267, -47, -34, 62, -137, 145, 400, 315, 528, 203, 515, 391, 327, 109, 28, -54, -260, -183, -141, -157, 97, -31, -29, 199, -116, 349, -13, -114, -309, -178, -443, -402, -477, -158, -396, 158, 17, -140, 127, -181, -248, -108, -497, -574]
3872e74Q3p1K77m5L45j50j01L03k36Q5J43nn42J92rl8L42J0K51r7J20L1k32k17
3896a35K64j41Rj37J80J62Q7R2J84l64M08j80o5j9n42K46j05j73L98J72n6K3Q3
3919C91j78J32n6L0l36j88R4P3j47M81k83K21Qj60J85k44q3n5j72j50L44j10j41
3942c44L74J8k05L38m4N0l41l15M38o13L93o6p7O19q0o1K10j94j3k00j26J33Q0
3965b6j66J74k55K02M8J22K57K10k71j49j49q8J26k28L02k8J68q7J76k67N28m44
3987A55o6m1O4n1o0j64J4L7J86P4R1J6j7j43l09k56J99j24K0R8J85k03L33j88
4011a50m1L27q8r3q9n38L50K8j53J01J42k6L97k41J20j10j34L8k89O09l02k34
4033c76M46j16J8L80M0j50ko8q0m4j94L20k72J1L36J07L6L6J08p2n7k04j1m2M
$$ y = [-574, -491, -562, -285, -330, 15, -135, -236, 67, -169, -84, 59, 54, -488, -296, -305, -343, -1, 9, 260, 163, 283, 314, 82, -135, 129, -12, -3, -140, 40, 202, 289, 381, 565, 201, 609, 429, 364, 345, -197, 49, -56, -229, 169, 341, 285, 308, 391, 213, 345, 289, 319, -17, -205, -111, -38, -185, 296, 13, 234, 242, 82, 267, 23, -60, -115, -287, -437, -93, -203, -344, 30, 48, -157, 181, 137, 187, -154, -469, -31, -644, -251, -317, -394, 225, 145, 84, 294, 100, 87, -113, -239, -106, -26, -192, -18, -273, -71, -23, 99, 356, 566, 295, 146, -3, -91, 35, -193, 109, 81, 249, 162, 338, 71, 599, 155, 89, 48, 112, 61, 1, -163, -149, -112, 74, 148, 239, 255, 238, 95, -214, -470, -271, -395, -375, -277, -92, -295, 38, -150, -191, 136, 48, -45, -134, -672, -322, -294, -447, -346, -204, -230, 167, -74, 46, -64, -198, -160, -449, 160, -142, -376, 70, -46, -28, 352, 392, 242, 240, 172, 92, 48, -146, 174, -98, -87, 249, 356, 392, 428, 536, 464, 407, 203, 192, 150, 154]
4058A54N6m7m7n5J53K20j06j0O3k30J79m46J12M2o5L13q0n5J54k48j09J6N7k54
4082b33J95k07L07j61j17j8k58K66K58J28j89l15k19r6K10l9M01j27k2l2NJ14
4104a49L70n30L99J24l07R3k94j4R3m8L11j81L99L8l67R3l3P1R6l0m2j38j51Q5
4128a12Q3N9J26K53m77R5J46J85k34m85L42L5m6J81J77p1j00K9j10j5k18K16p0
4151a1o2K3j18J63k32l7L31q3j93K72j38k89J05n7J77M5J15O8K60n37k25J85O0
4174a78L08j8m05K0q9K38L51o3N2o9J10l03L28k03Jj96J00J77K70n6P8j75k37
4197D1O5K28l1O3O9k63%k1o4J44n1K41j59M5L2k28L8k73K39j92J52K76k19q1m4
4222Gj03J37K84k75K43m29J58m09j23J12L35J8n3P1p2l4m00M6K22n9M05l59K5
$$ y = [154, 210, 163, 116, 61, 214, 434, 328, 318, 381, 151, 330, -116, -4, 38, -27, 286, 206, 151, 305, 57, -52, -36, 21, -233, -38, -245, 62, -99, -216, -234, -492, -226, 32, 160, -29, -344, -563, -659, -449, -488, -87, -214, -236, -268, -263, -149, 221, -309, 90, 214, -93, 0, -294, -308, -215, -263, 48, -133, 266, 304, -63, 30, -3, 68, 164, 134, 92, -46, -197, -112, -29, 30, 156, 409, -68, 27, 173, 358, 124, -361, -19, 16, -30, 151, 328, 257, 157, 186, 76, 61, -157, 59, -11, -73, -50, -168, -5, -237, -274, 57, -26, -219, 53, -85, -374, -269, -326, -149, -104, 11, 79, 339, -198, -423, -238, -178, 130, 112, -293, -273, -362, -124, 227, 164, 216, 147, 257, -46, 282, 79, 80, -116, -16, 161, 431, 375, 453, 278, 41, 106, 334, 303, 366, 435, 172, 172, 151, 87, 231, 180, 421, 262, 307, 339, 111, 149, -124, 115, -77, 75, 351, 132, 51, 7, -96, 41, 325, 50, 293, -136, 22, -387, -510, -398, -63, -45, -98, -27, -99, -133, -533, -487, -265, -324, 81, -278, -253]
4245b53J2p2kJ05J3Q8j04K82j68k40K16k8l52L78J32L5J9oj37K5q1l0J17K03o6
4270H6K0o9j61J38J93J57m09L05J41o6j11k21Q5j48J21J35J34l33K89k55J04m0
4292I5p4L89j05k12M7k64r9M94m46L21j35j29J35K2k57o9J93O3J33JJ83j51n01
4315c66j2J60K87J86k90m8o5j54K76j18J42R6j80K48j55J71k10J23j23L3L3R4
4337A28J78j73j50j65K37J04J27n8j02j4k62J67m1j49K03K25J11m45M3J98k03
4358d1j71K03K18j09J02q7r9L2k43J83J61O3oo0k19j44P9n9k4J88J6j62Ok25K21
4383a77j82kJ06K42j43J58o4N9l31K17k55J88J87J95n45j68L25M1j00M18j30k22
4405a83J32k66J33L75m18J08J23j68K76k27J48L0k29K12KK1L82l34K5jQj64J35
$$ y = [-253, -241, -313, -315, -210, -197, -109, -213, 69, -99, -339, -123, -151, -503, -125, 7, 42, 61, 55, -82, -57, -138, -168, -51, 152, 86, 106, 37, -124, 14, 207, 364, -45, 260, 401, 335, 224, 3, 88, -60, 61, 196, 330, -3, 286, 31, 135, 95, 21, 410, 305, 93, 140, -124, -223, 271, -175, 146, 11, -118, 17, 39, -218, -287, -94, -31, 102, 103, 286, 135, -366, -378, -218, 69, 255, -35, -83, -148, -302, -26, -144, -2, 94, -86, 162, 7, 178, -32, 91, -32, 1, 34, 128, 306, 133, -17, -182, 55, 159, 286, 228, 126, 112, -150, 17, -24, -173, 30, 255, 366, -79, -36, 162, -41, -212, -9, 209, 100, 202, 115, 16, 48, -195, -12, 149, 212, 206, 146, -73, -217, -138, -197, -221, -33, -17, -179, -173, -398, -177, -359, -361, -255, -13, -156, 2, -62, -3, -334, -117, -372, -184, 3, 198, -347, -515, -190, -149, -249, 169, 39, -183, -51, -317, -184, 191, -227, -119, 4, -164, 112, -115, 33, 63, -166, 46, 48, 69, 451, 117, 142, 141, 149, -15, 120]
4428A20j09L93l05J36Q3n97L75L7O0K93l03J5K48n38K05J07l07L11j73kK04m68
4450b15K42j13K14r6r2J33J6k96N5J34j11L86l33j86rN5R5l5o1K40k01k9O9k21
4474c59P5L20k22K47r4j22K86j51l9j65N6J29n6J64Q7p7j61J32j78O0N0N3J63
4497A98j32K7j10J15O0r4k41K93r7J2K13l02l1L4j97N31j4j39k04P8j07j33K11
4520b9Q1K18k66J33k53O2j01l2l2J16P6Q9jj08j0lk76L17J21k47J31j82L3j24
4544b87J51K87j93j44J08m4j37ML79p2q0l33L58R1J47j06l7R2j62J89Lrj23M4
4568A26j11j05O5M73j70j37K4M6j03m0K10j42L28l10j12J38k46J39J32j19K05
4589B91K76l33j2j03k08m6K42N9O5r6R6p0n7m0j49L4k6q7N7k35K58j66J35J00
$$ y = [120, 11, 404, 99, 235, 318, -279, 96, 133, 193, 486, 183, 198, 446, -92, 113, 220, -87, 224, 51, 49, 253, -215, 27, -86, 128, 32, -60, 73, 89, -207, -152, -18, -129, 257, -76, -262, -271, -216, -121, -156, -217, 23, -178, -207, -138, -359, -284, 36, -186, 61, -33, -155, 131, -20, -59, -224, -168, -39, -95, 69, 156, 79, -82, 50, -128, -68, -18, 35, 198, 66, 93, -17, 98, 158, 64, -177, 116, 19, 31, 244, -58, -89, -55, -252, 279, 265, 126, -78, 0, -107, -240, -29, 52, 270, 4, 137, -116, -54, -155, -187, -219, -103, -27, 62, 61, -47, -57, -60, -336, -19, 102, -145, -14, -196, -163, -287, -136, 151, -42, -186, -78, -122, -259, -255, 124, 52, -28, -361, -3, 88, 235, 129, 92, 184, 22, 211, 214, 205, 82, 126, 15, -90, -25, 448, 278, 141, 165, 211, 108, 68, 278, 136, 464, 154, 42, 180, -66, 73, 205, 86, 291, 567, 234, 222, 119, -89, -135, 107, 166, 231, 135, 231, 161, 104, 64, -85, -51, -77, -164, -107, -342, -84, -250, -115, -15]
4613a5J82j79l3r1O9m57J57j79K69j76K20L68j89l6Q%o7J24j27J1j95K02J6l7
4637a55m2J28J46q6j39J93j66j61L4L9K40J40J02n7n1J28k23j2M49l58J21k5m64
4660b19J91p7N2J37N1L8j30J14LJ48L8l11j09K55k77J19K4q8n5K9R2K5L11m79
4684a18J37j04q0R2k41J50J29k67J9J51K33Q4m5j33q9mo6l82N03j07J59nJ10j5
4708A11O8j98J51j45k13J47J84L52n74K82r4J38J05L2j41K9k72L33k33k1L45m15
4730b9M4Q5k2J70J33k38L6m5k84J01K1J46k6j53R1k35K51J00j70K09l83J84p2
4753h6r2k8j70R6L19l03K41j0k05L35l71J40m4J03j30J29k12k9m7K20k1j9J71
4776a3k05K32k29M22l19p1J2k26M60l65K24L4J55nj68R6Jn5k11m7L11j13K71J61
$$ y = [-15, 167, -12, -45, -136, -67, -524, -367, -546, -277, -453, -233, 135, -54, -90, -82, -82, -149, -25, -152, -141, -336, -134, -118, -155, -197, -69, 77, -9, -148, 45, -121, -282, -248, -209, 31, 171, 273, 216, 165, 293, 70, 58, 507, 149, 270, 245, -219, -28, -105, -53, 84, 135, 173, 43, 157, 160, 308, 346, 35, -74, 181, -96, 23, 47, -41, -96, -67, 25, 50, 361, -118, 19, -85, -165, -73, -314, -164, -35, -302, -283, -132, 101, 185, 140, 7, -82, -86, -152, -534, -31, -138, 21, 16, 126, 111, 179, -19, 132, -13, -226, -79, 105, 457, -117, 165, 71, 209, 314, 346, 205, 234, -38, 295, 62, 41, 386, -29, 15, 100, 78, 248, 381, 143, 179, 134, -150, -49, -28, 118, 92, -61, 30, -205, 46, 146, -24, 185, -198, -14, -86, -178, -206, -376, -280, 39, -264, -23, -33, -238, 97, -274, -134, -178, -75, -205, -76, -288, -317, -364, -144, -165, -184, -13, -218, 14, -215, 207, -112, -183, -171, -397, 63, -302, -78, -44, 111, 106, -62, 34, 35, -20, -231, -278, 33, -80, 191, 352]
4800C52k1k5k31J02O4L6j99j20k6j7L78j91k7K06j01k18J85Mn2n0M9k53J21P9
4824D5J04mpj34j5J61j90J3l1k15K15n2R7k7J07pn5R7j77N1l85K28R4O8j55Q0
4850i4k9j8J09J76k29m8J81m4K2l08qK05o1K88l19K92K13l2k13n6K3n7k15L48
4874A26l7l13K53K47Kj86j53L24j74K6J6j15J74l18J70J30q2J81l67J75m0M9K5
4897A13j44j1j87K81p9p9J55k04J80L01m07p2N8j45L3j09P4R0O1J01j88J89j92
4920a81R6J08r4M8Ll6k83K43p7L04M5k46J61k3j72K25M4K23m30J44J6J15l9J57
4944C51N2j06N7k84J14p2j8N7o6k8L1q0K55j16R9J86k86J81P7l30J01j37P9j7
4968A00k71n3K43J52J14q8O2j3l7k17p9mQ9J68j02J98l29R0j17r9K09l02o5J8
$$ y = [352, 331, 306, 75, 177, 241, 277, 78, -42, -68, -85, 293, 102, 75, 281, 180, -38, 147, 151, 99, 49, 98, -155, -34, 45, 149, 145, 138, 4, -11, 150, -40, -27, -58, -273, -58, -110, -13, -40, 67, 60, 5, 102, -75, -24, -409, -181, -87, -19, -174, -94, -123, -141, -32, 144, -85, -133, 48, 4, 26, -282, -290, -85, -146, 142, -177, 115, 328, 296, 83, 27, 50, -7, -222, 126, 89, -224, 29, 276, 278, 92, -61, 263, 89, 115, 131, 16, 190, -128, 42, 172, 90, 271, -96, 79, 39, 88, 113, -31, -42, -229, 52, -27, -106, 49, -155, 25, 326, -81, -153, -95, -240, -207, -316, -242, -152, -91, 10, -178, 11, -181, -85, 23, -71, -23, -20, -56, -339, -96, -173, 131, 176, -70, 91, 68, -104, 121, 165, 388, -42, 102, 118, 233, 194, 351, 403, 297, 354, 70, 184, 112, 94, 151, 85, 57, 88, 8, 263, 147, 246, 432, 146, 327, 404, 74, 175, 38, 117, 100, -171, -224, 19, 171, 285, 197, 259, 246, 209, -8, -87, -91, -2, 166, 64, 262, -67, 23, -94, -193, 16, -286, -351, -333]
4992c33J95j02J71l7n1J55k52M04j44p4J6L6l59K34M7j14K40j39J56j96J33J51
5014A37j30o3k5j33K53k47K11J50j97J39q3q7K26k5j32M5N7k00K65J1k6R2k71
5037c3J70k19R0J08PJ47k85J15j75j17Q7Q9KL17j24O2k27j54J81k76J04L39k44
5060c6k73L81O2l9j23o3K01N6L1j40j63k79K26K55j57J35NJ6L4q1j9J98m00K94
5084A21q5K33l50J15p9Q7k71M96J17l67K79k63r5M2q9J45MK70q2k9n9j14J66k14
5108b2J77j30J80k28J23K10l62l4L08p5j49K89k79l1j14J64j40J55J37m15j6L06
5130E4O9k61o3J4J30J4k9l66J13j04L93j93R8J17l0N8k00j53L47J30l37K8J09
5153f2j76R3J00J9k74L2L25q1r7O5j8O7n7KJ34N2J4KJ0oL0P3q4j61R6r9J13j5
$$ y = [-333, -138, -240, -69, -106, -157, -2, -254, 150, 6, -68, -52, -16, -375, -141, -94, -208, 32, -107, 49, -147, -14, 137, 7, -56, -81, -214, 39, -208, 3, 153, -44, 95, 12, -75, 151, 126, -6, 39, 96, -104, 161, 172, 146, 238, -33, 137, -82, 8, 116, 123, 270, -15, 100, -75, -192, -105, -16, -14, 303, 179, 241, 14, -140, 41, -235, -131, 208, -36, -309, 72, 134, 95, -28, -91, 110, 166, 197, 57, -106, -385, -159, 96, -61, 74, 79, 95, 129, 48, 29, 227, -173, 121, 36, 269, -81, 34, -45, 42, -229, 267, 384, 17, 296, 33, -62, -20, -109, 36, 40, 310, 228, 199, 140, 26, 192, -22, 155, 25, 205, -23, 100, 310, -52, -86, 222, 147, -2, 287, 8, -23, -137, 27, -113, 42, 179, -236, -252, 54, 123, -138, -201, -187, -57, -43, -72, -438, -325, -429, -36, -229, -131, -14, -44, 14, -186, -339, 8, 138, -199, -171, -62, -238, -145, -45, -26, -300, -268, 57, -24, -121, -56, -74, -7, -64, -62, 72, 124, 138, 140, 150, 144, 174, 247, 163, 2, 98, -1, 112, 97]
5181I7k03j12M29j29J17j14MK22j66m8R0K3K8j29j2Q4j08m4J94j68O0O8m85M53
5205A51j44j49RJ95k86K48j53LJ63j27LJ23l22J92J12P2r1k45J16L8J0K90l67
5228a59K26J12J2l48L58k48M04j31l67J50J29l6k96K1Q2N3J04L3n2l1m2P1RK59
5252C13p0j38k31j7j53L04J17k75M09J51k64R8k12J52j03J82m79M01j30k1k44
5273b10K49O8k92K93k08K82k33J81k26n0k2J38j29J52j19J29l28K5P6J83k27o0
5295c28M55k46j78M9j1L0J90j29L03k26k5L4o3N5k99M63o7m5M6k8l8n0K67n5J6
5320A20K3L2L8l71K19j51K07k70M08J40l51J49j57K0K1p3J02j24J31j26P0R1k08
5343f0J58J23j41J17j20j13lk8J89j48J86O8k03po5j45K52j50k1L23l39P8j27
$$ y = [97, -106, -218, 211, 82, 199, 85, 89, 311, 145, 97, 187, 210, 238, 109, 97, 181, 73, 29, 223, 55, 115, 183, -302, 151, 7, -142, -133, 62, -224, 24, -129, -126, 37, -90, -87, 36, -286, -94, 18, 90, -1, -246, -130, -92, -82, 208, -159, 67, 179, 191, -157, 201, -47, 357, 226, -141, 9, 138, 102, -194, -173, -91, -38, 66, 99, 47, 16, -26, 45, 54, 313, 243, 105, -126, -143, -296, 8, 125, -150, 259, 410, 146, 244, 32, 184, 81, 263, -216, 185, 55, 34, -210, 39, 107, -185, 108, -100, 182, -51, 130, -96, -146, -168, -30, -159, -7, -126, 3, -325, -300, -224, -41, -268, -328, 127, -119, -297, -248, -259, -229, -39, -168, 135, -91, -116, -82, -145, -90, -389, 74, 7, -38, 8, -20, -58, -108, 159, 104, 120, 143, 175, 213, -158, 61, -90, 117, -153, 255, 395, 44, 193, 36, 56, 77, 4, 106, -18, 113, -13, 57, 148, -60, 98, 221, 80, 197, 77, -36, -39, -67, 122, -26, 160, 228, 25, 18, -47, -192, 60, -90, -111, 212, -127, -49, -176]
5366a76M31n93J53m5K85j56K09n2k77K04j05j94K97P4k34K50m13J86K01j13m2
5387a10P7Q0L8j22K1J00k0k03L35k42k7J76J67k00j49J81P7m3j96k2k2J73k87
5410b18K88o7L2j9q7K32K1k65j4K31j91l7K0j76L57l68M53k14M2r3L98o98K94
5433g9j16j35K70j91j4N00n39m0K72j58J80m3n2K92j62k10J29k50L46j56J7O7
5455g2K2J9J32L4j19j99J88k32K00j04J93l10M78k08J33N2j62N2J49l75O4J3m
5478e6K67j88J79n9J00n1K5j47r8J66k88L15J1r5J07k14J08M8J71n0j76K27j18
5501A84k74P2mk3m1r0p6M77k87J03j8M4J1k87K30l22M15m39L88l72J48M12m38
5524a87J51j83R0o2l3j14K44J18r5q9K5m7J16N5lr7K53j74q1j12K64j46k9K91
$$ y = [-176, 255, -338, -185, -230, 55, -101, 108, 56, -221, -17, -122, -316, -19, 55, -179, 71, -342, -156, 45, -68, -110, -33, 47, 85, -37, -16, 84, 64, -139, 196, -46, -73, 103, 270, 70, -79, 102, 179, 136, -60, -82, -104, 69, -218, 70, 3, 35, 16, -71, 161, 182, -83, -97, 134, -57, -94, -74, -250, 107, -261, 192, -22, 20, -73, 325, -373, -79, -195, -330, -60, -251, -265, 235, -304, -344, -72, -230, -50, -93, -145, 147, -15, -225, -96, -346, 0, -156, -139, -72, -50, -31, 101, 135, 16, -183, 5, -227, -27, -131, 62, -248, 230, 22, 155, 207, 45, 97, 246, -129, -65, -52, -56, 211, 23, 202, 143, 243, 192, 217, 70, -28, 138, -150, 165, 176, 81, 188, -26, 82, 130, 301, 251, 75, 302, 184, -90, -18, -22, -45, -86, -176, -252, 225, -62, 41, 23, 67, 78, -209, 21, -301, 114, -325, 63, -309, -161, 251, -187, -36, -219, -129, -191, -224, -338, -94, 24, -71, -160, -135, -182, -66, -11, -14, -111, 142, -32, -113, -225, 39, -107, -136, 155]
5548A55k6j57p5L56k39J8k14L32R2L2l57J79l9j46J26J4l1n0O9%o7K65k47k8J27
5573H9M2k6j87P9k32J39J46j91J33R6N3j04mj81Q7q2J78J9m6L7r7p3O7j15L3O3
5599g7n4K40j12j62J69J36j52K9R2jk74P7K44j01M5k93J42J99J70m78j2K19j41
5622i5K3pJ24m6o0K17L0n9J4R1k23K46j10J36l04Q0nn4J00q6k7J74j47j12L3K
5648f5K7L0k0l0lp3n6J57J96o7J78k60k84M4J4J78m4q8k8K37m0j72j11j17J39
$$ y = [155, 129, -28, -103, 253, 14, 32, -182, 150, 242, 274, -83, 96, 57, -89, 37, 51, 20, -30, 39, 39, -28, 237, -10, -38, 89, 131, 105, -82, -3, -235, -96, 50, -141, -8, 88, 141, 37, 33, -148, -61, -143, 35, 54, 8, 45, -52, -125, -58, -173, -140, -77, -131, 109, -3, -165, 4, 140, -12, 17, 109, 108, -166, -89, 155, 54, 99, -194, -52, 147, 317, -161, -173, 46, -95, -72, -79, 45, -1, -61, 156, 186, 127, 141, 232, 9, 255, 145, 281, -23, 57, 52, -2, 98, 12, -15, 159, 12, -100, -67, -65, -38, -8, -28, -58, -61, -134, -190, -33, 163, 96, 274, 14, -270, -226, -212, -34, -78, -166, -194, 43, 3, -169, -280, -397, -258]
$$ [...]
8191e6
##END NTUPLES=NMR FID
##END=
