##TITLE=1H_SL62-d-SeO2-f5-2
 CDCl3, 8 sc, 
 5.4.2019
##JCAMPDX= 6.0         $$ Bruker NMR JCAMP-DX V2.0
##DATA TYPE= NMR FID
##DATA CLASS= NTUPLES
##ORIGIN= UXNMR, Bruker Analytische Messtechnik GmbH
##OWNER= root
$$ XWIN-NMR		Version 3.5
$$ Fri Apr  5 13:58:02 2019 Russian Standard Time (UT+4h)  she@DPX200
##.OBSERVE FREQUENCY= 200.1316
##.OBSERVE NUCLEUS= ^1H
##.DELAY= (6, 6)
##.ACQUISITION MODE= SIMULTANEOUS
##.ACQUISITION SCHEME= undefined
##.AVERAGES= 8
##.DIGITISER RES= 18
##SPECTROMETER/DATA SYSTEM= spect
##.PULSE SEQUENCE= zg30
##.SOLVENT NAME= CDCl3
##.SHIFT REFERENCE= (INTERNAL, CDCl3, 0, 15.7039)
##AUDIT TRAIL= $$ (NUMBER, WHEN, WHO, WHERE, WHAT)
$$ ##TITLE= Audit trail, XWIN-NMR		Version 3.5
$$ ##JCAMPDX= 5.01
$$ ##ORIGIN= Bruker BioSpin GmbH
$$ ##OWNER= she
$$ F:/spectra/data/she/nmr/H-F/1/audita.txt
$$ ##AUDIT TRAIL=  $$ (NUMBER, WHEN, WHO, WHERE, WHAT)
(   1,<2019-04-05 13:56:45.01 +0400>,<she>,<DPX200>,
      <created by zg, POWCHK disabled, PULCHK disabled
       configuration hash MD5:
       00 E9 B6 7A A2 85 ED C7 34 08 36 98 17 FE 4E 26
       data hash MD5: 16K
       0D 42 04 97 9E 0B 92 E7 6F 8B A6 BF 02 D7 55 76>)
$$ ##END=
$$ 
$$ hash MD5
$$ 02 61 D7 A5 53 32 AF 99 D0 94 17 49 B8 78 99 63
##$RELAX= 
##$RELAX= 
##$RELAX= 
##$RELAX= 
##$RELAX= 
##$RELAX= 
$$ Bruker specific parameters
$$ --------------------------
##$DU= <F:/spectra>
##$EXPNO= 1
##$NAME= <H-F>
##$PROCNO= 1
##$TYPE= <nmr>
##$USER= <she>
##$AMP= (0..31)
100 100 100 100 100 100 100 100 100 100 100 100 100 100 100 100 100 100 
100 100 100 100 100 100 100 100 100 100 100 100 100 100 
##$AQSEQ= 0
##$AQ_mod= 1
##$AUNM= <au_zg>
##$AUTOPOS= <>
##$BF1= 200.13
##$BF2= 200.13
##$BF3= 200.13
##$BF4= 200.13
##$BF5= 200.13
##$BF6= 200.13
##$BF7= 200.13
##$BF8= 200.13
##$BYTORDA= 1
##$CFDGTYP= 0
##$CFRGTYP= 5
##$CHEMSTR= <none>
##$CNST= (0..31)
1 1 145 1 1 1 1 1 1 1 1 1 1 1 1 1 1 1 1 1 1 1 1 1 1 1 1 1 1 1 1 1 
##$CPDPRG= <>
##$CPDPRG1= <>
##$CPDPRG2= <>
##$CPDPRG3= <>
##$CPDPRG4= <mlev>
##$CPDPRG5= <mlev>
##$CPDPRG6= <mlev>
##$CPDPRG7= <mlev>
##$CPDPRG8= <mlev>
##$CPDPRGB= <>
##$CPDPRGT= <>
##$D= (0..31)
0 1.2 0 0 0 0 0 0 0 0 0 0.03 0 0 0 0 0 0 0 0 0 0 0 0 0 0 0 0 0 0 0 0 
##$DATE= 1554458204
##$DBL= (0..7)
120 120 120 120 120 120 120 120 
##$DBP= (0..7)
150 150 150 150 150 150 150 150 
##$DBP07= 0
##$DBPNAM0= <>
##$DBPNAM1= <>
##$DBPNAM2= <>
##$DBPNAM3= <>
##$DBPNAM4= <>
##$DBPNAM5= <>
##$DBPNAM6= <>
##$DBPNAM7= <>
##$DBPOAL= (0..7)
0.5 0.5 0.5 0.5 0.5 0.5 0.5 0.5 
##$DBPOFFS= (0..7)
0 0 0 0 0 0 0 0 
##$DE= 6
##$DECBNUC= <off>
##$DECIM= 24
##$DECNUC= <off>
##$DECSTAT= 4
##$DIGMOD= 1
##$DIGTYP= 9
##$DL= (0..7)
0 120 120 120 120 120 120 120 
##$DP= (0..7)
150 150 150 150 150 150 150 150 
##$DP07= 0
##$DPNAME0= <>
##$DPNAME1= <>
##$DPNAME2= <>
##$DPNAME3= <>
##$DPNAME4= <>
##$DPNAME5= <>
##$DPNAME6= <>
##$DPNAME7= <>
##$DPOAL= (0..7)
0.5 0.5 0.5 0.5 0.5 0.5 0.5 0.5 
##$DPOFFS= (0..7)
0 0 0 0 0 0 0 0 
##$DQDMODE= 0
##$DR= 18
##$DS= 0
##$DSLIST= <SSSSSSSSSSSSSSS>
$$ [...]
##$SUBNAM2= <"">
##$SUBNAM3= <"">
##$SUBNAM4= <"">
##$SUBNAM5= <"">
##$SUBNAM6= <"">
##$SUBNAM7= <"">
##$SUBNAM8= <"">
##$SUBNAM9= <"">
##$SW= 24.9336934301222
##$SWIBOX= (0..15)
0 0 2 0 0 0 0 0 0 0 0 0 0 0 0 0 
##$SW_h= 4990.01996007984
##$TD= 16384
##$TD0= 1
##$TE= 0
##$TE2= 300
##$TE3= 300
##$TEG= 300
##$TL= (0..7)
0 120 120 120 120 120 120 120 
##$TP= (0..7)
150 150 150 150 150 150 150 150 
##$TP07= 0
##$TPNAME0= <>
##$TPNAME1= <>
##$TPNAME2= <>
##$TPNAME3= <>
##$TPNAME4= <>
##$TPNAME5= <>
##$TPNAME6= <>
##$TPNAME7= <>
##$TPOAL= (0..7)
0.5 0.5 0.5 0.5 0.5 0.5 0.5 0.5 
##$TPOFFS= (0..7)
0 0 0 0 0 0 0 0 
##$TUNHIN= 0
##$TUNHOUT= 0
##$TUNXOUT= 0
##$USERA1= <user>
##$USERA2= <user>
##$USERA3= <user>
##$USERA4= <user>
##$USERA5= <user>
##$V9= 5
##$VALIST= <valist>
##$VCLIST= <CCCCCCCCCCCCCCC>
##$VD= 0
##$VDLIST= <DDDDDDDDDDDDDDD>
##$VPLIST= <PPPPPPPPPPPPPPP>
##$VTLIST= <TTTTTTTTTTTTTTT>
##$WBST= 1024
##$WBSW= 4
##$XGAIN= (0..3)
0 0 0 0 
##$XL= 0
##$YL= 0
##$YMAX_a= 156600
##$YMIN_a= -320130
##$ZGOPTNS= <>
##$ZL1= 120
##$ZL2= 120
##$ZL3= 120
##$ZL4= 120
##$ABSF1= 10
##$ABSF2= 0
##$ABSG= 5
##$ABSL= 3
##$ALPHA= 0
##$AQORDER= 0
##$ASSFAC= 0
##$ASSFACI= 0
##$ASSFACX= 0
##$ASSWID= 0
##$AUNMP= <proc_1d>
##$AZFE= 0.1
##$AZFW= 0.1
##$BCFW= 1
##$BC_mod= 2
##$BYTORDP= 1
##$COROFFS= 0
##$CY= 11.3945322036743
##$DATMOD= 1
##$DC= 2
##$DFILT= <>
##$DTYPP= 0
##$F1P= 18.9103706918063
##$F2P= -1.10871071338519
##$FCOR= 0.5
##$FTSIZE= 0
##$FT_mod= 4
##$GAMMA= 1
##$GB= 0.15
##$INTBC= 1
##$INTSCL= 1
##$ISEN= 128
##$LB= 0.24
##$LEV0= 0
##$LPBIN= 0
##$MAXI= 10000
##$MC2= 0
##$MEAN= 0
##$ME_mod= 0
##$MI= 1.114404
##$NCOEF= 0
##$NC_proc= 0
##$NLEV= 6
##$NOISF1= 3.799351
##$NOISF2= 2.8
##$NSP= 1
##$NTH_PI= 0
##$NZP= 0
##$OFFSET= 15.70392
##$PC= 1
##$PHC0= -8868.716
##$PHC1= 37.60028
##$PH_mod= 1
##$PKNL= yes
##$PPARMOD= 0
##$PSCAL= 0
##$PSIGN= 0
##$REVERSE= no
##$SF= 200.130013532006
##$SI= 16384
##$SIGF1= 3
##$SIGF2= 2
##$SINO= 400
##$SIOLD= 16384
##$SREGLST= <1H.CDCl3>
##$SSB= 0
##$STSI= 0
##$STSR= 0
##$SW_p= 3612.71676300578
##$SYMM= 0
##$S_DEV= 0
##$TDeff= 0
##$TDoff= 0
##$TI= <>
##$TILT= no
##$TM1= 0
##$TM2= 0
##$TOPLEV= 0
##$USERP1= <user>
##$USERP2= <user>
##$USERP3= <user>
##$USERP4= <user>
##$USERP5= <user>
##$WDW= 1
##$XDIM= 8192
##$YMAX_p= 0
##$YMIN_p= 0
$$ End of Bruker specific parameters
$$ ---------------------------------
##NTUPLES= NMR FID
##VAR_NAME=  TIME,          FID/REAL,        FID/IMAG
##SYMBOL=    X,             R,               I
##VAR_TYPE=  INDEPENDENT,   DEPENDENT,       DEPENDENT
##VAR_FORM=  AFFN,          ASDF,            ASDF
##VAR_DIM=   8192,          8192,            8192
##UNITS=     SECONDS,       ARBITRARY UNITS, ARBITRARY UNITS
##FACTOR=    0.0002004,     1,               1
##FIRST=     0,             0,               0
##LAST=      1.6414764,     0,               0
##MIN=       0,             -320130,         0
##MAX=       1.6414764,     156600,          0
$$ Real data points
##PAGE= N=1
##DATA TABLE= (X++(R..R)), XYDATA
$$ [...]
$$ plain form
2180 1478 2120 1514 -192 718 2175 1211 394 794 1180 109 -383 587 733 -395 -1079 -1032 -722 -886 -321
2199 -321 -737 -1732 -2101 -1148 -629 -830 -460 217 -1016 -1475 219 1088 309 -744 1033 1276 393 854 2320
2218 2320 1792 6 337 1766 1551 814 657 1141 -19 -739 -405 280 -431 -953 -1279 -1085 -1101 -91 -674
2237 -674 -1195 -1299 -955 -867 -1696 -828 860 114 -1232 -274 1436 1007 -841 56 1811 1441 701 978 2264
2256 2264 1230 305 265 797 335 149 -141 -41 434 371 -397 -1306 -828 -240 -1551 -2225 -1143 -3 -1118
2275 -1118 -2066 -679 233 -509 -1462 -635 832 493 -43 575 1463 614 463 1206 1165 933 922 500 769 1701
2295 1701 1171 410 -90 632 407 -850 -1056 347 362 -1371 -1809 -782 43 -1326 -1683 -449 -160 -1207
2313 -1207 -1695 -13 225 -423 -1083 -67 241 73 803 1205 868 770 1143 933 842 1480 1027 348 -116 927
$$ packed form
2180A478O42o06j706R10J457r64q17M00L86j071m92R70J46j128o84M7L10j64N65
2199c21m16r95l69R53N19k01L70O77j233m59J694Q69p79j053J777K43q83M61J466
2218B320n28j786L31J429k15p37j57M84j160p20L34O85p11n22l26J94j6J010n83
2237f74n21j04L44Q8q29Q68J688p46j346R58J710m29j848Q97J755l70p40K77J286
2256B264j034r25m0N32m62j86k90J00M75o3p68r09M78N88j311o74J082J140j115
2275a118r48J387R12p42r53Q27J467l39n36O18Q88q49j51P43m1k32j1m22K69R32
2295A701n30p61n00P22k25j257k06J403J5j733m38J027Q25j369l57J234K89j047
2313a207m88J682K38o48o60J016L08j68P30M02l37r8L73k10r1O38m53o79m64J043
$$ plain form
2333 927 855 -440 -172 683 32 -1131 -635 556 -610 -1529 -1124 -548 -1350 -1634 -849 -459 -505 -689 -337
2352 -337 82 399 -66 80 678 719 640 822 692 1485 1106 624 53 1237 1543 855 511 625 1238 -43
2372 -43 -914 -569 -33 -1097 -1678 -1029 2 -1009 -1416 -661 -330 -767 -1333 -880 -328 -625 -365 -85 149
2391 149 432 379 257 349 1166 1405 901 1462 2006 1636 223 -137 618 471 -253 -164 699 576 -285 -335 -137
2412 -137 -7 -848 -1799 -1377 -688 -1010 -1201 -1081 -548 -272 -1030 -820 -423 528 90 207 731 1213 960 115
2432 115 256 834 813 721 384 1046 1594 696 616 839 755 -274 -1041 -607 -495 -991 -830 -528 -286 -1475 -1049
2453 -1049 -929 -210 -786 -1010 -434 -30 -286 -862 -470 -89 279 -64 401 1185 1332 699 719 1121 1364 966
2473 966 166 528 594 360 -110 -149 837 217 -348 -165 155 388 -808 -1352 -676 -889 -1389 -1530 -933 -434
$$ packed form
2333I27p2j295K68Q55o51j163M96J191j166r19M05N76q02k84P85L90m6j84L52
2352c37M19L17m65J46N98M1p9J82j30P93l79m82n71J184L06o88l44J14O13j281
2372d3q71L45N36j064n81O49J031j011m07P55L31m37n66M53N52k97K60K80K34
2391A49K83n3j22R2Q17K39n04N61N44l70j413l60P55j47p24Q9Q63j23q61n0J98
2412a37J30q41r51M22O89l22j91J20N33K76p58K10L97R51m38J17N24M82k53q45
2432A15J41N78k1r2l37O62N48q98q0K23q4j029p67M34J12m96J61L02K42j189M26
2453a049J20P19n76k24N76M04k56n76L92L81L68l43M65P84J47o33K0M02K43l98
2473I66q00L62O6k34m70l9R86o20n65J83L20K33j196n44O76k13n00j41N97M99
$$ plain form
2493 -434 -1143 -815 -267 366 235 -151 283 936 761 209 357 979 1299 426 18 1202 1597 932 554 860
2513 860 1144 871 -211 -667 -344 -760 -1249 -1246 -699 -186 -599 -1155 -498 130 -412 -1193 -763 -84 -4 -533 -249
2534 -249 377 644 -98 -41 542 1135 895 1160 1573 1845 1301 246 340 377 217 -576 -281 537 465 305 -135
2555 -135 -80 -14 -679 -1381 -1257 -813 -882 -1383 -1057 -258 -698 -1110 -749 82 246 6 542 1486 685 -120 640
2576 640 706 221 -270 392 1132 1338 812 1208 1483 840 70 -721 -418 -349 -909 -808 -678 -584 -440 -1239 -1002
2597 -1002 -656 -491 -1124 -679 -366 75 -387 -763 -159 102 -824 -546 112 1000 1031 1249 1709 1873 832 163
2617 163 333 361 -341 -580 -57 374 575 270 -90 -474 -487 -276 -629 -892 -568 -1203 -1038 -1392 -893 -417 -962
2638 -962 -1033 -621 69 -31 677 1174 1157 442 37 554 348 367 95 316 841 1191 1199 1275 1129 654 183 -182
$$ packed form
2493d34p09L28N48O33j31l86M34O53j75n52J48O22L20q73m08J184L95o65l78L06
2513H60K84k73j082m56L23m16m89LN47N13m13n56O57O28n42p81M30O79Q0n29K84
2534b49O26K67p42N7N83N93k40K65M13K72n44j055R4L7j60p93K95Q18p2j60m40
2555a35N5O6o65p02J24M44o9n01L26P99m40m12L61Q31J64k40N36R44q01q05P60
2576F40O6m85m91O62P40K06n26L96K75o43p70p91L03O9n60J01J30R4J44p99K37
2597a002L46J65o33M45L13M41m62l76O04K61r26K78O58Q88L1K18M60J64j041o69
2617A63J70K8p02k39N23M31K01l05l60l84j3K11l53k63L24o35J65l54M99M76n45
2638i62p1M12O90j00P08M97j7p15m05N17k06J9k72K21N25L50QP6j46m75m71l65
$$ plain form
2660 -182 -153 -564 -578 -779 -815 -687 -1004 -973 -686 -591 -752 -794 -628 -45 -5 -756 -551 221 -183 -466 -116 1055
2682 1055 1214 826 1140 2021 1883 1036 441 595 872 -225 -402 -109 451 356 102 -277 307 50 -598 -931
2702 -931 -810 -391 -992 -1658 -1185 -616 -792 -1178 -937 -176 -417 -43 365 1531 1573 319 -225 114 752 -173
2722 -173 -345 765 1289 739 995 1485 1361 652 -66 -504 -307 -427 -526 -849 -904 -845 -965 -1168 -625 -491 -952
2743 -952 -842 -58 557 117 -210 -166 -660 -748 -1101 -307 1028 1101 1220 1004 1751 1658 1497 199 233 -20 -449
2764 -449 233 765 767 125 -441 -251 -300 -596 -658 -245 -354 -580 -861 -682 -475 -917 -1395 -1815 -1002 204 200 500
2786 500 671 1331 531 158 276 371 -42 -231 421 1275 1121 626 1250 1363 846 55 295 610 381 -80
2806 -80 -672 -681 -611 -985 -1646 -715 -324 -358 -861 -298 286 148 -442 -400 -627 -616 -759 -631 252 789 1155 818
$$ packed form
2660a82K9m11j4k01l6J28l17L1K87R5j61m2J66N83M0p51K05P72m04k83L50J171
2682A055J59l88L14Q81j38q47n95J54K77j097j77K93N60r5k54l79N84k57o48l33
2702i31J21M19o01o66M73N69j76l86K41P61k41L74M08J166M2j254n44L39O38r25
2722a73j72J110N24n50K56M90j24p09p18m38J97j20r9l23n5N9j20k03N43J34m61
2743i52J10P84O15m40l27M4m94q8l53P94J335P3J19k16P47r3j61j298L4k53m29
2764d49O82N32Ko42n66J90m9k96o2M13j09k26k81J79K07m42m78m20Q13J206mL00
2786E00J71O60q00l73J18R5m13j89O52Q54j54m95O24J13n17p91K40L15k29m61
2806h0n92rP0l74o61R31L91l4n03N63N84j38n90M2k27J1j43J28Q83N37L66l37
$$ plain form
2828 818 1076 1311 1067 681 420 249 191 -85 -238 753 325 -365 -656 9 657 -189 -534 -299 54 -462
2848 -462 -1463 -1128 -561 -1084 -1646 -1138 -478 -137 78 585 512 971 701 232 205 325 -55 -373 -63 582
2868 582 1395 1070 673 1288 948 100 -293 189 233 -407 -649 -423 -290 -855 -1002 -1133 -888 -1081 -672 -82
2888 -82 448 162 -14 -549 -613 -628 -703 -371 295 543 872 861 1420 1729 973 397 -14 173 80 -144 730 1058
2910 1058 628 -536 -535 164 -57 -730 -331 24 -45 -245 -512 -529 -785 -1289 -1743 -1183 -674 -100 554 622 1024
2931 1024 955 32 -162 344 498 -501 -405 950 1462 917 864 1022 1255 118 -371 132 1019 484 -475 -440
2951 -440 -555 -622 -1162 -1141 -977 -711 -889 -487 303 418 -98 -1034 -789 -388 -774 -789 -278 805 873 399 689
2972 689 1571 1280 206 231 746 758 241 273 604 310 -297 -311 -173 -68 -395 -448 -354 75 -195 -473 -1021 -1322
$$ packed form
2828H18K58K35k44l86k61j71n8k76j53R91m28o90k91O65O48q46l45K35L53n16
2848d62j001L35N67n23n62N08O60L41K15N07p3M59k70m69k7J20l80l18L10O45
2868E82Q13l25l97O15l40q48l93M82M4o40k42K26J33n65j47j31K45j93M09N90
2888h2N30k86j76n35o4j5p5L32O66K48L29j1N59L09p56n76m11J87r3k24Q74L28
2910A058m30j164JO99k21o73L99L55o9k00k67j7k56n04m54N60N09N74O54O8M02
2931A024o9r23j94N06J54r99R6J355N12n45n3J58K33j137m89N03Q87n35r59L5
2951d40j15o7n40K1J64K66j78M02P90J15n16r36K45M01l86j5N11J083O8m74K90
2972F89Q82k91j074K5N15J2n17L2L31k94o07j4J38J05l27n3R4M29k70k78n48l01
$$ plain form
2994 -1322 -747 -1399 -1483 -1030 -188 78 -168 584 1112 62 -159 619 499 -281 -345 698 906 793 713 835
3014 835 884 718 491 394 326 27 328 -310 -674 -633 -1034 -858 -967 -887 -398 -647 -526 241 344 -390 -894 -833
3036 -833 -475 -828 -926 6 835 800 462 1585 1329 847 746 503 399 556 476 631 768 381 203 -266 -613
3057 -613 -40 -164 -654 -400 135 89 -601 -598 -563 -1335 -2026 -1234 -364 -109 -153 183 756 690 345 44 13 364
3079 364 138 170 386 1231 1186 376 576 585 645 -101 86 994 643 227 -61 -45 -119 -1222 -1832 -1482 -667 -683
3101 -683 -434 -41 529 27 -176 -842 -513 -554 -661 -408 59 441 924 786 455 872 391 639 751 1093
3121 1093 1009 789 812 345 331 -510 -627 -203 -369 -346 -107 435 235 -251 -869 -1293 -1220 -1436 -1231 -1037 -194
3142 -194 388 149 137 443 335 74 -17 114 350 506 320 741 753 420 -94 237 586 301 337 413 956 560
$$ packed form
2994a322N75o52q4M53Q42K66k46P52N28j050k21P78j20p80o4J043K08j13q0J22
3014H35M9j66k27r7o8k99L01o38l64M1m01J76j09Q0M89k49J21P67J03p34n04O1
3036h33L58l53r8R32Q29l5l38J123k56m82j01k43j04J57q0J55J37l87j78m69l47
3057f13N73j24m90K54N35m6o90LL5p72o91P92Q70K55m4L36N73o6l45l01l1L51
3079C64k26L2K16Q45m5q10K00RO0p46J87R08l51m16k88J6p4j103o10L50Q15j6
3101f83K49L93N70n02k03o66L29m1j07K53M67L82M83j38l31M17m81K48J12L42
3121A093q4k20K3m67j4q41j17M24j66K3K39N42k00m86o18m24P3k16K05J94Q43
3142a94N82k39j2L06j08k61r1J31K36J56j86M21J2l33n14L31L49k85L6P6N43l96
$$ plain form
3164 560 132 -333 -407 -900 -1159 -1164 -827 -470 -535 -435 -223 27 -134 -977 -708 -331 -786 -625 -308 522 656
3185 656 503 69 662 745 279 839 902 991 623 509 453 662 -441 -357 -235 -182 -183 -214 289 360 68 -658 -933
3208 -933 -668 -1074 -1377 -1138 -513 -25 -429 -56 226 532 67 -488 439 560 267 422 527 669 798 294
3228 294 122 500 345 357 368 929 855 389 84 -217 -665 -866 -1126 -1181 -716 -713 -427 -80 382 -295 -609 -935
3250 -935 -424 -295 -756 -347 89 589 245 300 543 564 669 361 348 998 932 627 534 516 584 -78 -625 -371
3272 -371 -70 173 -628 -132 559 23 -979 -765 -805 -1026 -1293 -1032 -491 -348 -468 -138 178 323 196 31
3292 31 208 412 735 583 705 704 348 83 209 747 712 232 634 738 587 516 -276 -103 -373 -961 -1266 -599
3314 -599 -370 -551 -647 -20 9 -603 -661 -647 -597 -483 -245 -39 164 159 128 56 249 463 696 482 554 1417 598
$$ packed form
3164E60m28m65p4m93k59nL37L57o5J00K12K50j61q43K69L77m55J61L17Q30J34
3185F56j53m34N93Q3m66N60O3Q9l68j14n6K09j103Q4J22N3jl1N03P1k92p26k75
3208i33K65m06l03K39O25M88m04L73K82L06m65n55R27J21k93J55J05J42J29n04
3228B94j72L78j55J2J1N61p4m66l05l01m48k01k60n5M65LK86L47M62o77l14l26
3250i35N11J29m61M09M36N00l44N5K43K1J05l08j3O50o6l05r3j8O8o62n47K54
3272c71L01K43q01M96O91n36j002K14m0k21k67K61N41J43j20L30L16J45j27j65
3292C1J77K04L23j52J22jl56k65J26N38l5m80M02J04j51p1p92J73k70n88l05O67
3314e99K29j81r6O27K9o12n8J4N0J14K38K06K03nl1p2J93K14K33k14P2Q63q19
$$ plain form
3337 598 517 674 387 50 -618 -302 258 -142 -187 152 662 -159 -559 -662 -538 -835 -1002 -1029 -557 -453 -509
3358 -509 -120 -277 -143 -36 -300 209 413 563 867 468 789 729 351 -145 686 795 587 171 761 911
3378 911 636 186 -39 -199 -666 -793 -986 -412 -641 -417 -398 29 -419 -513 -574 -691 -344 -377 -222 -104 544
3399 544 317 -31 -366 249 793 291 45 826 1299 413 659 655 354 -80 -289 -155 233 -127 -234 231 424
3420 424 -212 -658 -736 -826 -706 -498 -919 -526 -21 -268 -355 -530 -159 18 -618 101 848 667 240 495 854
3441 854 652 130 -142 538 710 204 319 902 746 304 416 213 -530 -819 -1111 -338 -266 -314 -323 -984 -493
3462 -493 -479 -500 -899 -390 43 -356 -373 230 737 360 -504 -312 414 360 316 753 1011 578 773 796 503 156
3484 156 100 -189 16 -118 230 93 84 64 -461 -455 -734 -585 -22 -357 -538 -585 -127 -276 -390 -289 -149 -634
$$ packed form
3337E98q1J57k87l37o68L16N60m00m5L39N10q21m00j03J24k97j67k7M72J04n6
3358e09L89j57J34J07k64N09K04J50L04l99L21o0l78m96Q31J09k08m16N90J50
3378I11k75m50k25j60m67j27j93N74k29K24J9M27m48r4o1j17L47l3J55J18O48
3399E44k27l48l35O15N44n02k46P81M73q86K46ml01m34k09J34L88l60j07M65J93
3420D24o36m46p8r0J20K08m21L93N05k47q7j75L71J77o36P19P47j81m27K55L59
3441H54k02n22k72O80J72n06J15N83j56m42J12k03p43k89k92P73P2m8ro61M91
3462d93J4k1l99N09M33l99j7O03N07l77q64J92P26n4m4M37K58m33J95K3k93l47
3484A56n6k89K05j34L48j37rk0n25Ok79J49N63l35j81m7M58j49j14J01J40m85
$$ plain form
3506 -634 -374 288 763 450 344 459 347 228 198 516 634 369 445 588 576 755 102 -299 -405 -232 -439
3527 -439 -602 -178 182 -558 -956 -488 -102 -826 -870 -678 -142 -337 -308 -49 396 40 -309 -34 101 546 362
3548 362 544 680 775 693 726 557 643 297 118 7 5 201 -105 -247 -18 111 -542 -1120 -554 -381 -533 -637
3570 -637 -435 -300 -514 -799 -284 159 -195 -516 71 716 642 473 413 479 445 358 188 239 567 735 42 356
3592 356 819 549 -551 -270 262 -122 -509 -291 242 135 -778 -790 -555 -150 -622 -963 -436 -525 -323 -355 210
3613 210 109 36 -350 -51 454 441 611 72 561 857 425 101 259 628 383 -111 -75 608 201 -290 -94
3634 -94 -75 -318 -774 -446 -320 -286 -483 -404 -164 -69 -413 -552 -160 -607 -318 -49 12 328 661 145 441 289
3656 289 806 398 186 500 774 244 259 699 587 230 6 10 50 -344 -242 -115 -28 -437 -504 -314 -204 -517
$$ packed form
3506f34K60O62M75l13j06J15j12j19l0L18J18k65P6J43j2J79o53m01j06J73k07
3527d39j63M24L60p40l98M68L86p24m4J92N36j95K9K59M45l56l49K75J35M45j84
3548C62J82J36R5q2L3j69Q6l46j79j11kJ96l06j42K29J29o53n78N66J73j52j04
3570f37K02J35k14k85N15M43l54l21N87O45p4j69o0O6l4q7j70N1L28J68o93L14
3592C56M63k70j100K81N32l84l87K18N33j07r13j2K35M05m72l41N27q9K02l2N65
3613B10j01p3l86K99N05j3J70n39M89K96m32l24J58L69k45m94L6O83m07m91J96
3634i4J9k43m56L28J26L4j97P9K40R5l44j39L92m47K89K69O1L16L33n16K96j52
3656B89N17m08k12L14K74n30J5M40j12l57k24MM0l94J02J27Q7m09o7J90J10l13
$$ plain form
3678 -517 -541 -570 38 -133 -180 -236 -87 -145 -79 -150 310 373 515 246 458 454 424 395 375 656 603 -208 196 454 430
3703 430 167 -399 14 -16 -198 -684 -270 -532 -317 -382 -582 -148 -142 -540 -717 -239 -205 -128 -118 178 585 169
3725 169 -5 128 547 597 366 82 639 638 294 308 124 411 74 -268 259 17 -142 -135 -40 42 -21 -661 -768
3748 -768 -66 -907 -882 -491 -140 -50 -222 -212 -134 -54 41 -80 170 451 798 92 314 735 210 224 448 642
3770 642 197 372 329 351 683 -17 -50 -172 -306 -550 -815 -451 -54 -521 -843 -427 -498 -142 -506 -262 -60
3791 -60 -464 -219 -43 120 239 -269 -48 197 496 287 387 650 532 663 578 411 572 206 -119 -195 276
3812 276 158 -387 -179 -327 -91 -477 -442 -289 -460 -478 -627 -302 -107 23 -411 -728 74 -96 -35 -56 478
3833 478 446 212 341 597 720 449 297 261 306 103 255 332 550 236 -4 -28 -398 -175 -482 -381 -328 -357
$$ packed form
3678e17k4k9O08j71m7n6J49n8O6p1M60O3J42k69K12ml0k9k0K81n3q11M04K58k4
3703D30k63n66M13l0j82m86M14k62K15o5k00M34Ol98j77M78L4P7J0K96M07m16
3725A69j74J33M19N0k31k84N57jl44J4j84K87l37l42N27k42j59PR5Q2o3o40j07
3748g68P02q41K5L91L51R0j72J0P8Q0R5j21K50K81L47p06K22M21n25J4K24J94
3770F42m45J75m3K2L32p00l3j22j34k44k65L64L97m67l22M16p1L56l64K44K02
3791f0m04K45J76J63J19n08K21K45K99k09J00K63j18J31q5j67J61l66l25p6M71
3812B76j18n45K08j48K36l86L5J53j71j8j49L25J95J30m34l17Q02j70O1k1N34
3833D78l2k34J29K56J23k71j52l6M5k03J52P7K18l14k40k4l70K23l07J01N3k9
$$ plain form
3855 -357 -587 -516 -526 -227 -383 -417 -336 -196 -231 -250 -162 81 162 -238 347 558 273 425 369 646 924 593 757
3878 757 502 210 194 25 35 151 -60 28 -172 -52 -293 -600 -351 -629 -68 -544 -649 -251 -239 -605 -441
3899 -441 -165 30 -4 -233 440 262 69 84 344 823 417 -105 80 669 170 -30 398 210 256 75 127
3920 127 79 177 -245 -457 -562 -14 -156 -575 -507 -250 -215 -267 -474 -225 -11 -127 -615 218 303 -86 -247 307
3942 307 159 122 516 766 390 533 719 608 196 405 465 142 -162 96 106 -331 -54 2 -203 -564 -264
3963 -264 86 -243 -565 -276 -402 -267 -485 -594 -151 -188 -275 -47 157 479 170 478 209 143 194 373 513
3984 513 478 393 258 359 275 182 121 -10 -257 239 25 -357 -410 -382 -594 -822 -34 -716 -157 -500 -114 -138 -262
4007 -262 -394 -427 316 -204 -387 -184 66 341 -198 227 821 697 652 362 691 532 566 53 88 -50 -88 -269
$$ packed form
3855c57k30P1j0K99j56l4Q1J40l5j9Q8K43Q1m00N85K11k85J52n6K77K78l31J64
3878G57k55k92j6j69J0J16k11Q8k00J20k41l07K49k78N61m76j05L98J2l66J64
3899d41K76J95l4k29O73j78j93J5K60M79m06n22J85N89m99k00M28j88M6j81N2
3920A27m8R8m22k12j05N48j42m19O8K57L5n2k07K49K14j16m88Q33Q5l89j61N54
3942C07j48l7L94K50l76J43J86j11m12K09O0l23l04K58J0m37K77N6k05l61L00
3963b64L50l29l22K89j26J35k18j09M43l7q7K28K04L22l09L08k69o6N1J79J40
3984E13l5q5j35J01q4r3o1j31k47M96k14l82n3K8k12k28P88o82N59l43L86k4j24
4007b62j32l3P43n20j83K03K50K75n39M25N94j24m5k90L29j59L4n13L5j38l8j81
$$ plain form
4029 -269 -548 -43 -112 -79 -580 -26 -23 -510 -539 -362 -18 -466 -431 -505 -54 -205 -338 18 201 245 762 445 744
4052 744 145 174 -4 220 261 641 415 297 603 327 83 87 303 -90 -220 -504 -26 -255 -904 -654 -540
4073 -540 -552 -467 -213 -79 249 -1 -306 -178 -10 127 -135 -68 42 55 293 300 758 592 470 558 724 396
4095 396 -20 253 312 -90 -210 -76 -97 121 -169 -191 -107 54 43 -559 -478 -458 -489 -389 -596 -458 -184 -185 257
4118 257 -190 183 452 294 0 463 885 -18 41 215 242 225 -180 374 396 57 450 227 535 -104 -292
4139 -292 -270 -584 -390 -564 -332 -727 -340 -264 -200 -144 -144 18 -605 -164 -92 -109 -46 -38 101 157 253 410 693 583
4163 583 341 42 820 397 85 -108 369 -119 -144 -218 93 -427 -230 -372 -422 27 -186 -440 -432 -314 -664 -464
4185 -464 -467 -158 -146 -206 -237 476 208 29 173 358 503 394 -102 336 476 420 141 -88 676 752 223 238 511
$$ packed form
4029b69k79N05o9L3n01N54Lm87k9J77L44m48L5p4M51j51j33L56J83M4N17l17K99
4052G44n99K9j78K24M1L80k26j18L06k76k44MK16l93j30k84M78k29o49K50J14
4073e40j2Q5K54J34L28k50l05J28J68J37k62O7J10J3K38PM58j66j22Q8J66l28
4095C96m16K73N9m02j20J34k1K18k90k2Q4J61j1o02Q1K0l1J00k07J38K74jM42
4118B57m47L73K69j58k94M63M22r03N9J74K7j7m05N54K2l39L93k23L08o39j88
4139b92K2l14J94j74K32l95L87P6O4N6%J62o23M41P2j7O3QJ39N6R6J57K83j10
4163E83k42k99P78m23l12j93M77m88k5p4L11n20J97j42n0M49k13k54QJ18l50K00
4185d64lL09J2o0l1P13k68j79J44J85J45j09m96M38J40n6k79k29P64P6n29J5K73
$$ plain form
4208 511 45 -273 -461 -197 -209 -315 -523 -750 -261 -376 -393 -229 -47 200 -275 -555 -15 -61 -232 -195 -32
4229 -32 314 252 293 606 636 290 275 682 626 440 295 241 -91 -398 -372 -50 122 225 -275 -297 -147 -172 -27
4252 -27 -868 -489 -362 -395 -577 -312 -194 -270 -478 -203 418 93 243 484 520 381 311 522 608 332 211 133
4274 133 45 -20 206 377 114 633 254 -148 -205 -257 -299 -297 -561 -685 -381 -102 -258 -305 24 -479 -456 -200 18
4297 18 -146 -159 -124 229 -50 53 20 524 446 368 438 480 484 164 320 61 -48 64 -124 -212 260 -184 -463 -210
4321 -210 -191 -163 -135 -619 -76 -436 -592 -281 -326 50 -363 -263 -243 415 173 357 372 486 333 153 -122 436
4343 436 327 -97 -241 119 503 426 250 364 138 -2 -142 -118 -46 -173 -648 -290 -501 -339 -513 -331 -426
4364 -426 27 16 -262 175 -56 105 -228 -72 -192 -22 -308 149 324 410 291 408 697 634 330 140 353
$$ packed form
4208E11m66l18j88K64j2j06k08k27M89j15j7J64J82K47m75k80N40m6j71L7J63
4229c2L46o2M1L13L0l46j5M07n6j86j45n4l32l07K6L22J72J03n00k2J50k5J45
4252b7q41L79J27l3j82K65J18p6k08K75O21l25J50K41L6j39p0K11Q6k76j21p8
4274A33q8o5K26J71k63N19l79m02n7n2m2Kk64j24L04K79j56m7L29n03K3K56K18
4297A8j64j3L5L53k79J03l3N04p8p8P0M2Ml20J56k59j09J12j88q8M72m44k79K53
4321b10J9K8K8m84N43l60j56L11m5L76m13J00K0O58k42J84J5J14j53j80k75N58
4343D36j09m24j44L60L84p7j76J14k26j40j40K4P2j27m75L58k11J62j74J82r5
4364d26M53j1k78M37k31J61l33J56j20J70k86M57J75Q6j19J17K89o3l04j90K13
$$ plain form
4385 353 135 56 15 21 57 -63 -239 16 -246 -115 -333 -171 -348 -402 -681 -494 -191 -226 -497 -291 -205 20 120
4408 120 -162 533 564 115 104 373 252 78 -17 334 214 317 336 329 155 52 25 -354 -333 -282 -254 -455 -618
4431 -618 -587 -405 -544 -567 -220 -135 -31 -314 160 335 -222 -277 16 153 -123 -21 114 354 153 398 727
4452 727 534 519 -15 214 330 -48 -393 -224 -172 -31 -125 -290 -218 -270 -293 -706 -314 -156 -219 -296 -434 -160 -455
4475 -455 -435 -414 88 18 -78 166 592 539 309 248 177 167 25 -61 192 331 212 303 199 27 477 23 3 132
4499 132 -67 -133 -490 -111 35 -794 -470 -208 -455 -411 -475 -105 -8 -83 266 70 -103 15 -400 -148 390 448
4521 448 305 440 639 634 519 112 -85 336 281 -150 25 33 -194 -620 -11 164 -283 -366 -694 -156 -286 -128
4543 -128 -101 -160 -192 -10 -380 -33 156 45 -26 160 534 727 405 144 75 216 -165 135 446 411 224 376
$$ packed form
4385C53k18p9m1OL6j20j76K55k62J31k18J62j77n4k79J87L03l5k71K06Q6K25J00
4408A20k82O95L1m49j1K69j21j74r5L51j20J03J9pj74j03k7l79K1N1K8k01j63
4431f18L1J82j39k3L47Q5J04k83M74J75n57n5K93J37k76J02J35K40k01K45L29
4452G27j93j5n34K29J16l78l45J69N2J41r4j65P2n2k3m13L92J58o3p7j38K74k95
4475d55K0K1N02p0r6K44M26n3k30o1p1j0j42q6K53J39j19R1j04j72M50m54k0J29
4499A32j99o6l57L79J46q29L24K62k47M4o4L70R7p5L49j96j73J18m15K52N38N8
4521D48j43J35J99nj15m07j97M21n5m31J75Qk27m26O09J75m47q3l28N38j30J58
4543a28K7n9l2J82l70L47J89j11p1J86L74J93l22k61o9J41l81L00L11l5j87J52
$$ plain form
4565 376 280 224 86 -219 217 497 -297 -572 351 -149 -403 -521 -190 -358 -236 -251 -32 -53 236 -92 134
4586 134 -37 119 -24 -80 -93 580 659 45 95 327 560 237 248 464 292 23 143 203 257 -154 -295 -368 -262
4609 -262 -247 -216 -312 19 -336 -354 -695 -102 -310 -343 -361 -122 -249 174 61 227 735 736 205 113 505 3 -23
4632 -23 -67 438 344 -120 286 292 117 15 52 91 -39 -382 -225 -314 -245 -577 -486 -329 -472 -257 -339 -343 136 386
4656 386 107 -240 -169 50 -237 -132 118 351 351 384 622 849 406 258 669 225 -125 -208 -161 -171 97 -209
4678 -209 -90 -62 -269 -303 -363 -242 31 -250 -213 -202 -276 -448 -338 -229 83 114 219 169 526 186 44 106 177
4701 177 387 286 147 66 339 186 182 105 383 -150 41 -67 -92 -45 -106 -190 -226 -122 -101 -935 -394 -242 -168 -180
4725 -180 -19 313 -60 -52 -56 0 -107 -321 73 374 340 92 149 364 436 -19 295 554 28 18 -130 -105 335
$$ packed form
4565C76r6n6j38l05M36K80p94k75R23n00k54j18L31j68J22j5K19k1K89l28K26
4586A34j71J56j43n6j3O73P9o14N0K32K33l23J1K16j72k69J20O0N4m11j41p3J06
4609b62J5L1r6L31l55j8l41N93k08l3j8K39j27M23j13J66N08Jn31r2L92n02k6
4632b3m4N05r4m64M06Oj75j02L7L9j30l43J57q9O9l32R1J57j43K15q2mM79K50
4656C86k79l47P1K19k87J05K50K33%L3K38K27m43j48M11m44l50q3M7j0K68l06
4678b09J19K8k07l4o0J21K73k81L7J1p4j72J10J09L12L1J05n0L57l40j42O2P1
4701A77K10j01j39q1K73j53mp7K78n33J91j08k5M7o1q4l6J04K1q34N41J52P4j2
4725a80J61L32l73QmN6j07k14L94L01l4k48N7K15P2m55L14K59n26j0j48K5M40
$$ plain form
4748 335 217 -114 -271 -68 178 -101 -474 -305 -19 -61 -590 -277 -298 -196 -583 -80 114 115 60 483 220 73
4770 73 192 -70 118 69 288 304 437 460 -129 198 354 281 -75 -413 -95 -9 364 -181 -93 106 -475 -295
4792 -295 -421 -341 -92 -406 -218 -195 142 -39 -304 -39 -24 -370 -91 222 369 363 302 351 293 252 80 52 296
4815 296 396 382 303 -182 -75 -82 -80 -336 -5 -82 -451 -282 102 -2 -334 -466 -90 -29 -370 -600 -155 -111 -203
4838 -203 76 221 279 -157 268 140 216 237 129 355 144 183 -117 269 107 -31 -7 39 -153 366 37 -171
4860 -171 -128 -391 -430 -623 -453 -385 -197 -433 -137 -145 83 -76 -35 -294 31 83 -127 256 151 -56 312 293 345
4883 345 264 260 477 317 270 8 157 477 459 146 -306 190 -228 -375 -301 -153 199 -256 -450 -284 -609 -645
4905 -645 -434 -163 -223 -51 162 98 246 74 6 -207 53 366 583 264 -33 504 224 237 225 451 341 129
$$ packed form
4748C35j18l31j57K03K46k79l73J69K86m2n29L13k1J02l87N03J94Jn5M23k63j47
4770G3J19k62J88m9K19J6J33K3n89L27J56p3l56l38L18Q6L73n45Q8J99n81J80
4792b95j26Q0K49l14J88K3L37j81k65K65J5l46K79L13J47oo1M9n8m1j72k8K44
4815B96J00j4p9m85J07pKk56L31p7l69J69L84j04l32j32L76O1l41k30M45M4r2
4838b03K79J45N8m36M25j28P6K1j08K26k11L9l00L86j62j38K4M6j92N19l29k08
4860a71M3k63l9j93J70O8J88k36K96qK28j59M1k59L25N2k10L83j05k07L68j9N2
4883C45q1mK17j60m7k62J49L20j8l13m52M96m18j47P4J48L52m55j94J66l25l6
4905f45K11K71o0J72K13o4J48j72o8k13K60L13K17l19k97N37k80J3j2K26j10k12
$$ plain form
4927 129 254 113 235 152 -123 -321 -82 -288 -331 -342 -251 -41 149 -303 -155 -219 -171 -230 -118 -12 -24 235 297
4950 297 307 289 -194 39 601 499 234 703 256 128 205 -88 128 7 -111 -12 -151 192 -79 -78 42 -233
4972 -233 -92 -371 -302 -127 -251 -304 -479 -34 57 -138 -119 215 319 -166 181 112 319 330 333 225 353 221 -8
4995 -8 56 384 -407 33 423 83 101 -251 -58 32 -279 -339 -269 -295 -160 -103 -405 -396 10 -277 -424 -88 -20 116
5019 116 -40 19 577 412 178 85 229 130 512 435 420 115 172 139 91 88 146 -91 -251 -341 36 -237 -290 261
5043 261 -382 -259 -388 -343 -124 -325 -626 -411 -192 -302 -109 279 76 -111 189 344 336 125 132 433 286 375
5065 375 224 463 308 -68 81 -56 -186 330 260 -318 -492 -10 -316 -509 -360 98 -181 -237 -55 -419 -43
5086 -43 -414 8 -72 -348 217 134 120 86 238 -105 133 545 144 256 374 262 253 163 386 77 59 -40 -184
$$ packed form
4927A29J25j41J22q3k75j98K39k06m3j1R1K10J90m52J48o4M8n9J12J06j2K59O2
4950B97J0j8m83K33N62j02k65M69m47j28P7k93K16j21j18R9j39L43k71JJ20k75
4972b33J41k79O9J75j24n3j75M45R1j95J9L34J04m85L47o9K07J1Lj08J28j32k29
4995hO4L28p91M40L90l40J8l52J93R0l11o0P0k6J35N7l02RM06k87j47L36O8J36
5019A16j56N9N58j65k34r3J44r9L82p7j5l05N7l3m8lN8k37j60r0L77k73n3N51
5043B61o43J23j29M5K19k01l01K15K19j10J93L88k03j87L00J55qk11PL01j47Q9
5065C75j51K39j55l76J49j37j30N16p0n78j74M82l06j93J49M58k79n6J82l64L76
5086d3l71M22q0k76N65q3j4l4J52l43K38M12m01J12J18j12rr0K23l09j8r9j44
$$ plain form
5109 -184 -106 171 -186 10 75 -491 125 -570 -372 -137 -136 -300 0 56 -336 -137 71 -24 125 191 8 493
5131 493 251 248 153 257 345 514 187 223 285 120 -84 78 71 30 -203 -39 -73 32 -358 -319 67 -32 -169 -56
5155 -56 -328 -50 -142 -88 -290 23 -141 -461 6 155 29 -127 -57 180 395 156 76 139 59 157 78 240 126
5178 126 0 263 96 323 114 -39 -190 -320 -403 -340 -501 -186 15 -444 -118 -194 11 136 -342 -290 39
5199 39 136 13 -14 135 291 -108 -133 179 172 414 367 174 99 12 197 402 12 137 45 -130 -151 11 -308 -319
5223 -319 179 -93 -205 -430 -277 -304 -306 -371 -49 -49 -230 286 187 303 -91 226 419 62 123 344 200 666 201
5246 201 261 278 -119 118 -21 13 28 462 267 -185 -39 141 -435 -112 -192 -140 144 -6 45 -76 -21 -223 -84
5269 -84 75 246 35 -39 89 119 518 128 601 39 338 203 473 219 409 347 59 189 159 -170 -101 112
$$ packed form
5109a84P8K77l57J96O5n66O16o95J98K35Jj64L00N6l92J99K08r5J49O6j83M85
5131D93k42lr5J04Q8J69l27L6O2j65k04J62pm1k33J64l4J05l90L9L86r9j37J13
5155e6k72K78r2N4k02L13j64l20M67J49j26j56P0K37K15k39q0O3q0R8p9J62j14
5178A26j26K63j67K27k09j53j51j30q3O3j61L15K01m59L26p6K05J25m78N2L29
5199C9R7j23k7J49J56l99k5L12pK42m7j93p5q7J85K05l90J25r2j75k1J62l19j1
5223c19M98k72j12k25J53k7ko5L22%j81N16r9J16l94L17J93l57O1K21j44M66m65
5246B01O0J7l97K37j39L4J5M34j95m52J46J80n76L23q0N2K84j50N1j21N5k02J39
5269h4J59J71k11p4J28L0L99l90M73n62K99j35K70k54J90o2k88J30l0l29O9K13
$$ plain form
5291 112 -279 -193 -568 86 -126 -69 -171 -50 -187 -355 -136 -306 -70 -95 -81 102 263 15 85 -52 382 86
5313 86 224 313 48 420 264 107 75 197 109 -201 -68 115 11 -75 146 16 -38 -348 -221 -103 -197 -266 -569
5336 -569 29 -136 290 -19 -8 147 47 151 -43 243 276 73 -105 -15 296 90 230 158 609 183 -6
5357 -6 -21 395 -251 -459 -121 -161 -2 -127 -250 -222 -46 199 97 -165 -478 -393 -172 -218 -82 -235 -57 -123 41
5380 41 214 81 106 257 319 91 112 223 591 182 282 -132 70 -278 -150 -121 19 -151 35 -53 -365 -147
5402 -147 174 -196 -199 -221 -297 -304 -419 -83 -180 -71 -278 78 -199 -5 -215 187 76 -55 161 335 404 74 417
5425 417 302 425 331 295 551 60 222 -6 -258 210 -410 -4 -239 72 -130 -235 -232 -373 53 -1 0 -86 -75
5448 -75 -46 -135 124 -159 -59 377 -50 302 -22 222 47 269 182 181 -159 -89 58 162 52 -163 237 -123
$$ packed form
5291A12l91Q6l75O54k12N7j02J21j37j68K19j70K36k5J4J83J61k48P0j37M34k96
5313H6J38Q9k65L72j56j57l2J22q8l10J33J83j04q6K21j30n4l10J27J18r4o9l03
5336e69N98j65M26l09J1J55j00J04j94K86L3k03j78R0L11k06J40p2M51m26j89
5357fj5M16o46k08L38m0J59j25j23K8J76K45j02k62l13Q5K21m6J36j53J78o6J64
5380D1J73j33K5J51O2k28K1J11L68m09J00m14K02l48J28K9J40j70J86q8l12K18
5402a47L21l70lk2p6pj15L36r7J09k07L56k77J94k10M02j11j31K16J74O9l30L43
5425D17j15J23r4l6K56m91J62k28k52M68o20M06k35L11k02j05Lj41M26n4Jq6J1
5448g5K9q9K59k83J00M36m27L52l24K44j75K22q7jl40P0J47J04j10k15M00l60
$$ plain form
5470 -123 -115 -156 283 21 -195 -280 -183 -180 18 14 -167 -150 -89 51 160 245 -224 -69 52 -177 345 206 208 414 457
5495 457 127 184 9 492 53 249 60 382 68 -235 120 67 -199 -182 -210 -46 -119 135 -336 -482 -275 -154
5517 -154 36 -91 -172 -145 -389 77 456 66 159 254 91 -1 139 -13 276 402 -116 83 -58 149 53 185
5539 185 12 326 135 -145 330 -338 21 -265 -424 -415 -44 -175 89 -170 -142 -108 103 -16 24 -217 65 -2
5561 -2 -66 24 -101 405 119 135 297 218 68 213 127 554 174 -345 240 -185 -90 -41 6 -310 -251 -225 -38 -212
5585 -212 -275 194 -135 -214 -365 -105 -151 -376 -51 156 -167 -71 165 220 219 104 -65 356 85 -167 177 11
5607 11 -166 183 101 119 75 -82 253 -75 -11 -276 -179 -152 158 -43 -70 -13 -139 -72 6 113 113 2 129 61 77
5632 77 165 32 -60 172 53 32 150 74 349 241 318 97 244 -128 128 144 -161 188 71 -159 -320 -87
$$ packed form
5470a23Qm1M39k62k16q5R7LJ98mj81J7O1J40J09Q5m69J55J21k29N22j39KK06M3
5495D57l30N7j75M83m39J96j89L22l14l03L55n3k66J7k8J64p3K54m71j46K07J21
5517a54J90j27q1K7k44M66L79l90R3R5j63r2J40j52K89J26n18J99j41K07r6J32
5539A85j73L14j91k80M75o68L59k86j59RL71j31K64k59K8L4K11j19M0k41K82o7
5561bo4R0j25N06k86J6J62p9j50J45q6M27l80n19N85m25R5M9M7l16N9K6J87j74
5585b12o3M69l29p9j51K60m6k25L25K07l23R6K36N5jj15j69M21k71k52L44j66
5607A1j77L49q2J8m4j57L35l28O4k65R7K7L10k01k7N7j26O7P8J07%j11J27o8J6
5632G7Q8j33r2K32j19k1J18p6K75j08P7k21J47l72K56J6l05L49j17k30j61K33
$$ plain form
5654 -87 -193 -210 -61 -61 31 1 -332 158 -42 -153 -265 -246 78 -5 375 40 121 235 305 326 92 88 322 129
5678 129 232 410 38 -52 -178 71 148 -93 -148 -168 -232 -412 216 -161 -388 -286 181 -192 -95 -257 -244 179
5700 179 -22 29 326 -291 -91 267 -43 209 175 212 403 248 223 160 151 -54 108 52 -165 -408 132 -128 -234
5723 -234 -143 -9 -197 -2 -81 -283 236 -97 -405 -339 -128 -5 7 -197 -111 71 5 22 358 181 167 -24 185
5746 185 400 -17 155 -1 18 229 80 -365 270 290 348 18 -21 66 -282 -406 -301 -379 -172 -271 -167 -188 -239
5769 -239 198 -107 -156 3 -374 -185 29 42 150 89 -65 233 138 210 18 363 354 238 175 337 129 -373 450
5792 450 64 281 -136 -247 -191 -77 -97 2 -316 -171 -241 -83 -234 -257 -37 -75 -146 145 180 -129 13 163 448
5815 448 614 64 232 297 156 185 100 145 -160 -99 -6 335 317 -43 221 11 236 -108 -210 -186 17 77 -360
$$ packed form
5654h7j06j7J49%R2l0l33M90k00j11j12J9L24q3L80l35Q1J14P0K1k34mK34j93
5678A29J03J78l72r0j26K49P7k41n5k0o4j80O28l77k27J02M67l73R7j62J3M23
5700A79k01N1K97o17K00L58l10K52l4L7J91j55k5o3rk05J62n6k17k43N40k60j06
5723b34R1J34j88J95p9k02N19l33l08O6K11J23J2k04Q6J82o6J7L36j77j4j91K09
5746A85K15m17J72j56J9K11j49m45O35K0N8l30l9Q7l48j24J05p8K07r9J04k1n1
5769b39M37l05m9J59l77J89K14J3J08o1j54K98r5P2j92L45rj16o3J62k08n02Q23
5792D50l86K17m17j11N6J14k0R9l18J45p0J58j51k3K20l8p1K91L5l09J42J50K85
5815D48J66n50J68O5j41K9q5M5l05O1R3L41j8l60K64k10K25l44j02K4K03O0m37
$$ plain form
5838 -360 -145 -61 -209 -308 119 358 107 -151 -281 32 -113 117 112 55 63 117 298 251 390 95 349 -45 415
5861 415 111 -11 39 -167 8 -190 17 59 -178 -166 -171 -126 307 -61 -53 -99 -207 -30 -202 -156 0 -165 119
5884 119 137 19 78 79 164 115 371 80 190 199 320 25 7 102 -22 436 8 50 -104 149 -322 23 1 -215
5908 -215 -173 -316 -401 -106 -222 -239 -245 -106 -193 -269 -103 -27 -48 -130 -74 275 -275 281 302 -157 130 45 416 183
5932 183 32 9 40 -143 -142 -144 -325 -75 -139 -272 -131 -214 -105 257 -161 130 -98 -191 -173 39 9 -157 178 6
5956 6 -11 396 139 259 6 123 133 78 73 171 264 160 -210 257 -77 139 47 -59 3 -160 -279 -58 21 -152
5980 -152 -452 -452 -111 -133 -113 -480 84 -42 -212 94 211 -46 -46 75 397 149 159 -10 -87 188 49 159 176
6003 176 80 261 152 215 -223 -247 27 -151 -88 177 -105 4 -8 -22 -156 99 -30 -175 -109 -248 15 38 -92
$$ packed form
5838c60K15Q4j48r9M27K39k51k58j30L13j45K30nn7QN4J81m7J39k95K54l94M60
5861D15l04j22N0k06J75j98K07M2k37J2nM5M33l68Qm6j08J77j72M6J56j65K84
5884A19J8j18N9JQ5m9K56k91J10RJ21k95j8R5j24M58m28M2j54K53m71L45k2k16
5908b15M2j43q5K95j16j7oJ39q7p6J66P6k1q2N6L49n50N56K1m59K87q5L71k33
5932A83j51k3L1j83Jkj81K50o4j33J41q3J09L62m18K91k28r3J8K12l0j66L35j72
5956Fj7M07k57J20k53J17J0n5nR8R3j04l70M67l34K16r2j06O2j63j19K21P9j73
5980a52l00%L41k2K0l67N64j26j70L06J17k57%J21L22k48J0j69p7K75j39J10J7
6003A76r6J81j09O3m38k4K74j78O3K65k82J09j2j4j34K55j29j45O6j39K63K3j30
$$ plain form
6026 -92 -10 -50 -72 -63 -27 9 250 56 368 250 -223 473 240 10 267 82 21 -184 36 -12 86 180 -97 52
6050 52 -152 -349 -74 29 -154 -83 36 -127 -105 -339 20 -167 61 122 -33 -252 127 480 321 -164 11
6071 11 39 221 -163 63 221 39 269 84 -116 185 -163 -28 226 -200 107 -7 -104 -500 -300 -142 169
6092 169 -204 -284 -338 58 -219 121 156 -139 115 -86 258 -27 135 49 108 -31 87 97 -247 -132 -140 255 121
6115 121 -84 37 301 -46 104 -136 -142 -131 -228 -141 -135 -316 67 -353 -353 -76 -206 305 -140 -46 -43 -101 354 181
6139 181 85 -241 -87 -14 141 157 -33 197 84 204 302 -134 -105 89 -447 80 361 -364 -249 -174 -74 -272
6161 -272 -146 111 -93 100 -115 -213 -213 353 54 -211 58 186 257 114 172 -46 71 227 72 291 235 31
6183 31 13 41 27 0 264 -89 -19 75 -373 -6 -67 -101 -163 -149 -460 -165 -194 -287 -137 59 -208 278 119 -200
$$ packed form
6026i2Q2m0k2RL6L6K41j94L12j18m73O96k33k30K57j85o1k05K20m8R8R4k77J49
6050E2k04j97K75J03j83P1J19j63K2k34L59j87K28O1j55k19L79L53j59m85J75
6071A1K8J82l84K26J58j82K30j85k00L01l48J35K54m26L07j14r7l96K00J58L11
6092A69l73q0n4L96k77L40L5k95K54k01L44k85J62q6N9j39J18J0l44J15qL95j34
6115A21k05J21K64l47J50k40oJ1r7Q7Oj81L83m20%K77j30N11m45R4Ln8M55j73
6139A81r6l26J54P3J55J6j90K30j13J20R8m36K9J94n36N27K81p25J15P5J00j98
6161b72J26K57k04J93k15r8%N66k99k65K69J28P1j43N8k18J17J56j55K19n6k04
6183C1j8K8j4k7K64l53P0R4m48L67o1l4o2J4l11K95k9r3J50J96k67M86j59l19
$$ plain form
6207 -200 139 5 302 -30 322 475 7 -171 215 399 344 -116 272 362 -86 99 -233 54 -19 7 101 -123
6229 -123 -259 -140 -159 -287 -344 -248 -227 -193 -476 337 -212 -274 52 -182 269 248 147 33 39 -11 75 -125 -240 251
6253 251 117 -226 63 320 340 -79 -99 93 107 170 241 -169 -208 -268 16 92 70 -170 -284 -227 -112 27 -14 -323
6277 -323 198 294 92 -56 211 -141 65 48 337 369 514 296 191 228 404 -84 232 177 -165 -188 -106 -283
6299 -283 -280 108 -14 -57 -198 49 -140 76 33 48 -230 -206 -178 -320 -19 -317 -80 94 -122 14 315 119
6321 119 -159 25 370 214 18 201 195 185 266 121 -154 57 68 -206 -96 -213 -91 -41 -202 -147 -18 154
6343 154 -190 -115 -20 -185 -346 -119 24 23 104 -11 -8 -96 -271 176 100 96 146 136 343 274 84 304 361 201 95
6368 95 13 89 -54 120 -6 -320 -379 200 -98 -397 -40 -337 79 -329 -129 169 3 310 -319 226 -98
$$ packed form
6207b00L39j34K97l32L52J53m68j78L86J84n5m60L88R0m48J85l32K87p3K6R4k24
6229a23j36J19j9j28n7R6K1L4k83Q13n49o2L26k34M51k1j01j14On0Q6k00j15M91
6253B51j34l43K89K57K0m19k0J92J4O3P1m10l9o0K84P6k2k40j14N7J15J39m1l09
6277c23N21R6k02j48K67l52K06j7K89L2J45k18j05L7J76m88L16n5l42k3Q2j77
6299b83LL88j22m3j41K47j89K16m3J5k78K4K8j42L01k98K37J74k16J36L01j96
6321A19k78J84L45j56j96J83oj0Q1j45k75K11J1k74J10j17J22N0j61N5J29J72
6343A54l44P5R5j65j61K27J43jQ1j15Lq8j75M47p6mN0j0K07o9j90K20N7j60j06
6368I5q2P6j43J74j26l14n9N79k98k99L57k97M16m08K00K98j66L07o29N45l24
$$ plain form
6389 -98 -42 202 -46 266 338 280 -57 131 -40 -125 4 34 260 93 -61 17 -127 -71 -322 17 171 -472 -290
6412 -290 4 -115 -78 -167 -231 -127 -38 -197 107 116 26 -93 43 49 -64 395 279 137 77 209 -199 72 95 -73
6436 -73 -104 -89 274 -115 -43 319 28 76 -209 -71 -47 -147 -117 188 -59 -168 -239 -9 108 -69 -313 -50 -50
6459 -50 117 112 -123 -148 331 115 237 284 221 -6 163 142 154 283 233 -24 172 -49 171 41 -221 81 -236
6482 -236 -99 -79 -64 58 17 -381 -379 -63 -221 55 3 -119 15 21 28 -266 157 205 279 38 524 197 142 241 -131
6507 -131 -42 271 151 20 113 311 -23 -221 65 -603 -83 -158 -198 34 131 -72 -154 -42 14 22 -362 -53 33
6530 33 -73 -100 254 -173 -13 -32 -200 -44 -32 382 186 -85 49 240 -25 42 -184 95 104 26 -42 -351 104
6553 104 -183 -200 -90 -44 -91 -39 -195 -392 81 -93 -481 281 -123 -170 114 12 -267 213 269 186 113 132 120
$$ packed form
6389i8N6K44k48L12P2n8l37J88j71q5J29L0K26j67j54P8j44N6k51L39J54o43J82
6412b90K94j19L7q9o4J04Q9j59L04Rr0j19J36Oj13M59j16j42o0J32m08K71K3j68
6436g3l1J5L63l89P2L62k91M8k85J38K4j00L0L05k47j09p1K30J17j77k44K63%
6459e0J67nk35k5M79k16J22M7o3k27J69k1J2J29n0k57J96k21K20j30k62L02l17
6482b36J37K0J5J22m1l98KL16j58K76n2j22J34OPk94M23M8P4k41M86l27n5R9l72
6507a31Q9L13j20j31R3J98l34j98K86o68N20p5m0K32R7k03q2J12N6Ql84L09Q6
6530C3j06k7L54m27J60j9j68J56J2M14j96k71J34J91k65O7k26K79Rp8o8l09M55
6553A04k87j7J10M6m7N2j56j97M73j74l88P62m04m7K84j02k79M80N6q3p3J9j2
$$ plain form
6576 120 107 200 231 -54 99 -35 160 -80 -38 319 145 340 43 -216 4 165 -262 -109 292 -109 -74 -161
6598 -161 -137 -91 -137 16 -77 34 2 326 -168 214 52 -90 -39 76 110 224 -5 -188 133 99 -2 175 -100
6621 -100 -287 146 125 -312 -67 -156 -90 -208 -164 -186 6 15 -150 -256 -38 176 -189 94 171 -71 -76 -43 -26 115
6645 115 107 60 -142 134 17 413 223 201 -316 122 -119 137 -32 44 -426 -86 29 -125 205 -56 -60 129
6667 129 -58 -377 -165 -180 100 222 160 127 145 -169 40 -79 73 177 350 232 -177 -92 -67 442 8 223
6689 223 12 20 -78 -253 399 28 -37 -5 79 -115 150 -47 -223 -188 5 -1 -421 -42 193 -293 -91 -38 -17 -60
6713 -60 96 193 -1 455 199 218 97 276 -60 296 228 82 97 45 93 -218 -151 -375 -257 -415 -318 -62 -186
6736 -186 305 -257 67 -204 -464 111 -51 -403 -415 12 -237 160 -444 -141 34 281 69 103 -16 -28 366
$$ packed form
6576A20j3R3L1k85J53j34J95k40M2L57j74J95k97k59K20J61m27J53M01m01L5q7
6598a61K4M6m6J53r3J11l2L24m94L82j62j42N1J15L4J14k29j83L21l4j01J77k75
6621a00j87M33k1m37K45q9O6j18M4k2J92Rj65j06K18K14l65K83P7k42nL3J7J41
6645A15qm7k02K76j17L96j90k2n17M38k41K56j69P6m70L40J15j54L30k61mJ89
6667A29j87l19K12j5K80J22o2l3J8l14K09j19J52J04J73j18m09Q5K5N09m34K15
6689B23k11Qr8j75O52l71o5L2Q4j94K65j97j76L5J93om20L79K35m86K02N3K1m3
6713f0J56R7j94M56k56J9j21J79l36L56o8j46J5n2M8l11O7k24J18j58R7K56j24
6736a86M91n62L24k71k60N75j62l52j2M27k49L97o04L03J75K47k12L4j19j2L94
$$ plain form
6757 366 -217 40 341 -100 243 206 104 -218 15 -130 -364 76 -260 28 -214 -225 -35 -371 48 -98 -346
6778 -346 -8 -266 -29 -124 -41 -83 186 -173 177 -92 -53 342 76 83 21 298 -146 41 61 37 2 4 170 -271
6802 -271 -79 0 36 -61 -211 -97 -260 -170 25 -108 -341 -222 4 56 -102 -151 66 -183 197 77 113 -51
6824 -51 -149 -85 -42 109 163 17 77 188 248 -247 77 -57 13 207 67 -330 -304 -95 -91 -35 -152 -149 71 -113 206
6849 206 -94 -12 -101 -2 -173 -350 178 15 204 173 209 -197 55 51 231 219 17 71 122 11 359 58 -47
6872 -47 34 74 -370 -34 27 157 37 50 -180 -22 -113 -409 -311 -202 -341 -153 -9 123 -123 37 30 116 181 -21
6896 -21 159 -20 310 433 285 -24 105 -16 99 93 66 131 245 162 -55 -90 -91 -340 -86 22 -194 -486 -29
6919 -29 -143 3 -192 10 9 -161 -205 122 23 -49 170 -35 222 80 -128 299 56 -318 201 197 -6 37 -90
$$ packed form
6757C66n83K57L01m41L43l7j02l22K33j45k34M40l36K88k42j1J90l36M19j46k48
6778c46L38k58K37r5Q3m2K69l59L50k69L9L95k66Po2K77m44J87K0k4l5KJ66m41
6802b71J92P9L6r7j50J14j63R0J95j33k33J19K26N2j58m9K17k49L80j20L6j64
6824e1r8O4M3J51N4j46O0J11O0m95L24j34P0J94j40l97K6K09MN6j17LK20j84L19
6849B06l00Q2q9R9j71j77N28j63J89l1L6m06K52mJ80j2k02N4N1j11L48l01j05
6872d7Q1M0m44L36O1J30j20J3k30J58r1k96R8J09j39J88J44J32k46J60pQ6O5k02
6896b1J80j79L30J23j48l09J29j21J15ok7O5J14q3k17l5jk49K54J08k16k92M57
6919b9j14J46j95K02jj70m4L27r9p2K19k05K57j42k08M27k43l74N19mk03M3j27
$$ plain form
6942 -90 218 156 81 -121 -149 -164 -166 -149 -115 58 -175 -587 -231 -122 -230 -11 -34 51 -226 -50 -113 202 23 141
6966 141 -34 252 18 193 -66 307 92 114 -33 76 105 172 60 98 -94 278 80 -186 -13 200 4
6987 4 -267 -311 -122 75 -112 180 -13 -89 -192 -26 -82 -160 -75 -105 -141 -42 280 221 322 69 -130 191 308 275
7011 275 317 97 55 -149 269 -19 3 25 128 -171 -24 214 -22 -393 -351 269 -215 -195 -309 186 221 -56
7033 -56 160 151 -12 -135 -121 218 -83 201 369 41 108 -12 178 90 -211 147 287 -12 200 216 300 -167 -169
7056 -169 5 42 -194 187 118 -162 -163 299 -355 -353 68 96 -38 -203 156 -194 -75 -281 81 -122 -46 95 342
7079 342 247 115 383 -83 3 66 262 127 -211 -6 -10 -292 41 -146 -8 -88 191 64 144 -87 13 -152
7101 -152 426 -101 -310 -50 200 -154 -61 97 107 -9 -40 359 -10 38 153 331 148 -42 -211 -114 -51 -206
$$ packed form
6942i0L08o2p5k02k8j5kJ7L4J73k33m12L56J09j08K19k3Q5k77J76o3L15j79J18
6966A41j75K86k34J75k59L73k15K2j47J09K9O7j12L8j92L72j98k66J73K13j96
6987Dk71m4J89J97j87K92j93p6j03J66n6p8Q5l0l6R9L22n9J01k53j99L21J17l3
7011B75M2k20m2k04M18k88K2K2J03k99J47K38k36l71M2O20m84K0j14M95L5k77
7033e6K16rj63j23J4L39l01K84J68l28O7j20J90q8l01L58J40k99K12J6Q4m67k
7056a69J74L7k36L81o9k80jM62o54KM21K8j34j65L59l50J19k06L62k03P6J41K47
7079C42r5j32K68m66Q6O3J96j35l38K05mk82L33j87J38q0K79j27Q0k31J00j65
7101a52N78n27k09K60K50l54R3J58J0j16l1L99l69M8J15J78j83j90j69R7O3j55
$$ plain form
7123 -206 44 63 127 -173 -348 -40 178 -182 155 98 -158 125 -104 177 -24 4 -135 -146 26 109 -51 -430
7145 -430 -35 243 -164 -4 117 -117 171 282 20 121 75 105 7 -266 -162 -13 32 -256 -3 234 -67
7166 -67 -102 -8 -63 -8 -136 -300 -14 272 -181 -19 40 48 -117 209 130 184 -84 110 44 -101 112 -87 239 -58
7190 -58 307 57 -44 185 -190 148 -33 -2 356 -71 -133 51 -116 -159 -198 -238 -129 -16 -104 -228 -202 -341 -136
7213 -136 -47 -230 -30 190 106 -121 126 -111 -284 -169 255 273 -173 131 542 4 -15 -53 285 145 -280 -182
7235 -182 -74 -168 47 13 252 95 -16 -58 3 113 -37 35 -130 148 54 2 272 146 238 -105 -27 16 40 194
7259 194 -247 186 -129 36 208 8 -127 -224 -26 268 98 -118 52 -151 -224 -328 -30 -126 -92 -374 33
7280 33 -167 2 -205 -337 -41 2 -231 -178 -115 166 -44 -112 382 -8 -6 74 120 318 -35 68 77 -362 -60 -83
$$ packed form
7123b06K50J9O4l00j75L08K18l60L37n7k56K83k29K81k01K8j39j1J72Q3j60l79
7145d30L95K78m07J60J21k34K88J11k62J01m6L0r8k73J04J49M5k88K53K37l01
7166f7l5R4n5N5j28j64K86K86m53J62N9Qj65L26p9N4k68J94o6j45K13j99L26k97
7190e8L65k50j01K29l75L38j81L1L58m27o2J84j67m3l9m0J09J13q8j24K6j39K05
7213a36Q9j83K00K20q4k27K47k37j73J15M24J8m46L04M11n38j9l8L38j40m25R8
7235a82J08r4K15l4K39j57j11m2O1J10j50P2j65K78r4n2K70j26R2l43P8M3K4J54
7259A94m41M33l15J65J72k00j35r7J98K94j70k16J70k03p3j04K98r6L4k82M07
7280C3k00J69k07j32K96M3k33N3O3K81k10o8M94l90KQ0M6J98l53J03Rm39L02k3
$$ plain form
7304 -83 -204 285 -67 21 26 -92 203 21 -110 49 45 -105 -58 -266 168 168 24 -32 203 -205 -241 -14 -12 284
7328 284 248 -50 221 158 314 233 -78 77 -116 282 -149 171 -144 187 -119 193 -147 -39 -37 105 -30 -54
7350 -54 -79 -357 -63 -148 -184 9 74 -237 -141 -78 33 -158 -143 -84 -92 138 136 110 82 -33 256 42 386 -63 -37
7375 -37 30 220 -100 94 -120 -366 44 -61 -46 163 114 -201 -102 -126 -97 -227 4 -136 116 -206 67 -52
7397 -52 369 277 22 60 130 424 -55 548 232 178 170 257 77 52 -10 -64 -26 -7 75 -124 -401 -34 -40 300 63
7422 63 -55 -200 49 107 -26 -65 67 -76 346 -139 -301 58 -337 297 690 297 151 -18 -158 47 98
7443 98 -44 19 36 -179 -122 -184 -219 5 -3 -142 -21 261 -109 -134 -110 36 -36 -308 -122 -21 -206 -45 -11 -100
7467 -100 -240 -101 53 303 174 -78 -143 -240 -187 -60 29 -9 136 31 122 284 178 93 -254 -222 43 -126 -313
$$ packed form
7304h3j21M89l52Q8Nj18K95j82j31J59mj50M7k08M34%j44n6K35m08l6K27KK96
7328B84l6k98K71o3J56q1l11J55j93L98m31L20l15L31l06L12l40J08KJ42j35k4
7350e4k5k78K94q5l6J93O5l11R6O3J11j91J5N9qK30kk6k8j15K89k14L44m49K6
7375c7O7J90l20J94k14k46M10j05J5K09m9l15R9k4K9j30K31j40K52l22K73j19
7397e2M21r2k55L8P0K94m79O03l16n4qQ7j80k5o2n4L8J9Q2j99k77L67oL40k37
7422F3j18j45K49N8j33l9J32j43M22m85j62L59l95O34L93l93j46j69j40K05N1
7443I8j42O3J7k15N7o2l5K24qj39J21K82l70k5K4J46p2k72J86J01j85J61L4q9
7467a00j40J39J54K50j29k52o5r7N3J27Q9l8J45j05R1J62j06q5l47L2K65j69j87
$$ plain form
7490 -313 -55 174 4 -212 -138 -289 -141 -183 119 -112 -257 -6 12 -118 227 -178 -59 269 85 -287 23
7511 23 -213 155 113 108 100 36 440 -168 -291 235 -166 166 -41 7 -271 117 63 -91 -191 51 -57 -228 -201
7534 -201 52 -160 -23 -64 0 65 -20 -308 144 200 74 113 15 -1 195 10 -154 221 227 -65 -92 238 -113 -268
7558 -268 95 -96 -14 159 -53 -15 -70 -337 235 -46 -210 -141 -323 149 19 123 -39 57 -106 -149 -260 199
7580 199 31 31 226 -131 438 458 4 74 218 -6 115 143 100 177 58 266 78 8 -318 -47 -22 -113 -300
7603 -300 -3 -183 -119 92 -227 -56 -75 -113 32 -132 -104 384 43 160 168 12 -138 56 -65 50 173 313
7625 313 65 84 204 -218 -243 -235 186 123 -197 -88 -327 -161 -233 -379 58 118 -204 -275 94 308 249 226 207 -18
7649 -18 -389 140 29 -2 145 307 231 184 117 194 73 82 112 189 -27 -10 29 -206 78 116 -250 250 21 204
$$ packed form
7490c13K58K29j70k16P4j51J48m2L02k31j45K51J8j30L45m05J19L28j84l72L10
7511B3k36L68m2nqo4M04o08j23N26m01L32k07M8k78L88n4j54j00K42j08j71K7
7534b01K53k12J37m1O4O5q5k88M52N6j26L9r8j6J96j85j64L75Ok92k7L30l51j55
7558b68L63j91Q2J73k12L8n5k67N72k81j64O9j82M72j30J04j62R6j63m3j11M59
7580A99j68%J95l57N69K0m54P0J44k24J21K8m3P7j19K08j88p0l26K71K5r1j87
7603c00K97j80O4K11l19J71j9l8J45j64K8M88l41J17Qj56j50J94j21J15J23J40
7625C13k48J9J20m22k5QM21o3l20J09k39J66p2j46M37O0l22p1L69K14n9k3j9k25
7649a8l71N29j11l1J47J62p6m7o7P7j21RL0P7k16J7L9k35K84L8l66N00k29J83
$$ plain form
7673 204 288 -68 -94 -30 -193 -107 -261 -190 205 142 -48 20 110 48 112 324 -123 184 -117 -183 344 192 -143 -30
7697 -30 -67 195 -102 -40 -199 168 -147 70 -108 -132 140 -229 -292 -195 -59 -300 -36 215 20 -73 -47 -265 -24
7720 -24 -40 -20 37 -56 229 35 42 237 69 28 -118 -54 -39 162 -54 -36 69 10 -168 226 -166 -41 -26 -336
7744 -336 162 -261 -298 -105 150 63 -178 85 142 -123 -120 -6 -224 -196 35 71 -223 191 151 56 -92 24 161
7767 161 -102 3 81 94 -81 162 60 -146 68 -10 -202 -50 174 -83 -127 -173 -257 -107 -18 -47 -27 28 -99
7790 -99 -44 375 -150 131 66 65 -36 120 217 39 117 46 19 -151 257 -30 84 103 -157 200 215 -303 -140 -168
7814 -168 120 82 -64 55 -14 -102 -260 -39 80 81 -105 -118 201 -108 122 -280 -278 -15 -80 155 -245 133 283
7837 283 51 -9 108 259 88 -81 246 124 141 28 -1 75 60 -214 -302 165 123 -4 -315 -18 -72 62 193
$$ packed form
7673B04Q4l56k6O4j63Q6j54P1L95o3j90O8R0o2O4K12m47L07l01o6N27j52l35J13
7697c0l7K62k97O2j59L67l15K17j78k4K72l69o3R7J36k41K64K51j95r3K6k18K41
7720b4j6K0N7r3K85j94PJ95j68m1j46O4J5K01k16J8J05n9j78L94l92J25J5l10
7744c36M98m23l7J93K55q7k41K63N7k65LJ14k18K8K31L6k94M14m0r5j48J16J37
7767A61k63J05P8J3j75K43j02k06K14p8j92J52K24k57m4m6q4J50Q9k9K0N5j27
7790i9N5M19n25K81o5jj01J56R7j78P8p1k7j70M08k87J14J9k60L57J5n18J63k8
7814a68K88l8j46J19o9q8j58K21J19Jj86j3L19l09K30m02KK63o5K35m00L78J50
7837B83k32o0J17J51j71j69L27j22J7j13k9P6j5k74q8M67m2j27l11K97n4J34J31
$$ plain form
7860 193 216 79 202 -176 57 -33 219 -257 -30 50 -146 258 203 85 100 395 -184 -162 -59 137 -338 16
7882 16 -161 280 52 -112 -174 159 238 -39 -109 -364 -125 -144 26 -181 -8 113 139 -173 25 -189 -21 290
7904 290 16 -98 24 25 247 82 -114 -58 70 231 -73 -46 65 -125 -98 148 380 26 -44 -285 -111 3
7926 3 -224 -88 66 78 -341 -34 -38 -42 72 198 -141 100 278 -17 47 515 224 -138 184 -232 28 -138 180
7949 180 2 -29 396 74 12 104 -98 -105 18 -232 257 7 -278 -120 90 -49 -324 29 101 -344 67 59 -3
7972 -3 -240 -30 -14 -311 2 -40 289 -10 -208 195 22 -36 312 27 42 -186 51 115 -205 -41 -10 -6 -150
7995 -150 -250 -31 -36 -227 -12 -54 -36 -337 94 157 152 -266 -71 -18 199 109 12 -6 117 -293 343 -44 302 435
8019 435 241 141 51 -22 62 -160 29 23 -189 -94 -171 -220 -201 121 -12 170 102 -92 114 -123 -270 217 20
$$ packed form
7860A93K3j37J23l78K33r0K52m76K27Q0j96M04n5j18J5K95n79K2J03J96m75L54
7882A6j77M41k28j64o2L33P9k77p0k55K39j9J70k07J73J21K6l12J98k14J68L11
7904B90k74j14J22JK22j65j96N6J28J61l04K7J11j90K7K46K32l54p0k41J74J14
7926Ck27J36J54J2m19L07mmJ14J26l39K41J78k95O4M68k91l62L22m16K60j66L18
7949A80j78l1M25l22o2R2k02pJ23k50M89k50k85J58K10j39k75L53P2m45M11qo2
7972ck37K10J6k97L13m2L29k99j98M03j73n8L48k85J5k28K37O4l20J64L1Mj44
7995a50j00K19nj91K15m2J8l01M31O3nm18J95N3K17r0r7j8J23m10O36l87L46J33
8019D35j94j00r0p3Q4k22J89ok12R5p7m9J9L22j33J82o8j94K06k37j47M87j97
$$ plain form
8042 20 179 61 25 -38 162 159 337 49 136 -85 121 1 222 224 5 -25 -320 -259 33 42 -117 104 -65 -251
8066 -251 174 -36 -28 -4 12 -135 -272 3 152 -216 145 16 245 33 207 93 105 34 226 38 101 290
8088 290 -118 -45 207 -3 72 -110 76 341 42 -134 12 -17 96 102 -339 261 10 -231 -20 84 -267 -190
8110 -190 -61 67 22 68 215 -10 156 -106 45 150 -181 31 51 -56 31 356 8 -170 191 -17 -142
8131 -142 -228 203 -25 -61 356 -281 -131 -259 -91 60 -288 36 135 -69 189 10 -17 196 339 115 -238
8152 -238 -33 313 -154 -2 55 384 164 -16 227 -6 178 154 -20 -47 31 -18 13 -264 194 -114 -12 10
8174 10 -67 -89 -13 -264 -242 33 34 -55 -157 -101 13 117 100 324 148 1 -4
$$ packed form
8042B0J59j18l6o3K00lJ78k88Q7k21K06j20K21Kk19l0k95O1K92Rj59K21j69j86
8066b51M25k10QK4J6j47j37K75J49l68L61j29K29k12J74j14J2p1J92j88O3J89
8088B90m08P3K52k10P5j82J86K65k99j76J46k9J13Om41O00k51k41K11J04l51P7
8110a90J29J28m5M6J47k25J66k62J51J05l31K12K0j07Q7L25l48j78L61k08j25
8131a42q6M31k28l6M17o37J50j28J68J51l48L24R9k04K58j79k7K13J43k24l53
8152b38K05L46m67J52N7L29k20j80K43k33J84k4j74k7P8m9L1k77M58l08J02K2
8174A0p7k2P6k51K2K75Jq9j02N6J14J04j7K24j76j47n
8191d
$$ Imaginary data points
##PAGE= N=2
##DATA TABLE= (X++(I..I)), XYDATA
$$ plain form
0 0 0 0 0 0 0 0 0 2 -8 8 -8 8 -8 15 -16 16 -24 24 -32 35 -40 48 -56 64 -74 84 -95 108 -121 137 -154 172
32 172 -194 218 -241 269 -299 331 -367 407 -448 496 -551 609 -675 751 -835 934 -1048 1179
50 1179 -1338 1530 -1774 2086 -2506 3099 -4010 5554 -8673 17413 -90060 -320130 -41824
63 -41824 156600 -11859 -124202 53424 125167 -19094 -78393 6221 4401 -43154 -953
74 -953 36812 -17288 -24166 36220 21995 -43800 -14310 41423 568 -38844 25354 59962 -14478
87 -14478 -45089 43450 83261 -1651 -60980 -21458 983 -32591 -19363 41543 41420 -5328 100
100 100 22855 -19565 -59040 -16300 23349 -7999 -21022 19001 14480 -32333 -14629 28816 -8518
113 -8518 -46355 17000 65228 857 -39234 24893 48401 -19901 -37187 14934 7666 -30756
$$ packed form
0@%%%%%%%Kj0J6j6J6j6K3l1L2m0M8n6O7p5Q8j04J20j38J58j79K03k29K58k91L26
32A72l66M12m59N10n68O30o98P74q55R44j047J160j284J426j586J769j982K227
50A179k517K868l304L860m592N605p109R564j4227K6086j07473k30070K78306
63d1824J98424j68459j12343J77626P1743j44261n9299Q4614j820m7555M2201
74i53L7765n4100o878O0386j4225o5795K9490N5733m0855l9412O4198L4608p4440
87a4478l0611Q8539L9811q4912n9329L9522K2441l3574J3228O0906j23m6748N428
100A00K2755m2420l9475M2740L9649l1348j3023M0023m521m6813J7704M3445l7334
113h518l7837O3355M8228o4371m0091O4127K3508o8302j7286N2121p268l8422
$$ plain form
125 -30756 7617 53288 12628 -21541 16601 25158 -23497 -22024 19387 -5385 -45892 -3424
137 -3424 38651 -11840 -50082 6108 43952 -6608 -38264 1425 19763 -11730 -17679 7470
149 7470 6591 -5127 10908 15599 -19329 -31191 12390 41474 16998 -3954 11537 17394 -2228
162 -2228 -7618 2882 -5125 -15881 2869 15569 -6796 -17456 9030 18954 -7435 -11852 9736
175 9736 -550 -28388 -15709 4695 -15086 -23175 21386 37769 -10700 -35187 -1389 11768
187 11768 -9313 3196 32873 15950 -9399 8685 15670 -21990 -31997 9134 24619 -334
199 -334 2860 29873 18373 -11589 -9857 -497 -15736 -18596 3928 6080 -14355 -10109 10302 3284
213 3284 -12339 -2701 5765 -11906 -19170 4501 16584 -2465 -8790 12273 17230 -7978 -21068
$$ packed form
125c0756L8373M5671m0660l4169L8142Q557m8655J473M1411k4772m0507M2468
137c424M2075n0491l8242N6190L7844n0560l1656L9689J8338l1493n949K5149
149G470q79j1718J6035M691l4928j1862M3581K9084k4476k0952J5491N857j9622
162b228n390J0500q007j0756J8750J2700k2365j0660K6486R924k6389m417K1588
175I736j0286k7838J2679K0404j9781q089M4561J6383m8469k4487L3798J3157
187A1768k1081J2509K9677j6923k5349J8084O985l7660j0007M1131J5485k4953
199c34L194K7013j1500k9962J732R360j5239k860K2524K152k0435M246K0411p018
213C284j5623R638Q466j7671p264K3671J2083j9049o325K1063M957k5208j3090
$$ plain form
226 -21068 -4976 7324 5750 12987 26741 21948 6619 156 -6144 -20119 -19916 -237 9667 7029
240 7029 12671 15710 -3912 -21022 -9428 -347 -14721 -13968 13312 16348 -13216 -21106 -394 1468
254 1468 -13645 -5550 10629 2678 -6963 8073 17703 5195 812 10164 5134 -10789 -10115 -934
268 -934 -1552 4478 23069 23004 1501 -4345 3705 -5867 -23983 -12932 10956 8903 -4807 -2813 70
283 70 -12638 -18484 -3889 5884 -1331 -2766 6620 4982 -5794 -6351 -115 -1844 -3477 3005 4245
298 4245 -1962 2058 15312 13948 3153 4938 11612 1657 -11125 -5209 3930 -1512 -4418 6791
312 6791 8762 -5478 -8373 3092 2325 -10866 -9734 1413 -2184 -9603 -2777 3470 -6121 -9878
326 -9878 -460 1478 -7318 -3457 10974 10688 3757 6850 8428 -2339 -5524 3365 2529 -5371 1915
$$ packed form
226b1068J6092J2300j574P237J3754m793j5329o463o300j3975K03J9679R904k638
240G029N642L039j9622j7110J1594R081j4374P53K7280L036k9564p890K0712J862
254A468j5113Q095J6179p951r641J5036R630j2508m383R352n030j5923O74R181
268i34o18O030J8591o5k1503n846Q050r572j8116J1051K3888k053j3710J994K883
283G0j2708n846J4595R773p215j435R386j638j0776n57O236j729j633O482J240
298D245o207M020J3254j364j0795J785O674r955j2782N916R139n442k906J1209
312F791J971j4240k895J1465p67j3191J132J1147l597p419O826O247r591l757
326i878R418J938q796L861J4431k86o931L093J578j0767l185Q889q36p900P286
$$ plain form
341 1915 15683 9173 -2997 2806 11788 1735 -7790 -1749 -769 -11665 -12640 -184 3444 -3388
355 -3388 -1831 3600 -4728 -14051 -8776 -1698 -1434 1799 10968 9960 -2699 -7445 -4385 -7035 -9306
370 -9306 2462 16880 16171 9984 10509 6529 -5991 -9355 898 3952 -3971 -2163 7732 5735 -4459
385 -4459 -3707 3002 8 -6706 -6063 -5901 -8719 -3966 3666 406 -4604 850 1112 -12683 -17330 -2065
401 -2065 8804 4814 8523 20079 14960 -4935 -12099 -5967 -4739 -4764 6628 17609 13998 6460
415 6460 4886 -188 -9166 -7791 144 982 -1628 2410 2677 -6024 -9556 -3133 -3248 -9527 -6419 2639
431 2639 134 -7223 33 11010 5267 -6346 -4133 358 -6730 -10904 1551 13728 12123 9306
445 9306 12169 7724 -3477 -6469 -2894 -2324 -360 8903 11256 908 -4306 -693 -3871 -12397 -7652
$$ packed form
341A915J3768o510j2170N803Q982j0053r525O041R80j0896r75J2456L628o832
355c388J557N431q328r323N275P078K64L233R169j008j2659m746L060k650k271
370i306J1768J4418p09o187N25l980j2520l364J0253L054p923J808R895j997j0194
385d459P52O709k994o714O43J62k818M753P632l260n010N454K62j3795m647J5265
401b065J0869l990L709J1556n119j9895p164O132J228k5J1392J0981l611p538
415F460j574n074q978J375P935Q38k610M038K67q701l532O423j15o279L108R058
431B639k505p357P256J0977n743j1613K213M491p088m174J2455J2177j605k817
445I306K863m445j1201k992L575N70J964R263K353j0348n214L613l178q526M745
$$ plain form
460 -7652 4958 3495 -4898 -743 4112 -4341 -12013 -5364 -1535 -7888 -7421 4323 7482 -32 2603
475 2603 10521 5514 -3556 -383 3898 -1357 -4259 5086 10274 4973 2761 6342 2244 -4698 -1003
490 -1003 4057 -1455 -5874 1046 4686 -3324 -8713 -2794 -1971 -8897 -8932 -836 1082 -1965 2164 5676
506 5676 -1221 -6697 -524 2730 -5213 -6716 3994 9672 4732 3482 6994 4521 -752 2651 5964
521 5964 1579 -796 3387 2546 -4108 -2662 3828 1573 -4770 -1509 1243 -6322 -9555 -79 3339
536 3339 -3938 -5384 1753 538 -10052 -11342 -3579 -178 1309 8066 11697 4258 -2214 -734 545
551 545 -2465 -476 6298 6947 4067 4556 4298 -862 -2371 4321 5572 -2742 -4439 2953 1651 -8250
567 -8250 -7359 4062 4150 -6579 -9354 -4538 -7054 -8838 465 9814 6317 207 -1041 -3775 -8302
$$ packed form
460g652J2610j463q393M155M855q453p672O649L829o353M67J1744L159p514K635
475B603P918n007r070L173M281n255k902R345N188n301k212L581m098o942L695
490a003N060n512m419O920L640q010n389N919Q23o926l5Q096J918l047M129L512
506E676o897n476O173L254p943j503J0710N678m940j250L512k473n273L403L313
521E964m385k375M183q41o654J446O490k255o343L261K752p565l233R476L418
536C339p277j446P137j215j0590j290P763L401J487O757L631p439o472J480J279
551E45l010J989O774O49k880M89k58n160j509O692J251q314j697P392j302r901
567h250Q91J1421Q8j0729k775M816k516j784R303R349l497o110j248k734m527
$$ plain form
582 -8302 -5735 517 1927 5367 13504 12402 339 -4527 1858 1370 -3614 2340 12241 7992 -3284
597 -3284 -3338 920 -2303 -5458 879 2836 -5073 -9237 -1630 3359 -129 -2871 -2269 -4189 -6863 -5848
613 -5848 -4574 -4291 -133 6470 6844 3219 2819 2433 -3464 -7581 126 9159 7739 4114 6788 5823
629 5823 -3672 -6451 2465 7150 -109 -3728 1545 3349 -1161 -2913 -1582 -4168 -7361 -5447 -2877
644 -2877 -3429 -1655 2188 -113 -3382 684 2199 -5071 -7804 1288 5974 393 369 8020 7347 -2373
660 -2373 -2654 6036 6077 325 2119 5639 1580 -1812 2332 3437 -1982 -2995 554 -2157 -5553 -2979
676 -2979 565 -2130 -2855 1615 220 -7773 -9102 -3220 -840 -1885 1392 5169 669 -4632 -739
691 -739 4356 1529 -198 5470 6328 -410 -2141 4167 5585 95 794 6817 4740 -1681 -1091 820
$$ packed form
582h302K567O252J410L440Q137j102j2063m866O385m88m984N954R901m249j1276
597c284n4M258l223l155O337J957p909m164P607M989l488k742O02j920k674J015
613e848J274K83M158O603L74l625m00l86n897m117P707R033j420l625K674r65
629E823r495k779Q916M685p259l619N273J804m510j752J331k586l193J914K570
644b877n52J774L843k301l269M066J515p270k733R092M686n581k4P651o73r720
660b373k81Q690M1n752J794L520m059l392M144J105n419j013L549k711l396K574
676b979L544k695p25M470j395p993j329N882K380j045L277L777m500n301L893
691g39N095k827j727N668Q58o738j731O308J418n490O99O023k077o421N90J911
$$ plain form
707 820 -4067 -5416 2231 6248 760 -4531 -4932 -7892 -9512 -2533 4162 870 -2636 1081 304 -7098
723 -7098 -6204 2862 2977 -2816 154 7154 4592 -887 2498 4960 743 140 6257 5626 -1071 -1650
739 -1650 1893 1367 98 4799 5035 -4126 -9671 -4630 -1310 -3752 -1761 4959 3317 -5522 -7589 -3843
755 -3843 -4843 -6521 -1344 4809 3631 470 2188 2846 -2663 -5241 650 5127 4829 5120 6135 2931
771 2931 -721 1734 3194 -434 -282 3393 1584 -4445 -1995 4017 778 -4123 -796 959 -6707
786 -6707 -10614 -1726 2817 -2584 -3312 3519 2402 -6319 -6563 -502 -178 -2090 2478 7065 4950 2108
802 2108 1608 -301 -1692 1819 3672 1760 3291 7720 3544 -4572 -2838 4699 2349 -6763 -4586
817 -4586 3864 1552 -5541 -3848 2572 -265 -7958 -6896 -1292 -724 -2320 -255 1655 -293 -1552
$$ packed form
707H20m887j349P647M017n488n291m01k960j620O979O695l292l506L717p77p402
723g098Q94R066J15n793K970P000k562n479L385K462m217o03O117o31o697n79
739a650L543n26j269M701K36r161n545N041L320k442J991O720j642q839k067L746
755c843j000j678N177O153j178l161J718O58n509k578N891M477k98K91J015l204
771B931l652K455J460l628J52L675j809o029K450O012l239m901L327J755p666
786f707l907Q888M543n401p28O831j117q721k44O061L24j912M568M587k115k842
802B108n00j909j391L511J853j912J531M429m176q116J734P537k350r112K177
817d586Q450k312p093J693O420k837p693J062N604N68j596K065J910j948j259
$$ plain form
832 -1552 -174 -734 -1015 2686 3711 347 700 5558 5881 -424 230 6005 4575 -1613 164 4428
848 4428 -78 -4794 1152 5756 -910 -5363 -929 -736 -7138 -5793 1766 2398 -2041 -2451 -1860 -5951
864 -5951 -6526 -209 2318 -81 1348 4528 568 -4193 -549 5192 3308 1424 5095 6478 -60
879 -60 -3503 403 3747 1485 1668 5524 3842 -2429 -5018 -2335 -2200 -2792 734 3122 -1821 -6559
895 -6559 -5180 -3075 -3402 -2017 1936 1793 -1248 -2078 -1465 -2813 -1364 3468 4646 1131 426 3059
911 3059 1395 -1955 1763 7519 5571 1845 2692 2636 -2247 -4722 -550 3362 2416 706 -9 -2320
927 -2320 -4400 -4308 -3763 -2341 795 1994 -1801 -4648 -3077 -1975 -4531 -3071 2687 3763 138 -345
943 -345 3051 2848 -363 179 4085 4559 924 325 2325 2414 1299 1200 2244 1974 1347 151 -1492 -2286
$$ packed form
832a552J378n60k81L701J025l364L53M858L23o305O54N775j430o188J777M264
848D428m506m716N946M604o666m453M434J93o402J345P559O32m439m10N91m091
864e951n75O317K527k399J429L180l960m761L644N741j884j884L671J383o538
879f0l443L906L344k262J83L856j682o271k589K683J35n92L526K388m943m738
895f559J379K105l27J385L953j43l041q30O13j348J449M832J178l515p05K633
911C059j664l350L718N756j948l726Q47n6m883k475M172L912r46j710p15k311
927b320k080R2N45J422L136J199l795k847J571J102k556J460N758J076l625m83
943c45L396k03l211N42L906M74l635n99K000Q9j115r9J044k70o27j196j643p94
$$ plain form
961 -2286 -380 104 -2839 -3102 -381 -2181 -6430 -5579 628 651 -4038 -2019 3739 1795 -4381 -2447
977 -2447 2718 867 -2287 106 4369 3497 1595 2807 2461 776 1880 3261 1541 950 3143 1825
993 1825 -2895 -2477 1018 -786 -4529 -2047 2648 995 -3247 -2281 -843 -3666 -5666 -2234 469 -1575
1009 -1575 -2660 -484 493 -1967 -531 2854 3019 1829 1947 2799 2004 1324 1771 1234 471 2365 3578
1026 3578 941 -926 1384 2504 -484 -774 3040 1590 -4290 -6673 -3267 -1918 -3759 -2099 1433
1041 1433 481 -3064 -3074 -999 -1067 -1386 326 1349 1557 1551 600 -2070 -2103 1300 3604 3262 4382 5953
1059 5953 2879 -1981 -148 3397 1602 -1515 -43 1381 -1489 -4004 -1594 326 -802 -1850 91
1074 91 536 -2041 -3907 -3852 -3279 -2232 -69 724 -495 -1851 -1331 -1345 114 3344 6103 3812 1320
$$ packed form
961b286J906M84k943k63K721j800m249Q51O207K3m689K019N758j944o176J934
977b447N165j851l154K393M263q72j902J212l46j685J104J381j720n91K193j318
993A825m720M18L495j804l743K482M695j653m242R66J438k823k000L432K703k044
1009a575j085K176R77k460J436L385J65j190J18Q52p95o80M47n37p63J894J213
1026C578k637j867K310J120k988k90L814j450n880k383L406J349j841J660L532
1041A433r52l545j0K075o8l19J712J023K08or51k670l3L403K304l42J120J571
1059E953l074m860J833L545j795l117J472J424k870k515K410J920j128j048J941
1074I1M45k577j866N5N73J047K163P93j219j356N20j4J459L230K759k291k492
$$ plain form
1091 1320 1892 1758 -1098 -1468 2960 3446 1161 1048 4074 2507 -2170 -2835 1035 2153 -659 -1472 -916
1108 -916 -2928 -5492 -5339 -2166 234 268 -881 -1706 -2081 -167 -399 -1292 142 2237 1602 -1522 -282
1125 -282 2149 753 -606 2688 6298 4516 1300 2390 2855 -347 -2379 610 2955 49 -3369
1140 -3369 -3047 -29 154 -1523 -2360 -643 738 -846 -4133 -4391 -1191 -549 -3549 -4109 456 2920
1156 2920 -476 -2697 763 4316 2593 753 2747 4712 1880 -1578 -437 1928 1768 55 305
1171 305 1683 2842 3471 1219 -1216 -1226 -922 -2456 -3741 -1963 -778 -2451 -4263 -2105 -297 -1804
1187 -1804 -2630 243 947 -645 -352 1702 1115 -1651 -1931 603 1968 1428 1805 2354 2727 3073 3884 3172
1205 3172 2687 1906 -5 -2524 -2191 -337 -224 -1414 -441 1695 293 -2520 -3542 -1681 -1033 -2086
$$ packed form
1091A320N72j34k856l70M428M86k285j13L026j567m677o65L870J118k812q13N56
1108i16k012k564J53L173K400L4j149q25l75J914k32q93J434K095o35l124J240
1125b82K431j396j359L294L610j782l216J090M65l202k032K989K345k906l418
1140c369L22L018J83j677q37J717J381j584l287k58L200O42l000n60M565K464
1156B920l396k221L460L553j723j840J994J965k832l458J141K365j60j713K50
1171C05J378J159O29k252k435j0L04j534j285J778J185j673j812K158J808j507
1187a804q26K873P04j592K93K054n87k766k80K534J365n40L77N49L73L46Q11p12
1205C172m85p81j911k519L33J854J13j190R73K136j402k813j022J861O48j053
$$ plain form
1221 -2086 -1691 -41 -105 -2300 -3695 -3133 -2363 -264 2566 3600 2440 1489 2607 2825 870 -801 1284
1238 1284 2629 1519 -350 -526 939 2095 2174 1363 1421 2067 375 -3801 -5073 -2409 36 -1634 -2254
1255 -2254 -1207 -1141 -4265 -4532 -904 1490 1005 219 1203 1890 -105 -2656 -2814 -158 1698 1750 1783 3224
1273 3224 4110 2262 643 1938 3487 2846 163 -1290 -1175 -908 -1756 -1178 508 1381 -925 -2549 -1716
1290 -1716 -1360 -2106 -2338 -322 167 -1745 -2834 -2202 -1798 -2733 -2146 1240 4338 3765 2491 1861 1979 1592
1308 1592 -95 -804 715 2612 1728 -734 464 3133 2737 752 202 904 -504 -2027 -1892 -1239 -1875
1325 -1875 -2598 -2228 -1990 -2789 -3153 -2261 -297 821 593 233 1058 2029 -62 -2302 -2002 -193 618 860
1343 860 2057 3360 4074 3445 2635 2262 2221 135 -1088 -216 517 -478 -1851 -87 1032 -1814 -4421
$$ packed form
1221b086L95J650o4k195j395N62P70K099K830J034j160r51J118K18j955j671K085
1238A284J345j110j869j76J465J156P9q11N8O46j692m176j272K664K445j670o20
1255b254J047O6l124k67L628K394m85p86R84O87j995k551j58K656J856N2L3J441
1273C224Q86j848j619J295J549o41k683j453J15K67q48N78J686Q73k306j624Q33
1290a716L56p46k32K016M89j912j089O32M04r35N87L386L098n73j274o30J18l87
1308A592j687p09J519J897q84k462J198K669l96j985n50P02j408j523J35O53o36
1325a875p23L70K38p99l64Q92J964J118k28l60Q25R71k091k240L00J809Q11K42
1343H60J197J303P14o29q10l73m1k086j223Q72P33r95j373J764J119k846k607
$$ plain form
1360 -4421 -1925 708 199 -1242 -931 -225 -1739 -3289 -3204 -2313 -1202 -811 -1078 -32 2698 3732 2298
1377 2298 1686 2753 2321 -495 -708 1098 1562 141 563 3619 4011 1085 5 616 -330 -1984 -1657
1394 -1657 1053 1360 -1441 -4139 -3985 -2842 -3168 -3170 -1464 1239 2001 386 -832 -159 579 352 -1745
1411 -1745 -1798 474 1542 492 531 3145 4143 2265 2411 3479 1961 -1113 -1249 489 213 -194 487
1428 487 578 -1852 -3414 -2243 -2001 -1041 931 1602 -109 -2234 -1982 -2576 -3716 -3259 -1323 -449 -588 1616
1446 1616 3354 2206 1086 2540 2750 1006 608 1379 1256 -340 437 1848 1861 1577 2167 1281 -1005
1463 -1005 -1798 479 1363 81 -894 -1108 -2590 -4285 -4424 -2996 -1659 -1006 555 1070 749 774 1041 -147
1481 -147 -2645 -1755 444 390 -826 1480 4049 2736 128 1782 3996 2851 -327 225 1273 408
$$ packed form
1360d421K496K633n09j441L11P06j514j550Q5Q91J111L91k67J046K730J034j434
1377B298o12J067m32k816k13J806M64j421M22L056L92k926j080O11r46j654L27
1394a657K710L07k801k698J54J143l26kJ706K703P62j615j218O73P38k27k097
1411a745n3K272J068j050L9K614R98j878J46J068j518l074j36J738k76m07O81
1428D87R1k430j562J171K42R60J972O71j711k125K52n94j140M57J936Q74j39K204
1446A616J738j148j120J454K10j744l98P71j23j596P77J411J3k84N90q86k286
1463a005p93K277Q84j282r75k14j482j695j39J428J337O53J561N15l21K5K67j188
1481a47k498Q90K199n4j216K306K569j313k608J654K214j145l178N52J048q65
$$ plain form
1497 408 318 89 -744 -1346 -1419 -2111 -3058 -1162 1708 813 -1693 -944 276 -2084 -4585 -2809 -526 -2094
1515 -2094 -3072 282 3215 2664 1013 2093 2620 644 -392 840 1921 1216 888 1338 1254 896 819 -73
1533 -73 -236 770 1349 310 -372 956 64 -3819 -5482 -3211 -993 -2408 -3264 -463 1410 -650 -712
1550 -712 1531 1733 -1486 -2287 -755 -319 -521 1051 2565 2332 2054 2277 2158 1056 1523 1485 573 751
1568 751 2544 2158 -1367 -2720 -1421 -1847 -2978 -936 1644 866 -1625 -939 523 -1496 -3663 -2708
1584 -2708 -1030 -2189 -2449 -409 1270 1140 1394 2220 2298 1513 1016 818 9 512 2162 2349 996 1266
1602 1266 1084 -395 -1184 617 2383 649 -1009 1279 1597 -1470 -4824 -3608 -2227 -3051 -2913 -368
1618 -368 910 340 -731 -147 235 32 -166 -560 -1307 -380 825 1241 1643 2466 2455 840 991 2646 2698
$$ packed form
1497D08r0k29q33o02p3o92r47J896K870q95k506P49J220k360k501J776K283j568
1515b094r78L354K933n51j651J080N27j976j036J232J081p05l28M50q4l58p7q92
1533g3j63J006N79j039o82J328q92l883j663K271K218j415q56K801J873k060o2
1550g12K243K02l219q01J532M36k02J572J514k33k78K23j19j102M67l8r12J78
1568G51J793l86l525j353J299m26j131K042K580p78k491O86J462k019k167R55
1584b708J678j159k60K040J679j30K54Q26P8p85m97j98q09N03J650J87j353K70
1602A266j82j479p89J801J766j734j658K288L18l067l354J216J381q24J38K545
1618c68J278n70j071N84L82k03j98l94p47R27J205M16M02Q23j1j615J51J655N2
$$ plain form
1637 2698 760 427 2165 1768 -382 -857 -975 -2341 -3449 -2048 265 280 393 400 -389 -1675 -2258 -2363
1655 -2363 -2246 -2263 -2177 -1684 -369 1773 2072 714 146 1105 2441 1179 405 1485 2452 1283 2 644
1673 644 2059 445 -1208 -523 1124 1505 1087 1125 432 -1565 -2185 -1982 -2623 -3733 -2895 -1624 -646 -396
1691 -396 300 540 57 -133 -752 -1613 -1046 1243 1155 -674 -205 2929 3041 291 -61 1750 2477 1558 1590
1710 1590 2857 2368 128 -1447 -913 -966 -2084 -2176 -1340 244 33 -248 -248 573 -595 -2856 -3624 -2036
1728 -2036 -328 -1239 -2010 -689 1488 1759 339 137 925 1286 284 811 2735 2937 1195 249 457
1745 457 300 -529 -475 696 1604 1260 678 955 492 -486 -2828 -3340 -2051 -1455 -2354 -2144 -502 483 -246
1764 -246 -1151 -298 641 -514 -1575 -871 826 1687 1092 586 717 1342 1032 150 1318 2209 2425 1997 2111
$$ packed form
1637B698j938l33J738l97k150m75j18j366j108J401K313J5J13Pp89j286n83j05
1655b363J17j7Q6M93J315K142K99j358n68R59J336j262p74J080R67j169j281O42
1673F44J415j614j653O85J647L81m18L8o93j997o20K03o41j110Q38J271R78K50
1691c96O96K40m83j90o19q61N67K289q8j829M69L134J12k750l52J811P27r19L2
1710A590J267m89k240j575N34n3j118r2Q36J584k11k81%Q21j168k261p68J588
1728b036J708r11p71J321K177K71j420k02P88L61j002N27J924K02j742r46K08
1745D57j57q29N4J171R08l44n82K77m63r78k342n12J289N96q99K10J642R85p29
1764b46r05Q53R39j155j061P04J697Q61n95n06J31O25l10q82J168Q91K16m28J14
$$ plain form
1783 2111 1975 436 -1217 -1547 -1230 -1094 -1684 -895 889 329 -597 -1788 -1095 -859 -1633 -2701 -2569 -875
1801 -875 -584 -818 -309 65 580 271 569 982 1205 1154 1943 2457 1883 887 260 749 47 -751 -830 1265
1821 1265 2393 1288 -201 963 743 -1187 -2793 -2693 -1832 -1456 -2119 -1482 -350 -511 -915 -979 -562 -525
1839 -525 -374 -243 693 1241 313 222 1173 1424 101 -303 997 2755 1825 684 2112 2690 933 -685
1857 -685 -823 -57 -900 -2194 -1376 92 367 -658 -933 -155 -248 -1943 -2945 -1656 -678 -1077 -1083 -151 712
1876 712 98 -714 -488 737 1485 1271 1045 2299 3169 1673 48 384 889 -56 -439 701 1619 1443
1894 1443 72 344 654 -114 -1992 -1914 -1312 -1618 -2139 -1880 -489 49 -702 -1762 -956 -404 -625 -1193 -414
1913 -414 1137 1571 603 127 569 1157 318 -471 947 2692 3133 1919 1201 1917 1277 -936 -1203 -190
$$ packed form
1783B111j36j539j653l30L17J36n90P89J784n60r26j191O93K36p74j068J32J694
1801h75K91k34N09L74N15l09K98M13K23n1P89N14n74r96o27M89p02p98p9K095
1821A265J128j105j489J164k20j930j606J00Q61L76o63O37J132j61m04o4M17L7
1839e25J51J31R36N48r28r1R51K51j323m04J300J758r30j141J428N78j757j618
1857f85j38P66q43j294Q18J468K75j025k75P78r3j695j002J289R78l99oR32Q63
1876G12o14q12K26J225P48k14k26J254Q70j496j625L36N05r45l83J140R18j76
1894A443j371K72L10p68j878P8O02l06n21K59J391N38p51j060Q06N52k21n68P79
1913d14J551M34r68m76M42N88q39p89J418J745M41j214p18P16o40k213k67J013
$$ plain form
1931 -190 -188 -1422 -1728 1 347 -537 -1372 -811 -950 -1559 -2262 -1542 -873 -648 -530 -534 -140 196 -358 -461 607
1952 607 1364 1678 1360 2330 2776 1215 206 240 942 217 2 1146 1617 1246 -31 -184 -190 -281 -1508 -1710
1972 -1710 -1149 -943 -1395 -1562 -786 -676 -1335 -1825 -1115 -490 -261 -395 272 1106 899 153 476 911 661 410
1992 410 520 1756 2220 1676 1250 2105 1262 -377 -651 -65 260 -807 -1096 -829 -56 -550 -864 -1058 -1031
2011 -1031 -1163 -1582 -1770 -491 -64 -914 -1665 -685 382 -258 -820 42 1750 1092 409 1646 2718 1620
2029 1620 306 789 1154 884 359 402 811 952 759 155 1 -185 -177 -1232 -1867 -1435 -789 -939 -1506 -634
2049 -634 -481 -1335 -1992 -810 217 -502 -605 572 1256 142 373 1102 994 -163 66 1216 1798 1329
2067 1329 1541 1838 1418 550 352 326 79 -110 -598 -999 -1213 40 448 -995 -1599 -1046 -1207 -2222 -1440
$$ packed form
1931a90Kj234l06J729L46q84q35N61j39o09p03P20O69K25J18mL94L36n54j03J068
1952F07P57L14l18R70M46j561j009L4P02p25k15J144M71l71j277j53or1j227k02
1972a710N61K06m52j67P76J10o59m90P10O25K29j34O67Q34k07p46L23M35k50k51
1992D10J10J236M64n44m26Q55q43j639k74N86L25j067k89K67P73m94l14j94K7
2011a031j32m19j88J279M27q50p51R80J067o40n62Q62J708o58o83J237J072j098
2029A620j314M83L65k70n25M3M09J41j93o04j54j86Qj055o35M32O46j50n67Q72
2049f34J53q54o57J182J027p19j03J177O84j114K31P29j08j157K29J150N82m69
2067A329K12K97m20q68j98k6k47j89m88m01k14J253M08j443o04N53j61j015P82
$$ plain form
2086 -1440 262 -13 -1775 -1140 -15 -334 -927 -622 681 413 592 1494 2122 1740 1221 332 236 559 780
2105 780 892 999 838 745 414 -60 59 316 -1061 -1878 -1247 -430 -827 -1027 -577 -410 -1495 -2469 -967
2124 -967 -323 -634 -726 272 942 352 224 468 475 59 706 959 1596 1927 2052 1234 508 1040 943 62 -301
2145 -301 720 664 -710 -984 306 -314 -1712 -1402 -246 -630 -2076 -1353 -90 -559 -1493 -1033 -344 -907
2163 -907 -698 211 369 600 838 823 694 1547 1641 1186 73 671 1518 1167 505 900 1483 313 -1232 -155
2183 -155 1168 205 -1588 -876 -427 -947 -1594 -455 -510 -1405 -1885 -946 -599 -541 -368 -252 -882 -662 350
2202 350 981 690 897 1373 434 328 1707 2273 1293 278 1098 1705 412 99 1166 826 -1628 -1092
2220 -1092 376 427 -890 -963 -324 -1043 -1742 -1094 -761 -864 -1380 -1307 -359 -582 299 361 -741 -462 639 538
$$ packed form
2086a440J702k75j762O35J125l19n93L05J303k68J79R02O28l82n19q89r6L23K21
2105G80J12J07j61r3l31m74J19K57j377q17O31Q17l97k00M50J67j085r74J502
2124i67O44l11r2R98O70n90j28K44Pm16O47K53O37L31J25q18p26N32r7q81l63
2145c01J021n6j374k74J290o20j398L10J156l84j446P23J263m69r34M60O89n63
2163i07K09R09J58K31K38j5j29Q53R4m55j113N98Q47l51o62L95N83j170j545J077
2183a55J323r63j793P12M49n20o47J139n5q95m80R39L47N8J73J16o30K20J012
2202C50O31k91K07M76r39j06J379N66r80j015Q20O07j293l13J067l40k454N36
2220a092J468N1j317p3O39p19o99O48L33j03n16P3R48k23Q81O2j102K79J101j01
$$ plain form
2240 538 206 851 1954 1101 55 724 2454 1534 14 -131 1586 1236 -169 -5 634 352 -1463 -1260
2258 -1260 -580 -612 -1031 -860 -684 -746 -1110 -1291 -1622 -910 -429 -1110 -1179 81 1183 -62 -671 770 1571
2277 1571 425 -117 852 2291 1230 372 1376 1507 803 -47 296 827 536 -258 -349 -123 103 -121 -1261
2296 -1261 -1520 -640 -757 -1674 -1704 -293 269 -1573 -1654 192 460 -383 -996 305 849 230 45 1119 1282
2315 1282 188 17 915 1340 1044 1138 1009 726 370 539 -71 -95 391 151 -954 -1163 -436 21 -1413
2334 -1413 -1454 -308 -618 -1504 -978 281 -783 -1462 -755 153 -82 -398 -62 1264 892 374 430 1254 981
2353 981 455 542 784 1080 676 959 291 403 6 -136 -318 322 296 -239 -1375 -715 -597 -1368 -2104 -1247
2373 -1247 -512 -1171 -1215 -315 369 70 -899 92 791 73 -231 457 987 900 340 1179 1122 1272 695 529 953
$$ packed form
2240E38l32O45J103q53j046O69J730r20j520j45J717l50j405J64O39k82j815K03
2258a260O80l2m19J71J76o2l64j81l31P12M81o81o9J260J102j245o09J441Q01
2277A571j146n42R69J439j061q58J004J31p04q50L43N31k91p94r1K26K26k24j140
2296a261k59Q80j17r17l0J411N62j842q1J846K68q43o13J301N44o19j85J074J63
2315A282j094j71Q98M25k96R4j29k83l56J69o10k4M86k40j105k09P27M57j434
2334a413m1J146l10q86N26J259j064o79P07R08k35l16L36J326l72n18N6Q24k73
2353I81n26Q7K42K96m04K83o68J12l97j42j82O40k6n35j136O60J18p71p36Q57
2373a247P35o59m4R00O84k99r69R91O99p18l04O88N30q7n60Q39n7J50n77j66M24
$$ plain form
2394 953 1300 1135 576 389 255 -89 -1228 -1289 -364 -603 -1101 -1022 -208 86 -1212 -1214 -663 -538 -1403 -1348 -446
2415 -446 23 246 -20 -57 693 903 437 501 1407 1823 892 659 841 1150 462 33 -122 887 633 -10
2435 -10 -124 282 486 -820 -1065 -728 -767 -1755 -1538 -983 -618 -962 -767 -2 -210 -679 -694 185 452 279 86
2456 86 546 752 828 217 638 1241 1079 720 744 1688 1454 309 -193 123 213 -627 -837 -739 -620 -1060 -1165
2477 -1165 -525 -132 -406 -1183 -1323 -294 -542 -1102 -1297 -613 55 -421 -520 766 1191 857 652 1361 1433 1093
2497 1093 566 616 1250 1095 164 193 524 461 -152 -290 352 900 -28 -861 -590 -175 -1007 -1713 -1713 -1258 -1066
2518 -1066 -1134 -722 -326 416 36 -598 119 321 118 -284 291 1003 1033 78 745 1653 1345 670 189 1122
2538 1122 1471 829 324 504 628 -551 -1271 -898 -668 -474 -1175 -644 -140 96 -1101 -967 -939 -770 -1373
$$ packed form
2394I53L47j65n59j87j34l44j139o1R25k39m98P9Q14K94j298kN51J25q65N5R02
2415d46M69K23k66l7P50K10m66O4R06M16r31k33J82L09o88m29j55J009k54o43
2435a0j14M06K04j306k45L37l9r88K17N55L65l44J95P65k08m69j5Q79K67j73j93
2456H6M60K06P6o11M21O03j62l59K4R44k34j145n02L16R0q40k10R8J19m40j05
2477a165O40L93k74p77j40J029k48n60j95O84O68m76r9J286M25l34k05P09P2l40
2497A093n27N0O34j55r31K9L31o3o13j38O42N48r28q33K71M15q32p06%M55J92
2518a066o8M12L96P42l80o34P17K02k03m02N75P12L0r55O67R08l08o75m81R33
2538A122L49o42n05J80J24j179p20L73K30J94p01N31N04K36j197J34K8J69o03
$$ plain form
2557 -1373 -1433 -501 -54 125 237 425 877 784 347 383 1110 1170 636 901 1556 892 -469 -93 608 -373 -420
2578 -420 91 1047 646 -33 -201 -247 -875 -1439 -1839 -1140 -1244 -1226 -809 -555 331 256 -614 -372 128 273 -231
2599 -231 21 780 748 611 -101 562 877 602 463 1032 1816 1293 373 594 620 -487 -1242 -1103 -602 -755
2619 -755 -1141 -123 57 -92 -699 -981 -574 -1285 -997 -1042 -432 -210 -212 -301 -390 531 396 255 686 1268 1358 1236
2641 1236 1324 1100 731 182 -59 171 382 294 -87 197 535 302 87 -432 -673 -1021 -1367 -1536 -1188 -985
2661 -985 -1225 -1000 -686 -418 -443 -283 262 220 216 257 519 831 590 -200 93 467 897 438 806 1810 1458
2682 1458 940 696 1175 265 -803 -1256 -672 -636 -1062 -1199 -659 -38 9 -526 -934 -513 -576 -732 -1187 -738
2702 -738 -57 -376 -647 110 226 338 -32 368 1481 1061 1036 1221 1501 787 -16 -699 -186 340 -12 -362
$$ packed form
2557a373o0R32M47J79J12J88M52r3m37L6P27O0n34K65O55o64j361L76P01r81m7
2578d20N11R56m01o79j68m6o28n64m00O99j04J8M17K54Q86p5q70K42N00J45n04
2599b31K52P59l2j37p12O63L15k75j39N69P84n23r20K21K6j107p55J39N01j53
2619g55l86J018J80j49o07k82M07p11K88m5O10K22kq9q9R21j35j41M31N82R0j22
2641A236Q8k24l69n49k41K30K11q8l81K84L38k33k15n19k41l48l46j69L48K03
2661i85k40K25L14K68k5J60N45m2mM1K62L12k41p90K93L74M30m59L68J004l52
2682A458n18k44M79r10j068m53N84L6m26j37N40O21M7n35m08M21o3j56m55M49
2702g38O81l19k71P57J16J12l70M00J113m20k5J85K80p14q03o83N13N26l52l50
$$ plain form
2722 -362 548 841 478 -148 187 -473 -1176 -1844 -1621 -1540 -940 -706 -721 -702 -526 -362 -229 -2 190 -147 19
2743 19 837 1285 638 -36 156 230 372 384 1582 1559 1760 759 914 601 573 -765 -796 -1026 -725 -662 -228
2764 -228 129 -175 -942 -843 -262 -257 -752 -958 -316 -621 -751 -829 -226 33 -237 -622 -57 1067 1637 1692 1585
2785 1585 1061 736 -126 -513 3 462 -52 -113 643 1031 289 -218 -85 -131 -352 -1504 -1002 -453 -264 -967
2805 -967 -1303 -818 -755 -998 -1018 -39 848 157 -249 545 814 465 -114 1 484 402 651 829 1315 1378 1217
2826 1217 746 991 370 182 -469 -1070 -228 -572 -877 -534 -125 -121 -821 -1044 -375 343 -481 -1107 -564 -301
2846 -301 -525 -666 -103 297 -110 -185 136 845 1227 1289 1304 815 805 507 -198 179 -366 342 268 99 599 1088
2868 1088 260 -486 -416 -362 -1093 -1335 -793 -199 -978 -1352 -680 -241 -775 -846 -202 -57 -16 179 739 856 526
$$ packed form
2722c62R10K93l63o26L35o60p03o68K23Q1O00K34j5J9J76J64J33K27J92l37J66
2743A9Q18M48o47o74J92P4J42J2J198k3K01j001J55l13k8j338l1k30L01O3M34
2764b28L57l04p67R9N81Nm95k06O42l05j30p8O03K59k70l85N65J124N70N5j07
2785A585n24l25q62l87N16M59n14o1P56L88p42n07J33m6k21j152N02N49J89p03
2805i67l36M85O3k43k0R79Q87o91m06P94K69l49n79J15M83q2K49J78M86O3j61
2826A217m71K45o21j88o51o01Q42l44l05L43M09Mp00k23O69P18q24o26N43K63
2846c01k24j41N63M00m07p5L21P09L82O2J5m89j0k98p05L77n45P08p4j69N00M89
2868A088q28p46P0N4p31k42N42N94p79l74O72M39n34p1O44J45M1J95N60J17l30
$$ plain form
2889 526 45 -296 104 242 337 721 1075 1364 1245 854 720 873 -153 -801 -740 -241 -627 -445 -279 48
2909 48 -592 -999 -1170 -75 -94 -880 -591 320 -79 -362 -252 -360 -445 -659 -10 699 1548 1688 1524 1119 870
2930 870 479 135 -179 143 874 241 -354 940 1024 274 -506 -220 -47 -901 -914 -221 -134 -653 -1262 -1269 -585
2951 -585 -802 -1183 -644 83 306 761 655 878 739 -9 -883 -489 345 470 646 828 1617 1546 355 392
2971 392 826 622 -592 -856 -311 388 -429 -554 -159 -797 -951 -851 -490 -469 -394 -283 -434 -384 -653 -554 -867
2992 -867 -628 -93 -173 359 829 1607 1096 902 1048 1208 570 -96 72 809 237 -188 678 328 359 15 -1
3013 -1 31 -538 -540 -723 -409 -586 -853 -990 -1131 -1126 -480 -751 -502 155 372 199 341 640 640 -190 -547 163 501
3036 501 97 328 1028 1482 1307 665 970 591 162 -436 -221 -547 -423 -101 -305 -411 -921 -909 -851 -746 -196
$$ packed form
2889E26m81l41M00J38R5L84L54K89j19l91j34J53j026o48O1M99l86J82J66L27
2909D8o40m07j71J095j9p86K89R11l99k83J10j08q5k14O49P09Q49J40j64m05k49
2930H70l91l44l14L22P31o33n95J294Q4p50p80K86J73q54j3O93Q7n19o09pO84
2951e85k17l81N39P27K23M55j06K23j39p48q74L94Q34J25J76J82P89p1j191L7
2971C92M34k04j214k64N45O99q17j25L95o38j54J00L61K1P5J11j51N0k69R9l13
2992h67K39N35q0N32M70P78n11j94J46J60o38o66J68P37n72m25Q66l50L1l44j6
3013aL2n69kj83L14j77k67j37j41NO46k71K49O57K17j73J42K99%q30l57P10L38
3036E01m04K31P00M54j75o42L05l79m29n98K15l26J24L22k04j06n10J2N8J05N50
$$ plain form
3057 -196 -303 -666 -256 555 -179 -1118 -713 -252 -605 -684 206 1196 1823 855 1093 1260 704 349 -137 -57 456
3078 456 453 185 676 820 442 -540 -543 -377 -431 -539 -495 -336 -49 -1031 -1396 -1211 -786 -1516 -1310 -171 571 589
3100 589 260 589 387 310 -747 -364 89 288 672 927 1167 1245 972 624 404 484 -45 -104 -22 434 66
3121 66 -469 -779 -277 -433 -1523 -1143 -228 -25 -113 -163 328 -129 -822 -674 -769 -572 -289 129 453 807 1085
3142 1085 579 860 920 704 526 96 620 494 632 258 480 296 -155 -278 -184 297 32 -372 -113 -39 -277
3163 -277 -1128 -759 -1251 -862 -763 -662 -29 465 384 132 514 492 -76 -586 208 406 327 293 729 718 1276 371
3185 371 631 446 273 172 -67 969 198 -517 -536 -492 -657 -973 -1093 -448 -121 -74 -299 -88 -143 -639 -909
3206 -909 -533 -708 -111 -586 -240 470 1045 454 642 965 757 221 110 581 405 301 222 366 394 125 -185
$$ packed form
3057a96j07l63M10Q11p34r39M05M61l53p9Q90R90O27r68K38J67n56l55m86Q0N13
3078D56lk68M91J44l78r82lJ66n4j08M4J59K87r82l65J85M25p30K06J139P42J8
3100E89l29L29k02p7j057L83M53J99L84K55K40P8k73l48k20Q0n29n9Q2M56l68
3121F6n35l10N02j56j090L80R15K03q8n0M91m57o93J48r5J97K83M18L24L54K78
3142A085n06K81O0k16j78m30N24j26J38l74K22j84m51j23R4M81k65m04K59P4k38
3163b77q51L69m92L89R9J01O33M94q1k52L82k2n68n10P94J98p9l4M36j1N58r05
3185C71K60j85j73j01k39J036p71p15j9M4j65l16j20O45L27M7k25K11n5m96k70
3206i09L76j75N97m75L46P10N75n91J88L23k08n36j11M71j76j04p9J44K8k69l10
$$ plain form
3227 -185 -145 -139 -166 -395 -192 -221 -123 -538 -1172 -1158 -820 -823 -747 -481 149 115 -57 587 436 368 50 -319 454 395
3251 395 424 294 967 1213 526 381 297 672 178 57 177 304 170 -282 -715 -730 -741 -780 -858 -439 -407 131
3273 131 -370 -368 102 -465 -1283 -1008 -273 83 -265 268 779 877 620 347 879 412 729 144 653 777 923
3294 923 478 183 372 183 -313 -515 -23 132 -265 -297 9 -110 -797 -1503 -1101 -808 -607 -934 -317 486
3314 486 268 -134 -97 367 -84 -456 -127 247 529 576 620 834 699 330 98 293 518 622 621 400 247 549
3336 549 -446 -685 -661 -609 -946 -963 126 209 -254 -509 -348 -669 -823 -848 -521 -303 -426 -328 434 486 294 649
3358 649 803 457 139 611 368 775 856 618 197 371 84 -343 -592 -298 642 31 -289 -119 110 -631
3378 -631 -1259 -764 -401 -840 -881 -486 212 -211 -90 -121 345 87 -347 58 440 356 242 841 843 853 723 149
$$ packed form
3227a85M0Ok7k29K03k9R8m15o34J4L38lP6K66O30l4j72O44j51o8l18l69P73n9
3251C95K9j30O73K46o87j45q4L75m94j21J20J27j34m52m33j5j1l9p8M19L2N38
3273A31n01KM70n67q18K75P35L56l48N33N11R8k57k73N32m67L17n85N09J24J46
3294I23m45k95J89j89m96k02M92J55l97l2L06j19o87p06M02K93K01l27O17Q03
3314D86k18m02L7M64m51l72L29L74K82M7M4K14j35l69k32J95K25J04jk21j53L02
3336E49r95k39K4N2l37j7J089Q3m63k55J61l21j54k5L27K18j23R8P62N2j92L55
3358F49J54l46l18M72k43M07Q1k38m21J74k87m27k49K94R40o11l20J70K29p41
3378f31o28M95L63m39m1L95O98m23J21l1M66k58m34M05L82q4j14N99KJ0j30n74
$$ plain form
3400 149 -78 436 751 236 77 343 401 -399 -669 -345 -399 -875 -1019 -126 -131 -371 -536 -149 -432 -1017 -414
3421 -414 -508 -253 61 11 -75 381 883 270 43 213 585 925 356 365 1500 960 213 211 304 165 -381 -188
3443 -188 89 137 -117 -209 213 -149 -945 -1158 -573 -788 -984 -380 -32 13 -133 -245 -215 21 48 152 -218 285
3465 285 379 632 325 486 945 270 -115 261 802 688 264 624 414 14 -444 39 50 -633 -858 -664 -295
3486 -295 -318 -129 -530 -343 -714 -713 -866 -535 -159 30 -16 -162 386 425 313 -213 326 180 294 216 827 928
3508 928 386 38 539 682 -280 131 -146 62 -158 59 13 0 -284 -663 -901 -453 -700 -519 -273 -322 307
3529 307 -282 -484 -532 -112 67 -597 17 603 661 241 636 855 508 -160 160 412 595 302 370 520 153
3550 153 290 -425 -403 -250 -668 -385 -1017 -585 -161 -425 -600 -269 -379 -893 -912 -762 63 -153 -269 49 342
$$ packed form
3400A49k27N14L15n15j59K66N8q00k70L24n4m76j44Q93nk40j65L87k83n85O03
3421d14r4K55L14n0q6M56N02o13k27J70L72L40n69RJ135n40p47kR3j39n46J93
3443a88K77M8k54r2M22l62p96k13N85k15j96O04L48M5j46j12L0K36K7J04l70N03
3465B85R4K53l07J61M59o75l85L76N41j14m24L60k10m00m58M83J1o83k25J94L69
3486b95k3J89m01J87l71Jj53L31L76J89m6j46N48L9j12n26N39j46J14p8O11J01
3508I28n42l48N01J43r62M11k77K08k20K17m6j3k84l79k38M48k47J81K46m9O29
3529C07n89k02m8M20J79o64O14N86N8m20L95K19l47o68L20K52J83k93O8J50l67
3550A53J37p15K2J53m18K83o32M32M24k64j75L31j10n14j9J50Q25k16j16L18K93
$$ plain form
3571 342 217 -124 350 788 233 123 787 685 834 315 280 312 25 188 -38 133 353 69 -320 -260 114
3592 114 14 -994 -1199 -475 -644 -758 -517 -2 -84 -574 -1032 -101 353 34 -204 246 818 20 402 545
3612 545 625 354 -33 220 350 766 620 154 47 332 22 -377 -326 117 -309 -842 -561 -252 -176 -677 -591
3633 -591 -686 -538 -568 -481 -367 27 75 -214 143 281 -110 35 314 259 521 725 786 741 809 380 86 422 283
3656 283 238 -4 -22 28 -475 -333 -63 -58 -534 -775 -589 -501 -476 -471 -120 -49 -217 -530 -304 -303 -45 -96 352 -56
3680 -56 528 465 488 990 506 219 331 643 348 615 142 67 494 143 -432 -130 100 -449 -439 -618 -199 -88
3702 -88 -217 -797 -579 -664 -587 -516 -244 -76 -170 -54 18 -89 165 -98 105 420 735 193 468 530 943 392
3724 392 208 375 648 337 -305 199 167 327 -200 -362 -460 -415 -634 -857 -694 -326 -414 -554 -285 36 -507
$$ packed form
3571C42j25l41M74M38n55j10O64j02J49n19l5L2k87J63k26J71K20k84l89O0L74
3592A14j00j008k05P24j69j14K41N15q2m90m58R31M54l19k38M50N72p98L82J43
3612E45Q0k71l87K53J30M16j46m66j07K85l10l99N1M43m26n33K81L09P6n01Q6
3633e91r5J48l0Q7J14L94M8k89L57J38l91J45K79n5K62K04O1m5O8m29k94L36j39
3656B83m5k42j8N0n03J42K70Nm76k41J86Q8K5NL51P1j68l13K26JK58n1M48m08
3680e6N84o3K3N02m84k87J12L12k95K67m73p5M27l51n75L02K30n49J0j79M19J11
3702h8j29n80K18q5P7P1K72J68r4J16P2j07K54k63K03L15L15n42K75O2M13n51
3724C92j84J67K73l11o42N04l2J60n27j62r8M5k19k23J63L68q8j40K69L21n43
$$ plain form
3745 -507 -593 -256 -187 -118 14 -9 405 593 64 297 587 566 389 468 543 567 668 172 319 8 101 -321 -159
3768 -159 -209 -244 -396 -388 12 -306 -701 -865 -572 -654 -617 -629 -105 -266 -235 -277 -113 -108 426 76 280 350 251 162 458
3793 458 673 158 144 235 217 461 421 143 541 443 76 -554 -428 -8 -512 -925 -474 -249 -256 -242 -368 -126 -263
3816 -263 -653 -611 -305 -1 -227 -89 249 497 298 287 398 840 344 487 226 756 454 34 199 693 212
3837 212 -168 -74 -8 -100 -219 -197 -203 -177 -150 -446 -655 -680 -571 -467 -319 -203 -3 -110 -236 -49 60 384 465
3860 465 275 635 -12 143 453 635 470 -56 804 528 701 210 259 418 345 -166 -482 -323 -270 -738 -754
3881 -754 -328 -78 -436 -407 -219 -270 -437 -672 -482 -35 -173 -232 -271 44 170 78 -12 707 584 225 346 494
3903 494 549 690 41 660 26 37 -137 47 269 -176 -436 -5 85 -117 -480 -885 -518 -568 -571 -525 -408 -197
$$ packed form
3745e07q6L37O9O9J32k3M14J88n29K33K90k1j77P9P5K4J01m96J47l11R3m22J62
3768a59n0l5j52QM00l18l95j64K93q2L7j2N24j61L1m2J64NN34l50K04P0r9q9K96
3793D58K15n15j4R1j8K44m0k78L98r8l67o30J26M20n04m13M51K25pJ4j26K42j37
3816b63l90M2L06L04k26J38L38K48j99j1J11M42m96J43k61N30l02m20J65M94m81
3837B12l80R4O6r2j19K2oK6K7k96k09k5J09J04J48J16K00j07j26J87J09L24Q1
3860D65j90L60o47J55L10J82j65n26Q60k76J73m91M9J59p3n11l16J59N3m68j6
3881g54M26K50l58K9J88n1j67k35J90M47j38n9l9L15J26r2r0P19j23l59J21J48
3903D94N5J41o49O19o34J1j74J84K22m45k60M31R0k02l63m05L67n0lM6J17K11
$$ plain form
3925 -197 46 -29 -126 73 221 179 -231 686 647 70 169 501 461 210 394 474 593 291 402 252 462 22
3947 22 -385 -278 -331 -231 -602 -194 -386 -293 -285 -114 -264 -243 -251 -284 -155 -120 -31 -511 -381 61 350 158 277 422
3971 422 544 444 229 725 604 297 200 388 198 -170 -54 181 52 157 -300 -222 28 -441 -57 -414 -643
3992 -643 -742 -330 -588 -573 -371 -404 -69 -74 351 33 -68 312 477 128 -100 335 505 508 -106 230 689 636 16
4015 16 282 469 583 -229 -2 -343 25 -359 -536 -282 -296 -667 -663 -541 -264 -136 -450 15 -259 37 -317
4036 -317 -317 88 210 -327 97 343 463 242 144 400 776 422 462 420 327 -214 160 -128 247 255 172 -111 -204
4059 -204 19 -281 -479 -258 -290 -568 -551 -369 -366 -180 -582 -472 157 206 184 272 475 459 92 286 527 268 263
4082 263 330 596 495 403 385 552 418 351 203 -267 -190 -142 -459 -863 -525 -191 -163 -600 -220 -61 -176 -439
$$ packed form
3925a97K43p5r7J99J48m2m10R17l9n77R9L32m0k51J84Q0J19l02J11j50K10m40
3947B2m07J07n3J00l71M08j92R3QJ71j50K1ql3J29L5Q9m80J30M42K89j92J19J45
3971D22J22j00k15M96j21l07r7J88j90l68J16K35j29J05m57P8K50m69L84l57k29
3992f43r9M12k58J5K02l3L35nM25l18j01L80J65l49k28M35J70Lo14L36M59n3o20
4015A6K66J87J14q12K27l41L68l84j77K54j4l71MJ22K77J28l14M65k74K96l54
4036c17%M05J22n37M24K46J20k21r8K56L76l54M0m2r3n41L74k88L75Qq3k83r3
4059b04K23l00j98K21l2k78J7J82LJ86m02J10O29M9k2Q8K03j6l67J94K41k59n
4082B63O7K66j01r2j8J67j34o7j48m70P7M8l17m04L38L34K8m37L80J59j15k63
$$ plain form
4104 -439 -354 -232 -123 -444 -350 -46 -63 -166 -236 330 489 547 506 703 654 547 449 -10 68 300 -481 -402 48
4127 48 414 -71 -434 41 140 -122 -481 -41 -181 -643 -695 -366 -374 -676 -563 -412 130 255 210 168 254 436 -200
4150 -200 153 198 396 212 115 257 313 587 149 361 505 337 -137 -266 17 33 -584 -652 -633 -365 -559 -495
4172 -495 310 -114 -156 -367 -427 191 -180 -576 -508 -244 53 -129 146 266 581 237 446 593 633 426 62
4193 62 526 45 157 -200 -110 38 130 -501 -426 162 -196 -383 -294 -86 -519 -535 -612 -382 -644 4 -421 -428 -38
4216 -38 245 181 359 592 130 -112 316 598 571 104 145 135 482 203 30 373 437 115 -81 223 -140 23
4238 23 -299 -389 -366 -280 -445 -409 -154 170 -117 -222 -130 -187 -287 -601 -105 -149 153 -273 437 320 428 6 324
4261 324 551 445 495 511 244 114 -152 -174 352 78 23 -279 76 -108 59 204 -202 -493 -474 -490 -268 -79
$$ packed form
4104d39Q5J22J09l21R4L04j7j03p0N66J59N8m1J97m9j07r8m59P8K32p81P9M50
4127D8L66m85l63M75R9k62l59M40j40m62n2L29ql02J13J51N42J25m5m2Q6J82o36
4150b00L53M5J98j84r7J42N6K74m38K12J44j68m74j29K83J6o17o8J9K68j94O4
4172d95Q05m24m2k11o0O18l71l96O8K64K97j82K75J20L15l44K09J47M0k07l64
4193F2M64m81J12l57R0J48R2o31P5N88l58j87Q9K08m33j6p7K30k62O48m25pL90
4216c8K83o4J78K33m62k42M28K82k7m67M1j0L47k79j73L43O4l22j96L04l63J63
4238B3l22r0K3Q6j65L6K55L24k87j05R2n7j00l14M96m4L02m26P10j17J08m22L18
4261C24K27j06N0J6k67j30k66k2N26k74n5l02L55j84J67J45m06k91J9j6K22J89
$$ plain form
4283 -79 -519 -744 -463 -476 225 92 -155 460 520 271 29 151 324 311 206 338 139 538 206 264 434 129
4305 129 132 -32 75 -91 -234 -737 -825 -549 -278 -808 -378 -253 -246 -423 -209 439 -115 -156 -755 62 -112 -198
4327 -198 62 516 460 199 401 317 489 802 428 334 195 158 17 -12 326 -136 -279 -373 172 212 197 -370 -469
4350 -469 -162 -242 -645 -487 -350 -287 -382 -476 432 -38 -104 45 365 44 312 286 271 196 172 251 191 536 -37 314
4374 314 200 283 269 -25 171 297 -186 -192 -773 -405 -555 -655 -270 -291 -152 -217 -326 -187 -202 -95 -233 -561
4396 -561 -199 -181 336 -72 -68 372 198 380 522 541 792 564 470 782 265 129 -254 282 -469 -201 -50 128
4418 128 7 195 -210 -49 -444 -727 -474 -249 -361 -526 -14 -480 -120 31 102 342 329 281 153 264 573
4439 573 340 235 60 169 274 210 192 343 434 69 348 275 290 -239 -163 -336 -478 -598 -799 -42 -211 -163
$$ packed form
4283g9m40k25K81j3P01j33k47O15O0k49k42J22J73j3j05J32j99L99l32N8J70l05
4305A29Lj64J07j66j43n03q8K76K71n30M30J25Pj77K14O48n54m1n99Q17j74q6
4327a98K60M54n6k61K02q4J72L13l74r4j39l7j41k9L38m62j43r4N45M0j5n67r9
4350d69L07q0m03J58J37O3r5r4R08m70o6J49L20l21K68k6j5p5k4P9o0L45n73L51
4374C14j14Q3j4k94J96J26m83on81L68j50j00L85k1J39o5j09J39j5J07j38l28
4396e61L62J8N17m08MM40j74J82J42J9K51k28r4L12n17j36l83N36p51K68J51J78
4418A28j21J88m05J61l95k83K53K25j12j65N12m66L60J51P1K40j3m8j28J11L09
4439E73k33j05j75J09J05o4j8J51R1l65K79p3J5n29P6j73j42j20k01P57j69M8
$$ plain form
4461 -163 -467 -317 -476 -301 -192 -280 -5 -259 182 -221 -111 409 -116 -274 390 604 437 171 333 444
4481 444 208 231 23 27 -119 42 -166 16 305 -278 175 -88 -237 -118 -608 -345 -408 -410 -400 -411 -288 92 -433
4504 -433 -372 227 206 298 -16 201 387 203 55 298 117 -26 340 371 428 48 272 -426 366 41 -90 -295
4526 -295 -520 46 -447 -304 -431 -152 -485 -440 -224 -77 -212 -250 -593 -52 192 -372 292 35 103 110 35 198
4548 198 559 637 620 556 372 419 205 -160 125 77 95 -314 -193 -209 -67 -255 113 -26 -363 -535 -226 -81
4570 -81 -332 -507 -282 -15 -477 -157 -143 177 246 -112 233 377 381 223 339 -4 -58 -27 288 95 800 463
4592 463 215 -69 498 316 -591 -358 -74 14 -347 -575 56 -16 -296 -73 -432 -61 -37 -217 -139 220 49
4613 49 -191 -263 -4 116 -395 330 57 697 243 304 639 426 279 20 162 -141 63 23 -58 322 232 -90
$$ packed form
4461a63l04J50j59J75J09q8K75k54M41m03J10N20n25j58O64K14j67k66J62J11
4481D44k36K3k08Mj46J61k08J82K89n83M53k63j49J19m90K63o3kJ0j1J23L80n25
4504d33O1N99k1R2l14K17J86j84j48K43j81j43L66L1N7l80K24o98P92l25j31k05
4526b95k25N66m93J43j27K79l33M5K16J47j35l8l43N41K44n64O64k57O8Pp5J63
4548A98L61P8j7o4j84M7k14l65K85m8J8m09J21j6J42j88L68j39l37j72L09J45
4570h1k51j75K25K67m62L20J4L20O9l58L45J44Mj58J16l43n4L1L15j93P05l37
4592D63k48k84N67j82r07K33K84Q8l61k28O31p2k80K23l59L71K4j80P8L59j71
4613D9k40p2K59J20n11P25k73O40m54O1L35k13j47k59J42l03K04m0q1L80r0l22
$$ plain form
4635 -90 390 -124 151 -254 -314 -132 -143 -598 -302 -464 -297 -387 -535 -265 112 355 330 171 546 446 117 108
4657 108 477 457 363 317 509 418 270 129 289 268 -118 -514 -120 -182 -266 -179 -126 -118 -342 -166 -459 -45 -234 -352
4681 -352 -150 -492 221 -195 -607 -41 -72 -100 7 590 505 423 347 508 344 211 146 115 126 175 -29 -23 443 413
4705 413 56 -119 -59 -341 -396 -395 -365 -322 -242 -319 -152 -351 -219 9 -381 -179 2 292 18 206 530 246 -3
4728 -3 -391 413 226 274 190 672 415 62 271 303 119 -46 -367 -371 24 -15 -266 -357 -138 -384 -343 -311 -152 -63
4752 -63 -76 -312 26 157 74 -310 273 1 -147 87 275 355 186 8 234 357 429 -186 383 133 -107 315
4774 315 -306 162 -130 -466 -133 -85 -48 -296 -552 -231 -27 142 -125 -422 -153 -138 -232 -293 114 211 -21 89
4796 89 178 186 112 -62 428 316 -11 231 459 282 145 14 195 329 1 -97 -195 -161 -372 -213 -402 -476 -199
$$ packed form
4635i0M80n14K75m05o0J82j1m55K96j62J67r0j48K70L77K43k5j59L75j00l29r
4657A08L69k0r4m6J92r1j48j41J60k1l86l96L94o2q4Q7N3Qk24J76k93M14j89j18
4681c52K02l42P13m16m12N66l1k8J07N83q5q2p6J61j64j33o5l1J1M9k04OM66l0
4705D13l57j75O0k82n5JL0M3Q0p7J67j99J32K28l90K02J81K90k74J88L24k84k49
4728cl88Q04j87M8q4M82k57l53K09L2j84j65l21mL95l9k51r1K19k46M1L2J59Q9
4752f3j3k36L38J31q3l84N83k72j48K34J88Q0j69j78K26J23P2o15N69k50k40M22
4774C15o21M68k92l36L33M8L7k48k56L21K04J69k67k97K69J5r4o1M07R7k32J10
4796H9Q9Qp4j74M90j12l27K42K28j77j37j31J81J34l28r8r8L4k11J59j89p4K77
$$ plain form
4819 -199 -406 -525 -271 -51 -103 -292 -111 -8 65 -121 -528 290 211 7 94 357 401 254 564 120 330 315
4841 315 50 564 100 114 -106 162 11 31 97 -417 -319 -70 -167 -468 -111 -148 -155 -341 -389 43 -163 -567 -68
4864 -68 244 -277 218 105 298 227 -10 181 257 488 188 254 393 227 428 161 246 516 85 28 -405 -186
4886 -186 59 -417 -301 60 -112 -206 -210 -223 63 -392 -148 -88 -177 -272 -184 -31 -112 100 -247 199 143 478 408 157
4910 157 384 -45 26 -82 -19 483 257 -60 233 -176 9 -219 -331 -378 97 -341 -191 18 31 -157 -642
4931 -642 -394 -301 -165 -296 264 186 -242 156 170 281 48 -204 -160 424 348 393 269 263 394 187 147 78 194
4954 194 146 -176 -44 -112 -393 -194 -247 -358 -738 -415 -273 61 34 -1 -84 -42 -110 -80 15 199 128 80 219 -47
4978 -47 149 506 108 248 256 133 177 -258 344 185 166 140 253 143 -489 -456 -219 -232 -178 -122 -424 -208 -402
$$ packed form
4819a99k07j19K54K20n2j89J81J03P3j86m07Q18p9k04Q7K63M4j47L10m44K10j5
4841C15k65N14m64J4k20K68j51K0O6n14R8K49r7l01L57l7pj86m8M32k06m04M99
4864f8L12n21M95j13J93p1k37J91P6K31l00O6J39j66K01k67Q5K70m31n7m33K19
4886a86K45m76J16L61j72r4mj3K86m55K44O0q9r5Q8J53q1K12l47M46n6L35p0k51
4910A57K27m29P1j08O3N02k26l17K93m09J85k28j12m7M75m38J50K09J3j88m85
4931f42K48R3J36j31N60p8m28L98J4J11k33k52M4N84p6M5j24oJ31k07m0o9J16
4954A94m8l22J32o8k81J99n3j11l80L23J42L34k7l5q3M2o8L0R5J84p1m8J39k66
4978d7J96L57l98J40Qj23M4m35O02j59j9k6J13j10o32L3K37j3N4N6l02K16j94
$$ plain form
5001 -402 -164 -316 -140 -523 -197 -90 -365 73 96 -209 227 204 13 36 166 684 107 131 452 144 460
5022 460 -10 127 186 76 23 -197 -65 52 -67 -278 -230 -458 -225 -306 -442 -3 -329 -82 -405 34 -178
5043 -178 -554 -349 206 -238 203 38 216 480 138 35 138 378 110 105 196 266 136 238 62 239 32
5064 32 -135 -71 -351 -238 -189 -149 -32 49 49 -525 -469 -71 -104 -68 164 143 142 162 -50 54 78 96 -91 248 542
5089 542 447 37 266 166 468 438 265 246 91 -174 -4 -189 1 168 -425 -149 -352 -48 -418 9 -185
5110 -185 -196 -302 -216 -213 -299 -476 -45 -68 63 -14 597 278 274 -119 144 236 -2 -25 204 641 185 -1 66 481
5134 481 -3 -276 -274 52 -12 -46 -400 -103 -398 63 -341 -300 -206 -172 -345 -151 62 -97 77 12 39 276 -52
5157 -52 -118 115 193 413 158 457 358 382 16 189 122 446 139 359 129 167 71 -277 -235 -446 34 -116 -186
$$ packed form
5001d02K38j52J76l83L26J07k75M38K3l05M36k3j91K3J30N18n77K4L21l08L16
5022D60m70J37N9j10n3k20J32J17j19k11M8k28K33q1j36M39l26K47l23M39k12
5043a78l76K05N55m44M41j65J78K64l42j03J03K40k68nR1P0j30J02j76J77k07
5064C2j67O4k80J13M9M0J17Q1%n74N6L98l3L6K32k1jK0k12J04K4J8j87L39K94
5089E42r5m10K29j00L02l0j73j9j55k65J70j85J90J67n93K76k03L04l70M27j94
5110a85j1j06Q6Lq6j77M31k3J31p7O11l19ml93K63R2k38k3K29M37m56j86O7M15
5134D81m84k73KL26o4l4l54K97k95M61m04M1R4L4j73J94K13j59J74o5K7K37l28
5157e2o6K33P8K20k55K99r9K4l66J73o7L24l07K20k30L8r6l48M2k11M80j50p0
$$ plain form
5180 -186 -154 -327 -522 -253 -301 77 -144 -134 -88 314 315 -167 158 570 151 5 155 131 -90 419 123 181 91
5203 91 194 206 27 112 96 25 -341 134 12 8 -178 90 -348 -257 -199 -370 -222 -120 -363 -37 17 -140 -237 49
5227 49 -16 -78 -228 34 191 157 242 499 277 80 211 -210 251 225 241 108 -74 129 -201 -519 -145 -436
5249 -436 -296 -569 -477 -164 15 -546 -446 -14 -26 -381 11 106 -123 376 35 19 382 161 77 81 45 305 56
5272 56 255 257 87 257 -65 -7 211 -378 -62 -15 273 -112 -198 -403 -68 -244 -511 -303 -157 -367 -141 13
5294 13 -8 -201 -168 59 153 195 -32 95 51 104 243 133 46 421 195 -19 -37 448 261 -44 -209 87 -58
5317 -58 -179 9 -140 20 -208 -129 -140 -26 -254 -223 -204 -393 -140 -327 -193 -187 215 96 -94 256 -17 -97 274
5340 274 326 441 122 362 546 441 -40 -36 352 35 87 -161 -18 5 -237 -140 -60 -441 -408 -436 241 -299 -87
$$ packed form
5180a86L2j73j95K69m8L78k21J0M6M02Jm82L25M12m19j46J50k4k21N09k96N8r0
5203I1J03J2j79Q5j6p1l66M75j22mj86K68m38R1N8j71J48J02k43L26N4j57r7K86
5227D9o5o2j50K62J57l4Q5K57k22j97J31m21M61k6J6j33j82K03l30l18L74k91
5249d36J40k73R2L13J79n61J00M32j2l55L92R5k29M99l41j6L63k21q4Ml6K60k49
5272E6J99Kj70J70l22N8K18n89L16M7K88l85q6k05L35j76k67K08J46k10K26J54
5294A3k1j93L3K27R4M2k27J27m4N3J39j10q7L75k26k14j8M85j87l05j65K96j45
5317e8j21J88j49J60k28P9j1J14k28L1J9j89K53j87J34OM02j19j90L50k73q0L71
5340B74N2J15l19K40J84j05m81ML88l17N2k48J43K3k42R7Q0l81L3k8O77n40K12
$$ plain form
5363 -87 -245 -118 77 11 29 -354 159 -114 97 53 -89 56 295 -24 442 477 328 97 72 209 202 31 -52
5386 -52 165 176 -118 -255 -306 111 -400 -180 31 -57 -423 -10 -375 -166 -198 50 -513 -99 201 96 114 -207
5408 -207 193 291 174 -91 117 26 115 102 150 568 -107 32 -156 341 -171 217 210 -138 -87 -338 -416 -348 -174
$$ packed form
5363h7j58J27J95o6J8l83N13k73K11m4j42J45K39l19M66L5j49k31k5J37pj71q3
5386e2K17J1k94j37n1M17n11K20K11q8l66M13l65K09l2K48n63M14L00j05J8l21
5408b07M00R8j17k65K08r1Q9j3M8M18o75J39j88M97n12L88pl48N1k51p8O8J74
$$ [...]
8191g0
##END NTUPLES=NMR FID
##END=
