##TITLE=1H_SL62-d-SeO2-f5-1
 CDcl3, 8 sc, 
 5.4.2019
##JCAMPDX= 6.0         $$ Bruker NMR JCAMP-DX V2.0
##DATA TYPE= NMR FID
##DATA CLASS= NTUPLES
##ORIGIN= UXNMR, Bruker Analytische Messtechnik GmbH
##OWNER= root
$$ XWIN-NMR		Version 3.5
$$ Fri Apr  5 13:51:48 2019 Russian Standard Time (UT+4h)  she@DPX200
##.OBSERVE FREQUENCY= 200.1316
##.OBSERVE NUCLEUS= ^1H
##.DELAY= (6, 6)
##.ACQUISITION MODE= SIMULTANEOUS
##.ACQUISITION SCHEME= undefined
##.AVERAGES= 8
##.DIGITISER RES= 18
##SPECTROMETER/DATA SYSTEM= spect
##.PULSE SEQUENCE= zg30
##.SOLVENT NAME= CDCl3
##.SHIFT REFERENCE= (INTERNAL, CDCl3, 0, 15.7039)
##AUDIT TRAIL= $$ (NUMBER, WHEN, WHO, WHERE, WHAT)
$$ ##TITLE= Audit trail, XWIN-NMR		Version 3.5
$$ ##JCAMPDX= 5.01
$$ ##ORIGIN= Bruker BioSpin GmbH
$$ ##OWNER= she
$$ F:/spectra/data/she/nmr/H-F/1/audita.txt
$$ ##AUDIT TRAIL=  $$ (NUMBER, WHEN, WHO, WHERE, WHAT)
(   1,<2019-04-05 13:50:44.92 +0400>,<she>,<DPX200>,
      <created by zg, POWCHK disabled, PULCHK disabled
       configuration hash MD5:
       00 E9 B6 7A A2 85 ED C7 34 08 36 98 17 FE 4E 26
       data hash MD5: 16K
       53 FA 8A 71 00 4F 25 B6 D1 AB 52 E0 05 59 E2 0B>)
$$ ##END=
$$ 
$$ hash MD5
$$ FC 2E 81 92 E7 87 F0 05 A5 5B 5C 78 82 12 11 BC
##$RELAX= 
##$RELAX= 
##$RELAX= 
##$RELAX= 
##$RELAX= 
##$RELAX= 
$$ Bruker specific parameters
$$ --------------------------
##$DU= <F:/spectra>
##$EXPNO= 1
##$NAME= <H-F>
##$PROCNO= 1
##$TYPE= <nmr>
##$USER= <she>
##$AMP= (0..31)
100 100 100 100 100 100 100 100 100 100 100 100 100 100 100 100 100 100 
100 100 100 100 100 100 100 100 100 100 100 100 100 100 
##$AQSEQ= 0
##$AQ_mod= 1
##$AUNM= <au_zg>
##$AUTOPOS= <>
##$BF1= 200.13
##$BF2= 200.13
##$BF3= 200.13
##$BF4= 200.13
##$BF5= 200.13
##$BF6= 200.13
##$BF7= 200.13
##$BF8= 200.13
##$BYTORDA= 1
##$CFDGTYP= 0
##$CFRGTYP= 5
##$CHEMSTR= <none>
##$CNST= (0..31)
1 1 145 1 1 1 1 1 1 1 1 1 1 1 1 1 1 1 1 1 1 1 1 1 1 1 1 1 1 1 1 1 
##$CPDPRG= <>
##$CPDPRG1= <>
##$CPDPRG2= <>
##$CPDPRG3= <>
##$CPDPRG4= <mlev>
##$CPDPRG5= <mlev>
##$CPDPRG6= <mlev>
##$CPDPRG7= <mlev>
##$CPDPRG8= <mlev>
##$CPDPRGB= <>
##$CPDPRGT= <>
##$D= (0..31)
0 1.2 0 0 0 0 0 0 0 0 0 0.03 0 0 0 0 0 0 0 0 0 0 0 0 0 0 0 0 0 0 0 0 
##$DATE= 1554457844
##$DBL= (0..7)
120 120 120 120 120 120 120 120 
##$DBP= (0..7)
150 150 150 150 150 150 150 150 
##$DBP07= 0
##$DBPNAM0= <>
##$DBPNAM1= <>
##$DBPNAM2= <>
##$DBPNAM3= <>
##$DBPNAM4= <>
##$DBPNAM5= <>
##$DBPNAM6= <>
##$DBPNAM7= <>
##$DBPOAL= (0..7)
0.5 0.5 0.5 0.5 0.5 0.5 0.5 0.5 
##$DBPOFFS= (0..7)
0 0 0 0 0 0 0 0 
##$DE= 6
##$DECBNUC= <off>
##$DECIM= 24
##$DECNUC= <off>
##$DECSTAT= 4
##$DIGMOD= 1
##$DIGTYP= 9
##$DL= (0..7)
0 120 120 120 120 120 120 120 
##$DP= (0..7)
150 150 150 150 150 150 150 150 
##$DP07= 0
##$DPNAME0= <>
##$DPNAME1= <>
##$DPNAME2= <>
##$DPNAME3= <>
##$DPNAME4= <>
##$DPNAME5= <>
##$DPNAME6= <>
##$DPNAME7= <>
##$DPOAL= (0..7)
0.5 0.5 0.5 0.5 0.5 0.5 0.5 0.5 
##$DPOFFS= (0..7)
0 0 0 0 0 0 0 0 
##$DQDMODE= 0
##$DR= 18
##$DS= 0
##$DSLIST= <SSSSSSSSSSSSSSS>
$$ [...]
##$SUBNAM2= <"">
##$SUBNAM3= <"">
##$SUBNAM4= <"">
##$SUBNAM5= <"">
##$SUBNAM6= <"">
##$SUBNAM7= <"">
##$SUBNAM8= <"">
##$SUBNAM9= <"">
##$SW= 24.9336934301222
##$SWIBOX= (0..15)
0 0 2 0 0 0 0 0 0 0 0 0 0 0 0 0 
##$SW_h= 4990.01996007984
##$TD= 16384
##$TD0= 1
##$TE= 0
##$TE2= 300
##$TE3= 300
##$TEG= 300
##$TL= (0..7)
0 120 120 120 120 120 120 120 
##$TP= (0..7)
150 150 150 150 150 150 150 150 
##$TP07= 0
##$TPNAME0= <>
##$TPNAME1= <>
##$TPNAME2= <>
##$TPNAME3= <>
##$TPNAME4= <>
##$TPNAME5= <>
##$TPNAME6= <>
##$TPNAME7= <>
##$TPOAL= (0..7)
0.5 0.5 0.5 0.5 0.5 0.5 0.5 0.5 
##$TPOFFS= (0..7)
0 0 0 0 0 0 0 0 
##$TUNHIN= 0
##$TUNHOUT= 0
##$TUNXOUT= 0
##$USERA1= <user>
##$USERA2= <user>
##$USERA3= <user>
##$USERA4= <user>
##$USERA5= <user>
##$V9= 5
##$VALIST= <valist>
##$VCLIST= <CCCCCCCCCCCCCCC>
##$VD= 0
##$VDLIST= <DDDDDDDDDDDDDDD>
##$VPLIST= <PPPPPPPPPPPPPPP>
##$VTLIST= <TTTTTTTTTTTTTTT>
##$WBST= 1024
##$WBSW= 4
##$XGAIN= (0..3)
0 0 0 0 
##$XL= 0
##$YL= 0
##$YMAX_a= 362890
##$YMIN_a= -553512
##$ZGOPTNS= <>
##$ZL1= 120
##$ZL2= 120
##$ZL3= 120
##$ZL4= 120
##$ABSF1= 10
##$ABSF2= 0
##$ABSG= 5
##$ABSL= 3
##$ALPHA= 0
##$AQORDER= 0
##$ASSFAC= 0
##$ASSFACI= 0
##$ASSFACX= 0
##$ASSWID= 0
##$AUNMP= <proc_1d>
##$AZFE= 0.1
##$AZFW= 0.1
##$BCFW= 1
##$BC_mod= 2
##$BYTORDP= 1
##$COROFFS= 0
##$CY= 11.3945322036743
##$DATMOD= 1
##$DC= 2
##$DFILT= <>
##$DTYPP= 0
##$F1P= 18.9103706918063
##$F2P= -1.10871071338519
##$FCOR= 0.5
##$FTSIZE= 0
##$FT_mod= 4
##$GAMMA= 1
##$GB= 0.15
##$INTBC= 1
##$INTSCL= 1
##$ISEN= 128
##$LB= 0.24
##$LEV0= 0
##$LPBIN= 0
##$MAXI= 10000
##$MC2= 0
##$MEAN= 0
##$ME_mod= 0
##$MI= 1.114404
##$NCOEF= 0
##$NC_proc= 0
##$NLEV= 6
##$NOISF1= 3.799351
##$NOISF2= 2.8
##$NSP= 1
##$NTH_PI= 0
##$NZP= 0
##$OFFSET= 15.70392
##$PC= 1
##$PHC0= -8865.046
##$PHC1= 34.40028
##$PH_mod= 1
##$PKNL= yes
##$PPARMOD= 0
##$PSCAL= 0
##$PSIGN= 0
##$REVERSE= no
##$SF= 200.130013532006
##$SI= 16384
##$SIGF1= 3
##$SIGF2= 2
##$SINO= 400
##$SIOLD= 16384
##$SREGLST= <1H.CDCl3>
##$SSB= 0
##$STSI= 0
##$STSR= 0
##$SW_p= 3612.71676300578
##$SYMM= 0
##$S_DEV= 0
##$TDeff= 0
##$TDoff= 0
##$TI= <>
##$TILT= no
##$TM1= 0
##$TM2= 0
##$TOPLEV= 0
##$USERP1= <user>
##$USERP2= <user>
##$USERP3= <user>
##$USERP4= <user>
##$USERP5= <user>
##$WDW= 1
##$XDIM= 8192
##$YMAX_p= 0
##$YMIN_p= 0
$$ End of Bruker specific parameters
$$ ---------------------------------
##NTUPLES= NMR FID
##VAR_NAME=  TIME,          FID/REAL,        FID/IMAG
##SYMBOL=    X,             R,               I
##VAR_TYPE=  INDEPENDENT,   DEPENDENT,       DEPENDENT
##VAR_FORM=  AFFN,          ASDF,            ASDF
##VAR_DIM=   8192,          8192,            8192
##UNITS=     SECONDS,       ARBITRARY UNITS, ARBITRARY UNITS
##FACTOR=    0.0002004,     1,               1
##FIRST=     0,             0,               0
##LAST=      1.6414764,     0,               0
##MIN=       0,             -553512,         0
##MAX=       1.6414764,     362890,          0
$$ Real data points
##PAGE= N=1
##DATA TABLE= (X++(R..R)), XYDATA
0@%%%%Qj6J6k2L0m0N5o4Q1j05J29j53J84k24K66l14L66m29N01n78O63p61Q73r96
28e30J127j274J442j622J818k038K277k541K829l143L492l874M292m751N260n825
44c061O452p149P934q827R846j1018J2386j4013J5985j8427K1545k5697L1526
57A7482m0362N5514q8384K76992k55346m56089O36698J48709n05890o6209N31850
68B54965p3370m06646J20167L21020k14245j83157K37151R2422k77841R114K65851
79A45431n2026k47291R7029J85294j29084j52175J60961J31849j40612j06181
89a06805J27622P1377j08621m1948J08282J0707j14610L36J09232k4927r3215
100f2570P0721R0984j18088q9132J49262O7808j77221l2741J93640k2260k06031
$$ y = [0, 0, 0, 0, 0, 8, -8, 8, -14, 16, -24, 31, -33, 48, -57, 72, -81, 103, -121, 145, -169, 197, -232, 269, -309, 354, -407, 466, -530, 597, -677, 765, -857, 961, -1077, 1200, -1341, 1488, -1655, 1837, -2037, 2255, -2496, 2764, -3061, 3391, -3758, 4176, -4651, 5195, -5823, 6563, -7450, 8535, -9892, 11653, -14044, 17482, -22880, 32634, -55750, 221242, -34104, -490193, 146505, 295214, -210676, -276885, 254965, 181595, -225051, -104884, 216136, 1891, -181266, 55885, 148307, -129534, -120420, 145431, 93405, -153886, -56857, 128437, -647, -152822, 8139, 139988, -624, -106805, 20817, 92194, -16427, -58375, 49907, 60614, -53996, -53660, 55572, 30645, -62570, 8151, 99135, -18953, -108085, 41177, 108985, -68236, -100977, 92663, 70403, -135628]
111a35628Q1162K06538j33514j85733J72411J33039k06251n3089K46075j7327
121A07683k63403P8430K40948j46095j95667K18904J51712k64050r7926K83167
131A13703L8438k77455K3700K51932q1750k15747J23450J63698j53213j12192
141a25436J63947N5545j62054k455J55075m0056j40367O7098J18903q9779j00586
152a00165J01664Q4746j05298p0037J07084O1837j00241m8366R7051L2356r3681
163c3050j2082R5428m435q8911K5806P2007o0155n6074R3673M0675j19295j8647
175f5060J32784j3871j36753N0729J30510r3341j20868J20920R5937j35654n2267
186h6934J43758q53j48567M9275J41342q4256j12990J18226P5806j43020l6622
$$ y = [-135628, -54466, 152072, 18558, -167175, 5236, 138275, -67976, -121065, 125010, 107683, -155720, -77290, 163658, 17563, -178104, 40800, 192512, -71538, -169464, 113703, 152141, -125314, -101614, 150318, 68568, -147179, -23729, 139969, -13244, -125436, 38511, 94056, -67998, -70453, 84622, 44566, -95801, -28703, 90200, 421, -100165, 1499, 86245, -19053, -89090, 17994, 79831, -20410, -68776, 28275, 60631, -33050, -45132, 50296, 45861, -43050, -17244, 54763, -5392, -61466, 32207, 72882, -46413, -65060, 67724, 53853, -82900, -32171, 98339, 4998, -115870, 5050, 100987, -34667, -86934, 56824, 55971, -92596, -43321, 98021, 13765, -99225, 19001, 94807, -48213, -84835]
197h4835J56214J418j50705L4024J33521o2515j07403Q2815P6275r2912m6839
208f0942R1540J6474q2604R866O8430l2678n6772M3514M1990n1077k9777N3417
220A1381J7763n6617j1836O2762J4248o0616j4326N6483P332n3745O581N8572
232C7982j6865n9929K5498N2852l5378l5151N4680J8190p0216o46P8168k0020
244B9165q0690L7633O7046o2544n2530Q4054L7238r1784j5688Q7948j5265q3661
256e9078M1735P2928o0413n3139P4394K9204q3461m598Q4938j5594p4918L7970
268a0032O3967n2073m6348O2562K8349o6895j3027O4425l567n5713J7544M5853
280C5045l0449l6376L8731K7050m4484j9778M1783Q132m2369L278M4274j1325
$$ y = [-84835, 71379, 72797, -77908, -43884, 89637, 27122, -80281, 2534, 78809, -14103, -60942, 30598, 47072, -35532, -25666, 42764, 10086, -46686, -3172, 38818, -12259, -42036, 11381, 29144, -27473, -39309, 23453, 37701, -22915, -37241, 19242, 26574, -27171, -20590, 37982, 21117, -38812, -13314, 39538, 4160, -30991, 23689, 41879, -28337, -28983, 49185, 29165, -51525, -13892, 53154, -9390, -61920, 22134, 59372, -32412, -48100, 39848, 24583, -59078, -17343, 55585, -4828, -57967, 16427, 45631, -37830, -42428, 42510, 26916, -48002, -10032, 53935, 1862, -44486, 18076, 46425, -20470, -33497, 30928, 27361, -28352, -10808, 35045, 4596, -31780, 6951, 34001, -10483, -30261, 11522, 19654, -22715, -19437, 24837, 13512]
292A3512m7615J0956M2202j4687l1038K7133K8294l3182k4015L8436J5336m1294
304a5962m791M3956o490m3355K0828M4176k9739l7504L8927K6424m8539j5641
316b7710N1741K146n4069R283M8226k4599m0884L7062L1830m5951k1604M8724
328A4195O257m9187R240M6904k3295m1049L4984L4130l9417j9905M3965N723m6749
341b4204Q541M8232j6413m2311K3835L2597l1279k0481L9194J0598m4838o073
353b2602M2154k305l7088J2283L2078k4348l1612K7290K6697k8467j8435L1494
365G139J0430l3623l619L4239l873l3158J0287L0737j5921k3221K6188K0248l0838
378d985j4326L3639N812l3791M967L4425j4668l3647K0378K6265k7616j7210L4009
$$ y = [13512, -34103, -23147, 19055, 4368, -26670, 463, 28757, -4425, -28440, 9996, 25332, -15962, -20753, 23203, 16713, -26642, -5814, 38362, 8623, -28881, 10046, 36470, -12069, -27710, 24031, 26177, -27892, -18609, 29617, 5018, -35866, 1196, 33026, -12925, -34529, 14195, 20452, -28735, -19495, 27409, 4114, -36935, -1951, 32179, -7238, -27143, 16822, 22545, -24204, -15663, 32569, 16156, -26155, -2320, 30277, -1002, -21483, 17711, 28309, -16529, -22602, 19552, 17247, -19841, -7558, 24520, 172, -31440, -4150, 22547, -5920, -24355, 7139, 17569, -16054, -19673, 14566, 10693, -22465, -12178, 18559, 2638, -20583, 5605, 25853, -4985, -19311, 14328, 20140, -13651, -8684, 25741, 11073, -22574, -2196, 24069, -3547, -20757, 13252]
391A3252O929l9259K650M0088j2298l9084K0400L0716l1607k3896L9154J7252
403B4297m2501q127M2667m89l7444J3125L4319k1927l0600K7328K4911k8579j3077
416a6097L1871L424l3932L454L2910r307k8429J5118K2653k2562j8306K5666J0403
429A6866k8357m369K8186l603k9376J0050K7707j6089k4154K2144J8838k6900
441i057j2339L1384O787l3502P91L5296p394l1979J6303L0355k2466k5204K8422
454G397J9567l2700j3901L3257M286l3168M953L1342j4327k8186K0648K3183k6880
467d529j6419K9441M911l4564K266L5609q857l2027J7047K7141k4406j9283L1245
480G575J5208l2992o116L2476l421l2229J1847L0980j6980k4348K3422J8830k7700
$$ y = [13252, 20181, -19078, -16428, 23660, 11362, -27722, -7322, 23394, -8213, -32109, 7045, 24297, -18204, -26331, 16336, 15847, -21597, -8472, 25847, 3920, -26680, 648, 25559, -3020, -16097, 15774, 19198, -14734, -11280, 21630, 12323, -16106, -988, 21665, -897, -19203, 6463, 16866, -11491, -15860, 12326, 8723, -20653, -10603, 17104, 1015, -23139, -995, 17843, -9057, -21396, 9988, 16775, -16727, -15936, 19360, 11966, -20013, -3710, 26645, 4179, -21025, 7397, 26964, -5736, -19637, 13620, 17906, -15262, -10309, 21033, 6706, -21480, -832, 22351, -4529, -20948, 8493, 13404, -21160, -18894, 16715, 7858, -24169, -7122, 20019, -4387, -23670, 7575, 22783, -10209, -16325, 16151, 12730, -19499, -7652, 23328, 6348, -18000, 5422, 24252, -3448]
493c448j3370K8845P311l0328l72K6694p591k5567J1011K1247j5491j7221J9573
506A293J2199k2833p808K2865K487k2638M513K3686r086k2165J5147J9241j8637
519a736j5486K3928J0974k6078l264K9232j992k9034Q801K6232j7741k3310K4199
532D725J7655k8670j1501L0342J287l3162O282L1291j2787k7184J7783K0082k3377
545g234j2980K5803N364k4349L812K1687j0645j7741J8038J4666k0538q247K4083
558A1719K747k5088J521K5003m494k2222Q244J9450j0817j9090J1364J4868j2467
571G38j2048J3927P871j6630n327J6462O70j9099L033J9535p095j8350J2746J7781
585A4214j6218j4870K0026J0440k1750l993K3938r82k2300Q260J8559j3516j2373
$$ y = [-3448, -16818, 12027, 19338, -10990, -11362, 15332, 7741, -17826, -6815, 14432, -1059, -18280, 1293, 13492, -9341, -17149, 5716, 8203, -14435, -9922, 13764, 4678, -17487, -2340, 16901, -1736, -17222, 6706, 17680, -8398, -11662, 17570, 15578, -13456, -4655, 21577, 3836, -19474, 4725, 22380, -6290, -17791, 12551, 13838, -19324, -13042, 18249, 5462, -21722, -3939, 16143, -7234, -20214, 5589, 10953, -13396, -9584, 12103, 1458, -16283, 1755, 16421, -4117, -12364, 11719, 14466, -10622, -9101, 15902, 11408, -10814, -2570, 16880, 6063, -13027, -1663, 13205, 738, -11310, 2617, 10488, -6142, -11469, 4993, 5663, -13436, -10403, 9132, 2037, -16313, -3567, 14214, -2004, -16874, 3152, 13592, -8158, -12151, 11787, 10805, -11495, -3235, 15324, 1808, -10565]
598a0565J9943O627k4373P16K4420r180k4283J5927K1170k2445j8235K4443J0280
611A4445k6376l341K5750k876k2583R049J7300j5030j2614J8352Q228j9022j495
624a0213J9479l424j8406Q623J9121q952j5714J0597J2288j0605j0135J1007P085
637A0751j1615n558J0531K911j0157L97Q975m266j0979P996J0369j2590j1337
650a4572J5405R476j9073p126K1115N092k2057m15K2103k508j8654O919J4791
663A0496j0649q414J4244K756j4903N737J5914j2360j4881J7422J2282k1899r421
676a3676K3470M018k3980N19K1408n345j8435P721J1123j1598n133J3403l07j4304
690a1116N352J3989r366j2138J3849J1784j5706j0421J6654J0158j5277p613J5032
$$ y = [-10565, 9378, 16005, -8368, -7652, 16768, 7588, -16695, -768, 20402, -2043, -20278, 4165, 14445, -11931, -15272, 10478, 7602, -14981, -5932, 11368, -3662, -16276, 2076, 10304, -8718, -10213, 9266, 5842, -12564, -3941, 15180, 6228, -9486, 1111, 13399, 2794, -7341, 3666, 10751, -864, -6422, 4109, 7020, -3137, -2740, 6235, 1969, -9010, -1014, 9355, -3235, -14572, 833, 10309, -8764, -15890, 5225, 10317, -11740, -12155, 9948, 7440, -11214, -4295, 10496, -153, -8567, 5677, 8433, -6470, -733, 15181, 2821, -12060, 5362, 17644, -4255, -13676, 9794, 13812, -10168, -9649, 11759, 6414, -12021, -4300, 6823, -4775, -9908, 3495, 3188, -11116, -5764, 8225, -1141, -13279, 570, 12354, -3352, -13773, 2881, 13039, -2238, -9851, 5181]
703E181P086j2053m959J0582J174j0134J184Q899l744p585P134M652j2094l975
717h652J5508J091j9157L09K0372l797k0566O358J8591j0035j5255J3932J1621
730A0320j4693n326J6201m49j4702Q263J3109j3568j0482J7958O884j9475k661
743h621K1096j206j8945L427J5661p111j3386Q334P854q385l505P015k304o846
757f922O026N165r987m284J2373M075j2654k530J3582J288j4088p63J4662K361
771H304j2378q35J0804j163q175M750O981p127m123R550M18j2767K988J4165p830
786C562j6177J0934J6321j5426j5849J7119J2319j8608q669J8989K775j7781J844
799h647J5503o068j1711J1605P726j3647k355J5675j632j5129O004J6146p965
$$ y = [5181, 12267, 214, -4745, 5837, 7011, -3123, -1939, 6960, 3216, -4369, 2765, 7417, -4677, -8652, 6856, 7947, -11210, -10901, 9471, 5674, -14892, -8534, 10057, 22, -15233, -1301, 10320, -4373, -9699, 6502, 6053, -8649, -386, 12723, -845, -11327, 6631, 13515, -5960, -8621, 12475, 11269, -7676, -4249, 11412, 4301, -9085, -751, 7103, -1282, -4787, 2228, -76, -6922, -896, 4269, -5718, -10002, 2371, 6446, -6208, -8738, 4844, 6132, -7956, -8719, 5943, 8304, -4074, -4909, 5895, 4732, -3443, 1307, 8288, 1161, -2962, 6588, 7006, -5761, -2773, 11392, 3562, -12615, -1681, 14640, -786, -16635, 484, 12803, -5805, -14474, 4515, 7290, -10491, -8647, 6856, 788, -10923, 682, 8408, -5239, -7594, 8081, 6449, -8680, -2676, 13470, 5505]
812E505j3578Q489R834r855o753J1338L899j0294j706P435k383n976M886L029
826C870q274k952R669J784j1036j578J2418K63j3303J394J4475j845j4182L896
840e401J3692n176j1442P307R446p807m450J0187M03j1289L380J2283q241j0868
854g976J1247Q470j5936n715J8129K449j9909p06J7951l370j6468O889J2276r326
868a995q596J1926M454j2885l42J2356l681j0181Q646J0081j0066q637J1878O326
882I284j0449l634J0729K051r738m6Q292k116p755K892N037m272l166N377J526
897D012p981q80Q134j051j0131K145R977m172r547P082R469r424p807J1282O311
912G419j1986k647J3985l00j2833M739J3118r330j0907J2030Q368j3778m427J5871
$$ y = [5505, -8073, 416, 10250, 395, -6358, 4980, 8879, -1415, -3121, 4314, 1931, -4045, 841, 3870, -4404, -7356, 2313, 4097, -6939, -8517, 3901, 4164, -9139, -7745, 6730, 4885, -9297, -5401, 8291, 3115, -8327, -1020, 8426, 619, -3831, 6356, 6759, -4530, -1150, 11133, 2892, -7976, 3271, 11741, -4195, -9910, 8219, 10668, -9241, -9947, 8004, 4634, -11834, -4945, 7331, -1995, -10591, 1335, 5789, -7096, -7438, 4918, 1237, -8944, -298, 9783, -283, -8920, 2958, 9284, -1165, -4799, 5930, 7981, -1757, -1803, 6489, 4373, -3382, -490, 4547, 275, -2891, 2486, 4012, -3969, -4849, 3285, 2234, -7897, -5752, 4225, 53, -9494, -2412, 7057, -2367, -10174, 1108, 7419, -4567, -7214, 6771, 6471, -6362, -1623, 11495, 2165, -8742, 3288, 11656, -2122, -6549, 9322]
926I322r57j5342L767J3639q157j2669J0061R227j1460m867J1078j256j2174M287
940e501J0820o382p905R740N211j0923k395J2002j63j1616K549J1323j714q865
954c819L334P639n162o010O288N739o505n129O213L921p836k571P798n32j0029
969f661K041J0173l416r546M984P700q001o390R987L681j1695j22J2488j863j1052
984g692O366R722r411o425J1986L740j2650J7J4255l678j2673O396R464r420p129
999g132J2204M572j3508j974J1863k462j1358M747Q436p098o917Q861M968r343
1013d141k863Q066l1p548L588Q221m205p125N147O582n832m114P257K945q184
1028b237q03R909M53r791R85Q491l225r141M538P814p193o724Q534M723j1058
$$ y = [9322, 8365, -6977, -3210, 10429, 2272, -10397, -336, 8891, -2569, -7436, 3642, 2386, -9788, -5501, 5319, -1063, -8968, 772, 5983, -4940, -7335, 4667, 4504, -7112, -4563, 6760, 5046, -3819, -485, 7154, 1992, -4018, 2270, 8009, 1504, -3625, 2588, 6509, -1327, -3898, 3900, 3368, -6661, -4620, 5553, 2137, -7409, -2425, 5275, -2726, -9116, 871, 4552, -7143, -7265, 5223, 3360, -7692, -1326, 8396, -1015, -7440, 4546, 8286, -4364, -4347, 9908, 6230, -6443, -47, 9417, -3, -7132, 5072, 9644, -3864, -5838, 6025, 3563, -7795, -3048, 5388, -1710, -8627, 234, 5202, -4141, -7004, 1062, 1031, -6517, -2929, 5292, 1087, -6038, -891, 5691, -141, -4255, 3002, 5947, -2237, -3040, 6869, 7322, -2469, -1484, 7007, 3782, -5359, -821, 6993, -200, -6924, 1610, 6333, -4725]
1043d725k765J0495j07j0222L219R508n485q374P732O225j0022l822J1180J816
1057D653r698L086J0338n679r449P758Q338r185m421R713J202j0857J634J0546
1071G979m309j0068N834P347p740m674R117J782j1660r41J0474j101r157L235
1085c882Q103n776o116P284M807o992k869Q063J692p253O23P377j579o558L039
1100c7O257m041n177N096L781n748k225O216j4p460J346P017l837p740M960O512
1116D906o905m501P648K345r676r88J0278r2q859L099P581n598o084Q107N134
1131F395q559k757R880J186q424J757P332m091o518N933N230o995l998O427J257
1146D055p474JP296k234o870K789O205m061n994M280L951n223k428O473J189o240
$$ y = [-4725, -7490, 3005, 2898, -7324, -4105, 5403, -82, -8456, -724, 5501, -4521, -8343, 2837, 4653, -5045, -1959, 8379, 2700, -6749, 1009, 9347, 162, -4259, 5454, 6656, -4201, -2567, 7979, 3670, -6398, -564, 6783, -957, -5631, 3486, 5268, -6392, -7333, 3141, 2040, -7117, -3882, 4221, -1555, -7671, -387, 4420, -2572, -5441, 2622, 4314, -2939, -2316, 5061, 3482, -3076, -37, 6220, 2179, -2998, 2098, 5879, 131, -2094, 4122, 4108, -3352, -2006, 5011, 1174, -6566, -1606, 4906, -1999, -6500, 1148, 3493, -6183, -7171, 3107, 3015, -5844, -2745, 4836, -762, -6846, 1261, 6395, -2164, -4921, 4959, 6145, -2279, -522, 6810, 2719, -3799, 2134, 7364, 369, -3629, 2798, 4055, -3419, -3418, 3878, 1644, -5226, -2437, 3768, -293, -6287, -2007, 1944, -3279, -5707, 766, 1955, -4285]
1162d285P20O618j266n664L899N320n563l479P858K738q682j358Q779l47q975
1177c687K573Q298n239p139O614N310p687l727O630k5p275J664P215m181n746
1192f402N320M194o954j928P773N62p813K187Q069k546o592L339N613m883l793
1207c854O267K689m582r53M687l46n141J696L522l023m012L516K885n484k233
1222d366O006J596o620j524N330N82n518J572N383k368m925L035M023l729j720
1237c243N148N54n418K747O602l340p188M008O456n317m201P443K588q364k356
1252c881Q086j47p352J408O060m960n323O659L257p427k176Q181j044p979K544
1267d094Q230l974o574N080N623n499l311O472J787m858M16M160k004k327L661
$$ y = [-4285, -3565, 3053, 1787, -3877, 22, 5342, -221, -3700, 4158, 6896, -1786, -3144, 5635, 5288, -3687, -1114, 7184, 1945, -5194, 1420, 6730, -957, -4684, 1946, 1921, -5354, -3690, 3525, -656, -6402, -1082, 3112, -3842, -5770, 2003, 2565, -5248, -3061, 5008, 2462, -4130, -791, 4822, -61, -3854, 2413, 5102, 520, -433, 4254, 3908, -1233, 463, 3985, 962, -3050, 466, 3351, -2133, -4366, 1640, 3236, -3384, -4908, 422, 1004, -4514, -2942, 2441, 73, -4852, -1817, 2206, -1523, -3243, 1905, 2459, -2959, -212, 6390, 3050, -4138, -130, 6326, 1009, -3192, 4251, 6839, -1525, -3881, 4205, 4058, -3294, -1886, 4174, -786, -6109, 550, 3807, -3620, -5796, 2385, 1341, -6638, -4094, 4136, 162, -6412, -1332, 4291, -1208, -4519, 1953, 3740, -1118, -702, 3458, 1454, -873, 2788]
1282B788J282m314m81M189j015m652K171M298k646n405J976M797k890m497K085
1297b314L528k340k960L017K248l860j220M865j89l798K160M822l998m917O180
1312A224M782o518l329P754K038q297K50Q538k343p308K684N725n060l378N466
1327B228J23o608K511N871m761o402O036M731o713l092O819J740o550J99N443
1342A575l15m612J809L180j536m83K449J85k391J218K131j082k176Q48J681r97
1358A484k229J140K250j459l493J048L759j857l584J421K483l048j632L937m02
1373a82l601J476K922k496j970N773K223o884q31P773n80q038K413Q100l516o290
1389c708N105N110n336k728N517o30n560J962M495n071l072N856J388p528p99
$$ y = [2788, 4070, -244, -725, 3464, 2449, -2203, -32, 4266, 1620, -3785, -1809, 2988, 98, -4399, -2314, 1214, -1126, -4086, -1069, 1179, -2681, -3901, 964, 775, -3023, -863, 3959, -39, -4956, 1224, 6006, -512, -3841, 3913, 5951, -2346, -2096, 6442, 4099, -3209, -525, 5200, 140, -3238, 2228, 2351, -4257, -1746, 4125, -636, -7038, -1002, 3729, -2984, -6076, 743, 2483, -4067, -3868, 1575, 1260, -3352, -1543, 1637, 101, -382, 2067, 2252, -139, 1079, 3210, 2128, -48, 800, 2481, 1484, -745, 395, 2645, 1186, -2307, -1259, 2500, 643, -2941, -1520, 963, -2085, -3717, 220, -182, -3783, -2307, 615, -1881, -3851, 1922, 4145, -2739, -3570, 4203, 3623, -4415, -2002, 6098, 2582, -3708, 1397, 6507, 1171, -1557, 3960, 3330, -2230, -268, 4227, -844, -3916, 1940, 3328, -4200, -4999]
1404d999P641j233p073K247N916l035m261M035L139l659j814K946K60j717J926
1419C19K281j801j920K439K491k191j760J797J580k427k014K433K179k406l490
1434b490K270K462k662j897K723J169l725o87K337r26k216K927J401m463K22N557
1450B002q56n355L181O534m643n472N882M195o163j914O574p33n681L157N030
1465E738m965l706O135J121p224P07P013k964p385L408N176l843l603L807J596
1480A011m127l10L636q76j413J901J195k572Q8L131j01k799Q20K507n1j979N97
1497F58K537l79k723n75K785m7k842o9L370j321l553J332K542l216k175M227N47
1514A098m670J022N311k948n364L944M612m967l301O705K338o460J50O549j486
$$ y = [-4999, 2642, 1409, -5664, -3417, 2499, -536, -4797, -762, 2377, -1282, -3096, -150, 110, -1607, 319, 2600, 799, -1121, 1318, 3809, 1618, -142, 1655, 3235, 808, -1206, 1227, 3406, 1000, -2490, -220, 2242, -420, -2317, 406, 1575, -2150, -2837, -500, -1426, -3642, -715, 686, -3777, -3555, 2002, 1146, -4209, -1028, 5506, 863, -4609, 1273, 5468, -695, -2609, 3965, 3232, -2449, 708, 5738, 773, -2933, 3202, 4323, -2901, -2194, 4819, 1855, -5530, -2122, 3054, -789, -4392, -585, 1011, -3116, -3426, 210, -666, -2079, -178, 1017, -1555, -1467, 1664, 1563, -1236, -416, 2091, 2040, 61, 658, 3195, 2816, 93, -482, 2303, 2256, -586, -655, 2715, 1394, -2159, -827, 1715, -1501, -3676, 551, 1098, -3572, -2550, 2761, -187, -5551, -1607, 3005, -1962, -5263, 1442, 3780, -2680, -2530, 4019, 2533]
1529B533m961L922L163m935j488N230K57n089J075M872l683m239L852K869m213
1544h35j617L797j3l913N12K402j389k176J482J369j738j65K883k48j789L67K415
1561A344m80k081Q23K113j42k087N27K805p41k107J251J518j591j494J694O16
1577A968l308m71L244p37l392J722K768l466k984M435K180m633r48M552l96m169
1593c635J860M300k538k950L238K581l690p66M762j11l973J598L169k928k032
1608a115K961J423l810j040L535j3l389P55K366j846k165J572J526k147j569J730
1624a226M72j838P60K060k97j685J385J388l57j513J669J309k321j093K223J780
1640B716k071r79K810M03k950M02K944j695l640K257J867l059j635L697K15l875
$$ y = [2533, -2428, 1494, 4657, -278, -1766, 3464, 3721, -1368, -293, 4579, 896, -3343, 509, 3378, -835, -2452, 1345, 1332, -2581, -2069, 333, -1056, -3232, -1750, -381, -2119, -2284, 599, 351, -1438, -1071, 1344, 864, -1217, -394, 1719, 1577, -510, 17, 2822, 2081, -26, 1225, 2743, 1152, -342, 1352, 1968, -1340, -1811, 1433, 696, -2696, -974, 1794, -1672, -4656, -221, 1959, -2674, -3622, 930, 534, -3635, -1775, 2525, -13, -2963, 275, 2856, -834, -1600, 3162, 3051, -922, 676, 3845, 917, -1115, 1846, 3269, -541, -1581, 1954, 1941, -1448, -693, 1673, -173, -2338, -766, 760, -1387, -2956, -1226, -754, -2592, -1832, 228, -69, -1754, -369, 1019, 662, -851, 818, 2127, -194, -1287, 936, 2716, 645, -334, 2476, 2879, -71, 331, 3275, 1580, -2060, 197, 2064, -995, -2630, 1067, 1282, -2593]
1656b593lL615k000l173K924K759l607r91M428j10l924R73L896k097k849L338
1672E86K330l105m14L487L00l472K80L108q24l081J309K418k005k151J656Q50
1688A272k684j346K193J129k169j32J931k79k121K27K068j191j900K002K250j943
1704f93o25K662N59l223N56L716j294l153K426L245l049k030L117M88m313j42
1720a753M255p99l502J677K581l289j883L192L27m137J14L689r85l145K046L384
1736A772k315k910K668K238k012r86K718O68k517P74K648j406k231J931J783j956
1752H67j132K570Q1l060qK569p03l245J092K546j826k798J766K388k833j526K721
1769e31P85k620J88L105k00k996J357K682k376j424L427J329k969m20L328l37
$$ y = [-2593, -2596, 1019, -981, -4154, -1230, 1529, -2078, -3069, 1359, 1249, -2675, -1702, 2194, 97, -2752, 586, 2916, -189, -603, 2884, 3184, -288, -8, 3100, 2276, -805, 504, 2922, 917, -1234, 422, 1272, -1412, -2758, -565, 564, -1605, -1737, 194, -85, -2206, -1979, 89, -1102, -3002, -1000, 1250, -693, -1318, 1344, 1903, -1320, -764, 2952, 1658, -1495, 931, 4176, 1127, -903, 2214, 2702, -1611, -1753, 2502, 1703, -1799, -122, 2459, -830, -2713, 479, 806, -3331, -3217, 472, -513, -3658, -1612, 1772, -543, -3453, -785, 1453, -559, -1545, 1173, 1841, -676, 98, 2746, 1340, -891, 1040, 2823, 867, -265, 2305, 2386, -674, -682, 1887, 1184, -2061, -969, 1577, -249, -3047, -1281, 1107, -1726, -3252, -531, 254, -2366, -2178, 927, 727, -2269, -912, 1770, -606, -2030, 1397, 2726, -243, -663, 2665, 2328]
1785B328l347J677K959k081l271K768K167k977j619K932n57l621R84L208k072
1800e22k602J895K375k887j629L270J36k608M71K831j47k356J547J877j849j182
1816a380K120J507k659M33K509j64k437P78J966r17k711J174J528j695j802J939
1832A89J171k010r59J847n48k616J022K566j370k311J837J951k248j078L393L86
1848A222l378N59L576J16l204J696K401k144j942L113J239l980K33L167j156k611
1864a093J596J966k322k047K565N70l122m58L040p43l000J553K425k005k105K558
1880f22J760k236n29K467N23k080J17K231q80j665J530J996j092j581J678J256
1896B873k290j642K617M75k802m20K494Ok695P11J566j717k165J864J777k260
$$ y = [2328, -1019, 658, 3617, 1536, -1735, 1033, 3200, 223, -1396, 1536, 979, -2642, -1658, 1550, -522, -3124, -1229, 1146, -1741, -3370, -100, 36, -2572, -2101, 730, 583, -1773, -226, 1651, -198, -1380, 740, 2247, -412, 21, 2530, 2366, -71, 707, 2673, 1756, -955, 219, 1747, 52, -1750, 189, 1360, -650, -1609, 238, -310, -2926, -1904, 662, -708, -3019, -1182, 769, -1479, -2557, 836, 1222, -2156, -1597, 1979, 2095, -1109, 587, 2988, 844, -1098, 2015, 3254, -726, -493, 2674, 1518, -1093, 503, 2469, 147, -1900, 665, 1235, -1887, -2345, 695, -48, -3048, -1495, 930, -1075, -3180, -622, 1138, -1098, -1627, 840, 1363, -717, -600, 1631, 751, -914, 616, 2612, 1520, -61, 1617, 2873, 583, -1059, 1558, 2033, -769, -1189, 1305, 1311, -1384, -673, 893, -824, -2989, -1125, 652, -1608]
1912a608q23K377N41k473M44K653j230k286J739K413j849k94K129Q22k852N15
1928B18K448j169k382J702J993k106j487K347J92k564q47K845o89k652J379J856
1944A084k329j664K559Q82k917m64L452L74l108N25K663r09j960J554K458j952
1960B48j775K919J297k598k00K373j80k403Q42K127j196k327J125J311j637j653
1976a727J882Q49k751j06K121K65k369k31J897l86k095J470J818j569n60J371
1992a21J009j983P05K192q86j888K345J571k190j243J924J210l135p1K406n83
2008A262k197J180J988k229j313J706Jk428M86K222j222k674J673K050j674j586
2024b755K376J397k171p97L146J7k326P65K297m75k024J364J447j490j473K492
$$ y = [-1608, -2431, -54, 487, -1986, -1542, 1111, -119, -2405, -666, 1747, -102, -396, 1733, 2555, -297, 218, 2666, 1497, -885, 817, 2810, 704, -783, 1564, 1756, -808, -1655, 1190, 501, -2151, -772, 1084, -1245, -2909, -350, 532, -2385, -2849, 603, 977, -2131, -1606, 1057, 148, -1812, -258, 2200, 248, -1527, 1392, 2689, 91, -109, 2264, 2084, -319, 523, 2650, 1454, -873, 252, 1563, -74, -1727, 155, 1004, -1747, -1853, 268, 533, -1836, -2067, -170, -556, -2651, -1181, 637, -932, -1492, -121, 888, -1095, -390, 1802, 916, -972, 1373, 2944, 754, -489, 1435, 2645, -490, -561, 1845, 1262, -935, 245, 2233, 4, -1309, 397, 398, -2030, -1544, 678, -544, -3218, -1545, 505, -1169, -2755, -379, 1018, -1153, -1950, 1196, 1213, -1113, -348, 1949, 1474, -550, 814, 2261, 771, -702, 1790]
2040A790J124k301j297J843N21k536K4K410q22k443O58K059j815j903J859J120
2056B91k148j07K298k41k351J287J953j230j536K245J349k192o23K777M90k777
2072e15N53K133l41j802N98J607j900p72J765m33j895N43J415j297j861J376J948
2089A122k379j410K123J395k484q17K863K00j999l36K715n38k005J641J247j321
2105A7n56K620J91k557K99K734j141k394J318K046k049j818J695J047k285n82
2121a415J716J08j993k13K139j242j197J358J081j973o23K250K36j510J69J926
2137H17J13k114J123K337j016j690R81J707j648m17J064M22j774K49J526r74j609
2154i03P36J440j989j122K182L22k501l27K429k64k380O96K176r62j899J508K013
$$ y = [1790, 2914, 613, -684, 1159, 1680, -856, -832, 1578, 756, -1687, -1029, 1030, -785, -2688, -829, 291, -1857, -1964, 334, 93, -2258, -971, 982, -248, -1784, 461, 1810, -382, -1005, 1772, 2262, -515, 38, 2171, 1830, 28, 626, 2233, 333, -439, 1326, 893, -1002, -459, 956, -341, -2202, -826, 1122, -1257, -2667, -544, 851, -1633, -2450, 413, 613, -1386, -1722, 993, 455, -1550, 91, 1338, 17, -539, 2081, 2272, -285, 14, 2748, 1607, -787, 531, 2577, 528, -1290, 405, 1452, -833, -1415, 301, 409, -1584, -1797, 342, -900, -2097, -739, 342, -1631, -2254, -4, 232, -1278, -1109, 817, 930, -1184, -61, 2276, 1260, -430, 551, 2258, 610, 193, 1257, 1679, -95, 154, 1680, 706, -903, -167, 1273, -716, -1838, 344, 666, -1835, -2162, 267, 3, -2377, -1681, 495, -467, -2366, -858, 1155]
2171A155j687q65K368L54j752K66K580j212k348J930K003k341j216J989O23k159
2187c12l10K438l61k271M94J200j477j115J573L53j866l27J951l35k086Q90K285
2204G24j208j504J733J256j464n53J796P16j526k34J950l69r99N49R92p71r49
2221A39P33R35j470q44J294L05j932n42K341q64j927O74J881j249j944J577J395
2238E02j877n39K343R3j970N89K060j368r74J956J407k542m63K874J5k580L98
2255g6K695j237k274J782R79j894r77J643L92k344l0K035q08j957P15J600j111
2272h67j373J650N44j209j06J379K79j383M61J511m08r19N51J366q52p20J163
2289A067P88j330m86J433J06j973J91J729p96j740R43J389j912j377K052M93k405
$$ y = [1155, -532, -1397, 971, 1325, -427, -161, 2419, 1207, -1141, 789, 2792, 451, -765, 1224, 1847, -312, -622, 1816, 1455, -816, -322, 878, -599, -1714, -141, 212, -1654, -1981, -30, -365, -2451, -1561, 724, -484, -1988, -255, 1001, -463, -1016, 780, 1496, -30, -264, 1686, 1317, 318, 867, 1859, 1088, 139, 872, 1807, 337, -507, 787, 1092, -840, -1382, 959, 95, -1832, -1158, 723, -526, -2470, -893, 502, -1375, -1914, 429, 522, -1448, -859, 1201, -167, -1141, 815, 2222, -320, -783, 2091, 2106, -474, -76, 2619, 1382, -892, 890, 1869, -25, -1002, 641, 1033, -1311, -1341, 694, -114, -2071, -1356, 244, -867, -2240, -590, -46, -1255, -1361, 18, 297, -1086, -625, 886, 478, -441, 110, 1476, 624, -96, 1067, 1855, 525, 39, 1472, 1578, -395, -204, 1525, 729, -1011, -68, 1321, -591, -1968, 84, 577, -1828]
2306a828j54K261l40k588J302J976j566p30J634J081j987k6K170O3k197J073K068
2323B212j515j249J709J104j813n82J683n90j585N43J495j022j454J383K76j666
2339a071m39J229K11j366j1R31L72j056O0J254k06j167O35J271l36q80O84J274
2357A389j186m06J518M90j418m18J730l55j237K38J423j311j239J192N47j885
2373i28m95K038o40j956P03K213j553j799J978J579k588o65K588j46k041Q06K379
2390A473j101j196J633J131j693k67J688j97j525R51R66j371j076J388N27j759
2406d28j22J203j92j348J60J078o41j368L34P43k9p67L95R91k95j015J136P24
2424E59q71m94J294O04r89j15J283J90j552M50J455j081j332J540Q82k179p3J758
$$ y = [-1828, -1982, 279, -61, -2649, -1347, 629, -937, -1667, -33, 1048, -939, -965, 1205, 1268, -929, 144, 2212, 697, -552, 1157, 2261, 448, -134, 1549, 959, -626, -83, 1412, 390, -1064, 319, 595, -1071, -1510, -281, -70, -1436, -1447, -516, -144, -1200, -1140, 114, -92, -1259, -624, 647, 311, -569, 115, 1389, 203, -203, 1315, 1805, 387, -31, 1699, 1344, 107, 345, 1768, 457, -782, 410, 957, -928, -1423, 615, -25, -1981, -1278, 935, -618, -2417, -439, 1140, -1448, -2113, 475, 329, -1712, -906, 1473, 372, -824, 809, 1940, 247, -20, 1668, 1471, -54, 897, 1863, 492, -584, 804, 1331, -428, -550, 653, 461, -887, -727, 351, -290, -1658, -1324, -581, -610, -1377, -982, 9, -286, -1301, -165, 559, -312, -806, 488, 1092, 103, -12, 1271, 1461, -91, 359, 1814, 733, -599, 941, 1823, -356, -429, 1329]
2442A329r78j414J024P73j820o26J750J42j983L59J613p05j713J374J573j399
2458g01r04J768M29j092J69J301j13r23N99R06p41p87J335K82r64m27R04K13j122
2477A32j66Q85m69j098k81Q35l46j045O77Q20r49l23Q39O13p93o42J646l24j254
2496a243M47J865j058q56J534P94j428j54J912k67j724L49J897j487j400J401
2512E82J060k005n70J811o51j504N13J206j153j187J186Q81j770J82J416j10j314
2529a427O65J122k37o36Q77M37o73J69Q58j31p95M26K96K1l02L23K71m01o38K01
2549D26k0K9r01O8N69o67r54M90P66o95k38R25j08j105N09R34l7j553J408J028
2569H74j301p03K192L97j741N57J760p92j622J215R18j574l03J538q13j520J065
$$ y = [1329, 351, -1063, -39, 734, -1086, -1712, 38, 180, -1803, -1444, 169, -536, -2249, -875, 698, -701, -1605, 163, 592, -500, -331, 970, 857, -66, 533, 1439, 698, -89, 1246, 1528, 564, 137, 1041, 1254, 132, -34, 851, 382, -716, -997, -162, -508, -1553, -876, -56, -1005, -1328, -489, 124, -669, -1311, 335, 11, -1243, -796, 1069, 11, -845, 689, 1483, 55, -99, 1813, 1546, -178, 171, 2068, 581, -819, 582, 1642, -363, -933, 878, 227, -1277, -764, 442, -711, -1898, -712, 169, -1601, -1419, -3, -113, -1427, -762, 360, 123, -513, 364, 801, 128, 297, 1155, 1024, 229, 655, 951, 972, 670, 993, 1264, 863, 225, 426, 406, 435, -466, -398, 171, -496, -1450, -960, -194, -889, -1127, -202, -310, -1415, -906, 28, -9, -1562, -154, 874, -427, -1130, 1062, 1459, -282, 275, 2035, 1243, -379, 836, 1754, 180, -123, 1415, 602, -918, 147]
2586A47J083k027o73J799N3k150P20J343n98j557J090J089j206p59J239P64j087
2603g30K50Q68j61J08k4J00K87j7L1j31K89j12j83O37m24p62J91J091o72j221
2623e85N95N76j249q38J270N73j599j72J472k49j270O21R04j134L04J381j84j543
2641a127J256J295r97j134J793P89j790O6J305j77j425O91J005j126o53J168j16
2658H23j450L72N77r76o67J290n1r66l0R05m32q07J165J34r50J6J083Q3p50K36
2678c95R82j34l11J76J057n55r0k78L92K23n48k89K43N62q60o93N23O51r90n88
2698i22J458q35r54M77P07j055l01J280k21j201R63J217j036r15J752R72j705
2715c19J19J409o5j272O99Q48j069l96J434m23j267M20J536j132j309J211M68
$$ y = [147, 1230, -797, -1470, 329, 382, -1768, -1048, 295, -303, -1860, -770, 319, -887, -1646, -407, 357, -730, -480, 388, 227, 335, 311, 411, 698, 681, 712, 581, 870, 758, 575, 1212, 788, 26, 217, 1308, 636, -585, 10, 586, -663, -1501, -231, 342, -1257, -1429, 43, -206, -1476, -855, 49, -1085, -781, 600, 416, -1127, 129, 1424, 427, -707, 1086, 1875, 85, 151, 1456, 1279, -146, 545, 1550, 424, -229, 939, 823, -627, -255, 322, -654, -1321, -31, -82, -1048, -1078, -173, -605, -1412, -247, -113, -1063, -1047, 36, 119, -631, -395, 587, 453, 142, 318, 1375, 820, 730, 452, 844, 1067, 519, 230, 473, 1035, 175, -518, 5, 656, -334, -922, 536, -299, -1253, -776, -69, -1124, -1425, -145, -366, -1567, -604, 613, -423, -1338, 414, 1386, -319, -200, 1209, 1144, -128, 571, 1419, 350, -46, 1388, 965, -302, 118, 1654, 522, -787, 424, 892]
2732H92j649l13J163o83p50J68J205r23O2N07m9n19L95O76j274N10J068n58j63
2751b35M46O48l55j52M91J80j68k26k8l98L80K73o95l40M39n76n77R79K46o82
2771c50m09R29o09q80Q05Q25j490o15J366L91j318N78J505j58j069P34L27n78
2789a6j17J092k67n89O35Q59j494O5J429l85j824N75J091q41j207P08L38r16P9
2808g85P83m21l67J42J72l94K68L06j29m83O67M46n22K92M32n3J23M66m00r1K91
2829G43N02r63j3N58n3m27o4N40n81m37K71k49m47K92J48n97K44K57l88q22R03
2850e83Q28o28q09P67P43o54k60J253m93l94N50N77m21k73Q18M8p47J89P74q62
2870D23n80N72L13q93k38O42k79q42O87%m06k15L50j32m76M68J07l48P5J40J11
$$ y = [892, -757, -1070, 93, -590, -1340, -1172, 33, -890, -828, -321, -370, -889, -494, 182, -1092, -582, 486, -72, -235, 211, 859, 504, 352, 843, 1023, 855, 629, 601, 203, 583, 856, 161, -179, 260, -316, -893, 86, 332, -350, -759, 170, -439, -1319, -514, 311, -1179, -1794, -428, -37, -1355, -777, 728, 570, -499, 235, 562, -16, -133, 959, 692, 103, 738, 1597, 103, 168, 1597, 1212, -612, -37, 1054, 213, -994, -286, 52, -864, -785, -2, -423, -790, -648, -476, -870, -602, -296, -425, -908, -241, 205, -317, -25, 407, 354, 477, 943, 543, 452, 743, 1245, 282, 269, 827, 774, 347, 283, 823, 242, -195, 76, -173, -620, -328, -180, -777, -533, -276, -664, -1486, -583, 245, -383, -1192, -425, 318, -336, -596, 657, 164, -230, 320, 897, 476, 203, 1021, 1069, 322, 511, 1285, 423, -157, 415, 728, -165, -403, 239, -40, -882, -195, -195, -601, -816, -466, -598, -1074, -606, -499, -847, -772, -632, -521]
2891e21N43N0K06K66p3L45m83n0N93m8o71M69N15j004K33L02r1l41q1K50j015
2912f06O3P44k62j007M45K19l56m49O31M22q57N45O40n57k91O26J96l47jJ099
2932H97m64m79L45J011p58l48O09L09r07K26M78j98j108M00M72p67j82M04j24
2951a84n86K91K64k06p1k18j17J50l1J16J74J24K24M22j84K17k73L2J57J42K90
2972G33k5j83l2J07j20J02p6j65K10m67j19L59j27o84j4L18p21J16J03N87m40
2993e38k10M28K96o36K79M68j74k12J59Q53m23n3O25m8m25O7K45j45j52L95j32
3014F67k20j39K46m51n12L28L55m04n22o2N87m46l63K75J53l25mN32j00q5J96
3035b94M43j85j46R8P40m04K02J20L30l50K7K96l78j17L83l23k1l93L30O6q19
$$ y = [-521, 22, 72, 278, 544, 471, 816, 333, 283, 876, 828, 157, 626, 1141, 137, 370, 672, 581, 240, 159, 409, -606, -543, 201, -61, -1068, -623, -404, -760, -1209, -578, -156, -1013, -468, 172, -385, -676, -50, 146, -201, -202, 897, 433, -46, 299, 1310, 552, 204, 813, 1122, 215, 441, 919, 721, -387, 13, 485, -282, -464, -60, -184, -770, -479, -215, -421, -492, -710, -827, -677, -708, -592, -418, -294, -70, 352, 168, 385, 112, 144, 301, 443, 733, 708, 525, 493, 600, 480, 582, 506, 341, 551, 84, -35, 324, 197, -487, -501, -183, -904, -788, -685, -98, -538, -748, -320, -24, -660, -381, 87, -87, -299, -140, 713, 290, 237, 862, 814, 389, 456, 701, 556, 404, 799, 667, 447, 308, 554, 103, -409, -81, 274, -130, -652, -714, -127, -573, -936, -661, -508, -833, -837, -305, -405, -490, -294, 149, -36, -182, -84, 656, 252, 454, 574, 904, 554, 581, 877, 499, 382, 765, 442, 421, 28, 358, 424, -395]
3056c95J23K83l42m59M58L14r25k12L60P83j005j1N81N18n67J22N23L71l09k28
3076a7P07l23l22Q26j2l31n7J05%m70M34M3m63J57K9j58n19M4M8k44j29k88L69
3099e71l52J04L61M18l75j67N73l54O5K43L40l0n02M65O72k72p35N59K99O8m33
3120C76M60m7k42n46Q9l4k86L36k70j78m8M07k13m54R7n6m0k63J18M73j71m44
3142i36J145j2o89L43O73N9n13J08Q55k09m83J5N12m35l90N55Ro18P0N65j58n67
3164a01mk49j62o20N15L55n91L40J09J0n53M28L50r6m15M34Q62n73l06O18M77
3185H28p63j55J007N4o71K49N93k51r06M12L52p53j48N24r4q95Q7N57k02p00Q3
3206g92N31m46j03K82L74n98k7Q99j87O2r1R81r03j44Q87l3r09K96J133k65j021
$$ y = [-395, -272, 11, -331, -790, -332, -18, -943, -1155, -795, -12, -1017, -1028, -447, 71, -496, -374, 149, 520, 211, -17, 690, 367, 45, 871, 859, 528, 471, 576, 576, 106, 540, 583, 120, 277, 306, 148, -371, -327, -279, -523, -652, -940, -571, -923, -819, -458, -40, -415, -582, -9, -363, -298, -55, 285, 255, -247, 218, 890, 618, -117, 442, 741, 809, 376, 836, 789, 547, 1, 90, 56, -230, 106, -164, -342, -390, 17, -196, -650, -553, -609, -649, -912, -794, -321, -492, -936, 209, 197, -492, -149, 524, 583, 70, 178, 1033, 824, 341, 356, 868, 433, 43, 598, 607, -11, 59, 624, 466, -101, -105, -354, -516, -1136, -621, -266, -857, -517, -408, -398, -951, -523, -173, -269, -684, -250, 612, 39, -267, 351, 828, 65, -90, 917, 971, 300, 549, 1142, 891, -15, 397, 749, -4, -152, 372, 278, -617, -530, 27, -175, -875, -792, -261, -707, -810, -528, -154, -752, -779, 120, -67, -5, -96, 885, -18, -162, 725, 692, -217, 79, 1212, 947, -74]
3227g4M52O68o35r77P31Q44q62q00M11L88p01l19L79L41q04K75M08m07J00K17
3247c65N3j19p9O64j49o87O58N20m12qM89J08m12j82M75j50k56J50M46j62n20
3268F2l6K32j6p63N16M20p60m13L21M46p77l77R00p9o25L95N04O6l43J38M29j86
3290E4k57R40o00J1K50N60l62n07Q78J24q61k37Q66l84o64L06J44k91m57P08j26
3311I5r04O7M14J85m73M9N25l68l45M12M9q2k78Q66J76J14k99K53O8K85k39q5
3333D85oj42j31K71P0o1m29K57j88k91K80J10p40P9M61l46m12j87N93j9p79M52
3355f73Q09n90l65J025j92n31N28O15m69l71O70M85r06k73J344n21q04K81O23
3374F85m83n01M80J32m22j53M28m80P3L3k44j26k76N87o1k48j58O25l74k8L53
$$ y = [-74, 378, 1046, 411, -566, 165, 1009, 147, -653, -242, 146, -555, -874, -495, -154, -958, -683, -275, -682, -582, -365, -312, -431, -510, 154, 5, -682, -24, 496, 84, 76, 565, 673, 261, 79, 554, 404, 148, 298, 744, 582, 62, 26, 258, 242, -521, -5, 415, -345, -758, -437, 9, -768, -1145, -245, -324, -949, -554, -50, 16, -327, -189, 240, 54, -203, 737, 137, 148, 398, 958, 596, 89, 967, 1091, 230, -7, 859, 475, -189, 117, 261, -30, -487, 221, 95, -809, -742, -328, -143, -616, -567, -42, -410, -755, -343, -294, -376, -654, 212, 388, 502, 203, 456, 524, 809, 570, 485, 479, 337, 206, 477, 547, 486, 57, 314, 126, -165, 115, 225, -515, -436, 25, -321, -733, -920, -327, -346, -1125, -673, 136, -454, -819, 206, 14, -517, 11, 626, 157, -214, 456, 941, 35, -238, 1106, 585, -219, 62, 685, 202, -299, 181, 313, -109, -262, 166, -314, -241, -208, -452, -578, -854, -267, -328, -576, -734, -109, -483, -511, -158]
3395a58L13j98J62N84k53l70J62J14L18J04o84M28j4j7m30M06M64r72p3M30J7
3416C33j043KO12j69n36K27P56o08m27L19N53o56N08M08p84J29M83K98n53J91
3436D3N59J17p57K43P57k67o50N61J48n15l94R71o33n70M73K55n65l57K84Q3l39
3457e53k9M72k47m44r4L10J59J13J46k49N61J50k15p1N06j90k79L26J98N4j53
3478D71J90o9k82K73k02j02l24N76j93j365R06L52q66m00R86l55m87J20J047p05
3498d29m95O95M37p85j42J030J0n38M21M84m28k19O51k05k89P3O59n89k7M48j64
3519E98p55J44L80m07n04M22K34n29k48O51k22q44N14L7M6K92J15L7o3m96P31
3540A33k34K82j67K09L1N2K96J7o2P4k8j29L82k40n04QM49o80k22J53j3k41o4
$$ y = [-158, 155, -43, 119, 703, 450, 80, 242, 356, 674, 778, 94, 522, 508, 491, 61, 467, 931, -41, -114, 316, 333, -710, -708, -96, -265, -801, -574, 182, -426, -853, -534, 19, -637, -129, 279, -505, -376, 107, 405, -148, 43, 602, 719, -38, 205, 962, 695, 45, 606, 754, 239, -155, 816, 183, -387, 86, 341, -224, -581, -297, -214, -553, -582, -110, -357, -801, -895, -585, -426, -313, -167, -416, 145, 295, 80, 9, 515, 325, 46, 372, 570, 624, 471, 661, 592, 310, 583, 381, 279, -45, 531, 338, -1027, -121, 231, -635, -1035, -49, -404, -891, -771, 276, -429, -924, -229, 208, -577, -719, 311, 321, -217, 204, 688, 260, 41, 692, 487, 198, 271, 930, 341, 314, 762, 598, -157, -13, 367, -40, -544, -122, 112, -417, -665, -14, -236, -1080, -566, -529, -483, -191, -76, -39, -102, -598, 133, -101, 181, 14, 223, 254, 306, 602, 619, 557, 631, 603, 474, 856, 616, 112, 120, 569, -111, -333, -180, -193, -434, -498]
3563d98L89m10l41M97K95o98j53R80k08n72N23O90o79n2O38N54j130K66O07o11
3583H7O0M87k6j99r2L40m3m30J13J08m25L90m29J26l54J15J86o75J81J08l55j1
3605g38K83J18j1m08P44m33K00J65J01L9L34j18m50L04L68P1n23L78N40n56l71
3626C7N77J02n83l31M32k96l86NJ11j50l2L21L0n72J12M38m31k34R37R5n97O70
3648B55J04m31K92K62m9m91K97M81J30o54K68O3J05p51K92K45n12M7o8k35J58
3669a92J71n40j9N18m70j8P1J38j00j41L58L25o88K81L91k64L35L06o2j96J75
3690C79J66j96r8M37J14p60L76j31j12m40L23J32j84j92J88n6m87L27M63p82n50
3711a083P46J35o9k84K76M0m82R79l34J02K23K68j99k54M42J19l88j4L88l55l41
$$ y = [-498, -109, -519, -860, -363, -68, -766, -919, 61, -147, -719, -196, 494, -185, -237, 401, 955, -175, 91, 698, 87, 147, 634, 608, 409, 317, 657, 614, 184, 297, 405, -20, 370, -59, 67, -287, -172, 14, -661, -480, -372, -727, -738, -455, -337, -348, -756, -12, -445, -245, -80, 21, 60, 394, 276, -174, 130, 498, 569, 46, 424, 964, 408, 37, 614, 716, 133, -198, 234, -62, -448, -443, -332, -482, -514, -193, -163, -735, -623, -185, -616, -850, 87, 182, -415, 255, 359, -72, 220, 482, 433, -58, 239, 720, 850, 196, 464, 527, 632, -119, 173, 418, -94, -47, -115, -350, -192, -21, -561, -580, -62, -532, -550, -479, -341, -441, -582, -224, 101, -587, -306, 85, -179, 156, 462, 400, 204, 379, 545, 349, 251, 688, 802, 42, 418, 287, 175, -265, 58, 190, 6, -186, 2, -54, -541, -214, 249, -533, -1083, -337, -202, -271, -555, -279, -239, -721, 258, -76, 26, 249, 517, 318, 64, 506, 625, 237, 223, 611, 256, -85]
3732h5N30J02m56M6K71o21J8J24J86l88J70ok40k14L93l96Q6N0K5qK57L80l84
3755a60q5j0O27m24L46L54P1n13K50r7K35r4j26M13p09J59K63j41l09j47L6m94
3777e55L21N0J02m86m8K99l54K26M28k27o14N89O88n47k86P86P9j02l0O1k36k66
3799a22M12K82j14J81j9k84j3R9K8n43M37j44p0o54K20r1j74k23P73k19l98M29
3821b07l60o5M88J09o74M92J37Q1j61M11n5K02j05J81j16R5J00K97j96q69R13
3842F98j22l05m60M11j72k73L43k00j3L7j46k74r7p4M41l11n4K12k61J40N05M7
3864G2k06L6L97K21l44J36O7j20k7L40k15l0K1j9k60o7j38M7j78J18K68m54j81
3887e16K03k88l31M61K08k97Q0K31j16m16N70L86m17L9M91k68K0L62J87m28K90
$$ y = [-85, 445, 547, 91, 137, 408, -213, -195, -71, 115, -273, -103, -109, -349, -563, -170, -566, -480, -430, -405, -413, -156, 224, -160, -245, -255, 372, -52, 294, 648, 719, 206, 456, 359, 594, 500, 374, 787, 78, 237, 500, 359, 50, -97, -61, -555, -234, -184, -82, -568, -616, -317, -671, -445, -17, -244, -858, -269, 419, -128, -414, 372, 451, 349, 319, 380, 144, -122, 290, 572, 458, 639, 620, 336, 323, 422, 450, -93, 344, 200, 130, -524, -304, -395, -569, -792, -19, -238, -636, -207, -567, -632, -144, -35, -709, -217, -80, 1, -160, 251, 196, 398, 293, 474, 358, 453, 553, 850, 654, -215, 698, 576, 271, -189, 222, 50, -223, 120, -80, -93, -56, -202, -476, -573, -647, -206, -517, -571, -359, -620, -480, 25, 72, -134, -98, 299, 520, 176, 312, 379, 259, 232, 572, 357, 327, 348, 329, 69, 2, -136, -89, -267, -149, 119, -335, -516, -313, -601, -932, -471, -263, -560, -480, -249, -365, -781, -211, 175, -242, -203, 288, 20, 40, 402, 589, 161, 451]
3908D51L67l28n56L53K97o50K54l7J12o13J08L01J41n00M7j67K5M2O9j28M4K45
3930a23j57k99N3P66j73l90K63N15n70L53L72l23j80K8O20l81j72M27K8p71L00
3951A86M71k89l31K3l62K26l60J66k16K57K94p51O0K32K84o63K30O37l6n75L41
3972a76L28k5l10P95l11m8J45J67j62j04M64m44l40L08L04n34j17M38j15p80M23
3993i4J91k23o88M95L78q92M07J23M39n13p1O00j24m27L43J80k02K97j36L5J90
4014C08L67q7k58P9J25r9k45L58k26j18k19L37l77J66j42m6l15J18l8p7O3K48
4036g8n84J39J93K62l78K29K75k38o7N39K10m56j63P53k23m48M09K04m30j37K95
4057C06N21r09J59L50n53J07j03k0m13L85J35j59m07L58K85n02P3P54n42k31K20
$$ y = [451, 818, 490, -66, 287, 584, -66, 188, 151, 263, -350, -242, 59, 200, -300, -253, -420, -395, -353, -284, -412, -368, -123, -280, -579, -526, 240, 67, -323, -60, 455, -115, 238, 610, 287, 107, 135, 755, 374, 202, 629, 657, -114, 186, 657, 368, 37, 60, -302, -76, -436, -270, -486, -229, 65, -686, -626, -394, -110, -773, -543, 94, 58, -517, -176, 152, 127, -183, 612, 301, 253, 398, 565, 403, 299, 763, 319, -21, 287, 591, 57, -60, 378, 263, -517, -94, 97, -126, -814, -319, 59, -833, -426, -303, 136, -377, -448, 152, 28, -399, -56, 124, -78, 219, 83, 118, 308, 675, 588, 330, 409, 534, 435, 190, 548, 322, 204, -15, 322, -55, 111, -31, -77, -392, -274, -312, -389, -326, -78, -662, -523, -330, -68, -446, -217, 58, -180, -247, 292, 502, 46, -117, 636, 413, -35, 374, 578, 148, 11, 306, 827, -82, 77, 427, -126, -19, -122, -142, -555, -170, -35, -194, -601, -243, 42, -460, -387, 367, -175, -406, -186]
4078a86L96j91k68N09J4j24J39j8oNM59k34k76n0L37l30J5J55p3m36P6k43K98
4101c2l19j13Q9q2M61o4l42m1J68j51N2J03K37k52Q1M49m44L62M7J07l48o3N67
4124D72m1j48J16L50l95m62K36J15j61m16L73%n46L59L90o96J14J92j67k67M14
4145a68l05K74j00J81R1n6j0K75J10k14M0L83k20o9J75J76j36O0m25J71j10j13
4167A0M70l06J15n05K39l12J37l58M79k14k6k99K80ok36M70J8J7m32M79L07l16
4189A1J39J42m1j81L61K86j87o16O24j90m71M54Q0n7q53M50L88k04n61L91R3l20
4211b62j52K40n1lj99M98o64J68k24M33K18l86L57J6ll3K31J03R5J28k27j32J67
4234C18L29q4n30K85l1R2j47m08J98J87l75l7K61m05j30J77J10l64L7K34J42k77
$$ y = [-186, 210, 19, -249, 260, 274, 150, 289, 271, 265, 270, 729, 495, 219, 169, 506, 176, 191, 346, 273, -163, -87, -330, -32, -351, -464, -375, -457, 4, -60, -402, -443, -275, -426, -374, -271, -34, -286, -205, 244, -200, 162, 209, 316, -32, -95, 472, 431, 283, 399, 749, 354, -108, 128, 243, 82, -334, 39, 39, -507, -148, 242, -454, -340, -148, -315, -582, -168, -473, -199, -299, -118, -27, -83, -93, 182, 292, 78, 118, 501, 281, 212, 387, 563, 427, 487, 62, 233, 123, 10, 480, 174, 289, -216, 23, -289, -152, -510, -31, -245, -271, -570, -290, -296, -532, -62, -44, -27, -459, 20, 327, 11, 150, 292, 251, 70, 431, 717, 530, -86, 538, 348, -123, 331, 411, 354, -499, -49, 339, 135, -426, -35, 58, -262, -414, -174, -225, -228, -427, 71, -593, -425, -649, -216, 2, -384, -27, -11, -14, -47, 184, 287, 382, 510, 283, 151, 318, 647, 563, 33, 318, 287, 379, 232, -176, 22, 209, -166, -203, 58, -347, -477, -300, -190, -554, -517, -283, -141, -418]
4256d18J91K69K02m38J82K03k64L6N13J60n17L86K45l87k42K05JLo40L19K85n63
4278b69O16m23K12m08J28j89J25l26Q0R5k92L06K02L10o02L16K85m87N14K6J35
4299C54q3l08K08J26K6l2R4J94k86l94K05L28l48K04M6l78k93k7L68m68j78J54
4321d88L86m22N3M52M5o51M37M53m92K4O22n06n6P36j88k57n4K41j19N9j51L41
4343D65L52l01l99K81m6n35J13L1L36n20R2k62L27k42j39K08J92n58L52J0J82
4364f1N3l0J00l72L27J40k86L58J15k62l6K99j56Q7j73L17K1j55q1n4L71j231
4386g09Q2P39j20j06Mm3k88k32L66K40l1o46O71J07k30m7O9K37j23j27L31j01
4408D3n2M33R6J1k29j4O1j2l55L70k71j04K16J17l25jJ52k33k80j26K77j09j14
$$ y = [-418, -227, 42, 244, -194, -12, 191, -73, -37, 476, 636, 119, 505, 750, 363, 121, 326, 327, 330, -310, 9, 294, -269, 347, -76, 136, -272, -144, -333, -208, -534, -454, -359, -651, -345, -143, 167, -435, -119, 166, -321, 193, 219, 354, 271, -37, 171, 297, 323, 291, 385, 579, 293, -101, 104, 432, 84, 288, 334, -44, -337, -364, 4, -464, -642, -488, -102, -524, -471, -19, 26, -625, -188, 265, -227, -203, 419, -87, -143, 593, 405, 148, 94, 335, 216, 275, 124, 465, 817, 516, 117, 398, 352, -183, -70, -39, 297, -223, -131, -393, -66, -308, -447, -239, -47, -605, -253, -243, -61, -8, -38, 62, -310, 17, 157, -129, 229, 344, 82, 46, 345, 189, 276, 103, 420, 441, 286, 205, 151, 522, -709, -627, 112, -8, -114, -110, -153, -441, -673, -307, -67, -98, -744, -73, 34, -196, -243, -174, 63, -60, -187, 144, 43, -9, 424, 520, 531, 302, 288, 349, 337, -18, 352, 81, -23, 193, 310, -15, -16, 136, -97, -377, -503, -226, -335, -449]
4431d49K69m5Nl59K96L63J18m28M06J71m76L94J74m02j83M72k9k16j93L35J84
4452D07r5k4J45m58K8J46J37m48N8J29k62O4m7K42k51j68K8L98l04L3O5K80Jl10
4476b06N37J20k99j63L90K79k06k38J83j07m8j63K06k54j54K19J26j1m22K12P8
4497G9l17M5q2k76r0K21K48J52k05K08j64k03J78K14o7J23J12J76j36J03L35j80
4519D74j52k00L38J78o24K66J80m04M9k5j31j98L7K95j19l83j12M01n0j92j30
4540e02J96rL59Q0k81j8J35j02L82k13j40M56l66l3L88K46j91j10R3K20l92k74
4562g6M31J54l63l45K98j22l84J03K25k68j1r5M41n64L15N9O1M3L7O9k11K6L83
4585B06k87k9L84J35k36kK79J4l33l01M71K24n31K01Lk19j34r4L8J41j61J39K42
$$ y = [-449, -180, -225, -220, -579, -283, 80, 198, -230, 176, 347, -129, 265, 439, 37, -146, 326, 297, 81, -112, 223, 407, 312, 288, 433, -25, 3, 149, 286, -162, -104, 25, -237, -173, -220, 22, -229, -397, -369, 29, -275, -242, -177, 103, 104, -206, 331, 451, 152, -11, 379, 658, 452, 214, 397, 290, 242, 79, 285, 31, -123, 96, 222, 211, -211, 1, 79, -238, -193, -275, -551, -641, -420, -172, -20, -225, -17, -181, -384, -206, 8, -59, 64, 176, 352, 216, 319, 654, 474, 322, 122, 460, 638, 14, 280, 460, 56, 105, 80, -51, -249, -212, 83, -36, -419, -531, -130, -180, -372, -502, -306, -315, 44, 124, -157, -175, -40, -142, 240, 27, -113, 343, -23, -56, 332, 578, 387, 277, 370, 590, 198, -76, 355, 509, 146, -199, 99, -23, -407, -304, -79, -347, -358, -453, -12, -576, -261, -202, -141, -98, -61, 8, -203, -177, 206, -81, -110, 274, 409, 173, 171, 450, 464, 131, -170, 301, 525, -6, 195, 198, -21, -155, -249, -211, -70, -231, -92, 150]
4608A50p9m60O3K19j77p8M08k78M9l8K91K37k42j00J9j5J35J57J82l87R9K1J97
4631C73j91m8J87k71jj63L39k62k65K90k86L4Q0O8j32M8J78k69K4k12J3M44n12
4654e34K60M01k63J61P9K13r1K11k71K71j70J11k78M08k05l34L75K03o20j47N31
4675C11n38nK00j78O7j35L34m73R2K42j13Q6k13N8K52M0k72K71J95m11J09O81
4697F00l81K26m15J43K15j01l41M01P5m03J97r7l30K34p4L73p07K16K90k96J36
4718c9n97N07J11r0k42J08j01K77J54J75j57p5J29N9J51n28L55j63K25J45k45
4739A59J14r3j06L67l62j45J05l5k0l18J03m5n1J96J00k7l00n8L80j01j0L4k96
4762d09L70J09P9j59J14K69L28o87L38Q3l06R5j11J48r3R3k95L27l68j71O2M10
$$ y = [150, 71, -389, -326, -107, -284, -362, 46, -232, -183, -221, 70, 307, 65, -35, -16, -31, 104, 261, 443, 56, 155, 176, 373, 182, 134, 321, 50, 49, -114, 225, -37, -302, -12, -298, -264, -184, -116, -248, -200, -22, -291, -267, -479, -466, -22, -534, -274, 127, -136, 25, 104, 317, 226, 437, 166, 437, 267, 378, 100, 508, 303, -31, 344, 547, -73, -220, 311, -227, -232, -32, -210, -143, -278, 56, -417, -325, -83, -196, -110, -323, -265, -13, 27, -245, 26, 221, -190, -81, 600, 219, 445, 30, 173, 388, 287, -54, 347, 422, 19, 216, 119, -211, 23, -51, 322, -385, -169, 121, -175, -39, -636, -129, -18, -108, -350, -242, -343, -66, 88, 263, 106, 31, 160, 219, 370, -158, 197, 34, 259, 404, 159, 273, 180, 74, 441, 79, -66, 39, 4, -16, -334, -231, -276, -327, -131, -31, -58, -358, -416, -36, -137, -147, -113, -409, -39, 70, 149, -10, 104, 373, 701, 14, 352, 435, 129, 224, 113, 261, 168, 261, -34, 293, -75, -246, -184, 226]
4784B26l62n8Kk21M96k65r4J14k35OQ9K34j23J26j34M46k66M40k42o2k94N63r4
4807B92k66K51m9j60M4J62l60K14j78L1l8k4P0q9j42o5N62l81j45J11J65k62J66
4830i1K13j12k07O1K73K03j36k70K56k76J65K56l20K28L0kn8j55K01O7j09N0j42
4853A25j06j30m1j41K47j41l6J9l5n5L8L2kJ12k39O85k74k13J6K56j38o8J92l3
4877G0L00k66o4L77k46n4K12l24p5O5M03n11o7K18N1l36K01J92k78k38K67K6l28
4900d05K24j17M72m51K89j0O4k00J74J31l37j9L06L00l54L28j92k13L84k99j3
4921F2K63l34K9N9J13k23Q1k49p1m8J21r2J66j44J83N2k68O4N9J20O3K7K38k85
4945a4K41j14J77j30L7L99k67j24K13j36n1M7r0o7J49n55M63m11n1M41k80j00
$$ y = [226, -136, -194, -192, -413, 83, -182, -276, -162, -397, -391, -302, -68, -191, -65, -199, 247, -19, 421, 179, 117, -177, 386, 292, 26, 277, 228, 68, 112, 274, -86, 128, -50, -19, -57, -81, -11, -100, -242, -307, 255, -126, -271, -160, 5, -257, -91, 122, 10, -197, -136, 137, 340, 204, -66, 190, -86, 79, 335, 15, 243, 273, 271, 213, 58, 259, 326, 217, 267, 125, 19, -111, -152, -293, -46, -187, -223, -204, -239, -294, -256, -224, -226, -114, -353, 332, 58, -155, -139, 117, -21, -89, 103, 70, 370, 104, 40, 417, 171, 117, 329, 5, -70, -5, 398, -113, -180, 38, 89, -247, -46, 146, -132, -370, -103, -77, -405, -181, -298, 174, -277, 12, 2, 66, -134, 40, 171, -166, -185, 121, 421, 67, 395, 203, -10, 374, 75, 62, 325, -9, 20, 79, 192, -31, 50, -199, -270, -318, -197, -289, -123, -267, -84, -32, -300, -236, -177, -57, 6, 33, 271, -14, 227, 113, 290, 160, 197, 596, 329, 205, 418, 282, 231, 278, 188, 121, 270, -285, 178, -233, -284, 157, -123, -223]
4967b23j22L31j52j92J78Q5k24K14l79M71k14M46j02j7M5j30rK23L3j73%k83L43
4990A49L54m74K29Q3j89j62J07jj98J03k91J88P0J03k38J23O8j34k83L55j63K1
5012a80k20K98L46j85k05J92J79k65L97j82j32l0N23o30L48k03P5K62l68K36k21
5033C5j1l20M18m06J04j24J12P3l2j72K09j58k28K63J07m2N0J78K51k21J29J22
5055C37K51j84l78K17L8J6l25L14j50k82L98p9J0j59J10j69J38m17K11k71L54
5076b0m1q6K37k35n3Q5j79N3J02o3J11M8m4K16j68L24n6k40JK19l65N23q9k88
5100hM77m95R8J14lm24k38N30j0m63J89J6R7k44N6J12n9K39q2K47l59l0Q5J76
5124B1j98J75J85m05K56n3K66j11R2K89j82n2j14K1j62q7J36j74j20L9R1k73M03
$$ y = [-223, -345, -14, -166, -358, -180, -95, -319, -105, -484, -13, -227, 219, 117, 100, 145, 15, 6, 229, 262, 89, 89, -194, 149, 503, 29, 258, 341, 152, -10, 97, 96, -102, 1, -290, -102, -32, 71, -167, -44, 24, -110, -393, -38, -201, -180, -400, -102, 244, 59, -146, 46, 225, -40, 357, 175, 43, 13, 536, -94, 254, 51, 126, 388, 20, 256, 35, 24, -296, 122, -284, -180, -304, -192, -119, -151, -323, -114, -272, -500, -237, -130, -172, -122, 56, 307, 86, 215, 337, 588, 404, 26, 243, 281, 297, -28, 286, 136, -146, 252, 173, 183, 24, 134, -35, 103, -314, -103, -374, -20, -61, -147, 90, -145, -198, -113, -292, -239, -137, -200, -89, -41, -85, 131, -37, 287, 231, -9, -8, 211, -154, 369, 280, -8, 469, -26, 72, 186, 183, -241, -479, 51, 41, -422, -233, -217, -120, -364, -308, -196, -255, -16, -98, 149, -210, -240, -155, 21, -177, -2, 183, -222, 34, -19, 247, 136, 228, 517, 335, 283, 169, 190, 28, -59, 77, -97, -217, -178, -87, -360, 43]
5147D3r9Q3j26K5J1l12O3p9M59j15K31J8j58j18M7K14j4J23j55Q4O3J29j2j99
5171B06M1k5p3k17O9j15K80j53j45M6j11J27k46L90K80n70J24k89J52q6J3L67
5193F5J74l35k00M06lO6j76rJ76l64N78Q9l79L13l03R4O9k86P5j84qK72j79j29
5217a78K09k23J75j69K7J12l13K54j40J74O0m7M9J12M7Jj96L55j65J40r4J3j73
5240C0M64j91l4j19k06J59j28K87l19R7j01j18K41n16K70K19q0l57O7N05n3l92
5262b75K59L29m15PP9m2K4L31j87J90q5j45J73n15M12J77K9m80K67R3k56K59l81
5285a52jK29k01J44j11Q3k38m13O61n27O2K0L82m0l83O38j39O4k21K62j43K80
5307B56N5m77L58o5J36p7k10J80Q7q9l16J27K55j86j54L08l60J76K6j21k1m04
$$ y = [43, -56, 27, -99, -74, -63, -375, -312, -391, 68, -47, 184, 202, 44, -74, -27, 187, 173, 296, 141, 225, 288, 417, 405, 206, 247, 222, 149, -68, 1, -114, 166, 13, -132, -86, -197, -70, -316, 74, 354, -216, -92, -381, -229, -315, -302, 65, 239, -96, -296, 110, 107, 173, -3, -12, 164, -200, 378, 467, 88, 401, 98, 192, 261, -25, 50, -134, -142, 130, -49, -178, 31, -192, -17, -186, -159, -47, -360, -106, -246, -72, -12, -59, -10, 102, 149, 150, -46, 309, 144, 284, 190, 203, 30, 494, 303, 269, 150, -56, 103, -25, 262, -57, 40, -61, -179, 62, -454, -184, 35, -45, -402, -335, 170, 117, -275, -16, 313, -102, -95, -16, -58, -34, 297, 110, 300, 215, 70, 243, -272, 140, 317, 346, -134, 133, 226, -30, 229, -152, -153, 76, -125, 19, -92, -9, -247, -660, 1, -526, -464, -444, -62, -102, -485, 153, 14, 78, -143, 119, -24, 256, 311, -166, 192, 127, 263, 186, -24, 156, 243, 154, -162, -35, 220, 34, -120, 188, -172, 4, 30, -91, -112, -516]
5329e16j89O02k30K44O5Oj79q4L17Kj91J88R9r4J12K06m0n1j27K0J09k77L78l43
5353B7J04O1l13q0K23j67J89J24k02m5m9j0k53L10k15J78m5J70j97J51j27L15
5375A49k63L02n0k69L66j2l46J32L25l81L06l82L19k45P0K10l22J12J31m63L84
5396G3k35K30l52j26L58J4m92j1N53k41J84K3J68j94k75K53M3j20K14m6J90K7
5418B38%j62k7j86K93J40k78L60m79O2k4k8j5K79j32J04k57l5J09k15K3K57N3
5441H0l51L14l3m20K60N3K5j83R7N58m73K28N4o3N3J39k87K9P1K30r6l79R5rO2
5466E4p0j35L76n26L46k10o2j15j07K64J22m27L58K04k5K0P6j21J13Qr7L22j64
5489B04l88K86J29J3l50J32k68J34J23j8K19k08J14K20o75OK26j45J5j49K8J38
$$ y = [-516, -705, -103, -333, -89, -24, -18, -197, -281, 36, 38, -153, 35, 134, 40, 152, 358, 318, 267, 140, 160, 269, -8, 370, 27, 131, 192, -121, -201, 22, -145, 44, 168, -34, -79, -128, -138, -391, -81, -296, -118, -163, 7, -190, -39, -166, 149, -114, 188, 138, -131, 235, 223, -123, 9, 334, -47, 259, -123, 196, -49, 21, 231, -91, 21, 152, -311, 73, -162, 68, -284, -410, -52, -38, -530, -541, 12, -229, -45, -22, 146, -48, -323, -70, -27, -147, 67, 21, 211, 238, 238, 76, 49, -137, 156, 296, 18, 378, -101, -39, -63, -91, -106, 173, 41, 145, -112, -147, -38, -253, -230, 27, 80, -271, 43, 10, -410, -150, -97, -72, -255, -158, 400, -73, 155, 209, 146, 199, 338, 51, 80, 151, 381, 285, -94, 1, -8, 54, -16, -151, 225, -301, 45, -165, -227, -342, -449, -185, -63, -490, -132, 72, 47, 67, 143, 22, 135, 143, 46, 368, 204, -184, 102, 231, 244, -106, 26, -242, -108, 15, -3, 216, 8, 122, 342, -333, -327, -101, -246, -231, -380, -352, -214]
5511b14r7J18K56j00O9m2Q7J19k8J49k64j19K18K84k29k64J30j59J05r6K4J04
5533E1M6j04K71j38j65j59K78o3l24n2K05J0R4M3k32L64r0j9J04p47O99j71k2
5556a21q5M22n5l27M07K92m32o7j04K96j56J90Q1l22L80n87M69l57m38P37j93
5577C0k20r4L22r5L5l35J77J56j92q3K62K09k20j8J55j89l9K56j42P4L15k18J27
5600B73j04j91K96p06O30j42n6j14L67m24k09L42K56m19J37K4m67N99%j95J6J08
5622B1j63M51J18n30j64K23J35M54q03M47k51P0J97j01LP6m07K16J59k61L09K69
5644D68m58j27J02M8j65K6n2r1K90j00k11j8J04o4jK08p5J02J43k11L5O7J72r4
5668I8Q1k36j03l3L27K39m58OQ1M31n12N4J84n5j90K5K0r2j60J94k4Q4j7J77O6
$$ y = [-214, -311, -193, 63, -37, 32, -10, 77, 196, 168, 317, 53, -66, 152, 436, 207, -57, 73, -86, 19, -77, -53, 51, 97, -7, 264, 126, -39, -198, 80, 17, -307, -359, -154, -144, -50, -7, -239, 125, 35, 16, 120, -627, 72, -99, -121, -206, 216, 161, -166, 241, 533, 101, 34, -70, 226, 70, 260, 341, 19, 399, -188, 281, -76, -514, 223, 30, -190, -284, 38, -57, -22, -357, -180, -24, -216, -299, -37, 172, -48, -66, 89, -100, -139, 117, -25, 49, 364, 146, 273, 169, -22, 274, -432, 198, 56, 0, -114, 253, -171, -380, -38, 218, -201, -64, -40, -507, 92, 92, -103, -87, 21, -142, 309, 427, -103, -267, -44, 91, 545, -258, 189, -62, 8, 205, 104, 107, 183, -224, -8, 151, -110, 199, 468, 10, -117, -15, 33, -132, -106, -158, -249, 41, -59, -270, -288, -184, -248, -249, -41, -116, -14, 129, -82, -47, 20, 192, 98, 179, -57, -160, -193, 134, 373, -85, -79, 2, 433, -79, -25, 159, 104, -86, -61, -41, -133, -293, -99, -123, -39, -56, 121, 187]
5693A87j26k24L19j38j47K11RL3j43L11m8q1R9nj82L6K01j28m0m46J59K51j79
5716g1M5r4J49m2m15K84j12J31J87k37k15M96j52k01L01k34P6n5P5K03l2r2m6
5739e1K2Kj81L61j82m9M89n67L21j97J88l35L68K7m53L95l36M17l24J52k4j32
5761h9J73j08k99J83L16m07J72l7L2J04K6j94J22J91k71mK11o6j33K23qj49J32
5784A20q3K3j55M8J32Q8k70J17r0n3k13P9J99k57Q1k36L96j84K22L52l20j12R9
5807a7Q2k23K67j81K23j63J22J22P8p3k84J28j6N7Lok30j8k27L38Q4j88K37n12
5831c97K88j58M0Q3j09J77k35K46Q2j38L14l6K9j03J6J58j73r7L87j45j67K57
5853C19m4k48l0K6j42m3O5K27Q4r8r3n9J44j42k39j9K33q6K18k73o9J41k7J37
$$ y = [187, 61, -163, 156, 18, -129, 82, 91, 124, -19, 292, 244, 163, 262, 257, 75, 111, 312, 184, 144, -302, -143, 108, -71, -26, -120, 29, -13, -428, -144, -256, -125, 62, -175, -390, 106, -46, -247, 54, -180, -104, -159, -84, 119, 87, -5, -51, -29, -27, -208, 153, -29, -78, 411, -156, 165, -32, 156, -179, 189, 216, -237, 158, -178, 239, -85, 67, 43, -89, 84, -24, -323, -140, 176, -231, -59, -96, -64, 40, 66, -128, -6, 185, -86, -90, 121, 55, -78, 145, 137, -12, 120, 37, 60, -95, -47, 85, 173, -97, 20, -70, -123, -336, -257, -58, -315, -234, -470, -74, -258, -36, 316, -4, -116, -17, 65, -158, 109, -72, 151, -12, 110, 232, 310, 237, -47, 81, 65, 122, 125, 119, -111, -129, -356, -18, 66, -122, 115, -397, -109, -267, -227, -144, -253, -76, -311, -65, 17, -121, 193, 157, 186, 83, 99, 257, 84, -13, 374, 229, 62, 319, 275, 27, -3, 23, -119, -162, -97, 130, 214, 116, 23, -36, 108, -34, -273, -292, -59, -145, 73, -200, -269, -128, -155, -18]
5877a8j5j09Q1L23m72P53o11J91Q1J2q5p6qJ74j94k54M49m40J12J80K53m86K85
5900A26Kl25r2K18k52K69k15K1L2M30j31k74m1M08j30N9l0J24l9J89j35k54J54
5923A14K88k55Q0N4k75J61M8k04J14j32j10j3J2j5l35M08j08K44k89M01n80mM16
5946B0l20K52l46L65M0k36K62K03k46k3j30R5M11k87K52q1k53J0K5Nm1j5J60j85
5970f3K66l67K67j1m53J64j05j89L64j21R7L27j27j59M1k46J72L69k13j29K48
5991A32m2J22k11K57oq3j94J62j21J00j75J75Q9n45O21m39K64k50L11j37p7j60
6013b07N7j92J58K53k03J02K25q7l16M2K67j60K00j35J84j08k34j0M8J61K36k58
6035B3j88M79k83K3J59m6j82L32o12L14k43m9m0K20n1l7j32J36J82J01j37l4K18
$$ y = [-18, -33, -142, -61, 262, -210, 543, -68, 123, 204, 216, 131, 55, 47, 221, 27, -227, 222, -218, -106, 74, 327, -159, 126, 128, -197, -289, -71, -323, -54, -269, -248, -216, 214, 83, -191, -232, 176, 46, 105, 75, 199, 160, 349, 214, -40, 114, 402, 147, 227, 281, 6, 167, 215, 11, 125, -7, -117, -130, -118, -133, -468, -60, -168, 76, -213, 188, -392, -396, 20, -300, -48, -394, -29, 11, -225, 37, 240, -6, -29, -159, -64, 347, 60, 312, 231, -22, -12, 13, 18, -23, -38, 122, -63, 203, -164, 103, 92, -361, -197, -302, -491, -127, -248, -151, 176, 49, -110, -69, -315, -143, 226, 13, -116, 132, 90, 212, 1, 258, 252, 169, -25, 137, 16, 116, -59, 116, 205, -340, 281, -158, 106, -144, 167, 30, -47, -207, -150, -342, -184, 69, -134, -32, 193, 106, -210, -168, 99, -61, 139, 4, 188, 80, -154, -164, -116, 45, 281, 23, -165, 314, 31, 54, 213, 167, -15, 317, -295, 19, -224, -273, -313, -93, -144, -181, -313, -177, 5, 106, -31, -65, 153]
6058A53l08Q8L5M11l34k70L50K6k59Q4j61R3j6J7J86p7n1J82k54O6n5j30J89J03
6082F8k15j2J54j84L40j99j17j96L04k55J45K14K35j5l63Q0L17k57P8j94K11K1
6104A60m72L50l5J02k02L18m0l69K59K23l93L14j74n3j19K89m19J68j7l3p4J34
6126h3j41J08K55k09j65N31k16KJ2J52l89J04rL26j78K31k46P2j20q5N1k4N8p5
6150c8q8k94M83m39J32M41k77q5J98j56J07N8Mn6Q8JmK09m35J80J99k26M6j44
6174i6O8j35L04j33J99k67K19k15QK10o7Nl67K60k20L40j90l3j6J39Rj32j87L40
6198D3o8J19M4m16K73K58l76N74q50M28R3l69L32k28J93q3K73q1o9j85J37l2q5
6221g5J56k12j43L67k15l5J07l1K34l58j20k2K79J47j65J25J2M1j61l8M70l4j97
$$ y = [153, -155, -67, -32, 379, 45, -225, 125, 151, -108, -24, -185, -92, -108, -91, 95, 18, -33, 149, -105, -39, -94, -224, -35, 68, -147, -159, -5, -189, 151, -48, -165, -361, -57, -312, -167, 47, 282, 267, -96, -16, 301, 44, 122, -72, 139, 160, -312, 38, 3, 105, -97, 221, 181, -188, 71, 294, -99, 215, 41, -12, -131, 158, -261, -93, -110, -143, -217, -83, -224, -116, 139, -70, -235, 296, 80, 82, 94, 246, -143, -39, -48, 278, 100, 331, 85, 157, 37, -48, 3, -21, 37, -38, -126, -420, 63, -376, -244, 197, -80, -165, 33, -123, -16, 42, 46, -10, 78, 79, 75, 284, -151, 29, 228, 2, 48, -96, -28, -163, 141, 8, 207, -60, 159, -56, -48, 162, 95, 100, -267, -7, -227, 113, -77, -110, -126, 13, 22, -110, -297, 43, -25, 94, 138, -278, -5, 253, -123, 451, -399, 29, 122, -247, 85, -143, 50, -33, 240, 159, 90, -95, 42, 10, -75, 81, -131, -274, 93, -122, -157, -50, -81, 153, -205, -325, -347, -68, 79, -86, 39, 51, 92, -69, -107, 363, 329, 132]
6244A32l21n4M91k34J9K72l58n2R4J24j13J86j00j64N8Ok2J55k93J54O6j21O0
6267a5k25J12K33p0j20k27M41J20k61m8jK9M9j41K41L21m27J92j49J03j75o9K29
6290A42k69k65P33j90l29R3J25L07l88J02j63j56J16L00m23M51j47Q9j26j46K30
6311H6k15L97m4l42J04J18q0J39J87m02N2L53m19k5O7N2r1M0Q2K08k71Q5n6p5
6335e0M8j04kP9K13l90n0K71m9oj07R9L62m41l24M83J06j83J58J62%l55K11j02
6359B9k21J28p7j05J91k52J07K65qj56k01M0K07p6O6J65k19q0Q9J37j13j09J15
6382g8K63m3k26J22j69KJ25j54o6K82O4o5jM2l20n0L57K58l59k96L63Q7j12N2
6406G8k52N0o2O7n4j80J64J3J9L32l19NL11k19L27m40J35J30J52K1p1j59M2k54
$$ y = [132, -189, -243, 248, 14, 33, 305, -53, -105, -11, 113, 0, 186, 86, -78, -20, -14, -36, 119, -174, -20, 46, -75, -15, -240, -128, 105, 35, -85, -312, 129, 249, -12, -60, -61, -32, 17, -124, 117, 438, 11, 203, 54, 157, -18, -87, 142, -127, -392, 341, 151, -178, -85, 40, 347, -41, 61, -102, -258, -142, 158, -265, 186, 39, 128, 2, -144, 86, -129, 268, 224, -118, -14, 104, 24, 163, 350, -52, 0, 353, -66, -91, -24, 28, -63, -23, 59, 267, -4, 81, 25, -50, -2, -106, -108, -29, 184, -206, -256, 15, -34, -40, -147, -48, 314, -127, -451, 32, 138, -45, 113, 275, 275, -80, 131, 29, -192, -64, -141, -246, -55, -307, -200, 65, 57, -99, -300, -260, -53, -129, -63, 102, -117, -197, -108, 29, -84, -193, -78, 185, 142, -84, 38, -131, -129, -4, -158, -224, 58, 122, 57, 56, 98, -222, -272, 85, 343, -16, -312, 51, 138, 26, 78, -174, -124, -186, -119, -173, -353, -189, -176, -157, 175, -144, -139, 172, -47, 280, -160, -25, 105, 257, 278, 207, 48, 90, -164]
6430a64K51j71L4k3N88n27L7r5O5K21k22L4k50q4mK94R7R1m48R0q0L8K07q7J08
6455@k21K38k03L08k70N10o65J55M53k30k6N2j38N8j25J45J15k08K89k31k05o1
6477b60K05K7J47l0o1j67j5J88r9p0R9K95j14P4j67J1L40k45j73k7N4R7k3r2K77
6502B71j05R5k46j60m2J97K34m69K36J0j5opj64R8j41N8L33m12J54J37l54L00
6525BK76k55p2J10K5m0P9j35L6J18j27MJ36o1k8L12l79K58k27K2j28L02m49n4
6549b75O2K33k2R9nj99j21Q7K18jo3J11j55k8j87J39j08P9J19o3K88m90M93P9
6573B90j51m09L66Ol55M44j72j51qR4K30k26O6k03J51K67k31j95K47kk86J13J19
6596Dkk30J34M3Q3l1J11MJ32R6j43j82K2J86k5l08L82k26m7j16K56k98J09Q6Q6
$$ y = [-164, 87, -84, -50, -73, 515, -12, 25, -70, -5, 216, -6, 28, -222, -306, -310, -16, 81, 172, -276, -186, -266, -228, -21, -108, 0, -221, 17, -186, 122, -148, 362, -303, -148, 305, 75, 49, 101, -37, 21, -104, 41, 156, -52, 237, 6, -199, -260, -55, -28, 119, 89, 28, -139, -154, 34, -65, -135, -36, 259, 145, 219, 52, 63, 403, 158, -15, -42, 12, 109, 86, -6, 271, 166, 261, 15, -145, -187, 10, 244, -225, 11, 21, 6, 0, -7, -171, -73, -214, -156, 177, -235, -81, 56, -298, 2, 278, 23, -49, 61, 86, 46, 125, -10, 26, 144, 17, 21, 157, 96, 68, 380, 1, 259, 32, 54, -74, 228, -221, -275, -213, 20, -2, 97, 92, -107, -228, -141, 77, 76, 13, 124, -31, -59, -246, -107, -215, -136, -17, -80, 208, -282, 211, 290, 139, -270, 96, 102, -253, 191, 19, -132, -140, -46, 184, -42, 24, -179, -28, 239, 8, -187, 60, 58, -228, -115, 4, 2, -228, -94, -51, 32, 1, 112, 116, 248, 344, 201, 19, 41, 227, 202, -106, 276, 50, 3, -113, 143, -155, -46, 40, 126]
6621A26k31K3L46k73k3l83K53J28j8M7o6K15j48R6l6j55L65J64l71J21j90J79
6643A69k58O8q9J86k24O9M5J11q0k77L84K12l36K18r1j27j80Q6J75k07Q6N7K6
6666B3l49L23Q5L5P9m13J14ML08j76J61m4k21o2L70k2n64J45N13m92O3qj37J61
6690a04J77k01Q9j4j66J44M2j13O2j90L69j49Q6j72J18j47K41M5Q8k55K4K21J76
6713C71l82r1L96j01j26j08L6p5J29k79K45J87k78qK06m24K07j0Q6K37k22m0K9
6736a5r4J09L0J15p9o2k54J24J48J41j70K90p1l40J90p2K08k72J70j7K6j92J71
6759H4p8l59J50J82j79K6l3O8q0K61n2Np0K27q5j75N0K29j08p9j06K88j38M9j04
6784b7J57pj98J89M5k88J57J09k4j23m8J82j13J07k09L24p5m6M5j49jj2q2J83
$$ y = [126, -105, -82, 264, -9, -32, -415, -162, -34, -52, -5, -71, 144, -4, 92, 56, -99, 266, 430, 59, 180, -10, 169, -89, -21, -110, 76, -148, -79, -34, 77, -3, -280, 104, 316, -20, 198, 107, -20, -200, -114, 61, -146, -60, -3, 23, -326, -3, 82, 117, 196, -217, -103, -99, 209, 33, 194, 150, -71, -133, 237, 215, -349, -204, 309, -183, -120, -128, -265, -104, 73, -128, -39, -53, -219, -75, -33, -146, -84, -274, 95, -54, 32, -140, -22, -169, 72, 117, 205, -50, -26, 195, 371, -11, -102, 294, 193, 67, -41, -5, -80, 49, -230, 15, 202, -76, -84, 122, -302, -95, -105, -19, 218, -4, -44, -15, -109, 0, 30, 145, 66, 4, -250, -126, 22, 163, -7, 283, 212, -128, 62, -10, 198, -74, 96, 79, 105, -87, 84, 6, -353, -203, -21, -200, -174, -207, -139, -219, 42, -10, -5, -75, 152, 67, -108, -58, 171, 63, -16, -122, 166, 28, 77, -27, 130, 123, -75, 114, 159, -129, 28, 137, 113, -10, -58, 124, 11, 118, -91, 233, 158, 112, 157, 8, 7, -5, -87, 96]
6808I6m11L55m0J54r3l62K96K4N4k3N7L5j32j03J15l34K67J23R0k04J9m1K9n7
6832h6l5q7p5M76k91J25r5K4N5q6k36M56j28l2J9P2p5J06r1j83nJ75PJ66j05j29
6858e8J19o6J62k94K41j08K79k34J50n66L64R9n0j44R7K2O3q8O2K75n44O9mO7
6882h7K95k02R5M0l27K08k80L90l5L0L7n4Q3k68J53j84K32j38J38%j00N4j00r9
6906a19j44J26J14J34J72k33k44K41p6K77m78M41Kk21l94K64M05j29n7k6Mr5K39
6929B03k73K32l92K22j32k9K40j88m5O1K11n8J19j63j84k6k0J68M5l3k26K90k3
6952ak7K80Q7l97k74L84r3m2o2J21p7K8OK3L22j65j58K19k72J39j40K46N7j84
6976B0K4j11J7o0Q8J09q3j33J32M1J5k43K45Pj9M3O4Q2j60k22J13J56m50M35k15
$$ y = [96, -315, 40, 0, 154, 61, -301, -5, 19, 73, 50, 107, 142, 10, -93, 22, -312, -45, 78, 168, -36, -17, -58, -29, -86, -121, -208, -283, 193, -98, 27, -68, -44, 11, -75, -311, 145, 17, -15, 4, 76, 1, 107, 16, -167, -172, 3, 10, 176, 71, -58, 61, -5, 157, -137, 104, -4, 275, 41, 191, -375, -11, 88, 38, -106, -9, 13, 76, -12, 50, 325, -219, -150, -154, -87, 208, 6, 101, 141, -186, 22, -258, 132, 97, 127, 164, 110, 193, -75, 78, -106, 126, -12, 126, 126, 26, 80, -20, -119, -263, -137, -23, 111, 283, 50, -194, 47, -29, 248, -230, 211, 213, -8, -402, -138, 267, 138, 81, 55, 59, -36, 203, -70, 162, -230, -8, -140, -169, 71, -117, -162, -101, 110, 52, 171, 8, -176, -202, -222, -54, -9, -42, -268, 22, -1, -28, 252, 339, -58, -332, 52, -41, -83, -145, -24, -101, -73, -67, -44, 278, 113, -45, 174, -98, 41, -99, 147, 204, 20, 44, -67, -50, -110, -22, 87, 4, -129, 3, 44, 59, -184, 61, 68, 49, 92, 156, 238, 78, -144, -31, 125, -325, 110, -105]
7001a05N6j41K79k05l8L33j00j80L08k13o4J87j14j86K20k59J5Q4K13L6r1K09
7023B44k72J75o6N1j34m16L89N9k62J19J55J83k97K02J04j57J9P2j58j44J59j44
7045a19N2P1m0j04N0j16K79j01J19k63J01L08l13J45M2k38J15J61j0j48QK30j58
7068G1j2k7k16K04J6K13l15j6l1J86N1k86J37l0J91k93J54j13N9l5qr9M31k61
7092b9k68K73r6K44k02L33o6o9p9n4R4k43O23j79k85j29K23k04L01m1j14K2K3
7115G8L0k51kK96r5kRMQ5N6k14q9o4L23k0k84k61J58L06O4l86R5J34J01o3nj5
7142a2M4L3Kn9N1m19L37J96l14L04J66n39O8K67L6l67J96mL1l40J68P3M8j7l0
7167h1nk86M8J85o2M95k16l20K47R1Q6m91O55j30k35L2j99P1k0N05n45J23K40
$$ y = [-105, -49, -190, 89, -116, -154, 179, 79, -101, 207, -6, -70, 117, 3, -183, 37, -222, -207, -123, 90, 126, 35, 244, -28, 147, 81, 132, -2, -418, -29, 30, -232, -113, 42, 225, -72, 130, 234, 77, 96, 168, 10, -134, 25, -119, -67, 4, -36, -140, -90, -206, 73, -28, 91, -172, -71, 237, -76, 69, 111, -127, -12, 149, 139, -9, -1, 229, 71, 59, 32, -184, 20, 36, 249, -66, -82, -113, 73, 124, -162, -25, -55, 136, -157, -3, -116, -57, -92, -100, -199, 232, -29, -297, -24, -120, 124, -78, 255, 189, 120, 41, -13, 81, -162, 461, 282, -3, -132, 91, -113, 188, 147, 33, 55, 78, 108, -143, -145, 151, 56, 54, 63, 67, 152, 208, -6, -95, -159, 164, 144, -140, -401, -243, 63, 127, -259, -164, -30, 71, 8, 3, -12, 32, 65, 67, 8, 59, -360, -23, 173, -141, 163, 329, -210, -142, 125, 161, -206, -10, -14, 17, -323, -155, -82, -34, -51, -81, -86, -372, -324, -139, -201, 294, 78, -242, 5, 96, 182, -309, 346, 216, -19, 13, -186, -115, -135, 370, -175, -52, 188]
7190A88q6J4o9j89J04J42k77K35j79j53N6J46J6O3j4J5j97J83M9M4j49j94K85
7213C3J01j86J98L38m67j52r5j57K60j11L10k89J61R7j07K65k58O9K1j08l32L90
7235a9k7j00J41l0j56K57m5O6J28j84p5K09J80l93K88l03l8M45m08j38L98k23
7257b7k0q6K98L7k50O9J94QJ4k61J84j0j40K26l28J83M4J14l43L12j73o1Q5J6
7281H5k11L50l83L0M11j82p2k70P8J06R7l65M41k3m3j09J1K09k07Q9o8j39J87
7304B2q0O1O2j37J04j17K8K57jk20J0p3M07k56p0k69K58l9K8p8L05n22L65J54
7328A99m80Q7l8L93l54L06J57l4k32J29j6l8L0k93K67J76l45O1l1M0k21K32N6
7351E1k33J57mK09k61m7K06j32J06Mp8J2L6j93L24r8k64M78k42l73L48r4l5r6
$$ y = [188, 102, 116, 47, -142, -38, 104, -173, 62, -117, -270, -214, -68, -52, 11, -3, 12, -185, -2, 47, 91, -58, -252, 33, 134, -52, 146, 484, 17, -135, -230, -387, -127, -238, 72, -217, -56, 41, -66, 199, -59, 10, 31, -77, -409, -19, -46, -146, -5, -35, -191, 66, 21, 87, 215, 31, -44, 165, 345, -48, 240, -63, -101, 344, -64, -202, 196, -27, -47, -133, 165, 202, -48, 21, 215, 223, 237, -24, 160, 150, 10, 236, -92, 91, 135, 249, -94, 218, 45, -16, 69, 85, -126, 224, -159, -129, 282, 100, 28, -242, -164, -58, 39, -326, 115, 92, 49, -60, -49, 160, -47, 42, -26, -165, 22, -58, 3, 65, -72, 32, -85, -57, 200, 199, -21, -11, -84, 323, 67, -3, -272, -14, -53, -25, -103, 202, -320, 45, 199, -281, -194, -232, 161, -193, 113, 270, 236, 4, 133, 117, 79, 109, -184, 83, 259, -86, -25, -56, -16, -237, -5, 51, -182, -25, -29, 180, -81, -128, 78, -54, 52, 56, -22, -10, 26, -167, 157, 59, -205, 273, 31, -342, 6, -88, -123, -219]
7375b19J06K62k01J20L6j30m32N5K13Q0j04J27K97N6l84K52l95K23R8L9j04o9
7397g4J14k49L5K28q1K93j82p3k5j1j95l1n3M96m6J80m63OL80k21j80J52j24J72
7421D8k48J82L89o16N23k74J44k5k68J74N2N4P4l15p9j7J77K50l35k4J72l72K60
7444g4k16N95k45j71K2k60K2L73l7rL75k81j97K36j9j90p6K97L7m95O90m35J26
7467F8l9m1K62l93P5j76J14K78j91J35k90J98P2K14l33L1L83n41j20J95pJ37o3
7490c2P4pj8K96l33J14j92k05K34m8M19l03J08Ok21O1K68M9m65K60n1l65M21j50
7514h0J99l83Q2M0pNK74l28J56J72l36Q0J26Q6L3k35M65m00k03K21n8K21k75j61
7538c06N11p0m15K20PJ44m1J75k93M4k65J30J55o0N0J8o4L95n54J84K0R1O2m14
$$ y = [-219, -113, 149, -52, 68, 104, -26, -458, -403, -190, -110, -214, -87, 210, 266, -118, 134, -261, -38, 60, 99, -5, -74, 40, -209, -174, 54, -27, 266, 84, 11, -14, -25, -220, -251, -304, 192, 146, 326, -137, -131, 249, 28, -152, 0, -124, 48, -200, -18, 371, -245, 278, 4, 148, 123, -145, 29, 81, 135, 209, -106, -185, -202, -25, 225, -110, -134, 38, -334, -74, -290, 305, 60, -111, -89, -349, -327, 46, 9, 0, 375, 94, -103, 133, 114, -76, -152, 145, 182, -313, 377, -58, 68, 29, -12, 250, -143, -68, -244, -130, 148, -43, 92, -198, 0, 72, 286, -47, -16, 367, -174, -294, -99, -106, 31, -32, 42, 35, 17, 313, -20, 94, -98, -303, -69, -117, 302, -1, 107, 113, -108, -47, 221, 270, -195, 65, 14, -351, 70, -80, 119, -264, -182, -142, -149, -144, 130, -198, -42, 130, -206, -126, 0, 86, 119, -116, 349, -51, -254, -33, -91, 130, -145, -306, 205, 135, -280, -60, -53, 91, 50, 225, -68, -24, -289, -159, -4, -64, -14, 4, -60, 335, -219, -35, -15, 76, 138, -276]
7562b76J79L15k14mk09P7P0J43k27J90Q1K1l38J59J44j20rO6j80J27j81J21j8
7585h3K8J82R3j95l47K43O1l0J18l01K12k46L42j35R9j45J66J07n4j11k85J65
7607a16jL98l12J40l75L37j1j59J94Pj36r9J87K74k47m13L79k52J81k21J81J23
7629E9j75K13l30L31j76o6j06J82J71J57k23J23j79J22j98j54pK02K01k67k25
7650c45O68j64l83K11K04k88L68l56K9J25l14K16N1j71J24K6L7l1O0Q7j10k46
7672b02L93p8J90m55L74j98m5J71p9l4l15K14L06n24K07J93j10l9J20P4l55M49
7694B57p6k35K05m28J72J08J28r7m6R9J29l67J88r7M6Q6J34K5k99Q3P6j71J60
7717H0J48j54j15p5L02r5K57o96N45l20J41j76N18j85j24m3M7j44kR4j6J26pk06
$$ y = [-276, -97, 218, 4, 0, -209, -132, -62, 81, -146, 44, 125, 146, -192, -33, 111, -9, -18, 48, -132, -5, -186, -65, -83, -55, 127, 220, 25, -322, -79, -18, -48, 70, -231, -19, -265, 77, -58, 41, -104, 62, 169, 115, 4, -281, -116, -117, 281, -31, 109, -266, 71, 60, -99, 95, 102, -34, -133, 54, 328, 81, -332, 47, -205, -24, -245, -64, 59, -116, 97, -233, 98, -78, -144, -250, -68, 103, 260, 37, 160, -19, 103, -95, -249, -256, -54, 147, -120, -345, 323, 159, -224, -13, 191, -97, 271, -85, -56, 69, -245, -29, 22, -149, -25, 1, 38, 7, 67, 154, 44, -202, 191, 113, 303, -152, 222, 24, -21, 150, 71, 37, -278, -64, 242, -282, -75, 118, 8, -31, 89, 163, -192, 257, 181, -54, 151, -277, -105, 3, 131, 34, -12, 87, 216, -151, 37, -60, -14, 72, 206, 231, -68, 15, 91, -80, 80, 228, 74, -41, -116, 186, 91, 348, -348, 197, -123, 18, -158, 360, 175, 51, 8, 55, -89, -91, 3, -13, 113, 106, -100]
7741a00j23J81m6J29Rp1k2K13p2k53j86J56M81k65r7J68N0M1kj77k37K74K8k16
7765a37K30j37K01n21J82k87O6L05k03M07j93Q8k2J2J70j48K02l65l3j25K75n0
7787h3P7j16k38N08l6l48K23r3K17j00J94l4k79K23k97N24j94k77K03p1K56k84
7809b5j50J98k4o4K06j94k52L60j74J39J96o50O13Mj78J84l75R8K8J89j53J47
7831A23k56m7J53J09j14k63N24n42K99q2Q8q5q7K43k4m9K7j42j3P5L27p0k19o7
7855i2K63o7q1J46k45K0Q7J2m2L9N7j64l69M88J87j63o8J08L0j82j12L38k15P7
7879E2n1k76K38m2J04QJ14j45q7K39j12J62p05M14J51j94J95l57K57J04k30L75
7901B14n02J05K22l51M21l7k00R5R9Jk5k71K44n3K53l01j5K02K67k03m08K86K46
$$ y = [-100, -223, -42, -88, 41, 50, -21, -43, 170, 98, -155, -341, -185, 296, 31, -66, 102, 152, 193, 191, 14, -223, 51, 79, -137, 93, -44, 157, -364, -182, -469, -403, -98, -301, 106, -87, 1, -21, -9, 161, 13, 215, -150, -183, -308, -33, -83, -6, -122, -360, 148, 112, -236, -13, -106, 111, 11, 205, 171, -108, 115, -182, 342, 148, -129, 74, 3, 259, -25, -175, 23, -1, -65, 141, -53, -305, 55, -119, 20, 216, -434, 179, 183, 5, 189, -186, -88, -60, 129, -24, 123, -133, -180, -27, 82, -32, -295, 229, -313, -14, -96, -8, -93, -180, 63, 39, -10, 17, -125, -138, -63, 264, 194, -25, -92, 171, 104, 23, 169, -76, -56, 31, 43, 1, 40, 97, -67, -436, 52, 239, 76, 8, 116, 146, -36, -148, 190, -25, 52, 1, -275, -37, -79, 25, 33, 147, 2, -85, 154, 42, 204, -501, -87, 64, -130, 65, -292, -35, 69, -161, 214, -288, -183, 39, -312, 109, 72, -128, -33, 66, 67, 42, -229, 15, -38, 215, -86, -101, 101, 368, 165, -243, 43, 289]
7924B89j38r5j96o9j19N88k88L26o1m50M42j87K58m62K20K69l29J07j64R0J20
7945A51N9m05M15k59j53J66L3N0O5R9j66J13j64j18K50j97L97l01k93L06R9r8
7967D9m3R6k26K31j28M8K20m39K28j60J89k7j60L56k58L4j3r2oj1L29j69o2Q0
7991F6N7M5j28O8l16M98K0l86J31k2j28K09k13J6N5N7qj14J48k09M03l55J50m04
8015c60N29j92j68P5K84j8l29J55q6j61M04m22K88L40o67K69n0J03k3J88j51j16
8037a08n6M43l21P6j7n3L46l32N5q7j20k8J39J00l55J23K7J71n7N6J05l41J28
8060a06j66M74k49m0o6K09lO8J5P5j64r3J26J32j08l65J21J52or5J91k3J84k54
8084IJ12j45J18J4j89n9k9M29m92K77j31J39J10n60N12J12l45PJ57J23k40K96
$$ y = [289, 151, 56, -140, -209, -328, 260, -28, 298, 237, -213, 229, 42, 300, -162, 58, 327, -2, 105, -59, 31, 151, 210, -195, 220, -39, -192, -26, 7, 57, 122, 221, 55, 168, 4, -114, 136, -61, 336, 35, -258, 48, 147, 49, 6, 102, -124, 107, -21, 27, 247, -192, 36, -124, 65, 38, -122, 234, -24, 10, -3, -95, -101, -112, 217, 48, -14, 66, 123, 168, 40, 108, -208, 290, 310, -76, 55, 33, -95, 114, -99, -83, -28, 29, 21, -93, 55, -154, 249, -106, 44, -360, 169, -23, -191, -116, 168, 150, -179, -24, -110, -271, 133, -289, -1, 339, -328, -59, -109, -6, -29, 159, 8, -108, -164, 279, -42, 34, 17, -36, 310, -22, 33, -54, -174, -202, -63, 37, -318, -195, -168, 3, -54, 2, 107, -234, -106, -272, 202, -47, -87, -153, 56, 53, 121, 136, 211, 47, -46, 80, 212, 104, -261, -140, 12, 6, -89, 102, 79, 263, 9, 121, -24, 94, 108, -81, -140, -169, 260, -232, 45, -86, 53, 163, -397, 115, 227, -118, -111, 46, 169, -71, 225]
8106B25m75N91m42p2J72J2n4L8O8P5k97J03K91m82J02J73J9j1m0o3L32m63K01
8129Coq8K04k59K80l10J57j24K84r0K79k99J95k44k16K58O0J21n8k5k17K01L9
8152A45k83p9L65k92j29N95l86J06j68j3J28j08J06l5J1M0J1k8m8L72m9%m97N8
8176a78L73L7j18n8K83k21p9k66J62K35j94lK24J0m68
$$ y = [225, -250, 341, -101, -173, -1, 11, -43, -5, 63, 138, -159, -56, 235, -247, -145, 28, 47, 36, -4, -67, 265, -198, 3, -3, -91, 113, -146, 134, -176, -19, -143, 141, 51, 330, 31, 226, -18, -234, 24, 84, 205, 147, 122, -95, 106, 145, -138, -217, 148, -144, -273, 322, -64, 42, -126, -139, -11, -119, -13, -48, -37, 3, 14, -14, -62, 310, 261, 261, -236, -178, 195, 232, 114, 56, 339, 118, 39, -227, -65, 170, -24, -27, 197, 207, -261]
8191b61
$$ Imaginary data points
##PAGE= N=2
##DATA TABLE= (X++(I..I)), XYDATA
0@%%%%qQ%Qj6J6j6K4l7M5m8N6p2Q8j04J20j38J62j87K13k45K80l19L61m08M62
30B45n19N82o52P29q14R04j002J113j235J367j514J675j854K055k276K526k811
47a481L137l511L948m471N104n886O885q214J0065j2818J7333k5969M7963j96988
61a64903l88609O40162K76240n39496j11825N36246j7902m69810Q9549L69364
71B19016j75238k48289K25583J40520k61367l3549K74334l0508k62089P7878K16308
82A42599j10948j65856J50626J40298j53911j22550J33377Q6897j17521n7789
92g4778J06830K4293j10851n007J15149r749j01118M5525Q9494r7074r2520J33936
104B4130Q0383j64291n2727J87167P543j99890N3315K09394j07916j98176J55012
$$ y = [0, 0, 0, 0, 0, -8, 0, 0, 8, -8, 8, -8, 16, -21, 24, -24, 32, -40, 48, -56, 64, -74, 88, -99, 114, -131, 149, -170, 191, -217, 245, -274, 308, -344, 385, -429, 475, -527, 586, -649, 718, -796, 879, -975, 1080, -1196, 1330, -1481, 1656, -1855, 2093, -2378, 2726, -3160, 3725, -4489, 5576, -7242, 10091, -15878, 32085, -164903, -553512, 86650, 362890, -176606, -288431, 247815, 229913, -239897, -150348, 219016, 43778, -204511, 21072, 161592, -99775, -133324, 141010, 110502, -151587, -73709, 142599, 31651, -134205, 16421, 156719, 2808, -119742, 13635, 100532, -16989, -74778, 32052, 56345, -54506, -59513, 55636, 45887, -55231, -9706, 79788, -17286, -109806, 24130, 104513, -59778, -112505, 74662, 82205, -117685, -64370, 145024, 37108, -161068, -6056]
115f056J64808j88242r4322K26209J5282k59825M7501K56604j10650k18674J84507
126A7142J74011k45409j26167K76399O8019k83601p953K65234n4998k36252J03002
137e0573J90159j40243j37897J61156Q4079j63033k6737J59393k0489j48239N5109
148c7315J30004p9178j08725R6966R2635j03375p6304J07395O6353j03452n5339
159g0335R8122M0813r4529k2686R3956K555r4738J3122P9600m2029o3740P7549
171A7660M8709j08079l0562J27198L715j36444L0894J34652p3001j26514J09524
182b248J11218j29415p5583J40947K6658j45602K6915J47944o7014j29505J01205
193E520R4546j32262n6425J51992J8376j55781J6399J43275m9525j21503P2759
$$ y = [-6056, 158752, -29490, -123812, 102397, 117679, -142146, -94645, 161959, 51309, -167365, 17142, 191153, -54256, -180423, 95976, 163995, -119606, -127559, 137675, 82677, -153575, -50573, 139586, -657, -138554, 22602, 106681, -56352, -83089, 76304, 55815, -92424, -37315, 92689, 13511, -95214, 1752, 94387, -8988, -85292, 22103, 88456, -14996, -70335, 27787, 68600, -25929, -48615, 45341, 47896, -46842, -33720, 45880, 3851, -59889, 17660, 66369, -41710, -72272, 54926, 58641, -77803, -46909, 87743, 14742, -111772, -2248, 108970, -20445, -96028, 44919, 71577, -74025, -47110, 100834, 33820, -95685, 5520, 100066, -32196, -88621, 63371, 81747, -74034, -57635, 85640, 36115, -85388, -12629]
204a2629R2081q9483o1750R3001L0457q7722l513P5326k2433o2798L9819N0135
216D0491m7784l4655N2836K4314n4239j3263O0545J2817o2571j4630N9014J1647
228C4522n4232k26N5623j2340o0409K1111N7836k9959m5145M4076K6153o3759
240b6749j0485P4414j0756q1333K8587P4852m9542n8857P4445M5324q9651k7788
252e7539R1326Q98q5863L0369Q0268n2023o3835O8222M1931p9435j6233Q5593
264D3679n606q0531K7727O9523m5795n5774N6982L7028o6401k1191O6117M036
276B9794o0846J0511N0645k4891m0943L4512L1642m2475k3117M3544J4531m1539
288a8632k225M3245p797m6556J2000M6879j1132l5620K0958K9770l0932k6287
$$ y = [-12629, 79452, -10031, -71781, 21220, 51677, -36045, -39558, 35768, 13335, -49463, -9644, 40491, -7293, -41948, 10888, 35202, -19037, -32300, 28245, 41062, -21509, -36139, 22875, 34522, -19710, -19936, 35687, 23347, -37062, -15951, 41885, 11926, -33219, 10857, 37010, -26749, -37234, 37180, 26424, -54909, -26322, 48530, -1012, -59869, 14576, 59900, -29751, -57539, 33787, 34685, -51178, -20809, 59459, 7436, -56399, 11823, 53754, -25681, -41914, 43679, 38073, -42458, -14731, 54792, 8997, -46777, 10205, 47233, -19168, -40359, 25758, 29794, -31052, -20541, 30104, 5213, -35730, -1218, 30424, -12051, -35168, 8376, 22907, -18632, -20857, 22388, 14591, -31965, -19965, 26914, 15782, -19838, 1120, 30890, -42, -26329]
300b6329L6447J9800m0111j0464M2937r24m4306J3969M3448k6360m2258L3559
312e92L1600m3999k1801N0395R239n3746L634N1302j6914m4500L1182L6653m1823
325i370k6859M8123J4422m8408K563M8807j5700m3648K9906L8035l7198k7446
337b6773M1884J2235m5620K083M7370j3316m6916K0345L7297k7854k6645L4833
349H923J5098m3268q609M4404J851l9927O725L3647j9271l1751K6959L0671k7458
362b006k1913L0015J5059l2071o264L4358k14l3628P254L2525j3147k7029K1351
375D290K0851k9166j7764L2506J0728l3627q33L3920j0973l5182J7021L0055k4198
388b372k2412L0372J2029l6932k426M0988p514m0041J6674L5620k5376k6270L6488
$$ y = [-26329, 10118, 29918, -10193, -20657, 22280, 21356, -22950, -8981, 34467, 8107, -34151, -592, 31008, -12991, -34792, 15603, 24842, -28904, -25270, 26032, 9118, -35382, -4200, 32453, -9370, -36229, 11894, 26316, -22092, -19529, 29278, 13578, -30070, -164, 37871, 673, -26773, 15111, 27346, -18274, -16191, 31179, 17863, -29053, -8708, 28589, 735, -25910, 8923, 24021, -19247, -27856, 16548, 18399, -21528, -14803, 18844, -427, -32178, -5219, 25452, -2006, -23919, 6096, 21155, -10916, -17180, 17178, 16964, -16664, -9410, 23115, 9968, -17061, 4290, 25141, -4025, -21789, 10717, 21445, -12182, -13015, 20905, 9932, -25250, -8229, 21826, -2372, -24784, 5588, 17617, -19315, -21741, 19247, 11733, -28308, -11634, 23986, -1390, -27660, 8828]
401H828K0784m1111j2474M2961M371m0446O587L5581j7599l3009K6190K8045k7726
414I82j8824K9307P867l4157m44L3490o617l1617J1696K4605j9329k0559K4449
427H49J4740k6805p983K9341O44k8478P162K9162j2993k5439J8823K2090k4616
440c503j5667K9862R939l2723k048L5102m076l3337J1603L1333k0282k8561K4911
453B553K1489l1687j7119L3093Q741l3542K35L2626r206l0423J7990K5478k3968
466c740j9873K8574J0263l1862q22L6195n395l3623J3428L0164j9991k2911K8304
479H711J7598l2591j1187L2635R44l2523Q303L1690j4990k8323J9728K1044k6498
492e459j6388K8711R428k9423l777K7893l799k6272R326K4246j3110j9272J7874
$$ y = [8828, 29612, -11499, -23973, 18988, 23359, -17087, -10500, 25081, 7482, -25527, 663, 28708, 982, -17842, 11465, 19332, -14825, -15269, 18221, 11604, -20013, -8317, 16288, -3041, -23600, 849, 15589, -11216, -19199, 10142, 10786, -17692, -10530, 18632, 5639, -19800, -977, 21113, -3503, -19170, 10692, 20631, -12092, -14140, 20962, 16886, -16451, -4848, 26485, 6203, -22358, 2553, 24042, -7645, -24764, 8329, 17070, -16472, -16237, 16389, 7183, -23240, -5250, 20228, -3740, -23613, 4961, 15224, -16638, -17460, 18735, 13340, -20283, -6855, 23309, 3318, -19593, 8711, 26309, -6282, -17469, 15166, 16110, -16413, -8110, 23580, 8590, -19733, -5, 21039, -5459, -21847, 6864, 16292, -13131, -16908, 10985, 7186, -19086, -9760, 14486, 1376, -17896, -22]
505b2J4235k0231r800K3157N756k2275J445K3600o733k3275J2229K1122j6661
518B547j7655K1460J3444k5343p670K7966J20l0551N094K7290j3859k4835K1462
531e30K0038k7184j4587K9520O039l1692L331L2653r779k9863J5289K4549k0341
544b557j5791K5553R182k4526p54K3306o718j9860J4965J6042j9830j1211K2025
557I826M595k4561n78K4786l364k3360N317K0450r985k0175J1035J7358j1579
570b35j3993J2958J0066j4944o978J6711L241j7713K139J9900m592j8230R855
583a815J8387j4679j6246J8542J3364k1108p318K2973J638k3362M104K0842j1201
596D121j6476J6527R237k2938l515K4356m884k4903J2647K2868j9673j9942K3437
$$ y = [-22, 14213, -6018, -15818, 7339, 13095, -9180, -7735, 15865, 9132, -14143, -1914, 19208, 2547, -15108, 6352, 19796, -5547, -13217, 14749, 14869, -15682, -10588, 16702, 2843, -21992, -530, 19508, -7676, -22263, 7257, 13296, -18396, -15065, 17588, 7809, -22054, -6765, 17784, -2557, -18348, 7205, 16387, -8139, -8893, 14413, 7695, -12165, 2800, 18842, -988, -12199, 9826, 14421, -10140, -10718, 14068, 10704, -12656, -7339, 13111, 3126, -17049, -6014, 11344, -235, -14228, -1270, 8796, -6148, -13126, 3585, 6826, -10887, -8748, 11152, 6560, -11670, -1815, 16572, 1893, -14353, 4189, 17553, -3555, -10873, 12100, 13738, -9624, -5520, 15322, 4121, -12355, 4172, 13409, -9529, -13044, 11312, 6428, -18475, -5828, 17040, -2633, -22575, 862]
609H62J4208k5079o399K6254R17k4415O550J9645j1144j4594J7313J0850j8924
622c956m351J9352r76j9093O071J9296r056j8020R077J4260j0932j1884J0675
635D63P652j1093o652J1074L832j0432j852R647k280j0530O539J0954r948j0836
649a3462J4391J0637j6644p746K0036P334k1461k969K2323j007k0564M639J7330
662A2837q829j1721J2265O005j4882R69J5337r216j6643J5031J3020k0312j1334
675a7473K2986O249k4029j433K2776k872k0181P009J4666q988p476J2821K542
688F597j4274L458J4531p282j3157J2243J2168j4831j0636J6377J0550j5887q965
701i108J5067P052j3928o691J0466K442j0685l75R473k492q540N370O402j0048
$$ y = [862, 15070, -10009, -16408, 9846, 10763, -13652, -7102, 12543, 1399, -13195, 4118, 14968, -3956, -8307, 11045, 10069, -9024, -2953, 16343, 7287, -10733, -1656, 12604, 1672, -10212, 463, 8115, -2978, -9630, 1444, 5276, -5156, -7008, 2639, 359, -10171, -3632, 7322, -2626, -13462, 929, 11566, -5078, -12824, 7212, 14546, -6915, -9884, 12439, 11432, -9132, -4493, 12837, 4008, -7713, 4552, 10557, -4325, -3356, 11981, 2765, -13878, 1153, 14173, -6139, -17473, 5513, 11762, -12267, -13700, 9076, 6204, -13977, -6968, 7698, -1290, -8766, 4055, 6597, -7677, -4219, 10312, 3030, -10127, 2116, 14284, -547, -11183, 5194, 15744, -143, -9108, 5959, 13011, -917, -7608, 2858, 5300, -5385, -5760, 3713, 1221, -7319, -1949, 4453, -5595]
715e595m417J4733K558j8007j62K0095k125k0582N632K0022q176j6414J2825J3771
729A4158j4122q398J6023K355j5218M394J3490j1524j2026J5670Q712j9296n194
742a0976K0276P9k0137J870J7141n650j4631P763J0822q227n586P573L89o934
756f228M712N666p391m447J1742M716j2300k888J2555L006j3943l93J4502J397
770A0706j3837j607J1101k26r633K279P606o530n704Q069K203j1372R68J3286
784G309n433j5619R776J5946j3337j6300J6754J4202j7716j0031J9036N936j8071
797g548l79J7313l641j3411R358R798j2718n388J4826K54j5233L748J5580p258
811E301j5637Q146J1363r586p734J0387M451j0851l307Q823k68o719K838M853
$$ y = [-5595, -10012, 4721, 7279, -10728, -10890, 9205, 7080, -13502, -7870, 12152, 3976, -12438, 387, 14158, 36, -8362, 7661, 10016, -5202, -808, 12682, 1158, -10868, 4802, 13514, -5782, -10976, 9300, 9379, -10758, -8888, 8253, 2603, -12028, -4265, 6557, -1670, -7256, 317, 706, -6228, -1516, 4150, -3241, -7688, 4054, 8770, -3530, -6418, 6137, 9143, -4800, -5193, 9309, 10706, -3131, -4738, 6363, 6137, -3496, -1217, 6389, -141, -5845, 2224, 4427, -6945, -5977, 7309, 1876, -13743, -3967, 11979, -1358, -17658, -904, 13298, -4418, -14449, 4587, 10523, -7548, -7927, 9386, 5745, -7666, 1692, 11490, -1228, -6616, 8210, 8464, -6769, -3021, 12559, 5301, -10336, -2190, 9173, -413, -8147, 2240, 6691, -4160, -7467, 1356, 1088, -5631, -2793, 2060]
825B060o120l161R311K760j0327j359J2054J287j2220M81J4315j502j3901K693
839c629J3599l943j2505O373J0196p670p336Q818K344j1727J753J1646o400j1402
853i883R141R690j4126p344J7108M425j9580j828J9269j242j6851N482J4792q166
867H87j0042J1206O624j2291k324J3085j155j1116O525J0109j0073r417J1017
880C035P791j1075n693J0339K698j0608j108Q366j292q350J838O279l036m318
894e134M620K391o599j230Q129J5r310K041J0491k363r432N527J0010q000q721
909g565J0400P868j1883m676J3243J266j3587K479J2936p664j2321J0496R679
922A0671j3190o965J4656J682j6376J654J4989o165j3558R398J1645j0922o964
$$ y = [2060, -4060, -7221, 2090, 4850, -5477, -6836, 5218, 6505, -5715, -5234, 9081, 7579, -6322, -3629, 9970, 6027, -6478, -105, 10091, 2421, -4915, 3903, 6247, -5480, -3727, 7919, 1519, -9883, -742, 8948, -5178, -12522, 4586, 9011, -10569, -12397, 6872, 5630, -11221, -5739, 9053, 887, -9155, 2051, 8675, -3616, -5940, 7145, 5990, -5126, 1399, 11508, 1435, -7982, 3035, 10826, -249, -5942, 4397, 7095, -3513, -4621, 3745, 2453, -5897, -4059, 2220, -816, -5134, -514, 1877, -4722, -5952, 2177, 2192, -7118, -5077, 5414, 3051, -6381, -854, 9156, 1156, -7565, 2835, 10703, -1180, -5856, 7387, 8653, -4934, -2455, 10481, 2817, -9504, 992, 10671, -2519, -9484, 5172, 6854, -9522, -7868, 7121, 956, -12602, -3204, 8441, -2481, -9445]
935i445J1515J603j1527L351J2182n145r255Q214O574j0308l587J1576J310j1559
949d501J677J1867k404j0297K684P295m756o384N110O020p091n594O275M159p530
964c470l327P586J325q773J218J0330k190j0374M385Q491o132p080R282N502j0315
979c542j355J2407o04j1850L838J0579p971p608J0456M975j2851k052J3334k104
993E652j3959N024J1374q684q132J0876N257j3156l344J1963J3j1492L774J0006
1007E172n922o970Q574N742q693m253R297J986p718J952Q003l679p455M413O667
1022G116n635n528O415L969p814j867Q666N64j0402k55Q924k472r078M070Q204
1037D877n986p683Q453N353r720l471J0534J933j0124J926J0362m068r637P395
$$ y = [-9445, 2070, 3673, -7854, -4503, 7679, 2534, -6721, 1493, 8067, -2241, -5828, 5748, 7058, -4501, -2824, 9043, 6639, -3658, -974, 6321, 1565, -4819, 291, 6311, -780, -6374, -99, 4060, -3470, -6797, 789, 2114, -6659, -5441, 4889, 2699, -7675, -3290, 5201, -931, -8011, 1271, 6773, -3542, -4897, 7510, 6906, -4944, -1106, 9473, 1502, -6106, 4350, 9325, -3526, -5578, 7756, 5652, -8307, -3283, 8091, -593, -8725, 2151, 7408, -5748, -9092, 2871, 2884, -8608, -4834, 5172, -750, -7720, 854, 6596, -2097, -6350, 2947, 4933, -2785, -833, 7170, 3491, -3964, 449, 7116, 1481, -4047, 2368, 6337, -1477, -3344, 5322, 5886, -4516, -4771, 4153, 1681, -7397, -3327, 4877, -1109, -8792, -339, 5014, -4706, -8177, 2357, 4290, -5834, -3908, 6454, 2386, -7251, 144]
1051A44P611q830m586J0892K951j0178M80R870m942j0292O889R000q513p035R124
1066B585K769j0639M1J0822l340j0906N418Q378o762o237Q521L143j0233j367
1080g807J1656L89r924K975Q595m522o880O549N982o779m075P691K655p591q02
1095a888P050j008p164K337N983m034n594M175M187n398l592O249M55p088P50
1110d580O886k461o974M275P094n279n550P363L553q319j092J0791K24r784K038
1125a815Q294m198p280P133O000q649l476R081J981r521l04Q014l336p231M633
1140f74N728o640m817O096K560o984n66P536j001o965K707O388l493n585M239
1155a471N117m297k720O107J568n873j13O745q73n858K302N017m357m700O422
$$ y = [144, 7755, -1075, -5661, 5231, 8182, -1996, -1516, 8354, 3412, -6880, 9, 9009, 496, -6539, 2585, 5354, -5285, -5244, 5578, 2238, -8668, -3250, 5128, -1634, -7871, 650, 3793, -6440, -7807, 3849, 4238, -5686, -2711, 5884, 1362, -5518, 1031, 7013, 234, -3841, 3850, 6505, -1086, -1888, 5162, 4154, -3010, -673, 5310, 1276, -4318, -143, 4044, -1354, -4946, 1303, 1758, -5330, -4580, 2306, -155, -7129, -2854, 4240, -1039, -6589, 774, 4327, -3992, -5084, 5707, 5931, -3853, -1815, 6479, 2281, -4999, 2134, 8134, -515, -3991, 5090, 7071, -2450, -2754, 5260, 1924, -5307, -674, 5054, -1586, -6403, -307, 2253, -4731, -5297, 2239, 1238, -5727, -3020, 3368, -125, -5710, -1471, 3646, -651, -3371, 2736, 4304, -1569, -1682, 5063, 4190, -1668, 634, 5651, 1294, -3406, 3016]
1170C016K941p936k598Q442M34r122J304Q286m244p369N553O032p117n028P076
1185c30J862o627J492P480l302o017M743N375n897k928P516J824p519J165P794
1200F631k404p577L220N808m665m036N508L108n525k789N062q11n121J004M028
1215A441k393l837L355L310m144k462N812J834o590j541O343J311n287Q63N433
1230C448j829m980L103M858l205k571M123J666n163N65O106l834p140L684O747
1245E578n006n183O126L456q710k532Q196J244p924M63O714l091n647N817M323
1260C824o840k585P823J185p893K126Q791l499p332M765O147n204m173N821K385
1275E341n507j204M125j128k923K519J780m266j188L947n16m426J175M395k720
$$ y = [3016, 5957, -1979, -4577, 3865, 4299, -4823, -3519, 4767, 523, -6846, -1293, 4739, -2378, -7406, -330, 1532, -5095, -3603, 3877, 575, -5442, -699, 4676, -1221, -4149, 3367, 5191, -2328, -1163, 6631, 4227, -3350, -130, 5678, 1013, -3023, 2485, 5593, 68, -2721, 2341, 1530, -3591, -2587, 1441, -952, -4789, -1434, 1876, -2268, -4730, 1082, 2916, -3674, -5215, 1128, 2439, -2848, -1985, 3448, 1619, -3361, -258, 4600, 1395, -1176, 2947, 4613, -550, 15, 6121, 2287, -4853, -1169, 5578, 572, -4611, 1515, 4971, -3739, -6271, 1925, 3169, -4755, -4292, 2422, -669, -6316, -499, 3824, -3016, -5601, 2222, 3407, -4486, -2360, 6431, 2932, -4400, 365, 6512, 1308, -2865, 2956, 5341, -166, -1370, 2755, 1627, -1296, 1223, 3003, -1263, -2451, 1496, 980, -3446, -2271, 2124, -596]
1290e96n133K593N170k335m408K342M462k217l014L083K998l633j286M719J061
1305C806m659Q26M468k860n082N001N103o074m555P260K586q369j356Q068q03
1320C360q717K198O585m253m654N345J617n972J011O548l676n804N832N119n791
1335a252l947P121K413o421p33O447j57n069J458M272j984j615J665O80k689k87
1351i8K106j178k420P35J838j250k177J156K066j088l454J459L758j819l409J686
1367b089K834j822j730L366J068l570Q56M036j966k264M264K333o611j281P065
1382D489K31q119J276Q424l188p275M352N211n708l640M837Q22n751J241M703
1397A905l348l760N339K320o994o26P973l59p364J993P021k482n025L772L804
$$ y = [-596, -5729, -3136, 2034, -301, -4709, -2367, 2095, -122, -3136, -53, 2945, -688, -1974, 2745, 3806, -853, -27, 4441, 1581, -3501, 1500, 6603, 529, -4026, 3234, 5820, -2549, -3905, 4163, 3360, -5357, -3159, 3426, -827, -5481, -136, 1481, -4491, -3480, 3068, -608, -6412, -580, 4539, -1252, -5199, 1922, 4335, -2086, -2819, 3628, 3471, -1598, -140, 4132, 2148, 533, 2198, 2878, 189, -98, 2008, 830, -1590, -855, 983, -267, -2444, -1288, 778, -310, -3764, -2305, 1453, -366, -3775, -2089, 745, -1077, -2807, 559, 1627, -1943, -1087, 2949, 983, -1281, 2983, 5316, -1295, -2576, 4489, 4720, -3399, -2123, 6301, 3113, -4162, 190, 5401, -307, -3947, 890, 1712, -4039, -2798, 1905, -1443, -5203, 136, 2456, -4538, -5164, 2809, 2450, -4914, -2921, 4100, 1618, -3407, 365, 4169]
1412D169l854k029L373J339k634R92J676j818k112K231J664k781j793J863J256
1427A542k448j285J745K170k996l017J912L220j784k527K589J698k968o14K929
1442A66N3k540K858J944l590q83O029q82n346K139O398m132n895N253M403o299
1458c24l005O581r5o084J776N135m405m392N455J901o717j00O694j832o894L520
1474b786O378l553m557M124K663l927n93M364j53k258J499J164k657k77L489m54
1490B466k455K39K229j9k493R9J839m40k858n70K380L37k927k91L020o72l560
1507c676J471L461k796j939L686J755m216j66N342j993n246L652N447m026l964
1522c208O362K293o282j091O837j234n986K346L645m106k428M719O60n507O74
$$ y = [4169, 315, -1714, 1659, 2998, 364, 1356, 3032, 1214, -898, 1333, 2997, 216, -1577, 286, 1542, -906, -2191, -446, 1724, -1272, -4289, -2377, 843, -941, -3468, -879, 819, -2149, -2763, 166, 219, -2321, 537, 2481, -1109, -1992, 4037, 3155, -2191, -52, 6346, 2214, -3681, 1572, 5975, -324, -3329, 3252, 3157, -2927, -1151, 3984, -421, -4813, 642, 2543, -4174, -4274, 2420, 588, -6306, -2786, 3592, 39, -4518, -394, 2269, -1658, -2251, 2113, 1960, -298, 1201, 2365, -292, -569, 2920, 2466, 11, 250, 2479, 2460, -33, 66, 1905, 1465, -1393, -1963, 417, 754, -2173, -2464, 556, -116, -3676, -2205, 1256, -1540, -3479, 207, 1962, -2254, -2420, 2922, 929, -4317, -665, 4782, 756, -3208, 3154, 5447, -835, -1926, 4911, 3677, -2309, 37, 3682, -424, -2852, 1867, 2527, -2980, -2306]
1537b306M780k839m343L742L428m521k397M213J007l543J55L122o27k055J548
1552f36K269j316o93K518J1k234M44J800j05k313N11K011n73j940N79J709o37
1569A405k704P21J671j550j754J750R11l089l91L270k02l129J508K494k099k644
1585c832M023K488m057r67M245O86m756J238M810j882m089K867L500l735j763
1600a224M484k34m391Q83L242k446k871K287K131l847j361M049J83l558K69L384
1616I80j463k379J718J917j686j521K081P89j016K81J992l43j466P04J888o65
1632A811j506R22J248j816j604K473J126k409j521K141N99l243lK719j070l695
1648c828J998L159k650j936L586J135m419K14L798j068k957K856L143l161j849
$$ y = [-2306, 2474, -365, -4708, -966, 2462, -2059, -4456, -243, 764, -2779, -2624, 498, -129, -2184, -636, 1633, 317, -376, 2142, 2153, -81, 363, 2163, 2058, -255, 256, 2267, 1694, -246, 333, 2042, 1405, -1299, -578, 1093, -457, -2211, -461, 450, -2639, -3030, 240, 38, -3091, -1583, 911, -1188, -3832, 191, 2679, -1378, -2345, 1900, 2586, -2170, -932, 3878, 1996, -2093, 774, 4274, 539, -1224, 3260, 3026, -1365, -482, 2760, 314, -2557, -270, 1861, -1986, -3347, 702, 885, -2673, -2404, 980, -483, -2862, -1144, 773, -913, -2434, -353, 436, -580, -299, 1693, 1350, -116, 588, 2476, 1811, 305, 1227, 2475, 659, -945, 1528, 2654, 245, -1276, 865, 1464, -1779, -1782, 937, -133, -3828, -1830, 1329, -1321, -3257, 329, 1464, -2955, -2741, 1057, -11, -2968, -112, 3031, -130, -1979]
1663a979M203P81m018N64L834j327l336K700K238k900j670L151L62m072k32L385
1679A684j313k685J072K309j611k262J706J211k437q81K763J025j862l71K360
1694G08J7j934L37K069n38j588J809K141j445j814K640Q11l608j31L649j146l390
1711a413J483L245l003k983K907J144m060o62M394k52l820J277K813k209k483
1726c622L448J012l251o4M429n48l280K145K934k421k879L024K788l055j036K629
1742B253Q15k757o7J831o83k639J560J637j724k292K061O70k894k26K646j34l060
1759c003J321K657j352l081K428K462k056j755L145J014k807L1K886J14k931J127
1775B00K668j484j939K298J862l318j256K996j02l522O41L517k741k855K327K546
$$ y = [-1979, 2224, 3005, -1013, -449, 3385, 2058, -1278, 1422, 3660, 760, -910, 2241, 2603, -1469, -1701, 1684, 371, -2314, -1242, 1067, -544, -2806, -1100, 111, -2326, -3207, -444, 581, -1281, -1652, 708, 725, -1209, -872, 1197, 659, -929, 880, 3021, 1576, -238, 2402, 3213, -395, -526, 3123, 1977, -1413, 70, 3315, 312, -2671, 236, 1380, -2680, -3342, 1052, 800, -3020, -1743, 1070, -1139, -3622, -174, 838, -2413, -2477, 1952, 1404, -1876, 269, 3203, 782, -2097, 927, 3715, 660, -376, 2253, 3068, 311, 244, 2075, 1392, -1247, 313, 1950, 226, -2066, -5, 665, -2229, -2455, 191, 57, -3003, -1682, 975, -377, -3458, -1030, 1432, -624, -2379, 766, 1780, -1027, -996, 1890, 2004, -927, 200, 2868, 1384, -555, 1743, 3605, 287, -969, 2027, 1925, -1597, -956, 2561, -180, -3035, -708, 1838]
1791A838l013j773K879P95l508L57L758j420k898J977K416k066j587L228J086
1806B069k632j46L425p5l168J046K011j591j270J788Q68k304m62K521p24k809
1822a453J72K293q84k678J332J924j834j275J720J412k490q90K192j81j671Q14
1838a497L346j072k590K012K264j722j714K740O09l010K43L326k94l679J496K562
1854C020k594j826K645O51l269n52L020o76k917J287J961k211j814K468J395k917
1870b329R2L170o50k443J389K580j283k234K086K100j960r47K305N79k427N2J789
1887A869m28j997J003J975r44k323J119R69k256j281J950Q83k629n45K954M11
1903G30k615l2K263j170j849K202K066k284r35K657Q65k755M54K893r31k406J695
$$ y = [1838, -1175, -2948, -69, 726, -2782, -2425, 1333, -87, -2985, -1008, 1408, -658, -2245, 983, 2069, -563, -709, 2716, 2641, -527, 519, 2530, 939, -331, 1457, 2325, 21, -441, 2080, 1356, -1453, -1281, 1012, 128, -2550, -1218, 706, -1128, -2403, -683, 729, -1761, -2651, -459, -640, -2311, -1497, 1849, 777, -1813, 199, 2463, 741, -973, 1767, 2376, -634, -391, 2935, 2641, -1038, 458, 3020, 426, -1400, 1245, 1896, -1373, -1925, 1095, 419, -2498, -1211, 750, -1461, -3275, -807, 588, -2329, -2237, 933, 283, -2160, -771, 1809, 526, -1708, 378, 2478, 518, -429, 1876, 2455, 28, 80, 1869, 1441, -556, 447, 2422, 1478, -845, 274, 1243, -1013, -2294, -344, 539, -2090, -2635, 319, 730, -1885, -1917, 346, -824, -2673, -471, 1595, -689, -1624, 1033, 1898, -857, -403, 2490, 1559, -847, 848]
1920H48K311j653j706K136K56k766m9K493q90k574J093K155j858j939J942J005
1936H04k774l46K417k94k663J189K729k060j829K290K114k332o61L604M16l481
1952h77J51L170o01k731J593K753k141j920J914J501k875q87K437k59k473K50
1968i95K293j331k365J026J917j516j811J621J645k097n25K639M55k597j9K444
1984G84K16k040J140K363j587j405J993N37j551k91J971m96k000J238J456j741
2000E87k544K284J094k886n45K642k74k515J081J702j730j507J917P59j938j00
2016a973K913p58j972J419K518j741k232K724J297j976q90K821M24k413J52K106
2032B419n83k425P64J858j623j841J810J197k847j333K229P36k340O5K336n60
$$ y = [848, 3159, 1506, -200, 1936, 2192, -574, -623, 1870, 980, -1594, -501, 1654, -204, -2143, -201, 804, -1970, -2316, 101, -193, -2856, -1667, 1062, -998, -2827, -537, 1577, -755, -1416, 2188, 2604, -877, -726, 2444, 1843, -888, 705, 3458, 1317, -603, 1311, 2812, -63, -950, 1487, 1228, -1245, -995, 1298, -33, -2398, -1372, 545, -971, -2782, -1161, 484, -1613, -2138, 501, 956, -1641, -1660, 784, 1000, -1040, 100, 2463, 876, -529, 1464, 2001, 450, 159, 2130, 1634, -366, 872, 2328, 587, -1957, 327, 1421, -1465, -2010, 632, 358, -2157, -1076, 626, -1104, -2611, -694, 65, -1873, -1973, 940, 182, -1790, -371, 2147, 406, -1826, 898, 2195, 219, -671, 2150, 2574, 161, 313, 2419, 1836, -589, 175, 2033, 410, -1431, 379, 1576, -1271, -2604, -375, 361, -1979, -1914, 422, -138]
2048a38k311O81K356r46j976J748J662j967J08J975J3k143J185K530j587j687
2064d97J607J343k005p63K200N08k879k39K066k70k050N53J237j722r80J694K85
2081H8j650k8J835p82j763Q64K191j639j496K533J817k314q78K199J148k757K23
2098d09K489l34k029P95J914j900q12J816N08l163O39K188r20k507P87K463k171
2115f46k079J818J132k004o89K166N79k320N30J836n0j759J607R47j329n04K164
2132A399M87j694j86J756J00k157M59K257r48j973J270R86j306j369J456l4j599
$$ y = [-138, -2449, -1768, 588, -358, -2334, -586, 1076, -891, -783, 1192, 1205, -938, 247, 2777, 1190, -497, 1110, 2453, 448, -315, 1885, 2393, -486, -725, 1341, 1071, -979, -426, 811, -911, -1891, -197, 88, -1562, -1590, 245, -537, -2300, -1436, 755, -884, -2380, 153, 1970, -344, -1222, 977, 2125, -632, -409, 2080, 1746, -283, 512, 2426, 526, -286, 1530, 2038, -1125, -486, 1702, 782, -1725, -938, 1525, -646, -2725, -907, 225, -1779, -2468, -302, 277, -2043, -1513, 323, 273, -1486, 121, 1068, -261, -765, 1399, 1886, 192, 6, 1762, 1862, -295, 164, 2421, 1473, -500, 770, 1756, 450, -919, 537, 503, -1096]
$$ [...]
8191B19
##END NTUPLES=NMR FID
##END=
