##TITLE=1H_SL62-SePh
 CDCl3, 8 sc, 
 14.3.2019
##JCAMPDX= 6.0         $$ Bruker NMR JCAMP-DX V2.0
##DATA TYPE= NMR FID
##DATA CLASS= NTUPLES
##ORIGIN= UXNMR, Bruker Analytische Messtechnik GmbH
##OWNER= root
$$ XWIN-NMR		Version 3.5
$$ Thu Mar 14 16:03:41 2019 Russian Standard Time (UT+4h)  she@DPX200
##.OBSERVE FREQUENCY= 200.1315
##.OBSERVE NUCLEUS= ^1H
##.DELAY= (6, 6)
##.ACQUISITION MODE= SIMULTANEOUS
##.ACQUISITION SCHEME= undefined
##.AVERAGES= 8
##.DIGITISER RES= 18
##SPECTROMETER/DATA SYSTEM= spect
##.PULSE SEQUENCE= zg30
##.SOLVENT NAME= CDCl3
##.SHIFT REFERENCE= (INTERNAL, CDCl3, 0, 15.7039)
##AUDIT TRAIL= $$ (NUMBER, WHEN, WHO, WHERE, WHAT)
$$ ##TITLE= Audit trail, XWIN-NMR		Version 3.5
$$ ##JCAMPDX= 5.01
$$ ##ORIGIN= Bruker BioSpin GmbH
$$ ##OWNER= she
$$ F:/spectra/data/she/nmr/H-F/1/audita.txt
$$ ##AUDIT TRAIL=  $$ (NUMBER, WHEN, WHO, WHERE, WHAT)
(   1,<2019-03-14 16:02:41.32 +0400>,<she>,<DPX200>,
      <created by zg, POWCHK disabled, PULCHK disabled
       configuration hash MD5:
       00 E9 B6 7A A2 85 ED C7 34 08 36 98 17 FE 4E 26
       data hash MD5: 16K
       86 95 4F D4 B5 35 99 D9 A5 CD D1 DC AF 4A 84 13>)
$$ ##END=
$$ 
$$ hash MD5
$$ 1F 7D 9C 1F EA 2A 0A 2F 2B 0F 9B 92 E6 2B 0A 19
##$RELAX= 
##$RELAX= 
##$RELAX= 
##$RELAX= 
##$RELAX= 
##$RELAX= 
$$ Bruker specific parameters
$$ --------------------------
##$DU= <F:/spectra>
##$EXPNO= 1
##$NAME= <H-F>
##$PROCNO= 1
##$TYPE= <nmr>
##$USER= <she>
##$AMP= (0..31)
100 100 100 100 100 100 100 100 100 100 100 100 100 100 100 100 100 100 
100 100 100 100 100 100 100 100 100 100 100 100 100 100 
##$AQSEQ= 0
##$AQ_mod= 1
##$AUNM= <au_zg>
##$AUTOPOS= <>
##$BF1= 200.13
##$BF2= 200.13
##$BF3= 200.13
##$BF4= 200.13
##$BF5= 200.13
##$BF6= 200.13
##$BF7= 200.13
##$BF8= 200.13
##$BYTORDA= 1
##$CFDGTYP= 0
##$CFRGTYP= 5
##$CHEMSTR= <none>
##$CNST= (0..31)
1 1 145 1 1 1 1 1 1 1 1 1 1 1 1 1 1 1 1 1 1 1 1 1 1 1 1 1 1 1 1 1 
##$CPDPRG= <>
##$CPDPRG1= <>
##$CPDPRG2= <>
##$CPDPRG3= <>
##$CPDPRG4= <mlev>
##$CPDPRG5= <mlev>
##$CPDPRG6= <mlev>
##$CPDPRG7= <mlev>
##$CPDPRG8= <mlev>
##$CPDPRGB= <>
##$CPDPRGT= <>
##$D= (0..31)
0 1.2 0 0 0 0 0 0 0 0 0 0.03 0 0 0 0 0 0 0 0 0 0 0 0 0 0 0 0 0 0 0 0 
##$DATE= 1552564960
##$DBL= (0..7)
120 120 120 120 120 120 120 120 
##$DBP= (0..7)
150 150 150 150 150 150 150 150 
##$DBP07= 0
##$DBPNAM0= <>
##$DBPNAM1= <>
##$DBPNAM2= <>
##$DBPNAM3= <>
##$DBPNAM4= <>
##$DBPNAM5= <>
##$DBPNAM6= <>
##$DBPNAM7= <>
##$DBPOAL= (0..7)
0.5 0.5 0.5 0.5 0.5 0.5 0.5 0.5 
##$DBPOFFS= (0..7)
0 0 0 0 0 0 0 0 
##$DE= 6
##$DECBNUC= <off>
##$DECIM= 24
##$DECNUC= <off>
##$DECSTAT= 4
##$DIGMOD= 1
##$DIGTYP= 9
##$DL= (0..7)
0 120 120 120 120 120 120 120 
##$DP= (0..7)
150 150 150 150 150 150 150 150 
##$DP07= 0
##$DPNAME0= <>
##$DPNAME1= <>
##$DPNAME2= <>
##$DPNAME3= <>
##$DPNAME4= <>
##$DPNAME5= <>
##$DPNAME6= <>
##$DPNAME7= <>
##$DPOAL= (0..7)
0.5 0.5 0.5 0.5 0.5 0.5 0.5 0.5 
##$DPOFFS= (0..7)
0 0 0 0 0 0 0 0 
##$DQDMODE= 0
##$DR= 18
##$DS= 0
##$DSLIST= <SSSSSSSSSSSSSSS>
##$DSPFIRM= 0
$$ [...]
##$SUBNAM2= <"">
##$SUBNAM3= <"">
##$SUBNAM4= <"">
##$SUBNAM5= <"">
##$SUBNAM6= <"">
##$SUBNAM7= <"">
##$SUBNAM8= <"">
##$SUBNAM9= <"">
##$SW= 24.9337058887773
##$SWIBOX= (0..15)
0 0 2 0 0 0 0 0 0 0 0 0 0 0 0 0 
##$SW_h= 4990.01996007984
##$TD= 16384
##$TD0= 1
##$TE= 0
##$TE2= 300
##$TE3= 300
##$TEG= 300
##$TL= (0..7)
0 120 120 120 120 120 120 120 
##$TP= (0..7)
150 150 150 150 150 150 150 150 
##$TP07= 0
##$TPNAME0= <>
##$TPNAME1= <>
##$TPNAME2= <>
##$TPNAME3= <>
##$TPNAME4= <>
##$TPNAME5= <>
##$TPNAME6= <>
##$TPNAME7= <>
##$TPOAL= (0..7)
0.5 0.5 0.5 0.5 0.5 0.5 0.5 0.5 
##$TPOFFS= (0..7)
0 0 0 0 0 0 0 0 
##$TUNHIN= 0
##$TUNHOUT= 0
##$TUNXOUT= 0
##$USERA1= <user>
##$USERA2= <user>
##$USERA3= <user>
##$USERA4= <user>
##$USERA5= <user>
##$V9= 5
##$VALIST= <valist>
##$VCLIST= <CCCCCCCCCCCCCCC>
##$VD= 0
##$VDLIST= <DDDDDDDDDDDDDDD>
##$VPLIST= <PPPPPPPPPPPPPPP>
##$VTLIST= <TTTTTTTTTTTTTTT>
##$WBST= 1024
##$WBSW= 4
##$XGAIN= (0..3)
0 0 0 0 
##$XL= 0
##$YL= 0
##$YMAX_a= 126825
##$YMIN_a= -249875
##$ZGOPTNS= <>
##$ZL1= 120
##$ZL2= 120
##$ZL3= 120
##$ZL4= 120
##$ABSF1= 10
##$ABSF2= 0
##$ABSG= 5
##$ABSL= 3
##$ALPHA= 0
##$AQORDER= 0
##$ASSFAC= 0
##$ASSFACI= 0
##$ASSFACX= 0
##$ASSWID= 0
##$AUNMP= <proc_1d>
##$AZFE= 0.1
##$AZFW= 0.1
##$BCFW= 1
##$BC_mod= 2
##$BYTORDP= 1
##$COROFFS= 0
##$CY= 11.3945322036743
##$DATMOD= 1
##$DC= 2
##$DFILT= <>
##$DTYPP= 0
##$F1P= 18.9103706918063
##$F2P= -1.10871071338519
##$FCOR= 0.5
##$FTSIZE= 0
##$FT_mod= 4
##$GAMMA= 1
##$GB= 0.15
##$INTBC= 1
##$INTSCL= 1
##$ISEN= 128
##$LB= 0.24
##$LEV0= 0
##$LPBIN= 0
##$MAXI= 10000
##$MC2= 0
##$MEAN= 0
##$ME_mod= 0
##$MI= 1.114404
##$NCOEF= 0
##$NC_proc= 0
##$NLEV= 6
##$NOISF1= 3.799351
##$NOISF2= 2.8
##$NSP= 1
##$NTH_PI= 0
##$NZP= 0
##$OFFSET= 15.70392
##$PC= 1
##$PHC0= -9220.614
##$PHC1= 14.60026
##$PH_mod= 1
##$PKNL= yes
##$PPARMOD= 0
##$PSCAL= 0
##$PSIGN= 0
##$REVERSE= no
##$SF= 200.130013532006
##$SI= 16384
##$SIGF1= 3
##$SIGF2= 2
##$SINO= 400
##$SIOLD= 16384
##$SREGLST= <1H.CDCl3>
##$SSB= 0
##$STSI= 0
##$STSR= 0
##$SW_p= 3612.71676300578
##$SYMM= 0
##$S_DEV= 0
##$TDeff= 0
##$TDoff= 0
##$TI= <>
##$TILT= no
##$TM1= 0
##$TM2= 0
##$TOPLEV= 0
##$USERP1= <user>
##$USERP2= <user>
##$USERP3= <user>
##$USERP4= <user>
##$USERP5= <user>
##$WDW= 1
##$XDIM= 8192
##$YMAX_p= 0
##$YMIN_p= 0
$$ End of Bruker specific parameters
$$ ---------------------------------
##NTUPLES= NMR FID
##VAR_NAME=  TIME,          FID/REAL,        FID/IMAG
##SYMBOL=    X,             R,               I
##VAR_TYPE=  INDEPENDENT,   DEPENDENT,       DEPENDENT
##VAR_FORM=  AFFN,          ASDF,            ASDF
##VAR_DIM=   8192,          8192,            8192
##UNITS=     SECONDS,       ARBITRARY UNITS, ARBITRARY UNITS
##FACTOR=    0.0002004,     1,               1
##FIRST=     0,             0,               0
##LAST=      1.6414764,     0,               0
##MIN=       0,             -249875,         0
##MAX=       1.6414764,     126825,          0
$$ Real data points
##PAGE= N=1
##DATA TABLE= (X++(R..R)), XYDATA
0@%%%%%%%qJ6j6J7k5L2m0N1n9P2q8J04j21J43j67J94k26K61k99L42l90M43n00
30b64N64o36P14p99Q91r95J109j233J369j518J683j864K063k283K530k807L113
47A637l461L862m324M863n504O283p249Q487j0143J2482j6069K2339l6459J26635
61A03379k3425k04954R2908J32463J8215j15783k0999P3922P1099l0440n3048
72D3337l0296P462J466K072m825O458J3404K1352j32j9235k5537j0827l090N097
86F706P936O533l431K920R670m093l5630k5148K6445M7613j678n1378k8156K8731
100a2960K9928j1993k2413Q291J3588j5355j8836J5654K4647j6265m1174p064
112e3952L5824K7795o106j9495q713J99J97k500q301q814Q413K9134J9105j4228
$$ y = [0, 0, 0, 0, 0, 0, 0, 0, -8, 8, -8, 9, -16, 16, -24, 27, -32, 40, -48, 56, -65, 78, -89, 105, -121, 140, -159, 183, -207, 236, -264, 300, -336, 378, -421, 470, -525, 584, -649, 720, -798, 885, -979, 1084, -1199, 1331, -1476, 1637, -1824, 2038, -2286, 2577, -2927, 3356, -3893, 4594, -5549, 6933, -9136, 13203, -23256, 103379, 79954, -125000, -32092, 100371, 118586, 2803, -18196, 55726, 126825, 96385, 43337, 13041, 20503, 21969, 24041, 19216, 25674, 39078, 60430, 60298, 41063, 15526, 4699, 1609, 6706, 14642, 21175, 17744, 20664, 30334, 26241, -9389, -34537, -8092, 39521, 37843, -13535, -41691, -12960, 16968, 4975, -17438, -9147, 4441, -10914, -29750, -14096, 10551, -5714, -46888, -53952, -18128, 9667, 3561, -15934, -24647, -24448, -24251, -26751, -35052, -43866, -35453, -6319, 12786, -1442]
126a442k9518j3088O090R085N648L016k833m824Q956J6946j075k3240j4423J1722
140b8980J4293m948n282J4369J6404q020k0872p262P388P031N256J0953N998j1392
154e064j6084L872J6467K036j6369n960K0178K2714m677k3888j1110J2944J4864
167I923n601j6912k667K0973K2181p39k1049j5426L957R011j201m436P282J3732
181A9028K764q844o484R77o01m599j152M806K486r40K136O499K806n050q153o168
197d89k643K890Q313N728l288o495J500P841J450j0826j0551k99P168M662k842
212B119l928K672Q884N384p424j5513r686N781J1797K895p517l549Q546R642l287
227F816j4736r821L097Q101N66n639j574Q287J0544K7j1380j2104j901P579N979
$$ y = [-1442, -30960, -44048, -37958, -28873, -23225, -20209, -23042, -27866, -18910, -1964, -3039, -26279, -40702, -28980, -14687, -19635, -24917, -10548, 5856, -2164, -23036, -30298, -22910, -15879, -10623, 330, 6328, -5064, -21148, -17276, -809, 1227, -15142, -21102, -924, 21790, 17113, -6775, -17885, -4941, 9923, 4322, -12590, -15257, 5716, 27897, 27158, 6109, -9317, -5360, 3651, 2450, -1986, 5296, 19028, 21792, 12948, 6464, 7441, 6840, 2241, 1089, 5895, 8381, 7441, 9577, 16076, 18882, 13832, 5679, -489, -3132, -242, 8071, 13799, 10511, 4016, 5516, 13357, 14807, 3981, -6570, -6869, 299, 4961, 2119, -1809, 863, 9747, 15131, 7707, -7806, -17492, -11711, 86, 2981, -4536, -8085, 461, 10103, 6816, -7920, -17741, -14644, -6543, -5977, -11616, -13190, -4903, 5641, 5668, -5712, -17816, -19717, -12138, -6159]
242f159k770n586J451Q589N532l058q805n424J339M003J035l391j870M413Q303
257b398L239m717o263k611R76O31l43L52K368L983L692K016k345m673l689j075
273a0857L79J209K817N184M615R08j757l375l985k892J41L263M397K034J658K170
289E909J102l463n271l122J623M616L329J561l30L39k7n83j903l256q32M072O229
306I993L087l401n767k852K553K872O72j506QL852L961j501o969n728J275M944
322E493L462K23J9J550R33l994n329k519J500L351K385O17P91Q04K08l539n783
339A72k822K968N358K270j401k001k16k8j469k242o37O0R80J823K873k56m804
356F28m577L91M567L720j358l272j573R57O30j948k486J70K375L880K039j249
$$ y = [-6159, -8929, -14515, -13064, -4475, 1057, -2001, -10806, -16230, -14891, -10888, -9853, -13244, -15114, -10701, -2398, 841, -3876, -10139, -12750, -11774, -11143, -11486, -11134, -8766, -4783, -1091, 925, -1420, -6093, -9782, -10857, -10478, -9269, -6452, -1268, 3347, 4255, 2498, -877, -4862, -7754, -7613, -4350, 47, 2081, 3739, 5909, 7011, 3548, -1723, -4845, -3222, 1394, 4723, 6284, 5954, 6293, 6266, 5683, 3780, 524, -308, 3764, 9993, 13080, 9679, 3912, 1060, 3613, 6485, 7157, 5651, 5659, 9511, 13472, 11971, 5002, -726, 549, 5493, 8955, 9178, 9197, 10747, 11680, 7686, 2357, -162, 1338, 4689, 7074, 7691, 8482, 9286, 9494, 5955, 172, -2650, 318, 5676, 7946, 6545, 4544, 4328, 4300, 2831, 589, -48, 12, 992, 2815, 5688, 5432, 628, -3949, -3558, 1009, 4729, 3371, 99, -1474, -517, 113, -1835, -4321, -4151, -1776, 2104, 4143, 2894]
372B894l415l884k993j048K431M359L073J244l05r32k211m295l914n86K377M025
388c180M059M262J415m800p293l609J670J830Q7J129M454M724R85l583m776m345
404f971j458J794L737M080J449l66o92j530j160j463j574nJ427L279K890K30k529
421A138k970l66Q41J536J048L5r61k3O26P99j055j413J5K758J557j263r09m64
439I29o49j870K20L123K392j94j263k49m52j280j783p03J138J670K169K100J02
456E400l176l084p27Q30K70N34J457J530R29o08j928j874q79j67L78R28J526K045
474C384L21k610k918l49J686R20j028j16J980J377j054l436p43N85J265LK25Q00
492B92J072n84j371j448m76J04J740m6J22M30J139L91k302k237n63J708J892J78
$$ y = [2894, -521, -4405, -7398, -8446, -6015, -1656, 1417, 2661, 2356, 1424, -787, -5082, -8996, -9582, -7205, -3180, 879, 5141, 6556, 1756, -5537, -9146, -7476, -5646, -5559, -4430, 24, 4748, 5733, 2150, -2626, -6971, -8429, -6635, -2898, 1182, 2631, 2265, 1573, 43, -1117, -2580, -4154, -4159, -2732, 547, 3437, 3667, 1138, -1832, -2198, -1357, 179, 1227, 1262, 301, 278, 904, 1703, 648, -765, -750, 2008, 3565, 2302, 1393, 929, 280, -1590, -1370, 1753, 4145, 3951, 2688, 2439, 1987, 707, -1076, -1779, -641, 1029, 3198, 5298, 5400, 2224, -860, -1587, -757, -487, 47, 1504, 3034, 3963, 3355, 1427, -447, -1326, -1493, -1115, -187, 1339, 3384, 3705, 1095, -1823, -2172, -486, 434, -594, -710, 1270, 2647, 1593, -1843, -2586, -2001, -736, -733, -508, 292, 1364, 780, -591, -2039, -2515, -2411, -671, -717, -595, -165, 974, 1365, -937, -3174, -3737, -2029, -137, 41]
510D1j81J43K90l19j689j035j46J771P47o74n55J150J670l73k199j680J231J493
528c15j20q01l54J465J047k96j524j252N28J358N21r18j115M79J944P81k32j093
546A03q30p1L1p01J63Q20J278N41j76o69o55L14k7m53o68L69O92Q46L53R5n89
567G66p69n66j07O4k3P93Q94L62k69r42m58L99N95l5j050k56j65O42P62O60k74
588A023q6r64k19k89l01O90J1P5J19O72K88k84j123n16J25o2k38M53O13J497M94
609A978r64j504j638k83J295J057K44l81Q27M78l90j508j072M45O17P19p26m8
627h54J276P88o78j248j863M05J651J390k04p53N1K03k09j202r32P54K196O02
645A373p19n98m10j62L33l62k51k31J415Q19K02l03j083o09k08m2n5J507J187
$$ y = [41, -140, 3, 293, -26, -1715, -2750, -2896, -1125, -378, -1052, -1607, -457, 1213, 840, -1359, -3039, -1808, -315, -435, -1236, -1590, -125, 922, 626, -898, -2150, -1622, -264, 257, -661, -1776, -1297, 647, 1428, 1196, 103, -727, -798, -767, -1468, -1305, -485, 793, 1334, 1158, 489, -166, 148, 121, -332, -1000, -631, 61, 907, 1260, 1355, 766, -3, -569, -676, -612, -635, 158, 1052, 1414, 1145, 203, -255, 144, 739, 704, -346, -602, -767, -125, 637, 1297, 1023, 937, -27, -246, -535, -836, -146, -135, -60, 59, 731, 1019, 735, -388, -904, -779, -841, -1079, -626, -13, 1484, 1978, 1014, -490, -2128, -2411, -1116, -59, 185, -196, 631, 1109, 719, -789, -1861, -1416, -799, -80, -806, -854, 422, 1210, 532, -716, -2579, -2174, -523, 867, 663, -90, -39, 164, -45, -1247, -2179, -1425, 771, 1373, 654, 56, -354, -516, -183, -545, -796, -1027, 388, 1207, 1409, 1106, 23, -586, -794, -836, -891, 616, 1803]
664A803L44j375q56k65J16oj67J010N57P38p09m29o36l78O37J52k6O6Q45o1M08
685A768q56p75k44j71O38O07Q51J26l45j293m75n25R03J155Q92p36j126M3O13
704A050k21j308o65P03J964R80o95j368Lq69O93m46j52L96N05J153K98p08j332
723a9j290J15N3J121Q28N02P4j028P6r51l01j63L08O3O12R54R03n36j754j156
743a589L14R29Q5J46l19M83L75n41o61p76j26Q70N41O97Nl22p95l32l53R51M12
764fl61k28JP23J51p95p86n30P16P94J000j19o56j062n4O60K51m25m47J016J108
785I51m10q39k02o2l31K8N74P78l45M6j98N8k49k97l8M10l82O95O35N24p42r68
807c64j08m8L59M86M48ro29o4O21n81m81k90N82P94L23l95m95k29q0qq9M83j86
$$ y = [1803, 2147, 772, -84, -349, -233, -239, -406, 604, 1161, 1899, 1190, 761, 125, -253, 384, 536, 510, 576, 1421, 1360, 1768, 912, 137, -107, -278, 360, 967, 1818, 1944, 1599, 306, -169, -694, 209, 1364, 2256, 1520, 394, 437, 1050, 829, -479, -1144, -441, 1523, 2503, 1808, 440, 443, -426, 267, -179, -331, 65, 570, 1723, 2021, 1313, -19, -1309, -1194, -1141, -20, 808, 1310, 1384, 356, 432, -519, -820, -983, -675, -612, 0, 954, 1857, 1321, -433, -1589, -1275, -346, -261, -115, -434, 49, 424, -117, -778, -1554, -1680, -810, -269, 428, 433, 111, -684, -1016, -1369, -418, -6, -367, -595, -594, 129, 280, -515, -1301, -1831, -1115, -321, 679, 560, -96, -1158, -1212, -552, -301, -726, -1173, -157, 951, 541, -298, -500, -562, -893, -865, -291, 487, 142, 188, -10, 48, -201, -498, -536, -126, -508, 187, 822, 1346, 604, -364, -472, -520, -161, 325, 773, 764, 135, 71, 692, 111, -370, -660, -78, 716, 1039, 644, 149, -80, -160, -168, -257, 226, 40]
830D0J15K97P19j009j70l13L61K10k25Q8O55j2m76k90J66J88m45J29r0N74j36
851C76J26l96j55l30L00N53n58j32J62N05n5o03m42P05o52K86M82N5p89l07O58
872b11P06m03j094N04N04M27q70j88L16K96o87J18M72K30m20l13J94K39k68J31
892c17K35j97m87K13O18o25K28j96j31K46K03O6j67o17r3O70P03l78p87j13O80
913b46N62l59l43J49l83M82K04M11p54p70M01N81M38m71n51N97O95n62j54k71
933c44N79l88k01J68K76N82l74m32k78j22Q17M44m28m24J27P25O4r1p31l79N53
954A43L69M69Q4m19o32K72K49M7p36J3P05K40M1j90n14J87j50n97O24L80J71m40
976C16j00j71Q1P2L3k86J10L61L42J50m06l73l83j08L62M18j12j85p6M05j15n4
$$ y = [40, 155, 452, 1171, 162, -8, -321, 40, 250, 25, 113, 768, 756, 280, -10, 156, 344, -101, 28, -62, 512, 376, 502, 106, -49, -379, -79, 474, -84, -216, -54, 451, 396, -207, -649, 56, -596, -310, 172, 227, -562, -869, -211, 495, 92, -1002, -498, 6, 433, -437, -625, -309, -13, -700, -582, -110, 120, -300, -613, -419, -180, -448, -317, -82, -279, -766, -553, 65, -560, -332, -528, -659, -413, -210, -144, -311, -928, -1021, -351, 352, -26, -813, -926, -246, 316, -43, -386, -237, -620, -138, 66, 477, -277, -1047, -646, -65, 373, -98, -649, -52, 643, 81, -73, -344, 235, -153, -354, -186, 90, 672, 298, -134, -412, -534, 283, 727, 299, -125, 2, 727, 791, 700, -31, -410, 143, 512, 981, 1065, 646, 14, 286, 535, 582, -154, -141, 564, 804, 845, 655, 141, 328, 178, -419, 205, 585, 756, 316, 216, 45, 126, 198, 231, -55, 55, 416, 758, 908, 502, 129, -254, -362, 0, 418, 306, 121, 45, 450, 335, 281]
998B81p72j17L89N79K60o2m76k68M9k7J13M7m98O61K00n7q6m21lm39P9L02M74
1021B08K43k43m8n74J65J38qk42K49l7M27J86o16j34n28M04M17K89j39l31K27
1042E3jj68J6k61j80jN55M57j84k92j93j92l2K22J55L52p4j62n5k5k83N46k01
1065E2l72M7M67M93m25l43K5l01M33J2j92l7N3K55L8jm89q3J45M28P4J5k0r1m99
1090c16J13K16N40m19p2J44k16L68N9l15m98j25K14O13K7m06L00j33J37j63j52
1111h4m7K81j86K60p7q4k51J14m83O59L09p9k50r6m0J67R2k94j32j94K50K74K34
1134C43k94q5j87k49J27R3J12K86J25n98K35l95K59j38L1OK32j03J25j70m4J12
1156a77k25O29k60j63r1M58j5k88R3l98K78O4J26j00L07k70j03l54K36k1M63k42
$$ y = [281, -491, -608, -219, 360, 620, 558, 82, -186, -137, -164, -51, -4, -502, 159, 359, 302, 216, -205, -208, -647, -568, -266, 208, 451, 208, 160, -414, -249, -111, -119, -361, -112, -149, 278, 464, -152, -286, -814, -410, 7, 296, 157, -174, 53, 52, -116, -100, -361, -541, -542, 13, 470, 286, -6, -199, -391, -423, -201, -46, 306, 232, 70, 15, -10, -293, 253, 52, -320, -273, 194, 687, 262, -81, -56, -357, 76, 88, -104, -141, -88, 167, 205, 204, -285, -368, -223, 205, 279, 294, 274, 183, -316, -203, 13, 553, 134, 62, 206, -10, 358, 417, 102, -396, -521, -307, 306, 333, -73, 227, 94, 231, 68, -84, -131, 150, -36, 224, 147, 63, -188, -74, -557, 102, 411, 332, 82, -14, -54, 113, 205, -89, -221, -415, -165, 109, 343, 49, -36, -223, -472, -345, -252, -140, 146, 271, -327, -92, -487, -228, -366, -335, -329, -97, -200, -75, -245, -289, -177, -402, 227, -33, -196, -287, 171, 156, -132, -39, -437, -159, -95, 31, -69, 238, -32, -135, -489, -253, -274, 189, -53]
1178e3n7m50P50P2k74j39j39O5L03k7l90L27J72j51j97M4j5M42j49m38M51o0k82
1201a95L06k80L53j80K06m0n5m32K38Q5K0K0K10J4n39o5N77K10l86j13J26j71
1223i1J12j9K1J51j51o4J78Q5Pk57k10L73k48J02K21n25J40L49J0l22K42m9p8
1246b3J75j74R5K36m3l85J06j53J94K75o10N9J48L41j62m17L83j36M6r6K25o9
1268A5q2k0Q9j96L57K74n16J45k08L36JJ78m54k33KO83k51m90l1M55L91j76l34
1291f5J33p0j36J45J11l6J38m27p1J97p0o2L34k3p2J53PJ44m6k39k47K56K72m93
1315a67L52m0j65L11m35J26J32j61K3k3r1K83p6L5oJ4j87J74J90n32M62k12m39
1338d32M71j86j2K33J64k88K77q7j57j57J37k47M40j11l46J44k48J35K46j25R2
$$ y = [-53, -110, -560, 190, 262, -12, -151, -290, -225, 78, 51, -339, -12, 160, 9, -188, -144, -159, 283, 134, -304, 147, 87, -195, 111, -169, 184, 4, 210, 170, 115, -317, -79, 6, 26, 46, 256, 270, -269, -334, 243, 453, 67, -46, 80, -91, 21, 2, 23, 174, 23, -41, 137, 222, 229, -28, -238, 135, -113, -11, 210, -315, -175, 174, 184, -138, 104, 55, -23, 152, -22, 73, 309, 266, -119, -13, -166, 28, 303, -307, -248, -100, 241, 79, -338, 45, -91, -45, -141, 84, 15, -67, -87, 2, -194, 163, 437, -79, 66, -142, 194, 195, 373, -81, -314, -312, 371, 120, -370, -401, 54, 445, 269, -65, 68, -2, -138, 7, 118, 82, 220, -207, -278, -81, -151, -213, 121, 98, 26, 179, 186, 330, 284, 45, -202, 54, 326, -167, 185, 145, -20, 291, -144, -18, 114, -47, -24, -47, -138, 145, 69, 104, 98, 112, -75, 99, 289, -243, 219, 7, -432, 39, -147, -159, 74, 238, -50, 227, 140, -17, -174, -37, -284, 156, 45, -301, -157, -405, -270, -24, -149, -57]
1359e7p8K96P2l3l07K06k33J38j89n9M44k43J33k53J23o0j65J31l4J29Q4M3j34
1382d6k38J94N9qR5k3K0O4j27o9J42J41m03K5J80J52j25j09j21J66k99M11k30
1405a49K77p4M3j93J87K3j82J8J47l72K00m1L5J34k39K34n3j75L53k60K43l77
1427b21N06j93M8K33n29K36L04k73K11l50R2q5K84p4k73L14j12K96j70l35K03
1448A12l7j93J76M0K88k14j94j19L99j96Kp9r3K57Q2r2P5j30j73pr4N2J96J46
1472B04n8k25n6L52j39j34J98r2J02Kp7j80J14J18m44M79m6J06l63L95p5k03M6
1495B4j45k6K34j06l8Q4R1j68qK93m09n4L0R9q9L63n3R4k03l70J60J5Q2k35J34
1520b01L0J63p2K79j35j10J46n9k53J12J38N5j65J05L11j85j96j45R6K40k97R3
$$ y = [-57, -135, 161, 233, 200, -107, 99, -134, 4, -185, -244, 200, -43, 90, -163, -40, -100, -265, -134, -168, -39, 45, 88, -46, -284, -90, -31, -39, 56, 33, 53, 117, -10, -79, 63, 204, -199, -174, 6, 158, 33, -76, -197, -31, -330, 81, -149, 128, 54, 97, -96, 91, 114, -68, -50, 97, -275, -75, -116, -81, 53, -186, 48, -5, -180, 173, -87, 156, -221, 285, 92, 140, 373, -156, 80, 384, 111, 322, -28, 64, -21, 263, 189, -84, 230, 118, 414, 244, -91, 112, 75, -118, 58, 98, 386, 172, -22, -141, 258, 62, 64, -15, -108, 149, 231, 139, 214, 84, -89, -96, -190, -138, 58, 204, 146, -79, -135, 217, 78, -56, 142, 50, 152, 154, 77, -103, 11, 129, -315, 164, 118, 224, -139, 256, 181, -22, 24, -121, -147, 87, -19, -57, 27, 118, -50, -58, 235, -174, -228, -198, -99, -188, 175, 122, 216, 13, -357, -197, -182, -100, -335, -201, -171, -8, -80, 199, 64, -46, 100, 41, -212, -100, 38, 93, -72, 33, 344, 159, -37, -182, -86, 154, -143, -50]
1542e0J58K3k42n9K39L1k50K96L6j03Nj53J11m1k31J9K31J41j87j41k0K35J08
1565A56l56K45J36M0m05O6K58j40j18j48M55l50m5K41j34J41PP6l70N10l15J19
1587F9M4l54K43l57L91k81J39L45l17L2N3j78K21j80K18M5l02n9J17K63k29j56
1609b33L87l29O8p8R0m6K68q4k18J01J73J5j04J01m88O20n24J59l6M8j8j81K78
1632c1J56m0l4l31J76l7j23M70k61J15k61J44l5m2J94j04Ok3kN2P9q6n7r3M20
1657B52j70j07J09J38J33l94n1P8j26J57Q0J3j21P0P2m57K02qj53M99l09L40l25
1680g8J99j79J03j08J12j23O8L01j81J38m47K39j4Q2j21J13L9k25Q3r1L63M5l45
1703b7L73n22Q1J63l2J08ML6l5j05O6k84k08M21pK87j57k81K83jK4j31j99L72
$$ y = [-50, 108, 131, -111, -170, 69, 100, -150, 146, 182, 79, 84, -69, 42, 1, -230, -211, 20, 161, -26, -167, -187, 48, 156, -200, 45, 181, 221, -184, -118, 140, 0, -118, -266, 189, -161, -206, 35, -99, 42, 49, 125, -245, 265, -50, 69, 113, -241, 2, -355, 36, -245, -106, 239, -78, -46, 7, -171, 50, -130, 88, 133, -169, -228, -111, 152, -77, -233, 154, -175, -107, -185, -95, -141, 127, 43, -175, -74, 99, 114, 10, 111, -377, 243, -281, -122, -158, -110, -128, -309, -31, 125, 85, 51, -280, -104, -141, -264, 206, -55, 60, -201, -57, -92, -134, 60, -44, -38, -61, -63, -11, 68, -18, -75, -168, 252, 82, -25, 84, 222, 355, -39, -90, -12, -138, 19, 99, 112, -9, 61, 133, -324, -122, -130, -283, 216, -93, 247, -78, 121, -58, 45, -63, 49, -74, -6, 295, 114, 252, -195, 44, 30, 112, -9, 104, 143, -82, 1, -90, 273, 318, -27, 346, -176, -95, 68, 36, 144, 148, 184, 149, 44, 110, -174, -382, 39, 32, 319, 162, -119, 164, 163, 187, 56, -143, 229]
1727B29j29j60L22k03J15M9m68J85%L25j29j30k81J94n1m3L47m44L00M4P8m18
1749b68K17P9M3o4J69l63R0K22q2j07p7K6L27j92m1j86L37r1J15j0n1k36J51K1
1773B9M8l22M0J93J52l62L28k8k7J35k50j8j83K34j59J14l82K00O2L82j83k33
1795b30K80J0l57J47K32l58L69j01k2K45k56P6r9PkK10J31r6l14J43Q6j28k29
1818b56N41k70K06k22j7J99l29N5J53k32N5L2p2K85j79J44J17j62L7j4j63L85
1840B93k30j81j5M22k11Q9j95j56J40n4Q2J00k14J16P4j29M0J27M16r2n24pj51
1863b60L96l78q7N25l90L42J46l94J19J1L6q2l3Q0l48oL20J17l46M11m0k34k23
1886c18L13J40l13K40j52J52j53R3K52l55J69j26M62l95J35J46k39m03K55K26
$$ y = [229, 100, -60, 262, 59, 174, 223, -245, -60, -60, 265, 136, 6, -275, -81, -132, -175, 172, -272, 28, 72, 150, -268, -51, 28, 71, 7, 176, -187, -97, 125, 43, -64, -141, -115, 212, 20, -21, -207, 130, 39, 154, 144, 93, -143, 8, 29, 77, -245, -205, -12, 140, -222, 106, 78, 51, 186, -64, -82, -265, -31, -190, -76, -458, -258, -196, 186, 3, -230, 50, 60, -297, -150, 82, -276, 93, -8, -30, 215, -41, 35, -64, -57, -59, 151, 282, 186, -128, 15, 101, -27, -256, 285, 15, 221, -1, -18, 181, -148, -93, 60, -172, -117, -85, -157, 128, -51, 93, 210, 48, 85, 71, -92, 293, 63, -118, -133, 289, 78, 167, -28, -184, -44, -98, -16, 84, -130, -14, 60, -69, -29, 98, 514, 422, -102, -109, -260, 136, -242, -329, 196, -194, 148, 294, -100, 19, 30, 66, -16, -49, 31, -317, -323, -3, 114, -232, 179, 139, -95, -318, -5, 135, -178, 62, -90, 62, -91, 2, 254, -101, 68, -58, 404, 9, 144, 290, 51, -352, -97, 129]
1906A29p0q1j65OM59k17n3J57k39J34l05M79k50r3l9J64J17L54l52j51n5J57K07
1929B93m09l2l5J95J53Nl99K46k56K03P5K88j38j99j02J71j73q7J91j05J41P5
1951A01m12K79r4pN1j17J86J15j43k13M72l51K74l5OJ44m63J25L49P4o47K91Q8
1974G3k28K09k48M14l41K94j82O0J19j39R0k39J08N9j58L4P4l35M10p9j65Q9K68
1997A87l62J25k28K58Q4K19l19l9R4p8K82j88l5J02l27J51Q2J64j77K0j26Q0p2
2020a03O3N5k44K71K1p4j02P0j1K26M7j39Km0M5O6k6o9o0O7j18J72k24o9MK51
2046H1k2j79K65K09r55M31K16Qj40O4J06k02J04k51J26R4j09L52k1l2j74N1j63
2069a41K32kj03J45k30L20j20k00K97j50Q9k85L81j74m3L14m79L26j62j73K25
$$ y = [129, 59, -22, -187, -181, 278, 61, 8, 165, -74, 60, -245, 234, -16, -109, -148, 16, 133, 487, 135, -16, -71, 86, 293, -116, -148, -183, 12, 165, 170, -229, 17, -239, -36, 39, 327, 189, -10, -112, 59, -114, -201, -10, -115, 26, 101, -311, -32, -126, -133, -82, -199, -13, 102, -41, -254, 218, -133, 141, 106, 112, 256, -207, -82, 267, 341, -306, -15, 73, -155, 54, -194, 220, -121, 173, -9, 51, 170, 31, 121, -118, -10, 49, -109, -75, -1, -336, 74, -5, -170, -81, 187, -175, -50, -278, -20, 64, 283, -36, -75, 19, -59, 223, 35, 0, 102, -225, -74, 8, 172, -5, 15, -111, -31, -103, -40, 15, -229, 42, 63, -11, -113, -43, -54, 172, 219, 80, 82, 42, 87, 153, 127, 58, -2, 65, -53, 119, -105, -174, -170, 81, 59, -120, 145, 354, -601, -170, 46, 54, -86, -22, 84, -118, -14, -265, -139, -45, -154, 198, 177, 145, -29, 22, -141, 91, 89, -14, 131, -99, 221, 101, -99, 198, 48, 137, -148, 233, 59, 16, 330, -149, 177, 15, -158, 67]
2090F7j95K47Q2l86L29M1k40N6K90k83o4l3N5j81M17k00j56j01J60L89J0N3k86
2113G1j44K54j84R6L8j47K6J75j77M4p1j25j9OJ2L36j6l27j13J3M17l24K37l4
2137D4j4P7k19L19l35j7K24J0j66K78p2k38J08L4MPj61J38K2m6r8J48j49J60n6
2162Bn5p1K31j21K36m09R4L0K5K23k64K31m36J58n5K55j17M5P7k51J48j67N02
2185C11n63O9M69o08J38K70k46L69k14k8N4J84j59J86n48M23O4k08P6l05L78j14
2207bJ36r2l1J40q1m4Q0r1K6N1k86J53J06K86l92Q6L82n05J62nJ03k26K69m50
2231b25J36j62J42J67O7n7n5j28J45O3j03L8L11l79J79j27p06P61lk63K71J75
2253B47k03j31Q1MJ78j41o6j76J13J79rj9j73M38n97M56j06k50M10l19jj31M34
$$ y = [67, -128, 119, 201, -185, 144, 185, -55, 1, 291, 8, -56, -89, -34, -215, 202, 2, -154, -255, -95, 294, 304, 357, 71, -73, 181, -3, 93, 131, -16, 10, 185, 8, 52, -19, -144, -163, -157, -145, 191, 175, -152, -265, -252, 165, -159, 78, 44, 30, 107, -112, 207, -128, -145, 79, 89, -77, 201, 129, -109, -1, 33, 37, 44, -117, 21, 43, -3, -101, 47, -102, 58, 2, -53, -124, 107, -14, 222, -187, -93, -63, -38, 185, -79, 152, -284, -126, -181, 74, -43, 2, 79, -172, -24, -191, 311, -252, -183, 286, -322, -184, 86, -160, 209, -5, -33, 21, 205, 46, 232, -316, 107, 171, -37, 39, -266, 112, -2, 134, 42, 11, 151, 70, 26, 106, 15, 41, 92, -194, -41, 65, 351, -41, 45, 427, -78, 84, 79, 182, -44, 225, -225, -89, -251, -109, 58, 125, 68, 13, -115, 30, 93, -10, 28, 339, -40, 139, 12, -694, 67, 64, -199, 72, 247, 44, -87, -6, -2, 176, 35, -31, -207, -94, 85, 76, 57, -116, 322, -275, 181, 75, -175, 235, -84, -85, -216, 218]
2276B18k61k4K93j26Lj15j00j25P7q8J79Jm9J94O8m67M64m82L86J4j62L33j75
2299E6L0J75l54o4N9J15k51L66k18j90J96L5N6J30j70k3J49m18K59P9K60j42j76
2322d1K51j68J38j60j75K65k17M45l18r9oO4L6j25o3k0K22K96l97r9K07m1K03
2345A98J68k12p0k27K85j27l91K54j20L41j89n9R6p0n4N00k98J61j04J03Lm68
2367b80K63k70N55k20j41J88n6k50J00O5k31K71K42l65P4k2K82j66j05m9j02J39
2389g8J51Q2m82L14J87j32k74L7L11J13j47O9m75N4L12q0J89m32L03j60K42m74
2411c70L29j84M57j50j19J1%j4J95k10k1J84l01L02j74K93j37j15k1J45j03N0
2433D7j89L7J25K15j53m71L30j14K18K9L5j06k32J47Rj63L67rj77m6JK09l14J75
$$ y = [218, -43, -67, 226, 100, 103, -12, -112, -237, -160, -248, -69, -68, -117, 77, 145, -322, 142, -340, 46, 60, -102, 231, 56, 86, 261, -93, -157, -98, 17, -234, 132, -86, -276, -80, -45, 11, 141, -29, -52, 97, -321, -62, 17, 277, 135, -41, 210, 42, 180, 20, -155, 110, -107, 338, 20, -79, -85, -21, 15, -110, -173, -193, 29, 325, -72, -171, 36, -5, 198, 366, 154, 84, -143, 142, 15, -376, -122, -242, 99, -90, -149, -53, -123, -177, 323, 25, 186, 82, 185, 188, -280, -17, -287, 268, 48, -93, 95, 39, -211, -111, -46, -277, -6, 236, -129, -55, -77, 205, 39, -66, -115, -217, -78, 73, 155, -327, -13, 174, 42, -232, -195, 116, 229, 82, 151, -324, -270, 42, -38, 151, -281, 22, -138, 104, -370, -41, -225, 232, 82, -37, -26, -26, -40, 155, -55, -76, 108, -193, 109, -65, 228, 91, -24, -45, 100, -3, 47, -142, -105, 20, 235, 82, -389, -59, -173, 45, 74, 109, 3, -229, -82, -73, -236, 131, 122, -55, -101, -100, 109, -205, -30]
2457c0k14J99K31k57P4R9j63j9K04k10j71K33p4O0J69l31L61k60k88N93j19k99
2479b12L14Lk02M2N7Kj35j61K55j66J89K9J21K34k39J7n7k92K02L28l33l48L40
2502a2J12J46n96K84K43k77m0K22K26l30J29n1n2k30K12K86L8j65K05j68k60K07
2524A29l09m3P8N5j2K57j61J73k14p9R2O9R4j39J00j48K03l47p0N16k96k8r4j37
2548c11N09j75j94J61K2R2n8m80L23L7K31nj10l6j34n3n4K27K72m45L03k73J5
2571a36J58N4Mo1m4j16J0P7j6n2J99Qj52r5M7J40k3kj6l9J42k70J51q7N1n5K63
2598A40j36Q7l22J89K93k34j19J49qn3j37J15N1K4R8k9k16J96r4K50j79L6j75
2621g4o3K82j64j09P5Q8l3k02K37N1m4J67k39J55k25l4m9M66l99k2p5L88k90o0
$$ y = [-30, -244, -45, 186, -71, 3, 102, -61, -80, 124, -86, -257, -24, -98, -38, 131, -200, 161, -99, -387, 206, 87, -212, 102, 105, -97, -55, 2, 4, -131, -292, -37, -203, -14, 15, 136, 370, 131, 148, 91, -201, 1, 329, -4, -352, -12, 100, 246, -350, -66, 177, -100, -140, 82, 308, -22, 107, 56, 4, -226, -14, 272, 310, 145, 350, 182, -78, 129, -180, -223, -145, -90, -102, 155, -6, 167, -47, -126, -34, 35, 129, -10, 90, -58, 145, -202, -272, 244, -52, -80, -174, -311, 198, 23, -171, -10, 12, 104, 46, -434, -111, -74, 157, 152, 42, 6, -128, -181, -235, -8, 264, -181, 122, -151, -136, 22, 76, 80, 19, -25, -141, -131, -54, -70, -122, 77, 85, -67, -162, -115, 25, 2, 0, -16, -55, 87, -183, -32, -119, -68, -123, 140, 4, 91, -231, -42, 251, 17, -102, 47, 39, -14, -151, -36, 15, 39, 137, 108, -108, 88, -6, 244, 65, 101, -74, -137, 145, -19, -128, -53, 35, 2, -200, 37, 88, 44, 211, -28, 127, -98, -132, -181, 285, -114, -136, -211, 177, -113, -173]
2645a73K53p2j18j35K84j42J6L59m32R1P2j85O0L27p0N2k46M0L97l99J22J40k31
2668A0J6j54p8L59r2k50J11K11n5l0J76m2n80N02j36j25k9O0K13j51K28p8k57
2691a71J9K5R6k73L27N5p8j22K10p5L93n60J97k18j35L55OK0LJ3k92K57p9r7n3
2716a77J58K3K91l50j58m6L49J9L3j0K64l52J4l7m6r0O2k40Q9K31M1N3j9j30k0
2741d8k20J30K83n03L48J27j26j5K45k77O8k79M29k76R0Mk41J51K13k25K12l6
2763E4p7K96l71J33j34k61L17K92j83j50PP1R3K2l60K76N0J0q8K75k02o1N8q0
2787a3J11R9j12j21oj85J39J69j63l9O4J62j01j86K33j81K40j65J22l5k47J80
2809c5J33p8j29L44k53K3j31K86r6j63J7P9M7j1jL10n61M0K46K2l39J91J50p8
$$ y = [-173, 80, 8, -110, -245, 39, -103, -87, 272, -160, -69, 3, -182, -122, 205, 135, 187, -59, -19, 378, -21, 101, 241, 10, 26, -128, -206, 153, 61, -189, -78, 133, 78, 48, 224, 182, -398, 104, -32, -157, -186, -126, 87, -64, 164, 86, -171, -152, -127, -31, -304, 23, 78, 0, -122, 88, 13, 406, -154, 43, -175, -310, 45, 51, 71, 74, 87, -205, 52, -27, -124, -177, -19, 4, 295, -55, -213, -259, 90, 109, 142, 132, 396, 44, 58, 21, -25, -115, -53, -293, -204, 27, 68, 121, 102, -28, -48, -268, -138, 145, -358, -10, 117, -9, -24, 221, -56, 12, -267, 162, -114, -24, -20, -261, -110, 103, -122, 90, 54, -23, 273, -98, 35, -99, -360, -43, 249, 66, -84, -77, -6, 87, 109, -251, 25, 75, 85, -3, 272, 70, 9, 67, -13, 98, 197, 85, -36, -42, -227, -88, 81, -82, -121, -57, 105, 4, -182, 51, -130, 110, -55, 67, 32, -215, -35, 98, 20, -109, 235, -18, 5, -126, 160, 64, -99, -82, -3, 44, 33, 32, 342, -219, -179, 67, 89, -250, -59, 91, 13]
2833A3K31j77m0K38j74J31p6j30j65O9R5k6J21j57J08n2J58j06Ko2j63M13M3P7
2857C71n15J46k1J69m45J77J72k9j84K37k28K17J56l60L93m39K74K7j24n2m1L1
2879f8J29j7n8Q6J26j21l2Q4l15K79Oql8q8L6j99L23l05J45J52nq8j46K38q8Q0
2905A08o2K7p0J44l6J63k21k22J80j60K09l26N6N9J69j11OM1l7K25k27k41K86
2928d0J38k97L97NK21m54L18k67K52l60j1J30j41k40M22j99M1k2O8k78J25R7J12
2951A7L3k35P5j31J55k06J27J74J52k89J04P1J90l11J1L06p8k66J25N7o4k89M80
2974B08k74n9K37j85J53j11L22l29k20M68j82R3j90QQ6P3j26J00q2M6K35j38j25
2997HJ06m4j25J26j44j54K83L7j89K08M3m78L02k7O4l05K93k14K70k89M13l33
$$ y = [13, 244, 67, 27, 265, 91, 222, 146, 16, -149, -80, 15, -11, 110, -47, 61, 9, 167, 61, 63, 1, -162, 251, 294, 371, -144, 2, -19, 150, -295, -118, 54, 25, -159, 78, -150, 67, 223, -137, 256, -183, 91, 118, -6, -58, -99, -68, 61, 44, -14, 72, 198, 77, 45, 129, -186, 93, 99, 91, 53, -35, 1, -198, 125, -180, -35, 117, 112, 24, -122, 116, 28, 108, 46, 73, 3, 147, 111, 274, 53, -169, 11, -149, 60, -266, -210, -151, 18, -93, -87, -46, -83, 142, -85, -326, -40, 98, -199, 198, 203, 424, -30, 288, 21, 273, -87, -98, 32, -109, -349, 73, -126, -85, -107, -39, -317, -192, -95, 17, 50, -185, -110, -241, -86, -292, -165, 9, 161, -128, -24, 47, 237, -74, -63, 243, 165, -101, 24, 81, 17, -272, 208, -66, -125, 112, -73, 80, -31, 291, -38, -258, 210, 28, 121, -69, -61, 25, 98, -28, 72, -10, 36, 271, 133, 8, 114, 70, -55, 71, -73, -227, 56, 93, -96, 112, 155, -323, -21, -48, 16, -289, 4, -210, 60, -229, 184, -149]
3019a49K0O0J84r1n4R4k43L28k97j63J32M03l2j62j27K48k89J90o9K9J17l74L57
3042A12j38K86m00m2K4K29m4pM1j46Q1k34J39j6k44M56k34K03rj1k64L46k29L
3066i8J30j20K97m67K39R8K1k16K05L9k7m9K38k67J05j13k09K97k37K40k24R9
3088a9k74K91j53k83N06K47m41K25r8L48l67m0k5K52K46p24J74QJ78j99J84k34
3110a98J88k07J81j25K90k97N4k9J17J44k07J37o4L87m10k35Q3J24M15k76P2l65
3132b21K72j34J32l0j82J85n3K34j00r5o3j5Q2k4l98L45K4k63L11L37l95j43q0
3155b74L93j8k20o3L25J42l48K29j55j2o4j23K54j09J29J42j39P6j28j44k2M5
3177h4j12K27Q1p9M4J5m52P6M28j60k01J14L37k43L6K58n40M44j12l46L67q0k03
$$ y = [-149, -129, -69, 115, 24, -30, 64, -179, 149, -148, -311, -179, 224, 192, 30, -97, 151, -138, 52, -17, 12, 129, -245, 112, -26, 260, -140, -182, -158, 71, 27, 20, 61, -85, -4, -238, -99, -115, -359, 97, -137, 66, 57, 46, -218, 128, -101, -98, 32, -88, 209, -258, -19, 79, 100, -116, 89, 128, 101, 52, 290, 23, 128, 15, -194, 103, -134, 106, -118, -19, -293, -2, -155, -438, 68, 315, -126, 99, 1, 349, -18, -58, -83, 169, 415, -309, -135, -127, 51, -148, 36, -198, -10, -217, -36, -161, 129, -168, -114, -143, -26, 118, -89, 48, -16, 371, -39, -274, -191, -67, 348, 72, 144, -221, 51, -83, 49, 19, -163, 22, -31, 203, 103, 8, -55, -70, 12, -12, -410, -65, -41, -304, 7, 344, -51, -194, -274, 119, 101, -119, -182, 143, 285, -63, 166, 11, -1, -65, -188, 66, -43, 86, 228, 89, 165, 37, -107, -129, -84, -196, 31, 112, 33, 77, 92, -360, -284, 144, -16, -217, -103, 234, -9, 27, 285, -255, 189, 77, -269, 98, 18, -185]
3200a85M05k81M9Q7LJ93m07K13J53k38nJ80j81N64n89j00L29m20L01o6O0l9J36
3223A62j62l5o6J06r4l5M8m2J48J2J19n06L22L19l01L5l88M32k04P9l%J24R3L
3248A66j44n7p0L32Mm38J00J05R6j89n6K44k90J23J25j20KQ7l77J85J00J25p2
3271a9L11j15k02K54Ml00K1O3r2J21L6j55L71m29J27%J44j77j43J38q6L42J47
3294C61l18k81N75j30j16l05K3P1K50k26k28N38k05M46l00j15N8p8k23M46j91
3315E2K99l75J0l51L99j31r3j78J60j09K38L67k71MR1q7k18K24J0l7j81K3K26
3338G2Lj74Q6R2M3N0m04L47l15K18k0j22N27m96Q6p2qj43L65r2K07j50k47KJ29
3363a6J47j35j8k9K01n19L70j64N50l56j5l8J92N6r4j67K03j78K59l00R0M9k32
$$ y = [-185, 220, -61, -12, 75, 78, 271, -136, 77, 230, -8, -13, 167, -14, 550, -39, -139, 190, -230, 71, 5, 65, 26, 162, 0, -35, -101, 5, -89, -124, -76, -118, 30, 42, 161, -345, -23, 296, -5, 30, -358, 74, -130, -51, -54, -54, 70, 163, 166, 22, -35, -105, 227, 231, -207, -107, -2, 94, -95, -151, 93, -197, -74, 51, -69, -67, 20, -357, -172, -72, 53, -19, 292, 177, -25, 229, 233, -67, -46, 17, -75, 46, 82, -73, 298, -131, -4, -4, 140, -37, -180, -42, -128, 214, 361, 43, -238, 337, 207, 91, -214, -191, -120, 130, -96, -324, 214, 9, 455, 155, 40, 98, 20, -203, 243, 52, 351, -24, -14, -365, 34, -97, -190, -368, -208, -317, -79, 288, 17, 21, 112, 25, -193, 31, 41, 4, -177, -154, 72, 75, -99, -13, 79, 122, 172, -232, 115, -200, 18, -2, -124, 403, -93, -7, -79, -87, -230, 135, 43, 250, 100, -147, -145, -16, 131, -4, -22, -51, 150, -369, 1, -163, 387, 31, 16, -22, 170, 226, 132, -35, 168, -10, 249, -51, 39, 88, -144]
3386a44M42n17M43J61l24l26J56n9Q3P8j07J05k81O5J39J91p4j06l55M14k2j03
3408a41M3Q2P3R6j75L7K07m75L16Q1L6l92L18k78J68k55J31J09l33O08j33l37
3430b14J89O6M4Jj7K5k43N0M5K85o78L97M0L19l81P3Q3J86j41j31L2J3k51K27
3454A9R3J38j97k6L46l08l75L35k25K73j6m7K8M6%k63J83M4J63k21J41j67j33
3477a69K42J47n9k29o5K92j8o0Q1k03R2q5J4p3K14r4j83K89m09L51PlJ54n5k82
3502a04O6Oj06j3L11l57J97J78k32J25k94L38r4j07n1n2L66j79k07L84J3j42k04
3525a58K48K01m72J43K84k71Q8k53N09l80l6J90j28K34k7m09L32m9O7Pk45K39
3547A14J67j59k81J83Q3m9J55%l41K35m05K31l3K68k33J3L24l27N8k19J84o7J24
$$ y = [-144, 298, -219, 224, 385, 61, -265, -109, -168, -85, -7, -114, -9, -290, -225, -86, 105, 31, -75, -430, -16, -38, -141, -98, -16, 57, 153, -22, 15, 222, -253, 63, 144, 180, -212, 106, -172, -4, -259, -128, -19, -352, 256, 123, -214, -25, 41, 85, 86, 69, 94, -149, -99, -54, 231, -447, -50, -10, 309, -72, 1, 84, 270, 129, -2, 30, 43, -208, 19, 112, 250, 53, 27, 373, 65, -310, 25, -200, 73, 57, 10, 38, 84, 84, -179, 4, 48, 211, -10, 131, -36, -169, 73, 220, 161, -68, -133, 159, 141, 81, 162, -41, 51, -34, -20, -93, 121, 27, -156, 133, -276, 75, 82, 79, 233, 178, -104, -38, -32, -138, -151, 160, -197, 0, 178, -54, 71, -223, 115, 21, -86, -137, -189, 177, -2, -209, 175, 188, 46, -158, 90, 291, -181, -38, 246, -25, 63, -190, 319, -61, -97, 93, -35, 199, 172, -237, 95, 46, 113, 120, -125, 114, 281, 122, -159, 24, 107, 58, 213, 213, -128, 107, -298, -67, -100, 168, -65, -52, 272, -55, 3, -216, -32, -99, 25]
3570B5P2k98K22J48j27m2o9J87j06j54M44l89QL87n90L96m45J59J97r7J95m25
3592c02J45N7m1L14l32L35k27j48K07j38K91k01K84k92o2J20M0O6J12l37J72m8
3614A5Q8p3J60j88j54J84k9K13k57R3j34K67l21NJ35K89k59Mr6o7j18K67p8J97
3638A43m46M95j99J54q9M0j76J38jmq8J94k8R5m28J07J98k03n4l1P0j53K98K10
3662B42j10n0r1k17K01K58j87pk32J94p1M27o15J43r4k85Q56n70K62Q5j42K9Q4
3685A10j21k66K41NJ81L4o4r1k69K53l3K92l88R7KL15j05m85N97j93j05J33r5
3708D5K72m08L24n98Q5M94q7j26R0kK3Ok45j07L14J3j17j25L6M4j89K48o7J97
3732A20k0k30L17j90o9l6K86m3rK38j59l58P1k02L79J42j77J73k30J46n60N22
$$ y = [25, 97, -201, 21, 169, 42, 0, -69, 118, 12, -142, 302, -87, -79, 308, -282, 114, -331, -172, 25, -72, 123, -302, -157, -100, -141, 173, -159, 176, -51, -199, 8, -130, 161, -40, 244, -48, -110, 10, 50, 116, 228, -109, 63, 15, 103, 30, 190, 2, -152, 32, 3, 216, -41, 52, -82, 185, -136, -131, 4, 293, 34, 38, -58, -125, -243, 24, -54, 143, -303, 192, -7, 147, 58, 98, -78, 60, 59, 55, -33, 161, 133, 228, -200, -93, 105, -98, -152, -183, -113, -266, 32, 242, 132, 82, -9, -226, -25, 233, 46, 39, -193, 1, -70, 357, -258, -115, -209, -494, 362, -208, 54, 139, -3, 26, 110, -11, -277, -36, -31, 150, 184, 120, 29, -240, 13, -20, 272, -116, -19, -17, 298, 193, -292, 305, 112, 7, 140, 45, 317, -91, 233, -365, -280, 214, 127, 1, 91, 89, 112, 118, -127, -234, 80, 93, -24, -149, -113, -69, -258, -10, -77, 120, 100, -130, 187, -3, -72, -108, 178, 135, 126, 364, 205, -153, -82, -284, 95, 237, 60, 233, 3, 149, -411, 111]
3754A11K7L9l15j32J11K06ln4L4j53M39m50O6j16L51j89J2PJ87j17j34J63JJ90
3778B81n47K10m6k99K91j14L25j7j94L8l1j23K7L57o04O37k26p9p1M23m3m0N2
3801B07j33k87L03k14J11m45O62k1j53J50o2j16j0J56k00O5q8K62p7m02M33j48
3823gk38L90j46OJ30q4j7o4n4m2J54K23m65n9K26K96j44j48O8J03j22j14J59l69
3847c18M66k80j57O16k71j45o5K87P8j9Q6m64K52j45q8rnK09k25L52L12l19l89
3870b41L24j62M1O0j96M6j3L2L0k0M06j31j53j53r5L81k68J0K41j83J42k2j79
3893a03N39n29pj74K23L6J1l8rJ51m4L6j93J29K27j87p6j64L13l5K2Qo5j49J5
3918f3n0K61N5l24R0J81mk88J63m1J96J01l20j50L19j88j9L88l01J34k70J56N9
$$ y = [111, 138, 177, -138, -270, -159, 47, 44, -10, 24, -129, 310, -140, -74, -190, 161, -28, -16, -9, 178, 61, -73, 90, 91, 281, -266, -56, -102, -401, -110, -224, 101, 84, -110, -72, -103, -226, -199, 158, -446, 191, -35, -114, -185, 238, 195, 155, 207, 74, -213, 90, -124, -13, -458, 204, 183, 30, 180, 118, 2, -8, 148, -52, 13, -75, 187, 110, -292, 141, -7, -245, 145, -1, 5, 135, 51, 34, -30, -84, -126, 28, 251, -214, -273, -47, 249, 105, -43, 25, 128, 6, -108, 51, -318, 148, -132, -289, 327, 56, -89, -154, 133, 211, 192, 278, -186, 66, -79, -167, -176, -181, 28, -197, 155, 467, 148, -241, 83, -79, -38, 22, -174, -128, -141, -109, -79, -99, 307, 176, 23, -130, -225, 156, -112, -102, 139, -44, 98, 76, -103, 436, -93, -100, -274, -51, -15, -4, -42, -51, 100, 56, 92, -101, 28, 255, 68, -8, -172, 141, 106, 128, 136, 71, -78, -63, -113, 148, 203, -121, -31, 150, 146, -142, 21, -20, 176, 277, -43, -193, 126, -62, -81, 307, 6, 140, -130, 26, 85]
3941H5k03M55l51k20J31l0J55p0q1L16j74k3J00Kk78L38k23l3J18M8o5J10k1Q
3965I4j4O3j00Km60M19j50K74q5M1K2j2n5l9J07m5j29k0Q1k0j08L63l8l73K22
3990D0j58J40j99J51Q5r9J55j51o4K06P2j90K75n28m8J97J63J71k27j3J86n30
4012c66N47j7p4l67j63L40J97k21K45j66K24k96K10K9l43K74j40L13o8l13R2L2
4034c1L9N5j47k14L53Qj14j4J85lj5k67M9J40j58R2k94J54J51p0K54r8mn8L5k87
4060b59J15n3K87q9rn3K60j90K49k9j26N5m1k36RL12j32k82L57m48L11k0M2J41
4084A71m89M1K19P5k59M09q7O6j39j99K54k01M3J30j14qK8LK38l7j13l07Q4L83
4108A91k42k0K33l5j48j8L6P8k39R7L83k40k04L21P3l62K12j62K32p3j90J0m3
$$ y = [85, -118, 337, -14, -234, -103, -133, 22, -48, -129, 187, 13, -10, 90, 92, -186, 152, -71, -104, 14, 62, -3, 107, 86, 94, 80, 143, 43, 45, -415, 4, -146, 128, 43, 84, 106, 94, 39, 0, 107, 62, -67, -87, -6, -26, -134, 229, 191, -182, 40, -118, 22, -177, -26, 59, -40, 115, -36, -100, 106, 178, -12, 263, -265, -313, -116, 47, 218, -9, -22, 164, -366, 181, 164, 90, -277, -440, -100, 97, -124, 121, -45, 179, -117, 93, 122, -221, 53, -87, 226, 158, -155, -63, -31, 8, 63, -84, -298, 55, 63, -51, -65, 120, 117, 102, -165, -116, 24, -134, -42, -336, -182, -31, -101, 153, 55, 51, -7, 28, -259, -144, -197, 90, 1, -8, -61, 199, 9, 258, 229, 103, 158, 117, -119, -110, 202, 70, -212, 145, -303, 8, -12, 30, 171, -318, -277, -58, 17, -242, 167, 80, 146, 7, -192, 62, -139, -96, 34, -80, -88, -60, -57, 181, 144, 31, -276, -192, 191, -51, -71, 162, 127, -21, -39, -3, 75, -164, -67, 316, 76, -128, 193, 266, -96, 116, -46, 186, 113, -77, -67, -110]
4131a10K66k36j91J79J92j71j03M59l81L13k92M52l23j00J66K33k72j88K84p6
4151A01j98K61k47k70M02l62M18k7m01N07l08j20M73J05l89K36K7k33j43J65l28
4172c31K24j2O4J91qj0J7Mj21Jj11J14n0K14k9k03l1J63o5O9K84m09N3M2k39K42
4198F3j19K53m19K06J88l42K87O8k69l37K85j05L03k34N40j51j45l00L7j8M34
4219B25j42j4n0J04l40M2J7K00J42j07J33m05L06p1K62n01L07J21k54jK22J18
4241C14k22jo0J90P0l12l48L32j1J51j61J42j25L8N4j47o0K6L76k79J15k28J23
4264b3J33r0j10J91j61k56J17oK7q7N32m76N45n78L96j60k99K68K16k37j57L65
4286A50j38lJ03j52P8J37J66m34J53j43j03K90j65K02k20N0j40O5n2pK18n3j18
$$ y = [-110, 156, -80, -271, -92, 100, -71, -174, 285, -96, 217, -75, 377, 54, -46, 120, 353, 81, -107, 177, 101, -97, 164, -83, -353, 49, -313, 105, 78, -323, 184, -124, -244, 229, 334, -55, 181, 208, -25, -168, -3, -331, -107, -119, -55, 136, 128, 118, 135, 139, 18, 19, -92, 22, -28, 186, 157, -46, -77, 86, 21, 90, 374, -35, 18, 60, -179, 63, -56, 197, -222, -16, 172, -170, 117, 185, -84, -421, -136, -241, 62, -172, 368, 217, 72, -228, -191, -209, 225, 83, 69, 19, 123, -217, -175, -158, 42, 184, 77, 210, -195, 111, 40, 302, -199, 108, 229, -25, -26, 196, 314, 92, 91, 31, 221, 291, -21, -369, -37, -48, 103, -58, 84, -41, -3, 51, -96, -156, -130, 246, -33, 82, -146, -23, 110, 20, -90, 101, -60, -316, -199, -205, -178, -265, 267, -209, 336, -242, 154, -6, -305, -37, 179, -58, -215, 150, 12, 9, 112, -40, 38, 175, 341, -93, 60, -83, -186, 104, -61, 141, -79, -29, -169, -104, -156, -163, 55, 2, -116]
4309a16o7M80j11k65K18l18K03K93l68ok70J84J38k02m2L84m31K03Q3k46M32l29
4331a53M30m33N2J63L9Rj80J81O0k64J49o7O5K1q6J27M8j47p7J10o7lo8J45rj49
4357a04J76o2m7K14k73M3L7k64J88P3j11r2L38r6Q2k78J42OJ88l6r3l46K36N7
4381b2j84L62j52m3K57k67O4J08j80L31l93m4L41l4q8j15K78j15rk46K72j6j39
4404c4j18J36J00L9m75N90l84K94k40m4L72p6P9j87p8J49k12q1j5j1M85n81N23
4427B31l92L99k25rM8j87J01N2j12J27M1j46J78j17p4Q5p6P0o7k55N63n14N28
4450B49l91k2Q0J98j2j41K22k44K01L9m12K94k4j92Nj50L52k01L79p6k42K75l38
4473a51K54r0k8j20L66m22K48k34K71l35J14L8R9J37j84L19l48M9O9O9J2j80O9
$$ y = [-116, -183, 297, 186, -79, 139, -179, 24, 317, -51, -57, -327, -143, -5, -207, -249, 135, -296, -93, -10, -256, 176, -153, 277, -156, -104, 59, 98, 107, -73, 108, 168, -96, 53, -14, 51, 72, -14, 113, 161, 14, -63, 47, -20, -23, -91, 54, 45, -104, 72, 10, -37, 177, -96, -53, -16, -280, -92, -19, -130, -222, 116, 20, 102, -176, -34, -28, 160, 124, 31, -315, -79, -22, -206, 156, 4, -39, 218, -49, 15, 123, -57, 274, -119, -163, 178, 144, 56, -59, 219, 104, 95, -151, 121, 105, -34, -152, -16, 84, 123, -352, 238, -146, 148, -92, -136, 236, 160, 239, 52, -26, 123, -89, -170, -185, -196, 289, -292, 231, -161, 238, 13, 4, 52, -135, -34, 18, -94, 33, 74, -72, 106, -11, -85, 0, -76, -6, -73, -328, 235, -279, 249, -142, -164, -84, 114, 102, -39, 183, -61, 140, 179, -233, 61, 37, -155, -150, -300, 52, -149, 230, 154, -88, 187, -151, 103, 13, -15, -135, 231, -191, 57, -177, 94, -241, -127, -89, 10, 147, -37, 282, -66, -17, 52, 121, 133, -47, 22]
4496B2J17P8O5m60J99m5K11k46R9J19J46m16N4j4L8N9K02o4m58K60q5K99k46J83
4520A17l59J63l8j64J12P2Q1J10k48p6J99l17L26J29j14j52L13mj57k69K55Q8
4542F7n5K93k08k09J74j58J00p4K15k37M00n28K57o2k3K23k45J9j89mJ70J19J52
4565A97j69k34K64k43R4j7m9K6O8J25O0K6k86P9j16J02K30j59j87J19O9K80j03
4588A76j53K2k08J28J19p7j47J50j64J95j12L20j87J93K5l20k44j17M64J29k93
4609a01o9K83l13N89l05l15K70l29K57J57j06k39O1k3j8O5K55J83l17k08r0P0
4631b43K42Kk41L94r6N8j64j16Q4J61L8k37K75k64O6l0j57M45p2P8k75m9Q0M4
4655B3k16J62J3L37m02J28L69m64p2O0j07L7J18J55M6j3p0P7k20j62K76kL46l03
$$ y = [22, 139, 217, 282, -178, 21, -24, 187, -59, 40, 159, 305, -111, -57, -71, -33, 26, 228, 164, -294, -34, -119, 180, -66, 117, -242, -79, -117, -281, -169, -97, -16, 94, -154, -230, -31, -348, -22, 107, -7, -159, 154, 150, -7, -276, -21, 67, 12, 305, 97, -112, 62, -96, 4, -70, 145, -92, 308, -220, 37, -25, -48, 175, -70, -51, -240, -244, -74, 45, 197, 28, -206, 58, -185, -91, -108, -157, -131, -63, 62, 122, 148, -138, -59, -175, -73, 157, -2, -189, -70, -1, 279, 176, 23, 45, -163, -35, 84, 7, -140, 10, -154, 41, -71, 249, 62, 255, 280, -40, -284, -401, 63, 192, -101, -170, 113, -200, 389, 84, -231, 39, -290, -33, 124, 18, -221, -160, -183, -201, -136, 119, 302, -15, -223, -313, -243, -1, 1, -240, 154, 58, 116, -48, -164, -80, 81, 119, -118, 157, -107, -41, -71, -228, 217, 145, 223, -52, -101, -21, 23, -193, -31, -18, 319, -83, 45, 414, -50, -122, -62, -169, -132, -14, 141, 187, 174, 104, 181, -39, -201, 75, 73, 419, 116]
4679A16j94Mp9M8J07jp5K78O5j19l47K54j65J28l19K88J24k65J81n2j57J69J45
4702A34n1j63j0Q1J53k92K3R8P2j18N2P1l89L72j97j48J76L32m6p2n4J67j07K55
4726C39k21n9j26n1O7k24J11M83m07j11M07l38O6K18R6l95J96j13Qqj63J75J35
4749H5K37l98K18p1j3O7J02j97Nj69J98K40l46j42N0J44k78K55l5K9P4p3r4L25
4773B13k9j38q8K09j94J02m1Q0j20k94O25m86L77j97L28l57O0L2j00o8j08K24
4795C0n6K30k99K00q4r4J17k53j07P1N34l23j2k45P1K59j68K13k70J70J87l33
4817a62j07M24k74JJ97L6L3k95O1N7n8L19k17J12O1P7j41j71J45p5K09j71J0r9
4841b8Pk5K09k66k9j93L63j09J41j42R0J6j78J34j44K74k08m7j26OM36j25J2k34
$$ y = [116, -78, -74, -153, -105, 2, 1, -74, 204, 269, 150, -197, 57, -108, 20, -299, -11, 113, -152, 29, -23, -180, -11, 134, 83, -80, -90, -9, 144, -148, -125, -27, 45, -73, -21, 50, -339, 33, -164, -312, -136, 196, 150, 78, 24, 191, 84, 339, 118, 59, -67, -118, -51, -275, -164, 319, -88, -199, 208, -130, -64, 154, 250, -145, 51, -62, -54, -62, -225, -50, 85, 322, -76, 142, 71, 58, 125, 227, 30, 35, -134, 64, 304, -42, -184, -134, 10, -268, -13, -48, -19, 55, -18, -112, 213, 184, 46, -42, 167, -27, 75, 34, 114, -6, -300, 325, -161, 216, 19, 347, -10, 50, 82, -18, -86, -194, 30, -26, 204, -95, 105, 21, -73, 44, -209, -316, -245, 289, -34, -46, -291, -220, 39, -129, 84, -186, -16, 171, -162, -269, 155, -119, -118, 79, 115, 148, -147, -86, -29, -87, 232, 15, 127, 188, 265, 124, -47, 98, 23, 232, 61, 71, -28, -21, -46, 163, -103, -132, -325, 38, -71, 70, -72, 18, 34, -144, -10, -154, 120, -88, -135, -261, -255, 181, 56, 68, -166]
4865a66J67M1R6p9p9J90k9j52Ml7L47l43q0L02j19J3l13J04N8K48j02r1N7l4k12
4890b09K63l1q7j00J48JR2j65j62M75l63R9J47k45j22K92Q2j25o2j28K75q2J67
4913A60K4j95l7l11N21j46J41N3k13j29Q7J5n5J0J53l7Q0J6j25j30J71M3l84M10
4937A22k3l30j41K22J79J4P9j23J55j27J95p7k57K7L64l43mk42M74P5m51L28K8
4960A44k28j20K61n7R8k74J39J6Q5k62J19k00J57J49k58K11l8j28J66p3K60j62
4982El2k24L16m30M01k23J04n2K81j45m56N51j74K57m27L86l23K50k00r2N5L69
5004A97o9k1n6P0R0j77q5o1R5p9J62J53o7j50P7l85J16J66j32r0K0M28l19J81
5028F4l17L35N5Q0l73M40n04k7L51k62j96K72J09Q3j17j57m4K70J26k85J22j20
$$ y = [-166, 1, 42, 138, 59, -20, 170, 141, -11, -7, -44, 303, -40, -120, 182, 63, 76, -237, -133, -75, 173, 71, -20, 37, 3, -209, 54, 23, -64, -164, -16, -15, 77, -88, -250, 225, -138, -39, 108, -137, -259, 33, 115, -10, -72, -200, 75, -7, 160, 184, -11, -48, -359, 162, 16, 157, 210, -3, -132, -45, -30, -85, -75, 78, 41, 121, 137, 12, -118, 53, 96, -288, 122, 99, -231, -372, -150, 29, 43, 122, -1, 154, 27, 222, 145, -112, -85, 279, -64, -68, -310, 164, 239, -212, 116, 144, -84, -204, 57, 0, 98, -176, -37, -21, 64, -198, -79, -279, -122, 27, -231, -20, -58, -186, -20, -93, 167, 5, -27, -251, 65, -365, 36, -187, -83, -135, 146, 1, -455, 96, -78, 179, -248, 138, -185, 65, -135, -227, -172, 197, 128, 107, 51, 121, 211, 34, -51, -112, -17, -96, 66, 219, 152, 2, 79, -306, -190, -24, -156, -246, -226, 202, -117, 64, -253, 82, 137, 217, -156, 284, -220, -247, 104, -158, -354, -82, 27, 110, -7, -164, -208, 62, 188, -97, 25, -95]
5050i5k79K61M0k03m3O8M27j87P1o7p2J72l11L45K2k13J46O5j21L34m04j26L68
5073A98k10M3MR9p8P7Pk55K35J16k47j37L42j42n5j93L62k51M58m76r9J63o6N7
5097d8o7J42r3K6L31j86l12K71j56L95l04j46L12k32j42K99r7J48k30mp3j32L31
5120C3o3J8J3j6M0P5k11M7r3J6J89R1l10K49J10l78K66J72J22l60%O4lL9j33j01
5146a24J01K31m37J27rJ44N9k65L30l58K23jK5j24j3J4M8j31J91k08K4j05J32
5169a26K38J41m07m4L26k84J34l9J24M9l29K37J67k00Qkj11j17N1M6Q7L07m01
5192a45K33p5J69l89J83O8k97K27M3J03J5j63J15l11K90k31R0L1p5j1OJ47J13
5215A36j59j02M65l14J77j31n2q4kL71l1m38M40l46K6n4M30k03Qn09M37oN0k33
$$ y = [-95, -374, -113, -73, -276, -319, -251, 176, -11, 60, -7, -79, 93, -218, 127, 149, -64, 82, 147, 26, 360, -44, -170, 198, -12, 31, 35, 134, 56, 133, 140, -115, 120, 236, -11, -148, 194, 52, -3, -196, 166, -85, 373, -103, -202, -39, -105, -48, -115, 27, -66, -40, 291, 105, -207, 64, -92, 303, -1, -147, 165, -67, -209, 90, -7, 141, -89, -93, -166, -298, 33, -30, -12, 1, -15, 25, 100, -111, -64, -157, -141, 48, 139, -171, 78, 188, -190, 76, 248, 370, 10, 10, 74, 71, 110, -23, -124, -23, 208, -229, -102, -111, 33, 92, -173, 157, -201, 22, 21, 46, -78, -91, -77, -29, -160, 31, -177, -153, -258, -126, 112, 253, -154, -198, 128, -156, -22, -61, 63, 112, -217, 20, 187, -13, -5, -7, -118, -235, -184, -138, -51, 256, -145, 88, 13, 182, -207, -24, 44, -253, -26, 17, 120, 135, -28, 87, -224, 66, -165, -75, -44, -119, -130, -124, 23, 136, -23, -125, 340, 26, 203, 72, 20, -64, -66, 305, 274, -164, 276, -70, -44, -98, 332, 129, 137, -372, 65, 59, 109, -124]
5239a24J47lk04N29J1m55k54L01J17k89L60k98k2J76J61k62J30J12j02pJ17j18
5261B3n1M8k49L18r8K32k02k81J81Ro2K48m1k65L85R5l21o2k2P8R1Q3o4N8k1l85
5287b75J02O75q52L27J70j37J4k32J24l1J52j4j34J66pnq8q8K15M8o5J5K84k97
5311F7k11L54l5k27R5j57K21j15K13j08j35J16J9K39k06j22m8O1J44n89L54K5
5333d5J90l05M4J03j52K78j70R2k46Q8P2L14j37k18O8l9KL7J00P9l11K94j10M15
5357D43k96j25j24M1L13n48L33j85R1M0k8l8L59j7j61n0j42M3K34j10p5K03k74
5380g3N9M4k58N3Q2l2K94j51j09J68M16n13rp8j48K11K3j38M32j13l22M27k33
5403C2m2R0k1j63J33N1k2j52J02k25K98M1j49J52j01k18J04J31j26l65M53NJ34
$$ y = [-124, 23, 20, -184, 345, 356, -99, -353, -52, 65, -224, 136, -162, -184, -8, 153, -109, 21, 133, 31, 24, 141, 23, -28, 20, -229, 89, -9, 223, 21, -260, -79, -70, -132, 116, 75, -190, 195, 290, -31, -93, -115, -37, 54, 137, 73, 131, 110, -275, -173, 502, -350, -23, 147, 10, 24, -208, -84, -115, 37, 23, -111, 55, 48, 43, -45, -133, 82, 130, 65, 80, 364, 67, -144, 210, 175, -52, 43, -114, 107, -8, 205, 97, -38, 78, 97, 336, 130, 8, -40, 21, 165, -424, -70, -45, 145, -160, -116, -13, -165, 113, -57, 35, -211, -123, -51, 263, 126, -92, -24, -63, -61, -24, 76, 155, -156, 138, 28, 443, 147, 22, -102, -61, 252, -296, 37, -148, -57, -17, -45, -83, 276, 259, 98, 48, -94, -51, 183, 73, -2, 201, -73, -14, 30, -228, -175, -93, -125, 169, 18, -91, 77, 493, -20, -29, -107, -255, -44, -21, -159, 273, 160, -162, 265, 32, -10, 80, 59, -104, 29, 80, 58, -94, 8, -217, 81, 122, -27, 125, 24, -194, -90, 41, -85, -450, 3, 8, 142]
5426A42j52J15k18J72KL2j94J97p9P9k82J39j1o4J83p4k6k29Q2L43r5K06jm75
5450b08J57N4K0Jj3J23m1j07J76J2k96L56Mn80O98m00J76j42O6P9ml62J84K25
5474A78n2j0J84l57J48j04m7K81m91M69k46q1j50M34j61K93k06j96P7k42P9M6
5496a54j78L78o2j4j09J52P1J85p6n9r9j43q8L31k17PQ9J16k84J56r0J34o2L29
5520C13m67L84Q7j61q5j0Q3l44%K11J08l02K61k01O3J71j81k95J26L45j40J66
5542A32p4j70K98j31J10M8j33J26k11J73j3j89j97K23Pk31M22O1m25L12R2j09
5564A21o1J35l05r2J80l8N6O4p6J8r3L70k08j81M01j23j88J90k19P0P4k54n9J14
5588a04K69K8k00j25j20M52n11K61K05l78M14j10q5K17j57K1J52J33l60J45K2
$$ y = [142, -10, 105, -113, 59, 61, 93, -101, 96, 17, 96, -186, -47, -58, -122, 61, -13, -39, -268, -186, 157, 62, 268, 267, -208, -51, 3, 23, 24, 11, 134, 93, -14, 162, 174, -122, 234, 238, -342, 356, -44, 132, -10, 56, 135, 131, -231, -47, 178, 126, 116, 300, -57, 91, -13, -60, 221, -270, 199, -47, -128, -278, 156, -5, 288, 82, -114, -37, -279, -200, -154, -332, 46, -16, -30, -139, 13, 84, 269, 193, 134, 35, -108, -196, 135, -82, -75, 14, 130, -154, 2, -88, 46, -16, 313, -154, 230, 317, 156, 71, 61, 144, -200, -200, 11, 119, -183, 78, -123, -60, 111, -70, -365, -239, 106, -34, 132, 58, -112, 186, 55, 165, 213, 80, 206, -5, 168, 155, -34, -231, -8, -1, -232, 190, 251, -174, 138, 230, 121, 60, 195, -110, -202, -22, -60, -4, 60, -16, 2, -91, 279, 71, -110, 291, 168, -20, 170, -49, 21, 95, -159, -218, -104, 165, 193, -7, -132, -252, 200, -311, -50, 155, -223, 191, 81, -4, 213, 56, 77, 229, 362, 2, 147, 169]
5609A69j29q4J7J49j20n9O7J29K3j33p0r5K80k16J46N9k68L8j36L30j48L3p5L66
5633B73m60o7J97J73J42j13r0j07m8J70L3O7k82J59k99J28O5Nl35L68l7j18J89
5656A3l35L30l9L8n6m2K88m66L0M30k26Q6J56k34K42j80J6J87k0l09j02K3J38
5679c2M6j51J07k7K31k74K51m38J41j22K78K20k57K12n36N01k07N1j21P8K17j37
5701C1Q1N2k1k53K64j18j27J08M0j9j36l5L54l14M08l98R4K87k62K73k57K40l05
5724a3r6L31j88L08o6j48k73rM28l60K57j1k45k8J39j23J08J21p4J9k27rJ20k41
5748b80j5K30O7K28m59m5L66j96K3R8K74k05k14K1m1J02L3j56K78j77k4K16o8
5771E6j58L1K19k84K0K56j97M0L0j83M36k21J15m0k5n5qQKJ02P5l28K22m1K08
$$ y = [169, 40, -44, -27, 122, 2, -57, 10, 139, 162, 29, -41, -136, 144, -72, 74, 133, -135, -97, -233, 97, -51, -18, -93, 273, -187, -254, -57, 116, 258, 145, 55, -52, -100, 70, 103, 170, -112, 47, -252, -124, -59, -54, -389, -21, -58, -176, 13, -322, 8, -31, 7, -49, -91, 197, -269, -239, 191, -35, 51, 207, -27, 215, 35, 51, 238, 218, -91, -193, -170, -32, 14, -137, -30, -57, 174, -100, 151, -287, -146, -268, 10, 230, -27, 185, -351, 150, -57, -6, -127, -49, 168, 31, 112, 164, 143, -110, 154, 36, -91, 17, 57, 38, -98, -133, 221, -93, 315, -83, 11, 298, 36, 309, 52, 292, -13, -109, 222, 34, 342, 276, 128, -145, -154, 274, -86, 171, 160, -85, -113, 26, -97, 11, 132, 58, 77, -150, -159, -39, -280, -295, -65, 2, 230, -229, -274, 92, -104, -81, 17, 291, 86, -128, -107, -148, -46, -13, -169, 109, -68, -92, 124, 56, -102, -71, 148, -136, -116, 140, -57, -17, 13, -170, 266, 45, 160, 120, 95, 40, 32, 40, 42, 144, 219, -109, 113, 72, 280]
5796B80m5j37k24K33k0k81k5J69L12l32L38k63j90M70k80k5K3J39k36j60N30k04
5818G2J85m47N02q7j7p1op7q3k49K19J66K3J26k44O6r0KM0j54N4M72n16J49mk12
5844a81J56J52J12j72j30J87o0l16n8L98j57K10k74J31l00l3M95K8mj93jO6O8
5867A24j10Mj98Q2o4q4K28P4k02k3PR1M4k73K04Q6J45n4l16J43L52j81r6K1j38
5892a34r9K24K83j54K3Pj55k47K01J57K0j91k06K45M4j28K93o6o8m7kk6K97l86
5916a15J13R2n8J85k65j22L01R2j99l67M13L7J13j53L58l74O4k28M96j70k93j6
5938i6N6J66j3j53L04j93k06p6L15K9k35j80J93k2J8K36m85M8K22J59J00k47K19
5961A59l58K50n9M4Q7Q1J3k51J03K03m39J86j3l7J35J53l53J66ro4N2j50K03l5
$$ y = [280, 235, 98, -126, 107, 87, -194, -219, -50, 262, -70, 268, 5, -185, 285, 5, -20, 3, 142, -94, -254, 276, 72, 257, -190, 312, 225, 208, 137, 131, 54, -29, -278, -59, 107, 130, 256, 12, 78, -12, -10, 30, -124, -70, 402, -114, 35, 31, -181, -25, 127, 239, 67, -63, 124, 64, -252, -310, 88, -69, 141, -133, -2, -302, -335, 160, 188, 184, -9, -10, 56, 124, 14, 18, -180, -98, -162, -246, -18, 56, -146, -169, -162, -71, -27, -300, -96, -10, 135, 81, -235, -92, 260, 79, -17, 4, -134, -233, -9, 274, 120, 143, 150, -5, -252, -51, 106, 126, -65, -271, -26, 18, -110, 183, 117, 49, 2, 0, -26, 271, -115, -2, 90, 32, 217, -48, -170, 131, 223, 24, -343, 70, 107, 220, 67, 425, 51, 115, -113, 383, 213, -80, -96, -40, 126, 113, -40, 264, 71, -135, -211, 104, 133, -102, -282, -89, -111, -93, 143, -342, -294, -72, 87, 187, -60, 159, -199, 51, -8, 36, 123, 204, 217, -34, 69, 272, -167, 19, 6, -31, 104, 257, -96, 70, 61, -3, 49, -101, 102, 67]
5985F7k20j3P9j20j3K27J2k07K3J03O9Kk20J62K20j96O8P1r8j03R9r8n6Q5l4K93
6011B02l20K18k11P0k0l31M77N0q6q2j17J07J77j5k64k24M72O2j8k41K30j7o7
6034E2j81Q3j09p6L61R9j03n2J32k80P6j60K08m7k5o1kN2J3J32J16j54q7k77M60
6059A70k96L37j81l95J25N65r1j74k74L72N8j77M3l7q3J88k29j12K66j03j4j27
6081a69L89O0k85k21J51q4K30j6j81n3K29k70J41N5no0J27Q2k46J66q7MJ41J14
6105B12L3j74k37J98j6o9R0j57K19K31o32N70k32J42k46J72j34J46%j96K0L58
6127B98m58j2O5J28Q2k99K15j64K35k68K2k02P1L74J42m67K98k17J17L16k07k1
6149D8K1j63R0L14l69k34O0M4M33l15O3J67m5k59J44p2N7l94K77Q8K8N3k8j06
$$ y = [67, -153, -166, -87, -207, -220, 7, 19, -188, -165, -62, 7, 9, -211, -49, 171, -25, 43, 114, 16, -87, 12, -86, -142, -57, -91, 202, -118, 100, -111, -41, -61, -392, 85, 135, 49, -33, -150, -43, 134, 119, -145, -369, 103, 165, 147, -94, 136, 119, 52, -129, -46, -155, -231, 130, 229, 126, 74, 206, -74, 2, -158, 50, 3, -22, -83, -85, -33, -20, 112, 228, 74, -13, -290, 170, -126, 211, 30, -365, -240, 325, 234, 60, -214, 158, 216, 39, 82, 45, -38, 150, -79, -191, 75, -28, -42, -169, 220, 280, -5, -226, -75, -159, 71, 55, -126, -179, 50, -220, -79, -24, -29, -89, 38, 120, -126, 40, -47, -43, 98, 212, 245, 71, -166, 32, 16, -53, 37, -120, 99, 330, -302, 268, 36, 178, -68, 104, -30, 116, 116, -80, -60, 298, -160, -172, -107, 21, 103, -196, 19, -145, 90, -178, -156, -358, -287, 87, 229, -238, 60, -157, -40, 276, 69, 48, 69, -94, -4, 310, -59, -293, -233, -189, 244, -71, -8, 159, 114, -145, -1, -73, -16, -410, -133, -45, -17, 36, 8, -98]
6173i8J38K3j9k70J20P8j76J45l9j41M18Q5m49K16j57pK80j50j11qO0M1k3K46
6197B02k93L00q3m9j63j78K30j16L16k21P0k2k2k1P3k1J10j01q9R3J13j78J15
6220F5q0M32n48L20l30M21l63j41K70Q7l75K76J7J86k09j11Q3k8k73L69L3o7j68
6243a34k76K89L05r3j17r6o1R7J40R4j84k2J63l85N2O7n7K95j8J72k77K75k32
6266cJ28j38p6RQq6J94j27K66m62M16j19J39l47J11K81j95J63k01J40j29J76l44
6289a96M74k22J51j89M6O2k93K39n9o9K13j42p8J25K7J33m6l50K29P3l48N6N3
6312a11Q5K01J6j15J90m52K41j53J92j99j48J09K94j86J49j34L8RL10j48l05j1
6334a28J35l5P3J45nl01J4N4J47J22m32K38J51K4P4j88j21oj10N4K26N7k14j58
$$ y = [-98, 40, 63, 44, -226, -106, -28, -204, -59, -98, -239, 179, 264, -185, 31, -126, -133, 147, -3, -114, -122, -62, -21, -44, 202, -91, 209, 126, 77, -86, -264, -34, -150, 166, -55, 15, -7, -29, -50, 23, 2, 112, 11, -78, 15, 128, -50, 65, -15, 417, -131, 189, -141, 280, -83, -224, 46, 133, -242, 34, 51, 237, 28, -83, 0, -28, -301, 68, 101, 34, -134, -410, -121, 184, 91, -26, -122, -183, -86, 54, 148, -36, -58, 105, -280, -228, -161, -218, 77, 59, 231, -46, 229, -3, 125, -13, -89, -80, -72, -158, 36, -91, 175, -287, 129, 10, 149, -198, -87, 194, -1, 162, -39, 101, -28, 148, -196, 278, 56, 207, 18, 64, 126, -167, 72, 13, -56, 157, 15, -63, 62, 89, 222, 176, -174, 55, 128, -220, -164, -111, -26, 175, 191, 76, 266, -186, 55, -98, 94, -105, -253, -144, 150, -36, 113, -21, 17, 26, 336, 188, -117, -128, 7, -28, 45, 190, 185, -116, -102, -48, 99, 221, -211, 27, 178, 202, 276, 88, -33, -39, -149, -95, 131, 188, -26, -184]
6358a84K63k35L25k33J98k46m9J88j21K19J18l42j33L35k50J41j47L95j45j2j97
6379a12L9j26L86m36J80j84L84Q4l46M5L09r4q2l0J6j23K80J24j57J1k87K48m81
6402c52K50j28R7J21j63M32m09K8J62j3m3L73j13o42L80K15j56K64k10m80M63
6423G6j51k31K30K6lJ47J38o85K78L5J45%o3p0M18m02KK23J4j52P7q9L5J4Q0J78
6449B70k03K9k75Pj07O79n03J79k19k3Q3K72k84q5QN26k64L1p7p1l01J69J16J20
6473G7l71L70j10K1j85K30N7J1n9j10j12J02p4K01M4k50J16J56l98M08j62q7j6
6496a41J12K08l45L7K69J18l65m4k5Q5J20J05k44j15K3L75m58L11k20J31k38J33
6518a68J21k6K26q1m20M20n8k27K78L8r6j45p4M18l16L61l61P0J31k32N7J85o5
$$ y = [-184, 79, -156, 169, -64, 134, -112, -161, 27, -94, 125, 243, -99, -232, 103, -147, -6, -153, 242, 97, 85, -112, -73, -199, 187, -249, -69, -253, 131, 215, -131, -86, 223, 129, 47, 17, 33, -90, 190, 314, 157, 168, -119, 129, -352, -102, -230, -133, -12, -175, 257, -152, -124, 38, 25, -18, 355, 242, -400, -20, 195, 39, 303, 93, -387, 76, -75, -306, -76, -50, -53, 94, 232, -453, -175, -140, 5, 5, -58, -128, 290, -112, -110, 113, 127, -25, 52, -37, -2, 12, 92, 270, 67, 96, -179, -172, -279, 400, -103, 76, -143, -166, -83, 189, -95, -180, -172, 354, 90, 121, 44, -27, -328, -159, -43, 77, -294, 76, -34, -13, -198, 32, 89, 100, 41, -69, -181, -79, -153, 48, 92, -158, -42, 114, -284, 124, -38, -125, -141, -29, 179, -166, -129, 140, 258, -107, -151, -176, -91, 29, 134, -110, -225, -202, 173, -285, 26, -194, -63, -301, -168, -47, -73, 153, 72, -348, 72, 14, -213, 65, 103, 7, -138, -212, 206, -110, 251, -110, -40, 91, -141, -84, 101, 36]
6541C6J05j17l1q9P6j65L34j74J9J87K06m72M0j70K56k15J34P2k45L29p4N4l00
6564b04K1J08Q0q9n2K66l5j92K36k93M8n0J00K07k62P6M1J33j77K19J8Nj30j51
6588g7o8L29j46j29J73m0j18Jn6J62J77k46J04%p5r6M8M22n55J51k5M7J5N8pj4
6614C5o2k32M08k25M73m04Rp1j3K0K0J5j9j04J45k07N4N06m23M02M8l74r5j72
6638b66L09K01k04J95j88j25o1J72j79L9J98j95p9J90p8J69o6k32r8J97J2K23
6660A34m10L06j20K43O0l82K6Qj56J14K68m11J31K76L48l14lr1j19K45m89M18
6682H2J16l51R5J8p1Q4k62J61L29l37L02r4k76K1K74l22K90l1K7l32K64J34j82
6705f1J2L2j28L48j12K77l02j26j7Q5l05J96J14k52J12J9K17k52J83k61K31n6
$$ y = [36, 141, 24, -7, -96, -20, -185, 149, -25, -6, 181, 387, -85, -45, -215, 41, -174, -40, 32, -213, 116, 42, 96, -204, -183, -75, 5, -84, -136, 130, 95, -97, 139, -154, -106, -156, -56, 151, -111, -35, 6, 139, -38, 181, 199, 204, 74, -77, -145, 184, 38, -91, 82, 42, -76, -75, -131, 31, 208, -38, 66, 66, -9, -105, -57, 365, -190, -39, -64, -17, -2, 56, 49, 35, -27, -259, 149, -76, 397, -7, 2, -69, -82, -62, -42, -27, -46, -150, -5, -212, -158, 348, -75, 327, 375, 1, -94, -266, 43, 244, 40, 235, 47, -78, -139, 33, -146, -107, 91, -104, -183, 7, -71, 98, 32, -200, -298, -101, -89, 134, -276, 30, -90, 153, 213, -169, -143, -135, -291, -177, 91, -320, -189, 87, 435, 121, 118, 27, -92, 153, -336, 82, 198, -153, -58, -40, -111, -27, -289, -128, 201, -136, 166, 72, -204, -183, 91, -231, 59, 28, 55, -277, -13, 121, -61, -49, -17, -145, 203, 91, 368, 66, -60, -77, 8, -297, -101, 13, -239, -127, -108, 109, -143, 40, -221, 10, -46]
6727d6NK72j84J9k24qK2L66l23J55J07k66r5q7M25o0m9r2K23ol27K45j5l14j0
6752b67J24K00N4p0J75r9k98L51O6j32K6k54L18n66K00L40j66j5k7q4L8l3K21
6775A02j3m8k4K73n40K38r6J35K46o0K43n44J51p5J91j88J02n2l97L72O2O6l69
6798b25K54k58K41J11m27L52J20n35N21o7p5j30q1K36j45J78J5k30J4K11k6K9
6820H3l6J00k78K54n3o3j58L03J25j39j61J71m34j16O31J21k46j32J35p9J57N8
6842B43l91J04K24k22J96j59j7O0j09K77j91k24J98k99L35n3J56j14l31K74j73
6863b16K22l95M65j26K2K73m38L85l50L28j87l1j4J93Ql92N0J69K65k91K57Q7
6885B84n6k59j02L80k98Q8J72l24J17Q2j14K35k94J11R7m8k81J64m0k56K95j20
$$ y = [-46, -41, 231, 47, 66, -158, -166, -144, 222, -101, 54, 161, -105, -200, -287, 138, 78, 29, -63, 160, 154, -173, 72, 57, -257, -267, -143, 57, 111, 41, 216, 117, -181, 170, 236, 104, 130, -124, 194, -372, -172, 168, 2, -13, -40, -124, -86, -119, 102, 89, 41, 17, 290, -250, -12, -108, 27, 273, 213, 456, -88, 63, -12, 179, -9, 93, 41, -356, 16, 78, 144, -225, 29, -229, 12, 123, -304, 48, 168, -367, 154, 87, 12, -118, -199, 37, -108, 70, 85, -145, -131, 80, 54, 83, 47, 147, -131, 123, 70, 7, -151, 152, 277, 138, -23, 148, -286, -402, 229, 350, 104, -28, 107, 28, 185, 243, -148, -44, 180, -42, 154, -5, -22, 38, -71, 206, 15, -209, -11, -310, 25, -28, 128, 14, -317, -43, -216, 6, -389, 76, -50, -28, 245, -193, 192, -158, 170, -17, -48, -62, 131, 139, -253, -203, -34, 231, -60, 197, 284, 228, -31, -133, 247, -51, 37, 209, -115, 2, 84, -30, 205, -89, 22, 119, 71, -210, -46, -86, -342, -47, -167]
6907a67J14P8R3j08l91J94K85n1j0l9K30l07p1K45J6o6l45M67k96N4J28K69m42
6930a20J27m9J47P4k57K35o6q0N7k29J72l17K07LJ50k8L7N4k53J59J39Q5k94J89
6954A42l01K42j24J45qk15R4P0j95N13m09K3k8Q6K9k08K47k35K76p0j04J17j43
6977e6J6l0P7mj89L78M2n8kn0R8l64K89j50j32K77j85r0J67lJ04m26L88J18j04
7002A11k29j44L74l53M23j29J25k03J14k78oJ58N0N5r1R0O7k81K8J65j55m6K39
7025H4k21m0K92j18l5K16k18J31L6k29j03J99K02m26K60k3k3J06j81K81k74K42
7047A58j8n2j89L18j91J04k08J04On26L85J42l7kK0l9J77j54J42j96M1R4k19K66
7071A26m1j85K27P5j29m2P2j82K08j50K10j69l6l02O35l94M6J00k27O6k13K59
$$ y = [-167, -53, 25, 118, 10, -381, -187, 98, 47, 37, -2, 228, -79, -150, 95, 111, 45, -300, 167, -129, -75, 53, 322, -120, 7, -42, 105, 179, -78, 157, 91, 11, 68, -161, 11, -306, -99, -96, 54, 26, 63, 117, -136, 23, 162, 247, -47, 142, -159, 83, -41, 104, 96, -119, -25, 45, -150, 363, -46, -23, -51, 35, 64, -144, 103, -132, 144, 74, -30, 87, -56, -40, -70, 7, 3, -186, 192, 234, 176, 174, 124, 222, -142, 147, -3, -135, 142, -43, -133, 34, 31, 135, -291, 97, 215, 111, -118, -262, 112, -241, 182, 53, 178, -25, 89, -189, -195, -37, 13, 68, -23, 67, 134, -147, -119, 46, -109, -155, 84, -137, -177, 115, -3, -38, 178, -40, 91, 127, -102, -205, -6, 196, -230, 30, 7, -16, 90, -91, 190, -84, 158, 140, 88, -101, 217, 26, 130, -78, 26, 32, -494, -109, 33, -4, -6, 14, -25, 152, -2, 140, -56, -15, 79, -140, 126, 85, -100, 127, 202, 73, 31, 103, -79, 129, -21, 189, 20, -16, -318, 317, -77, -31, 69, -158, -92, -305, -46]
7093d6K68k24J3Q0o4pj85L86k44j43j2J55j36M97k56K2l2J51j25k81J01M1j35
7116a76M65l62j0M6P3m2j9j2m4J62k29J86m7n4QJ9k68M70l45P7J38J63k72R5J38
7141A60j51j13k45L06L11n92M15q9lr4O4j20p9L24o6P8l09L53k32k8n1J62K49
7164B50j95j66k09J47j9M3K92j56nk3K0j98J47P6k46K87J62m42M34j48p8q7L21
7187B07J3o0n00K06J16J2j08J63j19R3J29o2l04L13Q3j87K71k97k60L86j22M6
7209A9k35K32j64J97j24l2J53k72K43K09l39on1J46J28r6j01J48k1n6j66J37J60
7232A09k32J05j1k3P2J55N4k88lK50j79j2J57l43N31l52r3J0k0L03k20o0L23j58
7256G5j91j09J25j2L15o9k36K06k25L48j90k22L48r6m7p3j9J49o1J63j2l36Q9
$$ y = [-46, 222, -2, 11, 91, 27, 20, -165, 221, -23, -166, -178, -23, -159, 338, 82, 104, 72, 223, 98, -183, -82, -41, -176, 289, -73, -83, -37, 36, -6, -25, -37, -81, 81, -148, 38, -9, -63, -55, -36, -304, 166, -179, -102, 36, 199, -73, 22, 160, 9, -104, -349, -43, 268, -324, 91, 2, -1, -95, -31, -151, -230, 94, 28, 106, -203, 150, -82, -110, -161, 1, 250, 55, -111, -320, -173, -192, -149, 143, -13, -18, -41, -21, -219, -72, 4, -242, 45, 207, -235, 199, 51, -27, -114, 207, 220, 160, -340, -134, -18, -6, -114, 49, -70, 23, 152, 90, -214, 99, 182, -5, 266, -31, -291, 95, -27, 19, -216, 16, -148, 49, -75, -107, 46, -226, 17, 226, -113, -119, -170, -24, 104, 8, -93, 55, 34, -22, -188, -51, 109, -123, -18, -29, -52, 20, 175, 229, -59, -62, 188, 9, -3, 154, -189, 342, -10, -103, -93, -113, 190, -30, -90, 233, 75, -116, -225, -100, -112, 203, 134, -102, 104, -121, 227, 37, -185, 163, 67, 20, -53, -72, 77, 16, 179, 167, -169, -80]
7279h0r6J5J57J53r1Q6k86L14k59l5L94j52j15j24R4j65r8M04ML8k1k65n0J40
7303c8J50k54R9K02Rk41J65j87k01L30J81j51R1Jk52J55j37P0q6K47m26L12k12
7326a73L77k92NN7K33k90k06K70k62J59K47j49K25j51m30L14L4r2K26j30K4J06
7348A02l44J00OJ80r3K62j97o1N6J99m68L54R8k67L33k67o6K8o7Op3M08j18q8
7372B3j42L15l71J86J02nJ54l82K23j16J61j30J06l9J97l18l2J88l4j4o8K3j89
7395a62J43Q4J14m20K94R6l65Q3R8J38k34j35L11q0K93k76j39K8PK36m8Rl44J30
7419a39M09j48j63K05J9n00O1O7J38L61l97J83Pj25K19m0j02O7m30L09k21j3J80
7442e3K05l05J62k27K31k34L37k06J9l5K64j05N7k48j93M07j85kQ9o6j24J52n8
$$ y = [-80, -176, -161, -4, 149, 58, 144, -142, 172, -87, -122, 272, 120, 5, -119, -25, -190, -288, 116, 120, 158, 137, -128, -178, -38, 112, -142, -43, 159, 168, -73, 92, -95, -296, 34, 215, 64, 155, 156, -96, 59, -78, -8, -94, 153, -273, 39, -173, 204, -88, -83, -26, 207, -83, -289, -19, -281, -122, 125, -24, 201, 50, -380, -66, -32, -124, 102, -28, -4, 102, -242, -142, -136, 44, -49, 213, 16, -45, 11, 210, -258, 96, 194, -73, 260, -7, -73, -45, -112, -106, -179, 229, 111, 23, -119, 196, -175, 11, 113, 108, 262, -120, 103, -13, 148, 18, 124, 85, 282, -36, -68, 120, 86, 72, 4, 27, -162, -19, 65, 179, -241, 53, 149, -216, -133, -35, 103, -131, -266, 45, -35, 258, -18, -157, -129, -122, 114, 66, 75, -269, -139, 270, 122, -41, 164, 183, -317, -256, -189, -51, 310, -87, 96, 103, -22, 197, 157, 55, 122, -308, 1, -220, -233, -53, 152, -153, 9, -218, 13, -221, 116, -90, -71, -106, 158, 53, 110, -138, -331, 76, -109, -111, -22, -88, -212, -60, -118]
7465a18q2J73L67k90rj37k0J09j70L86o9n3j2q3J15m39j0L93j32K04j29R6kj62
7489g4L6r6O45q31O01o3j07J15m76K15K7P1j70K09m12J13L07j26j25j8K30k28
7511a57j41J38J74N9k03J06nq3J47j39J96nk10mJ32Pj11J68k35K03j7J78l0l06
7535a38K85k62j95N1L43m02M11K3P9k36NJ69j90L9J62k01M0Q8k53L68n24N50k25
7558a3J23L9l17J01j82N18k48p3P9n4L86m27J36j18k6R2k31J32J07l1j7P1L6k43
7582a60K18Q7l20N7K35K93n39R0J22O0j67J63k51jj84L8L35k17K18R6K07k79j60
7605e9m5N3J34J43j28l9j19J63l27L34p2j44O3j02K47n2J45l27R7k2J30J5J49
7628B37j3M6k24j20K13k9k84L64r0j84K83k4j49n9P3k34J34j9j03J5J06q8N45
$$ y = [-118, -200, -27, 340, 50, 41, -96, -116, -7, -177, 209, 140, 87, 75, -8, 107, -332, -342, 51, -81, 123, -6, 90, 88, -74, -38, -134, 511, -320, 281, 218, 111, 226, -250, -35, -8, 63, -107, 102, -310, -197, 110, -16, -141, -159, 71, -157, -298, -160, 14, 73, -130, -24, -29, -112, 35, -104, 92, 87, -123, -127, 5, 12, -99, 69, -166, 37, 20, 198, 168, -138, 147, -115, -310, -259, 84, -318, 93, 116, 195, -41, -36, 133, -57, -18, 144, -57, -17, 71, -182, 186, -338, 212, -13, 110, 149, -168, -67, -249, 269, 21, -52, 27, -27, 359, -68, 68, -50, -76, 16, -215, -83, 24, -7, -24, 47, 83, -160, 58, 145, -175, -118, 117, 410, -129, -39, 83, 143, -24, 139, -112, -113, -297, -259, 76, -141, 77, 173, 380, 101, -59, -104, -51, 83, 226, 98, 59, -60, 103, -224, 110, 38, -106, -43, -145, 102, 50, 195, -132, -35, -57, 73, 88, 237, 224, 270, 46, -74, 139, 110, -174, 190, 100, -84, 199, 175, 26, -33, 40, -194, -60, -79, -182, -167, -61, -149, 396]
7651C96n55J46J9N4j13J5J30j36L58k80N7J95k49J34j59k83K05J22K6j41J26p3
7673fK98m19L62j55P3m7j99p9J57K2k40K19j44J74J35o3N0k3j7o7j27%P6J78j45
7698A3n4J79l8P8J8j09n3k36L96k40K51l19L41n7o21M64R1j69m2q6mL06m4q5k3
7723d3k89J43M59j43Nk01K45o7k50j78L74P4p3l0j49O0K92j59Nj80P0K75J08j65
7747A83m5k33K32%j58j70o2M51L0j72k49k0R3J32m2J05N1J2k11N5kK06j68j45
7771a27J23K2J0n4o3J0N3k8P0m13K68J61Ol3m3J00l5j18K25k50M3j37Q2K56j11
7796A7J79j47M3j63R5O0q6K35m74J96l9R7j82N37j98j81l0j66L17p1j58J50j54
7819a23R9k46n1J25L3k1K37r0K2M7j40O4J08qJ28l17J27j28O2j1q4r7M49k30M3
$$ y = [396, -159, -13, 6, 60, -53, -38, 92, -44, 314, 34, 91, 286, 37, 171, 12, -271, -66, 56, 82, -59, 67, -6, 292, -127, 235, 80, 153, 106, -93, -172, -15, 7, -233, -14, -158, 16, 151, 88, 138, 115, 98, 31, -96, -96, -20, 158, 13, -41, 138, 100, 178, 196, 87, 34, -202, 194, -46, 205, -114, 227, 170, -451, 13, 104, -65, -107, -193, -197, 109, 65, -20, -43, -332, -189, 270, 127, 132, -69, 176, 109, -141, -319, 55, 129, 56, 26, -123, -63, 229, 70, 75, -105, -35, 240, 348, 183, 138, -95, 137, 137, -21, -191, -253, 198, 228, 56, -193, -213, -120, 12, -30, 75, 126, 138, -73, -18, -20, 186, 18, -127, -4, 18, 28, -26, -89, -79, -26, -54, 16, -397, -129, 32, 38, 5, -38, 62, 27, -91, 134, -116, -73, -210, -128, 128, 17, 196, 49, 92, -71, 24, 84, -2, 233, -241, -45, -84, 13, -169, 368, 170, -11, -41, -207, 110, 39, -119, 31, -123, -24, -270, -321, -196, -163, -184, 53, -37, -15, 32, -108, -44, 64, 56, 184, -133, -6, -134, -72, -83, -167, -264, 185, -45, -2]
7844bj11J09j47KJ3k33l9L39J79M9j95J71KK1J56P0l13o1k8m14O23j28m10J99
7868a48R5qj22J39O8M8O5k53J19o2M5k24K71j75J17m7J32r8j09J22Q7k8k00p1
7892b37L12j18R6r1k92M82r5k40K82j04q5J68L7l64K39J48k84L39j81J28k97M64
7914C07l11k68M09k87J07pr1J50K07l24q3K7M7J42N0O4k18j66P6K29k50P1L2K32
7938A45l06l6R6j10K44M2J48j02N4K0J19M0n32J89O4n9l75J90L14k63P2K54o04
7961c96M02j43J52K2j0n9p4N0j03L00j99M9l0k8N9m3J09Kj99K49k56n8K87J52
7985B35k36NL61j57k49L63l10J76k39J38l73K89j22K05q0q9J53P1k68J75L0j37
8007e9K75m15M3q5M95j27J10m32L38j12k05j5J7m1o9J54RoK81r7QJ15l0l52K95
$$ y = [-2, -113, -4, -151, -149, -136, -369, -408, -69, 110, 159, -36, 135, 137, 158, 314, 384, 71, 10, -18, -432, 191, 63, -347, -148, -53, -61, -183, -44, 24, 72, 137, -116, 3, -59, -14, -238, 33, -142, -25, -72, 60, -38, -147, -25, 62, 34, -166, -237, 75, -43, 53, -38, -330, 152, 57, -183, 99, -5, -90, 78, 115, -249, -10, 138, -146, 193, 12, 140, -157, 307, -4, -272, 137, -150, -43, -50, -141, 9, 216, -108, -191, -164, -117, 25, 75, 139, -79, -245, -169, 60, -190, -119, -87, 145, -161, -197, -101, -211, 33, 75, 223, 121, 175, 195, 314, 354, -178, 11, 75, 16, -359, -169, 145, -118, -46, 208, -396, 6, -137, 15, 37, 27, -32, -106, -56, -159, 141, -58, -9, -39, -67, -8, -51, 58, 60, -139, 110, -146, -204, 83, 235, -1, 4, 365, 208, -41, 322, 12, 188, -51, 87, -286, 3, -119, 86, 6, -83, 70, 141, -127, 48, 78, -59, 216, -199, -156, -241, 254, 127, 237, -195, 143, 31, -174, -189, -172, -213, -282, -128, -119, -125, 156, 59, 67, 182, 152, -200, 95]
8032I5m3L1Q3k69J55j11j91K19j92L13L5l20J58o9j84K89QK7N9j16O4j09K08K0
8056A60j24K6J0Q1m97L84j22PJ47J57j68j35M32k31n6O4J49o1n79K03K13J66k54
8079b8j3J18p4l7L3Mj36K28m05O8L96k97J41J33j74q8K81K2k84p9O5l1L5L02n9
8104A21k40r0N89m37J68q3K99l47M4k1p4j18J61K84p4j53J13O0l06l1K20J8p3
8127C0J58K7k96J62k32M32m49j32J80mJ55j66K66o0o9J01k91J42J20k34K70J56
8149B66j73j50J06n3q9l6p4K18j14m2K23k29K59j78M7L6l6l4J22q0L42k53J61
8172B39m81J89N77n26P9j93j17J85Q8kM9r8K0L2j06j67K76J67k35
$$ y = [95, 52, 83, 166, -103, 52, -59, -250, -31, -223, 90, 125, -195, -37, -106, -290, -1, 7, 34, 93, -23, 41, -68, 140, 160, 36, 62, 72, 153, -344, 40, -82, -75, 72, 229, 61, -74, 358, 127, 71, 135, 284, 223, -356, -153, 60, 226, -28, -41, 77, 3, -34, -1, 3, -133, 95, -310, -242, 154, -143, -2, 131, -43, -131, 150, 172, -112, -191, -126, -157, -122, 180, 121, -119, -209, 380, -57, 111, 28, 327, -20, 24, 3, -71, -189, -28, 256, 182, 29, 142, 202, -104, -135, 85, 103, 30, 188, 215, -81, 81, -151, 281, -168, -300, -120, -124, 31, -135, 131, 71, 2, 103, -188, -46, 74, -160, 110, 266, 93, -57, 49, -4, -93, -129, -203, 15, -99, -141, 82, -147, 112, -66, -19, 17, -19, -53, 69, -11, 331, 78, 239, -242, -53, 524, -2, 77, -116, -233, -48, 40, 38, 87, -11, 9, 41, -65, -232, 44, 211, -24]
8191b4
$$ Imaginary data points
##PAGE= N=2
##DATA TABLE= (X++(I..I)), XYDATA
0@%%%%%%%%jRj6J6j6K4l2L2m0M8n6P1q0R0j06J22j44J67j89K14k41K72l08L48
32A84l90M35m85N41o02O69p43Q24r12J009j117J237j370J519j687J880k101K357
50A248k659L019l461M021m751N745p190R493j3758K4276r7907j67951J55120J59901
64F5146j1956j29258j2314R0323N0596o1997o8384j1155L1939J8741O730R45Q232
77b2412J0017Q097j2875k5777j8300M732J3665J4048J0066N199m894k555M150
90a6839o576k3808p124L5775M0523j4558n1826j3932M2814L3458j7037k5887R699
103a5318J7577j0520j4343J7245K1588j6260l1299Q736M3842K2096k0603k6749
115d008m051Q843N728Q75q01J473J3392K2083M694k5777k8250j045K0275J5532
$$ y = [0, 0, 0, 0, 0, 0, 0, 0, 0, -1, 8, -8, 8, -8, 16, -16, 16, -24, 24, -32, 39, -41, 49, -57, 65, -79, 88, -101, 113, -128, 144, -164, 184, -206, 229, -256, 285, -317, 352, -391, 433, -479, 530, -587, 650, -720, 799, -888, 992, -1109, 1248, -1411, 1608, -1853, 2168, -2583, 3162, -4028, 5465, -8293, 15983, -81924, -249875, -94755, 65146, 53190, -76068, -88382, 1941, 52537, -9460, -77844, -88999, -57060, -38319, -31589, -30644, -22412, -12395, -4298, -17173, -42950, -61250, -56518, -42853, -28805, -18739, -13540, -18434, -20989, -16839, -23415, -47223, -54347, -18572, 21951, 7393, -44433, -58365, -15551, 17907, 870, -25017, -15318, 2259, -8261, -22604, -5359, 16229, -31, -31330, -22594, 21248, 43344, 22741, -4008, -8059, 784, 6512, 7387, 6586, 8059, 21451, 43534, 48228, 22451, -5799, -6844, 13431, 28963]
129B8963L733j91l042k931O174R793o958k2312o837J9425J6801n246p744R413
143C9041R231j3633k1245k86J6047J0250J253K126j907j4071j2735P141J6938
156C8150m48j5817l088J9279J3275j5442k6650n664J8319J3268q896j5690K399
169A2995J9836J2183j4121k6353j1001J1061J3046j187m775M684Q390m801j4386
182E571q310K394K485l477M36M996K050k826o23J966k078r224p623j650L324N760
198f829O641J315o770p382J039N738k086j0819p043N180J0053L975m507l824K193
213a3126N775n18j0936j2405j534J2702J3432L7r551l409P909O116q338j4694
227b8540l187R978J1116mn615L47Q157N528n875j2829p596N580J2135N904l924
$$ y = [28963, 32696, 32505, 29463, 26532, 32706, 42499, 35541, 13229, 6392, 25817, 42618, 37372, 29628, 39041, 48272, 34639, 13394, 13108, 29155, 39405, 40658, 42784, 40877, 26806, 14071, 21212, 38150, 37702, 21885, 18797, 38076, 51351, 35909, 9259, 3595, 21914, 35182, 26286, 10596, 12995, 32831, 45014, 30893, 4540, -6461, 4600, 17646, 16459, 11684, 16368, 24758, 19957, 5571, -2739, -345, 2140, -1337, -901, 4095, 6145, 3319, 2696, 4662, 2584, -6640, -14263, -15913, -12589, -6829, -188, 1127, -5643, -13025, -11986, -6248, -8334, -19153, -26196, -21016, -10963, -6988, -11495, -15319, -13126, -7351, -7869, -18805, -31210, -32744, -20042, -6610, -6573, -16124, -19533, -11624, -5508, -13846, -28540, -31727, -21749, -10633, -10637, -16252, -15905, -7748, -2220, -8095, -20924, -28520, -22940, -10805, -4901, -8825]
242h825m955K944P733J973p059q123j299N365O191J687k246k18N401N783j037
257C315p712n863M76M563L211O76J425K759K668O04j330m727m417r27K419L670
273H10L011L002L262Q71k897n060l554j491J019L170M461L380O85j599q45j803
289F422l785l957L92M703N474J370j289k539j244j339o83j351j764J599M189M447
305A0645j188n661n867r1M231L227m63k169O3K691J048m010o732k511M675O627
321D515J818k493j935j98j367l887l637O38M291M480N59q86j611p39j612l402
337e466l488R42N222N318M30m103k635j24n1r62j071N94K082J661R56Q29k109
354a975m025k446K910N456K280l262l962m39K139Q59j539n82J508L637J943l79
$$ y = [-8825, -13780, -10836, -3103, -1130, -8189, -16312, -17611, -12246, -6055, -4368, -6614, -6832, -1431, 4352, 3315, -4397, -10260, -9784, -5221, -2010, -1334, 91, 2850, 5518, 6122, 4792, 65, -4352, -5279, -2860, 810, 3821, 6823, 10085, 10956, 8059, 2999, -555, -2046, -1027, 2143, 6604, 9984, 10669, 9070, 8225, 6422, 2637, -1320, -928, 3775, 9249, 10619, 9330, 6791, 5547, 4208, 3525, 2174, 410, 2009, 6198, 10645, 9457, 3796, -2071, -2162, 2069, 5296, 4833, 2664, 2727, 5418, 6466, 2456, -4276, -6787, -2112, 4515, 6333, 3840, 1905, 1707, 340, -3547, -7184, -6546, -2255, 2225, 2784, 1898, 287, -452, -2064, -5466, -8954, -8012, -2790, 2528, 2958, -1145, -3780, -3904, -3955, -4917, -5988, -5394, -3312, -1651, -695, 134, -1975, -6000, -8446, -5536, -80, 2200, -1062, -5024, -5463, -3324, -2465, -4004, -4586, -3078, 559, 2502, 2123]
370B123l908l394j837J61K621M565L660J454k037k566k392k032k511l18L261N073
386A923L879J838k51l351n872n312n1M927M557J156J005K328J518k594n539m600
402d439p88K819M211M214K234j236k897k294j256p90k31L01J395K219K333J030
418F825k213l677k000Q45K115J472L3k23j422p7L32K96r44j057R86K510M46k152
436B095j848J8k21p03J118K844J557j754k876q56m0m77p91Q35J913J793O08k69
454B946j728l299k380J440K014J658M38J97N07o48j605k078o25K78J090R28R64
471I7J039Q18j173k835k419J247K551Q41q82p4J787L39k407k212J20J906J214
488d3J32j45K81K79j062j536n13P48J280J199L07n60J46N83p93k120j565J301
$$ y = [2123, -1785, -5179, -7016, -6855, -4234, 331, 3991, 5445, 3408, 842, -1550, -3582, -6093, -6411, -3150, 1923, 5802, 7640, 7389, 4038, -1834, -7146, -7197, -2270, 2287, 3443, 4448, 6776, 8294, 5700, 161, -4439, -5227, -2408, 1803, 6017, 8251, 7015, 4118, 1824, 568, -222, -453, -152, 1243, 3462, 5795, 6825, 4612, 935, -1065, -220, 1895, 3367, 3400, 3177, 1755, 1678, 2010, 2306, 1362, 305, 1291, 3801, 4247, 2095, 247, 265, 44, -659, 459, 3303, 4860, 3106, 230, -626, -666, -1143, -1934, -1099, 814, 2607, 3215, 2946, 1218, -2081, -4461, -3021, -1007, 651, 1089, 1286, 1793, 1145, -460, -2538, -3163, -2885, -1795, -867, 97, 1136, 1954, 781, -2054, -4473, -3226, -675, 166, -716, -790, 997, 1336, -1071, -3283, -3163, -1257, -43, 89, -56, 225, 504, -558, -2094, -2607, -1859, -579, 620, 927, 367, 513, 1096, 303, -1817, -3382, -2081]
506b081K715J647n05j163J0l38m04r97k43J275J675O12j414o43J088J029j268
523I95k175n61J717K059m06j051K9Q78J016j136j613n80O75J514M96j356q55J079
541G25J494M47j415j458j36m3O04k32O92O43Q27m90r10q81n11O96N9q7o34R65
561C55R80kl6p46q72k53m31j49N89M86K07N09l5r60q50m8N79P35o92r61K08N10
583h77O73O88j38r50k34p26k88O7O23K53M96m09L28j31L06p40j074n7O46O18o22
604a548R00N20Q62l49j508j648j76J031J356Q27j01m51k13N86r98j197j58Q42
622a423J511O8l06j25N94M90j008k164L73R82J813N80r72o51j15N6n74l00QJ462
642B99J715j50j352j391l93J104N68n40J1J62P91O76k43r58q83j04O06M40L52
$$ y = [-2081, 634, 2281, 1776, 613, 623, 285, -119, -1116, -1359, -84, 1591, 2203, 789, 146, 1234, 2263, 995, -1180, -1741, -24, 2035, 1629, 578, 607, 1485, 2501, 1365, -248, -828, -153, 1361, 1857, 501, -354, 725, 2219, 2666, 1251, -207, -343, -386, 218, -14, 678, 1321, 2148, 1658, 748, -133, -644, 52, 111, 24, -610, 355, 1335, 1333, 1297, 551, -321, -574, -1005, -1154, -565, -79, 128, 637, 602, -358, -1208, -1256, -677, 58, -634, -1595, -1387, -877, -204, 484, 346, -604, -838, -1564, -1852, -1785, -1162, -909, -413, -822, -494, -625, -319, -1059, -2133, -2190, -1544, -926, -1548, -648, -128, 734, 385, -1123, -2771, -2947, -1916, -560, 267, 166, -285, -498, 88, -910, -2107, -2265, -1423, 88, 156, -150, -275, 319, 809, -199, -2363, -1990, -1008, 805, 1385, 413, -238, -353, -297, -871, -1171, -1163, 299, 2014, 1864, 512, -879, -1272, -168, 400, -140, -129, 33, 824, 1500, 1257, 299, -584, -688, -82, 358, 710]
661G10Q52O75n17j633j033L9P96M33J27O91N56k64j025n37o31M37P36M81j23k55
681E15M69J41p31l41o32M37L30N84M09Q7k88j046p50m19N32J295R80Q4j277p62
701c83k64K58J39o32J47R08J640o7j261j414n15O30M18j87j64R57R36j8l52j608
721h32q15n29J036R68R14N84n28j158n70O6k58R0N43K28N92L99j45K31j217j179
741a580l68R32J280N31q11K29j06oj52r98QJ093n2R23l91m13j66n31l93P37J136
762I02k71j91r76K73J010o0q64o64M64Q93P40J68m76j071p29K80J013L91n32j17
782A83N84O04m46r65p91L34M84M74L82P82n55r67k91J9K68j16K05J74K29O77m7
803A221k39j087l21k03Q00Q99m62M05m64n15N3J71L01p81n17J029Q44j35o67n21
$$ y = [710, 1562, 2237, 1720, 87, -946, -907, -111, 322, 449, 1140, 1696, 1432, 407, -130, -761, -324, 412, 893, 770, 515, 984, 1125, 394, 53, -579, -142, 188, 772, 1181, 1268, 980, -66, -816, -1235, -703, 592, 1572, 1656, 379, -383, -647, -389, -250, -882, -735, 173, 1813, 1746, 485, -929, -1444, -814, -396, -583, -747, 210, 1146, 1128, 776, -832, -1647, -2176, -1140, -172, 742, 1326, 798, -360, -930, -864, -1122, -1032, -489, -261, 331, 730, 585, 816, -401, -1580, -1948, -1016, 264, 795, -16, 213, 107, 101, -51, -1049, -1041, 52, 0, 923, 532, 119, -47, -578, -971, -234, 902, 631, 440, -536, -263, 747, 687, -177, -841, -377, 516, 1256, 1424, 948, -123, -852, -572, 441, 832, 300, 183, 767, 1371, 925, -40, -831, -497, -13, 461, 843, 1625, 1070, 103, -188, -169, 99, -17, 188, 362, 591, 1268, 1221, 982, -105, -426, -629, 171, 1070, 608, 1013, 549, 34, 87, 258, 559, -222, -739, 290, 1134, 999, 332, -189]
823a89J12k2o5K97J68Om76P18j67o11m95O4P47j1k20m22R03o9o98o19N68L38l88
846e31P8M79P7J08m84l37r6K3N04J74n9n25K70K96k42m98j01O79j1m5r1J9l59
869f72k24P86O09p32p30k8J355L1j093J06O06O2n37J1O39m38k14j48M91K57k27
890i0J1l63L27o6K26o4K62n55r6N09k7q6L57m62j6k83P65O18o99o37l14J185K99
913H01n42m17L17L9l9M07J32o69o08L25J242r8p31k44N65j12r7m96m2Q61k54j04
935B36J07K28n5k99n00o0L13N66Q8k06o60J48O53lm51m59p9P27K59q1J34n05r02
958h01P29J44k6o39K50O91q9k08n45m0qJ34J99L14L84m18n35k9j94K66o2R1L1
981c61l2K28K51j46o94m3K05j4L81J88J74l40l98L91j02j92n72J71R95O33o57
$$ y = [-189, -77, -99, -164, 133, 301, 307, -169, 549, 382, -229, -724, -660, 87, 76, -144, -566, 337, 268, -430, -1049, -481, -143, -531, -453, 26, 103, 211, -273, -610, -706, -683, -179, -5, -64, -589, -319, -23, -265, -763, -864, -185, -196, -241, -332, -313, -672, -896, -110, 499, -233, -963, -991, 364, 395, -698, -592, 14, 76, -461, -450, 189, -249, -463, -611, -120, 137, -90, -79, -442, -115, -181, 45, -19, 243, -312, -408, 101, 74, -12, 345, -117, -133, -416, 349, 967, 268, -369, -683, 502, 801, 259, -158, 159, 198, 159, 566, 698, 29, -579, -254, 988, 890, 159, -85, 480, 368, 271, -225, -267, 594, 340, 236, 343, 571, 516, 217, -283, -343, -30, 536, 624, 418, -242, -94, 559, 556, 105, -354, -433, 294, 553, 472, 606, 101, -801, -72, 72, 46, -593, -343, 348, 259, 51, -494, -534, -542, -408, -209, 105, 489, 71, -464, -493, -687, -421, -483, -392, -361, -393, -165, 86, -60, -754, -797, -592, -606, -225, -37, 137, -203, -601, -210, -312, -504, -1076, -905, 90, 723, 66]
1002F6l50l96N6J50J15o3j71N18Q3K27k76l72m4J76m3K8M18r5O66o74n56p9L76
1025b40M40n1k40k27N36J57Np36k5J8Q03N2P5k23j91k1q8M5j15k0L79j57K05P8
1049D59O9m36n2l66M67L45K57j68j81j96J65l73M15L9q3n3M24Q4k14j90m19M7
1071D0K51K44Q9l44N1K53L46m01k05m72j43K77N83J82n33R7m32l8K70L73r0m45
1093d7M55j19j48j60J95l86r5N3M46J64l74L04m15L37l64K9n4j22O36Q1K9k80
1115A65j5k15r2k40P82j15j49l01j89M64k66J92j78j55j2o3M64j22j9o8l75K67
1137b40R9R6j47L30m45r3J80J48m68P8L24K18M3J69l35p4k63J21K90r0j28p6q
1160b71M82j10k53K3k20J17L61j79J83N5k67p3k04J03K0P22n63k48J59M59p7k3
$$ y = [66, -284, -680, -624, -474, -359, -422, -593, -75, 8, 235, -41, -413, -457, -281, -324, -296, 122, 27, 693, 19, -537, -616, -240, 200, 149, -91, -318, 218, 375, 380, -356, -381, -363, 440, 492, 567, 344, 153, 132, 44, 89, -26, -46, 333, 176, 381, 459, 528, 92, 40, -326, 141, 486, 743, 575, 394, 198, 363, -10, 405, 444, 361, 308, 732, 816, 602, 412, -7, 40, 291, 535, 624, 280, 331, 584, 930, 529, 324, -148, -291, -14, 569, 751, 218, 315, -117, -155, 115, 488, 398, -47, 408, 289, 141, -19, 176, -210, -305, -252, 194, 358, -16, 288, -127, 210, -154, -125, -179, -301, 335, 416, 445, 165, 150, -65, -157, -397, 385, 270, 121, -180, -369, 95, -171, 21, -157, -312, -324, -387, 77, -45, -64, -132, -507, -240, -141, -45, -192, 138, -307, -400, -220, -72, -540, -462, -138, 80, 123, 292, -43, -117, -380, -259, 31, -59, -187, -263, -271, 211, 101, -152, -129, -349, -232, 129, -50, 133, 188, -79, -152, -356, -253, -233, 489, -74, -322, -163, 296, 219, 196]
1182A96l73pK65q5J9m8J94Qj91K0k47K92J40L5o51L84K69j50l2l97K36J87N2j30
1206a4J3l37L99Lk39L91m46K14j27n5K79J07l48K74j61M3p9M23P4l48k40K15k32
1229a91J81K82l00j10M4J9L26k40q9j67J28J18%O1k48l4M89jJ6l02lk47L63J93
1253B88q9k56j61J57K21J04j53n73L93j48M13R1l82N22m29l3K1jJ96Q5l10J41
1275I7Pj6J86M3n97J76NM01j93j0j63J0P7JQ3j02K04l28L1L62j36j43K10n94L14
1300g5r3K05K89k19k36Q0K76k17L3q6j48P13k63l66K28j22l87M29P4k63Lm6J26
1323f5L40l97K14k03k18J3O75l59J67k99K03J43k95m3K49j66J96k32K66k35j07
1344a53N9p1J52K11l13M1j43P3j61J2M03J97k81J41k60K50M9l5j94j03L2J58K25
$$ y = [196, -177, -184, 81, -4, 15, -33, 161, 169, -22, -2, -249, 43, 183, 218, -433, -49, 220, 70, 38, -359, -123, 64, 116, -14, -1, -338, 61, 64, -175, 216, -230, -16, -143, -198, 81, 188, -160, 114, -47, -4, -83, 340, 414, 66, -174, 41, -191, -10, 272, -28, -138, -94, -75, 251, 11, -78, -245, -117, 1, 1, 62, -186, -220, 269, 268, 284, -18, -21, -268, 95, 288, 199, -57, -218, -61, 160, 264, 111, -462, -69, -217, 196, 287, -95, 427, -2, -35, -14, -15, 181, 266, -44, 97, 104, 88, 274, 317, -280, -104, -99, 302, 109, 99, -64, -54, 23, 24, 107, 5, 209, -119, -88, 274, 138, -5, 205, -389, -75, -168, 37, 326, 107, -129, -49, 227, 10, 43, -43, -191, 522, 259, -107, 121, -1, -388, 41, 115, -148, -145, -191, -65, 275, -122, 92, -111, -329, -316, 359, 0, 167, -132, 71, 214, -81, -124, 125, -41, 155, -77, 189, -46, -153, -94, -165, -13, 198, -115, -74, -217, -144, -305, -293, 110, 307, 26, 167, -93, 157, 206, 171, -23, -126, -94, 64, 289]
1367B89k4m43J21K17k27l51M65q9j48L80j3l58J89K4j07j71J98P1K20N3j79Qk28
1390a03J49j85K80p4k85M95q2k86L56k13j35J58j39j43M51j71J12k30L6K37j84
1411D4J6Q8m27K19q7J59n5O1J10j76K80j89j53J61M0l3j12q3J84L68r8o70J44
1434b09J57L3j80q7mL59Qj26p0J6j47L15k62Mj71P00m54K29o8j49P6j44p3L5M4
1459a68L32m83N76k87l89J38Q3j2K25k34J95K32l08M49n15J74j01l34N44n1O7
1480A33Q4m00o4M53n78M71j30o8J69m8O3K7j72J93j64K63l78K01q1o5K65j72J58
1503A60J49k13k1k27p4M36j47J72l73J41O8J2J01k6k02L25P5k06k10M65m02j40
1525a37J04J45o5K05m00m4O36n02J52J79j59N3jj47P3K66l39r9Q7R2r8J69J63
$$ y = [289, 265, -178, -57, 160, -67, -418, 47, -42, -190, 190, 177, -181, 8, 32, -75, -246, -48, 23, 243, 296, 117, 125, -103, 46, -139, 141, 67, -218, 277, 195, -91, 265, 52, -83, 75, -64, -207, 244, 73, 185, -45, -9, 228, 44, 60, 148, -279, -60, -147, 12, -43, 18, 128, -48, 232, 43, -110, 51, 91, 58, -54, -137, 47, 415, 317, -353, -209, -52, -19, -199, -286, -290, 69, 77, -49, -119, -103, -250, 65, -197, -193, -364, 336, -118, 111, 43, -106, -30, -174, -247, -212, -168, 164, -319, 257, -30, -419, -281, -198, -210, 15, -219, -24, 208, -100, 349, -166, 8, -93, -427, 117, 66, 133, 217, -183, -247, 206, -372, 99, -31, -99, 70, 22, 85, 112, -60, 133, -31, 232, -146, 55, -26, -91, 174, 2, 160, 309, 96, 75, -152, -226, 210, 63, 235, -138, 3, 71, 83, 184, 158, -44, 281, 356, 150, -60, 405, 3, -137, -33, 112, 47, 252, -148, -192, 444, -58, 94, 273, 114, 167, 166, 19, 92, 358, 19, -80, 7, 99, 1, 170, 333]
1548C33o50M97O4j30k01M37l95Qn2j04K81Q5J98m28j89k3K30j35j7KK78K4K64
1571C77m73N2j44K71K38m88K3K87l42J36J84p6q8k08M35r9r3J06k65rJ46j09K23
1594H4l4q4PO9NJ63l23o5k16L25N0P8Q9l73O9K68j19l5l91K10J26K1J98k59k40
1619c77N4J32J34m0J10j90J44J16j61P6K5j11j00J54j82J47Lj06k1j9kL10j45
1642d9m7r5Q8J17k32J58J05q1K66o04K94j42L91k20j24K84k06J07J07k67K89j07
1664C2j70K3J94K36k84k9J60r4j28R9J16l52J07K32Q9k9l12K04p8n3P1K00L1k31
1688C4n7j32L44m61M12m08K34K75o49K90j5M59k72J60l86j17K80J11N8l51kL21
1710A28l11L55l77L40k50L05j13k62J4OR7K47l62M05m93L34l09K73l08M91rl62
$$ y = [333, -317, 180, 244, 114, -87, 350, -45, -37, -89, -193, 88, 173, 371, -57, -246, -269, -39, -174, -191, -189, 89, 113, 377, -96, -44, -188, 83, 321, -167, -144, 143, -199, -63, 121, 45, -43, -251, 184, 85, -8, 98, -167, -176, -30, -139, 84, 50, -34, -27, 42, 47, 210, -113, -178, -394, -69, -19, 59, 148, -225, -156, 112, -7, -42, -433, -223, -97, -76, 122, -137, -377, -323, -191, -57, -97, 13, -177, -33, 83, -78, -2, 23, -88, -188, -34, -216, -69, -66, -172, -193, -212, -214, 96, -49, -96, -191, -103, 14, -218, -60, 45, -36, 230, -374, -80, -222, 169, -51, -175, 109, -97, 10, 117, -150, 139, 32, -138, -115, 79, 315, 31, 2, 162, 68, -60, 39, 155, -197, -90, 142, 231, 202, -110, 94, 16, -37, 34, 234, 265, 34, -23, -155, 189, -272, 140, -268, -34, 241, -408, -118, -133, 326, 54, 214, -172, -289, -9, 102, 160, -191, -193, 128, -183, 172, -205, 135, -115, 190, 77, -185, -171, -165, -68, 179, -183, 222, -271, 63, -246, 27, -281, 210, 201, -161]
1732a61J20j65J65j5k40M13J27n46L26k56j16K54j89L07l3oq0n9K47j46r7L4N2
1755f4j9r7K16j22j7q2L04k52K28p0J20n8k36M33j98j24N5j20k6K1K48k89J40
1778iR9L5R3j91J7J24j79k6l1l8J67kM7j98K41j0n0j03J41j32j4q2J20J94k95
1803h2K9M7J32m7Q0k86K24K94n36J60L53k42l57K35m55L93j00K15k2L15l62R4
1825H2Oj71L78k31k18K89j97J33L8k62J33j31K25N1j61j37L93J45j16k12l38N46
1847B45j78k76L52l03K60r2l45N52k58l3Kr1J69k38K02L2R5k1k5J16k46M2nO5
1871B1J6k08j00K40J10P7l24J79Q1k53k15K27l6O8l03M00O8J6J01j73n3k13K85
1894A1K44j86k14L02q2J69m84K23O0p7r3P9j01L13j36l05R0OJ72j22l0L40j18
$$ y = [-161, -41, -206, -41, -56, -296, 117, 244, -302, 24, -232, -348, -94, -283, 24, -9, -15, -95, -154, 93, -53, -150, -116, -64, -83, -180, 36, -86, -103, -185, 119, -133, 95, 25, 145, 87, -149, 284, 86, -38, 17, -103, -129, -108, 140, -149, -9, 90, 125, 218, 27, 44, 168, -11, -37, -68, -106, 61, 59, 106, -92, 149, 139, 89, -14, 127, -5, -19, -101, 19, 213, -82, -53, -6, 126, 79, 159, -127, 97, 391, -145, 15, 368, 126, -231, 4, -451, -58, -158, 57, 35, 350, -12, 82, 88, -83, 295, 64, -154, 135, -62, 71, 109, -153, -20, -151, 74, 125, -36, -173, 220, 365, 249, 37, -301, 245, 67, -209, 143, -160, 100, 8, -337, 215, -43, -76, -74, -165, 4, -234, -32, 0, 95, 74, 49, 165, -81, -39, -44, 21, 37, -171, -271, -31, 79, 156, -168, 11, 92, -161, -376, -149, -185, -117, -420, -20, 48, 64, 165, -8, -61, -274, 11, 255, 69, -145, 157, 75, 244, -240, -17, 43, -34, -127, -48, -149, 164, 28, -277, -187, -181, -9, -131, -161, 179, 61]
1917F1q0k0N1J21n2K84m69K32%l1k97M3K38K49n24L99l51nK88o0l53M92j02k39
1941a25J50r8L76l48J18l4M0j07n1L58l76n6J30j82L46l45K33m8K9j45K42k48
1963a41L40n46L59j65L17r4r5p6q3M11n7l60J12k99K70L26n08N48l13J9J63m5
1985H3j37n7J39l45L37Nj13J20o0J41j97J20k63M22K42l97N1l11O1J22j45l3j4
2008b29K76J54m19M85k11j46L1j83L18j21J10k5k7k7L1m7j59M94l13q0J21K42
2030B75l70K75j93J23n56K91J3R1oO4N9r1l25K28J64j69K80n5k07J1n6K57m0l84
2054c21M73o0m2k95L49J38l44K11k74O4L38k78K22j19j17K73O1o1l35j14J29L22
2076B20k16r3PJ03r1J59p9k39N39k83J11K26l84P1O4j47K97o2Q2K9j96o5R1k16
$$ y = [61, -19, -39, 12, 133, 81, 365, -104, 128, 128, 97, -200, -157, 81, 330, -194, 205, -146, -151, 137, 77, -276, 216, 114, -125, 25, -73, 303, -45, 73, 39, 79, -28, -79, 279, -97, -153, -23, -205, 141, -204, 29, -19, 10, -135, 107, -141, 199, -347, 12, -153, 164, 70, -25, -101, -184, 227, 170, -190, -78, -377, -107, 219, -289, 259, -54, -35, 128, 83, -54, -111, 28, -317, 20, 25, -88, 32, -28, 113, -84, 36, -227, 195, 437, 40, 91, -220, -159, -37, -182, -215, -229, 47, 201, -218, 267, 56, -90, -59, -242, 76, -45, 65, 40, 13, -14, 17, -30, -189, 305, -8, -88, 33, 275, -95, 180, -13, 110, -446, -155, -142, -51, -57, 7, 66, -25, -350, -122, 42, -127, 153, 98, -109, -98, -154, 103, 63, -321, 152, 92, 50, -245, 104, 242, -102, 109, -165, -101, 237, -41, 181, 62, -55, 218, 279, 218, -117, -231, -102, 220, 4, -89, -82, 21, -70, 89, 10, -229, 310, 27, 138, 364, -20, 51, 115, -32, 265, 203, 285, 314, 118, 53, 144, -72]
2100g2L41k03k13J72K11l0j93j95K00J60j43r0p7J46L31m18J02k5K47k9k25j7
2122b0L16j68j82N6m3K40j96J82j86J33m6k03L03o7j88J99k99P5K03q4O7O6m0
2145A18p3k46j69L08J16j34L20j82J7J8o3L6k3P6n9M0j61j8j16N11l64kK19j35
2169C4n2m56M85n6l3j48M14l52K73q1k5J65l02K12l1mk57J52J57k46o8j03K14
2192a08J36R3J50k96K64j71L42l11p0k51J35K64k66J78l02J09L35j65j00L4J0
2213A0M13l58K71l53j20L09J7nk37k8Q1o4k5K18j08j82J47j2J31j42o6K12K9q9
2237D9k70J47K69n28K19J19J90k60n5L76j35On2j92J59n4m2Q5k52M06r4n13N40
2260A18K4j87lj04o0n5K52j0P5k65L10l26Q7k7N07j84j53J63r4l16K68j40J5O8
$$ y = [-72, 269, 66, -147, 25, 236, 206, 13, -182, 18, 178, 35, -55, -132, 14, 345, -73, 29, 4, 251, 222, -3, -20, 296, 128, -54, 2, -41, 199, 3, 185, -1, 132, 86, -117, 186, 119, -69, 130, -169, -94, 109, 25, 92, 158, 118, 45, -201, -370, -62, 54, -80, 240, 58, 75, 93, 30, 66, 43, 119, 60, 100, -61, -79, -195, 316, -48, -50, 169, 34, -18, -474, 11, -45, -78, -226, 188, -164, 109, 28, 3, 168, -134, 78, 47, 43, -214, -62, 95, -151, -219, -322, -108, 28, 121, 271, -25, 239, 68, 410, 99, 29, -222, -87, 177, -89, 89, -213, -104, 231, 66, -34, 0, 10, 423, 65, 336, -17, -137, 172, 189, 184, -53, -81, 0, -64, -89, 129, 21, -161, -14, -26, 105, -37, -103, 109, 138, 49, -221, -74, 195, -333, -114, 5, 195, -65, -120, 256, 121, 127, 75, -117, 42, -12, -54, 31, -221, 185, 91, -422, 118, 142, -45, -48, -152, -212, -267, -15, -25, 50, -215, 95, -231, -144, -171, 336, 152, -1, 162, 68, -248, 20, -120, -105, -37]
2284c7J22M6p3l35L29j53J76k9j64K21Kl18L4J67Q6l14J77L9J67Ol38K32J5l3
2308B5L26l18q0M50k33j79J01j42K06j05r3p8Q3j09L98p6k08m6K69m4j68J88l35
2331a68j83L42J09j22J04K04j58j24k12K69j59M3J15j54j63L87k49K16l5J12p48
2352e74L08R4L58k8l16K88n5j10M2p5j12N25m40oM0QK3O3n2K26k94O1K18P8j24
2377A46j27M8J56k47J03k22J71j22J12L0nm4R0qj94L55m9k83j53M28k80L05l67
2400a57L52r5m5J68p2k23n2J80L7j31m5J82j98J10r5J91j91N5m8K90j62m8j76
2423a73J3KJ54j01l6J2R0L0j23j55K51J42J91l23j29K83k85N7J64J34l08M10k17
2446H3k23J72o3j58J70p8J06J31r3J7J13k09L9p5M5N7j64L56m26J36pKj85K57
$$ y = [-37, 85, 131, 58, -277, 52, -101, 75, 46, -118, 103, 105, -213, -179, -12, 74, -240, -63, -24, 143, 149, -189, 43, 58, 25, 351, 33, -47, 403, 170, -9, 92, -50, 156, 51, -42, -120, -37, -146, 252, 176, -32, -78, 191, 147, -21, 167, -168, -351, -9, 100, -22, 82, 286, 128, 4, -208, 61, -98, -55, 60, -94, -257, 130, -119, 97, 62, 174, -574, -266, -172, 186, 158, -158, 130, 75, -35, 7, -68, -180, 345, -95, -101, -61, -53, -30, 33, -19, 207, -87, -26, 192, 270, 146, 19, 67, 223, -24, 79, -143, 28, -94, 18, 48, 43, -1, 89, 81, -113, 242, 193, -90, -243, 185, -95, 210, -157, 195, 100, 55, 223, 151, -72, -124, 56, 93, -38, -83, 99, -99, 11, -84, 107, -84, -29, -77, 213, 51, 3, -173, -160, -158, -4, -105, -141, -129, -39, -9, -132, -287, -36, 106, 297, -26, -155, 128, -157, -100, 64, 198, -110, 300, 83, -140, 32, -31, -189, -19, -97, 9, 140, 47, 64, 177, -32, 7, -68, -23, 34, -130, 226, -200, -64, -71, -69, -254, 3]
2470CL54m79K12j83J65n4N9j41P5J67j09J03m9M1q9k65K58l08l5K32l2J04j19
2493i0K35o6P4Lk27J68j75k2K81k36J69j03O8k11j03J85p6qL56k16K0j72J52K32
2517B38j11k22Kl52N06K92l17J35j41j06L05l60QL37j49l72K37p0J36j81J99k13
2539a99J19o1K50l2N5O3l19n7K41k12J18MJ16m66Q4J20J80O8J43q7p0J86m76L38
2563A06p8K7l41J69J95J03m98J43K02j56K47n8J50k56K01k04L09m73J08J01j36
2584a39k27M43j92P5j35JK16j49N3k3l2L23j94J53j96j68P4J23l3j3L54n52M35
2607A97p4k59L16j56j94J89j34J48K81m11J17K31k08k03Q1%q0l0K89l21J80k66
2629c07K26l6J40K6k85L34k41J29M8j2j09l1R7K52j10k94L01l79J10K11K1j04
$$ y = [3, 357, -122, 90, -93, 72, 18, 77, -64, 11, 178, 69, 172, 123, 164, 75, -190, 68, -240, -275, -43, -75, 29, -90, 145, 79, 153, 156, -71, 97, -78, -100, 181, -55, 114, 11, 79, -132, -235, -50, -126, -134, 222, 6, 26, -146, 6, 238, 127, -95, -93, -445, 61, 353, 36, 171, 30, -76, 229, -131, -123, 214, 65, -307, -70, -140, -4, -185, 14, -199, -80, -141, 109, 77, 132, 195, -124, -181, 60, -152, -34, -30, 86, -380, -296, -176, 4, 72, 215, 128, 58, 244, -232, 106, 28, 55, -286, -117, 78, 181, -317, -174, 28, -128, 119, 61, 211, -45, 156, -48, 261, -212, -104, -3, -139, -366, 77, -115, -40, -175, -174, 42, -107, -54, -77, -109, 214, 20, 173, -23, -191, -117, 6, -27, -40, 314, -238, 197, 123, -136, 180, 24, -170, 19, -115, 33, 314, -97, 20, 251, 43, -160, -79, -79, -159, -189, 100, -221, -41, -307, -81, -117, 23, 49, -236, 98, -143, -14, 34, 22, -87, -118, -21, 231, 121, -173, 128, -251, -141, 70, 91, -13]
2651a3K14k11j81N3M75n04M6K3o3m1RK82k35j22L5K39K08j5k72J33J21j63N2j67
2675i7J60j60j32K3J14K00m45N03Q5m28K24j82m8K45K7j88J58O9k23J05M4J03
2697A57j89R2K6j29K38l13Q5P7k74K35l23M61j81rj31J51r4K41l26J50J06j71
2719a21K55k79N48k92l05k4J69j31K10n2j2j05M9lo0M97j29l24K32j92j48J18
2741i9l1J72O8n52N15J6p7J1L5J42j51k8R8N2j58p3J58k35K24j27J60j69j02N8
2765i3J08j67K77l4J02m23j13O19l93J26O0r9K59k47Rl2J43k45J22lJ60M15o56
2788a05K71m95K75J16k37p6Q1J11J01nK50l00j20J79J6L48o19K41M3J40m39J48
2810g6J56j55J83J45l64L61r4j34j44J09j83o8O6J27J02P8K46n64L62j15J92l83
$$ y = [-13, 201, -10, -191, -138, 337, -167, -121, -98, -161, -202, -193, 89, -146, -268, -233, 6, 214, 199, -73, 60, 181, 18, 70, -97, 63, -97, -229, -206, -92, 108, -337, 166, 251, -177, 47, -135, -183, 62, 89, -99, 59, 128, -95, 10, 54, 157, -32, 60, 86, -43, 195, -118, -33, 44, -230, 5, -318, 143, -38, -47, -178, -27, -121, 120, -206, -56, 50, -121, 134, -145, 403, 111, -194, -218, -49, -180, 30, -22, -34, -139, -90, -93, -153, 344, 215, -109, 123, -69, -217, -99, -130, 42, 110, -442, 73, 89, 12, 23, 58, 200, 49, 21, 119, 171, 13, -60, 98, -137, 87, -40, 120, -49, -151, -93, 15, -152, 125, 91, 193, -230, -343, 276, -117, 9, 69, -30, 229, -18, -9, -41, 102, -143, -21, -24, 136, 551, -105, 166, -329, -54, 62, -175, -251, -170, -59, 42, 37, 287, -13, -133, 46, 62, 410, -209, 32, 75, 215, -224, -76, 80, -75, 108, 253, -111, 250, 156, 22, -122, -13, -196, -264, -198, -71, 31, 109, 355, -209, 153, 38, 230, -153]
2832a53K31r8j27j1J62k08R8K97m0l40J80N5N7k12J66J22Jk92L55l20J44j37l2
2855a02O7l34L97K24k35j33J59pm6J47p5j46L04m51K90j93N3j22o9K42pJ01k50
2878a86o8M46l87O55o17N6O2oJ31j17j94K89K5j12k5l05J55K98k48J93L6k41L08
2901A48j03k1k8j26K87j99J97j73O7j30K05l02O0KK12k42j7K90k56MJ47k07j05
2924b90N05l47K49j85j60L0L22k54o3M45J76l95P3l9n3J62o3%M4j3n4o8n2J24
2948I4L18j82j39j75K44j86p7l0J13j51j87K16oJ59P0K42j57l15K15j64J85k02
2970a15K41J3j80K58k04j58L33k04L42j99o9l4p1L4J66m9k79L09k27L15m05K51
2992F8j91K79j50P4j09jJ29k9j41K36k35o3r6oJ60J94j89j83K16L18J3m04Nm2
$$ y = [-153, 78, -20, -147, -158, 4, -204, -106, 191, 151, -189, -9, 46, 103, -109, 57, 179, 180, -112, 243, -77, 67, -70, -102, -35, -369, 28, 252, 17, -116, 43, 36, -10, 137, 62, -84, 220, -231, 59, -134, -81, -203, -272, -30, -37, 64, -186, -254, 192, -195, 460, -157, -101, -39, -45, 86, -31, -225, 64, 89, -23, -48, -353, -198, 100, -148, 45, 81, -160, 148, 45, 24, -4, -130, 157, -42, 155, -18, 49, -81, 124, -178, -118, -116, 96, -146, -163, 127, -129, -125, 22, -185, -290, 215, -132, 117, -68, -228, -198, 124, -130, -193, 252, 428, 33, 106, 67, 14, 176, 113, 113, 157, 144, 90, 22, -30, 94, 412, 230, 91, -84, 160, -26, -103, -133, -20, -171, -358, -142, -148, 11, 81, 323, 166, -149, 66, -98, 87, -115, 126, 139, -41, 217, 13, -145, 188, -16, 326, 127, 58, 24, -47, -13, 153, 104, -175, 134, -93, 222, -183, 68, -123, 156, 6, 80, -29, -30, 99, 70, -71, 165, -70, -133, -229, -235, -75, 119, -70, -253, -37, 281, 294, -110, -105, -147]
3016a47l3J74j40J5J72j66J41N2l58J57Q4rl8J5J80j04J8L6K00k67K34j20R8P6
3040B70l60J42K0r3J64j67j14j2O1K8N7J6J32l89L20m5j8q3J04J91m98J87O7J41
3064A21K97m62J86l27M89l29Lo1J06k0pQ8M0k31K50p3k28L83k71M04k37L85l10
3087A96k43O0J01k97P2k93M09J31j73L60k27l05K18R8k03n3j54M00pk4r5J99m21
3110b51J93O6J2K2L1j34K26j36J13k38K45m0q3K01l10J2l1k2MM05l73K00k26N6
3134e8j4J37j95J44Q7j67K4K37k14k04N75j21k67R7Nk5L9j5j56J47J25k63K30
3157A48j42j03l51L14L11l67K22j60M3M4K31k09R7J64j61l4r1K1j34N8P7k57J73
3180a06oN6k08q7J93K89k72r2K21L3j21n3r1K63p9J80m19J37L49q6j68j38K43
$$ y = [-147, -180, -6, -146, -131, 41, -125, 16, 68, -290, -133, -49, -58, -96, -81, 99, -5, 13, 49, 249, -18, 216, 96, 194, 270, -90, 52, 72, -21, 143, -24, -138, -150, -89, -61, -4, 12, 144, -245, 75, 30, 12, -71, 33, 224, -274, -87, -20, 121, 418, -44, 142, -185, 304, -25, -22, -83, 23, 3, -4, 84, 124, -107, 143, 70, -158, 225, -46, 358, 121, 506, 196, -47, 13, 114, -183, -111, -404, 5, 136, -37, 323, 96, -209, 9, 107, -96, -149, -303, 97, 90, 66, -29, 170, -251, -58, 8, 20, 42, 73, -61, 165, 29, 142, -96, 149, 109, 26, 227, -83, -71, -102, -124, -120, 285, -88, 112, -114, -58, -72, 65, -130, 14, 101, -66, -42, 195, -19, -223, 352, 231, -36, 61, 66, 41, 80, 65, -91, 56, 181, -82, 148, 6, -97, -448, -134, 177, -190, 32, -128, -85, -41, 190, -19, 78, 242, 81, 47, -44, -23, -157, -99, -22, -279, -106, -112, -56, -264, -351, -158, 131, -141, -233, -12, 21, -100, -153, -244, 19, -60, 120, -299, -162, 187, 101, -67, -205, 38]
3203C8J16l36J69j24L19k35j79K02j44J85o0Kpj34K57j93K67j03j6k5L1j15N1
3226c4Q4oo5L29j42n1Q5k20L52l50K32m88J46K35k90L43j54Or1J37j94J68M4M3
3250A19k46L02l5j61J22R9r8j8k28n9M07k30p4K46j78O5J7R5l15jK81n6k81Q9
3274a38J37k51J70R6k53M27k98o3J90M4p4K9m09J19J14N70k9m47o0K01j17j99
3296b41L37k99K72O0m9ppl0J56J77o66L00O9j63k35J52L45m26r1L46r0J8O3p6
3320h5J72j14j71k8J05J17j23K76l18J11Q0k84L08Oj87J56j54O4K21J70n79J85
3342g2K23k84J25j55K01j59M4l2p6K17j34J48K5j6j10j33L60n13J50J92L1p6j31
3365a75L87m98J26R7Q3K12m89K29K6P1j67K09j62Ml4q4j03K21J80j47J52O2j83
$$ y = [38, 154, -182, -13, -137, 182, -53, -232, -30, -174, 11, -49, -47, -54, -188, 69, -124, 143, 40, 24, -1, 30, -85, -34, 50, 44, -21, 308, 166, 115, 200, -20, 332, -18, 214, -274, -128, 107, -183, 160, 6, 12, -79, 58, -136, 32, 76, 119, -127, 175, 140, -21, 101, 200, 102, 84, -144, -203, 204, -26, -100, 146, -32, 33, 50, 145, -170, -171, 110, 54, -227, -138, -1, -252, -82, 14, -239, 188, -110, -173, 17, 61, -13, 16, -393, -274, -160, 410, 381, -66, -126, 75, -42, -241, 96, -203, 69, 129, 80, 73, 66, 36, 192, 369, -297, 3, 72, -91, -326, -174, 171, -255, -346, 0, -90, -72, -9, -85, 87, -27, -198, -226, -121, -4, -127, 149, -169, -58, 22, -262, 46, 52, -135, 21, -133, -69, 152, 322, -257, -72, 151, -133, -8, -163, 38, -121, -77, -109, -185, 32, -102, 46, 71, 55, -55, -188, 172, -341, -191, 1, 32, -44, -175, 212, -286, -160, -63, 20, 232, -257, -28, -2, 69, -98, 111, -51, -47, -81, -165, -268, -47, 133, -14, 138, 200, 17]
3388A7lN6M2n9k1k8J08J14%j06k23P7j68K64K9p6M0j37n3Q6J01j62n0K19k52M2
3414a43J26P1O4k46J85l5R4O5j66j7j79J88K14l10r0J99J5J53j16L7J58r8l37
3437a68j1J69p5J83k10K50k95M74q03O62j75j6j7K74r1l08N6K79p2R6l00K37j43
3460dm3j43K02k33L1K7l5K13J0m2k24K82L4J41Lp3m75L10J46n5l20L83l05J09
3484f1Q4O8N7R1l26M5j6K15k05J87j55j56K50rl27j0J68J3J60J89k92k73J61K67
3508A25l15K87J04k32k35N81j80m01N07j10m5m9mP2l58M54j63k39k1J84O7J08
3530A37k25P7p0K2j30O6K83j31L5J4L2j17P6j45J80j24n2K13j7k19O2j37L03j14
3554A9Q7j05L5O8J86l69J6J96o8J34j69m0K60j40oJ40j02m79J52J96r7p7J65l38
$$ y = [17, 14, 70, 112, 53, 32, 4, 112, 226, 226, 120, -103, -26, -194, 70, 99, 23, 63, -74, -127, -41, 60, -102, -152, 67, -185, -143, -17, 54, 118, -128, 57, 22, 116, 181, 15, -2, -181, 7, 221, -89, -179, 20, 35, 188, 72, 109, 267, 169, -168, -179, -10, -85, 98, -112, 138, -157, 317, -486, 176, 1, -15, -32, 242, 151, -157, -101, 178, 106, 202, -98, 139, -4, -47, -190, 12, -221, -190, -163, -198, 15, 25, -17, -241, 41, 75, 216, 219, 146, -329, -19, 127, 72, -248, 135, -170, -61, 23, 91, 148, 239, -87, -42, -58, 157, -48, 139, -16, -172, 78, 69, -258, -268, -100, -87, 73, 262, -30, -303, -142, 125, -190, 97, 201, -31, -266, 315, 135, -266, 241, 131, 86, 37, 33, 105, -253, 201, 38, -201, -222, -38, 29, 137, -88, -11, -81, -59, -189, -123, 160, 29, 64, 78, 110, -7, 69, -76, 104, -20, -72, 141, 124, -95, -33, -170, 133, 19, 106, 1, 36, 104, 290, -79, -63, 133, 65, 199, 30, -10, 250, 110, 104, 244, 142, -337, -185, 11, -86, -163, 2, -336]
3578c36L08L47l18p4k05K95k36L19l19K34j29L85q6j89j02J00j64R1J53mM6j72
3600e6J05J44k70l5K80m4j2j23J0L2R3r8j37J06j98K96p9J89k28j16J43j30L41
3623B13l15N9K68l79j08N1N8J89j58k01J16K50l13K77j05K44j60j7j32Q0J4K28
3645A59O8k50J27J03j0j64K12j90P8n9P9P0n12J1K66k04N59l50N6l7J13j73J84
3668A36P6j95J13P6j38o8r9J24o9L2k9K50L7k94J09j28J17k46M1q5M12m24J65
3691h7M3J49K53l40L1k20j44L70P0k70j28L44K6j57M4J36j46R9j45l5J34l88K52
3714a09L72k84k24KJ06r3L69L5l79J09m73L88K76j84K07j37K72q8j63J86l62J78
3736Dq0L9k29M63j85j86P9j63J54R3J09j59k07L99m4n82L88M34l52J6J03m3k11
$$ y = [-336, -28, 319, 1, -73, -278, 17, -219, 100, -219, 15, -114, 271, 185, -4, -106, -6, -170, -79, 74, 70, 116, -56, 49, 193, -77, -112, 168, 124, 112, -11, -1, 31, 124, 26, -111, -5, -203, 93, 14, 203, -25, -141, 2, -128, 213, -102, -43, 225, -154, -262, -211, -153, 36, -122, -323, -207, 43, -270, 7, -98, 146, -14, -31, -163, -83, -69, 159, 227, -23, 104, 207, 197, 33, 245, 55, 133, 74, 153, 223, -289, -278, -12, -216, 343, -7, 49, 12, 125, -48, 136, 212, 17, 130, 206, 68, 0, -99, 25, -44, -12, -41, 209, 246, -48, 61, -67, 50, -196, -155, -240, 172, -252, -87, -44, 105, 358, 18, 49, -171, -315, 55, 125, -145, -273, 71, 97, -60, -16, 120, -26, 73, -72, -107, 27, -361, -109, 263, -21, -245, -243, -137, -230, 139, 174, -205, -96, -569, -181, 95, -89, 118, -19, 253, 165, 2, 188, -174, 4, -76, -37, -266, 197, 12, -174, -95, -258, -104, -11, 98, -61, -268, 131, 87, -495, -107, 327, -25, -9, 94, 51, -160]
3759a60J14L7O0L05l57M08n26l8J39O8p6L00m02J71n16L07K89o1q1J15m8L7j01
3782a6J35RJ97m13o8M21r5l31L04j83j40J08j14L17k58n0L05k77O3P0J61j71J07
3805H1J05j70j8L5j29K89l63K12L3j83K05Lj74L86k91M4l87L53j29J18J26k81
3827a35L97l65o3N7k07M21j30o6J84l44P6J24k0j56J32J21J0k6j09L01l64o6Q6
3850a42q1K63o5O4j25P9J25m28M40J18j00Kn1j43M3k3N2K27j98p3M3mj88N4J58
3875D7j35J71m2o9K84m29K86l63L02j5J23r3j17K95j78j7Ok80N6L12j56N2K4j14
3899e0J04j99J26p7m9L44mk36J41R7j93j8J47L7M4m34K90p1QL0J62j65N6j68K23
3924A45j22K02l47L6L61m74L29J2j93L2L3j15J48K78k61Q6j06K49l25J41o6j0
$$ y = [-160, -46, -9, 51, 356, -1, 407, -119, -157, -18, 50, -26, 274, -128, 43, -473, -166, 123, 62, -19, 96, 48, 85, -16, 119, 128, 325, -88, -156, 265, 170, -161, 143, -40, -180, -72, -186, 131, -127, -177, 128, -149, -86, -16, 145, -26, 81, 186, 16, -2, 33, -96, 193, -170, 42, 75, -108, 97, 100, -74, 312, 21, 65, -322, 31, -98, 20, 146, -135, 262, -103, -166, -109, -316, 105, -25, -91, 93, -251, -175, -51, -71, -227, -95, 26, 36, 10, -99, 202, -162, -228, -142, -223, 40, -25, 39, -86, -7, 118, -310, 130, 248, 148, 150, 99, -44, -1, -24, 28, 255, 57, -16, 27, 23, -165, -111, 47, -88, 83, 41, -28, 256, -173, 113, -250, 52, 37, 160, 67, -50, 245, 67, 50, 56, -224, -168, 144, -12, 40, 64, -50, 54, -145, -19, -96, -145, 199, 195, -41, 100, 197, 4, -14, 133, 170, 214, -220, 70, -1, 7, 37, 199, 34, 90, -78, 145, 23, 225, -122, -86, 275, -199, 130, 142, -51, -19, 14, -101, 47, 325, 64, 150, 44, 293, -32, 109, 43, 33]
3946C3O7k16k66N51k19J82q4o2%q8K7p6oL4J03l27L50q2P6k1N9j33J53l13L34
3971G6r7NJ68k06j48l7L42k87J25J03l25L31j49R2J22l07N01l80J30q1m56M06
3993g2O1j90K6J13n2K57k17Q8j70J6L8P1k0J7K99j61k12P1k18L88k18j3P8k66
4017b86P25m65o1J86k61J75J23k74k36K60K77o2N0J27l30O6K5k73j11M86j44J16
4039A13r6l8K95j28j10j7J54n6n26L61k16K76J49k29O8M2K09j92Q7j44J27k44
4061a15k77L38K17k63q2K04K50k19k34K31k49L85k91K75k03o5J97o4l22K94OM6
$$ y = [33, 100, -116, -382, 169, -50, 132, 48, -14, -14, -102, -75, -151, -157, -123, -20, -347, 3, -79, -3, -24, 35, -98, 55, -258, 76, -21, -16, 152, -54, -202, -239, 103, -184, -59, 44, -281, 50, -99, -7, 115, -192, 309, -71, 59, -22, -478, -72, -11, -201, -175, -62, -114, 143, -74, 14, -156, -140, -102, -31, -51, -34, 265, 104, -108, -37, -255, 133, -85, -98, -20, -286, 439, -26, -87, 99, -162, 13, 136, -138, -374, -114, 163, 101, 151, 278, -52, 14, 39, -234, -345, 141, -3, 113, 17, -21, 274, 146, 36, 19, 173, 117, -409, -48, -264, 12, 161, -68, 0, 42, 251, 59, 146, 2, 129, -115, -392, -54, 163, -100, -182, 22, 272, 53, -181, 50, -199, 186, -105, 170, -33, -98, 99, 35, -287, 7, 13, 59]
$$ [...]
8191a9
##END NTUPLES=NMR FID
##END=
