##TITLE=1H_SL62-SePh(-1)
 CDCl3, 8 sc, 
 14.3.2019
##JCAMPDX= 6.0         $$ Bruker NMR JCAMP-DX V2.0
##DATA TYPE= NMR FID
##DATA CLASS= NTUPLES
##ORIGIN= UXNMR, Bruker Analytische Messtechnik GmbH
##OWNER= root
$$ XWIN-NMR		Version 3.5
$$ Thu Mar 14 16:45:00 2019 Russian Standard Time (UT+4h)  she@DPX200
##.OBSERVE FREQUENCY= 200.1315
##.OBSERVE NUCLEUS= ^1H
##.DELAY= (6, 6)
##.ACQUISITION MODE= SIMULTANEOUS
##.ACQUISITION SCHEME= undefined
##.AVERAGES= 8
##.DIGITISER RES= 18
##SPECTROMETER/DATA SYSTEM= spect
##.PULSE SEQUENCE= zg30
##.SOLVENT NAME= CDCl3
##.SHIFT REFERENCE= (INTERNAL, CDCl3, 0, 15.7039)
##AUDIT TRAIL= $$ (NUMBER, WHEN, WHO, WHERE, WHAT)
$$ ##TITLE= Audit trail, XWIN-NMR		Version 3.5
$$ ##JCAMPDX= 5.01
$$ ##ORIGIN= Bruker BioSpin GmbH
$$ ##OWNER= she
$$ F:/spectra/data/she/nmr/H-F/1/audita.txt
$$ ##AUDIT TRAIL=  $$ (NUMBER, WHEN, WHO, WHERE, WHAT)
(   1,<2019-03-14 16:44:03.71 +0400>,<she>,<DPX200>,
      <created by zg, POWCHK disabled, PULCHK disabled
       configuration hash MD5:
       00 E9 B6 7A A2 85 ED C7 34 08 36 98 17 FE 4E 26
       data hash MD5: 16K
       E4 16 54 A8 6A 3F 56 CE 23 81 E7 40 6F FA 75 5A>)
$$ ##END=
$$ 
$$ hash MD5
$$ E8 81 0D AA 99 72 12 C1 F0 D0 B7 73 D7 A4 07 46
##$RELAX= 
##$RELAX= 
##$RELAX= 
##$RELAX= 
##$RELAX= 
##$RELAX= 
$$ Bruker specific parameters
$$ --------------------------
##$DU= <F:/spectra>
##$EXPNO= 1
##$NAME= <H-F>
##$PROCNO= 1
##$TYPE= <nmr>
##$USER= <she>
##$AMP= (0..31)
100 100 100 100 100 100 100 100 100 100 100 100 100 100 100 100 100 100 
100 100 100 100 100 100 100 100 100 100 100 100 100 100 
##$AQSEQ= 0
##$AQ_mod= 1
##$AUNM= <au_zg>
##$AUTOPOS= <>
##$BF1= 200.13
##$BF2= 200.13
##$BF3= 200.13
##$BF4= 200.13
##$BF5= 200.13
##$BF6= 200.13
##$BF7= 200.13
##$BF8= 200.13
##$BYTORDA= 1
##$CFDGTYP= 0
##$CFRGTYP= 5
##$CHEMSTR= <none>
##$CNST= (0..31)
1 1 145 1 1 1 1 1 1 1 1 1 1 1 1 1 1 1 1 1 1 1 1 1 1 1 1 1 1 1 1 1 
##$CPDPRG= <>
##$CPDPRG1= <>
##$CPDPRG2= <>
##$CPDPRG3= <>
##$CPDPRG4= <mlev>
##$CPDPRG5= <mlev>
##$CPDPRG6= <mlev>
##$CPDPRG7= <mlev>
##$CPDPRG8= <mlev>
##$CPDPRGB= <>
##$CPDPRGT= <>
##$D= (0..31)
0 1.2 0 0 0 0 0 0 0 0 0 0.03 0 0 0 0 0 0 0 0 0 0 0 0 0 0 0 0 0 0 0 0 
##$DATE= 1552567443
##$DBL= (0..7)
120 120 120 120 120 120 120 120 
##$DBP= (0..7)
150 150 150 150 150 150 150 150 
##$DBP07= 0
##$DBPNAM0= <>
##$DBPNAM1= <>
##$DBPNAM2= <>
##$DBPNAM3= <>
##$DBPNAM4= <>
##$DBPNAM5= <>
##$DBPNAM6= <>
##$DBPNAM7= <>
##$DBPOAL= (0..7)
0.5 0.5 0.5 0.5 0.5 0.5 0.5 0.5 
##$DBPOFFS= (0..7)
0 0 0 0 0 0 0 0 
##$DE= 6
##$DECBNUC= <off>
##$DECIM= 24
##$DECNUC= <off>
##$DECSTAT= 4
##$DIGMOD= 1
##$DIGTYP= 9
##$DL= (0..7)
0 120 120 120 120 120 120 120 
##$DP= (0..7)
150 150 150 150 150 150 150 150 
##$DP07= 0
##$DPNAME0= <>
##$DPNAME1= <>
##$DPNAME2= <>
##$DPNAME3= <>
##$DPNAME4= <>
##$DPNAME5= <>
##$DPNAME6= <>
##$DPNAME7= <>
##$DPOAL= (0..7)
0.5 0.5 0.5 0.5 0.5 0.5 0.5 0.5 
##$DPOFFS= (0..7)
0 0 0 0 0 0 0 0 
##$DQDMODE= 0
##$DR= 18
##$DS= 0
##$DSLIST= <SSSSSSSSSSSSSSS>
##$DSPFIRM= 0
$$ [...]
##$SUBNAM2= <"">
##$SUBNAM3= <"">
##$SUBNAM4= <"">
##$SUBNAM5= <"">
##$SUBNAM6= <"">
##$SUBNAM7= <"">
##$SUBNAM8= <"">
##$SUBNAM9= <"">
##$SW= 24.9337058887773
##$SWIBOX= (0..15)
0 0 2 0 0 0 0 0 0 0 0 0 0 0 0 0 
##$SW_h= 4990.01996007984
##$TD= 16384
##$TD0= 1
##$TE= 0
##$TE2= 300
##$TE3= 300
##$TEG= 300
##$TL= (0..7)
0 120 120 120 120 120 120 120 
##$TP= (0..7)
150 150 150 150 150 150 150 150 
##$TP07= 0
##$TPNAME0= <>
##$TPNAME1= <>
##$TPNAME2= <>
##$TPNAME3= <>
##$TPNAME4= <>
##$TPNAME5= <>
##$TPNAME6= <>
##$TPNAME7= <>
##$TPOAL= (0..7)
0.5 0.5 0.5 0.5 0.5 0.5 0.5 0.5 
##$TPOFFS= (0..7)
0 0 0 0 0 0 0 0 
##$TUNHIN= 0
##$TUNHOUT= 0
##$TUNXOUT= 0
##$USERA1= <user>
##$USERA2= <user>
##$USERA3= <user>
##$USERA4= <user>
##$USERA5= <user>
##$V9= 5
##$VALIST= <valist>
##$VCLIST= <CCCCCCCCCCCCCCC>
##$VD= 0
##$VDLIST= <DDDDDDDDDDDDDDD>
##$VPLIST= <PPPPPPPPPPPPPPP>
##$VTLIST= <TTTTTTTTTTTTTTT>
##$WBST= 1024
##$WBSW= 4
##$XGAIN= (0..3)
0 0 0 0 
##$XL= 0
##$YL= 0
##$YMAX_a= 42713
##$YMIN_a= -87160
##$ZGOPTNS= <>
##$ZL1= 120
##$ZL2= 120
##$ZL3= 120
##$ZL4= 120
##$ABSF1= 10
##$ABSF2= 0
##$ABSG= 5
##$ABSL= 3
##$ALPHA= 0
##$AQORDER= 0
##$ASSFAC= 0
##$ASSFACI= 0
##$ASSFACX= 0
##$ASSWID= 0
##$AUNMP= <proc_1d>
##$AZFE= 0.1
##$AZFW= 0.1
##$BCFW= 1
##$BC_mod= 2
##$BYTORDP= 1
##$COROFFS= 0
##$CY= 11.3945322036743
##$DATMOD= 1
##$DC= 2
##$DFILT= <>
##$DTYPP= 0
##$F1P= 18.9103706918063
##$F2P= -1.10871071338519
##$FCOR= 0.5
##$FTSIZE= 0
##$FT_mod= 4
##$GAMMA= 1
##$GB= 0.15
##$INTBC= 1
##$INTSCL= 1
##$ISEN= 128
##$LB= 0.24
##$LEV0= 0
##$LPBIN= 0
##$MAXI= 10000
##$MC2= 0
##$MEAN= 0
##$ME_mod= 0
##$MI= 1.114404
##$NCOEF= 0
##$NC_proc= 0
##$NLEV= 6
##$NOISF1= 3.799351
##$NOISF2= 2.8
##$NSP= 1
##$NTH_PI= 0
##$NZP= 0
##$OFFSET= 15.70392
##$PC= 1
##$PHC0= -9230.776
##$PHC1= 31.20026
##$PH_mod= 1
##$PKNL= yes
##$PPARMOD= 0
##$PSCAL= 0
##$PSIGN= 0
##$REVERSE= no
##$SF= 200.130013532006
##$SI= 16384
##$SIGF1= 3
##$SIGF2= 2
##$SINO= 400
##$SIOLD= 16384
##$SREGLST= <1H.CDCl3>
##$SSB= 0
##$STSI= 0
##$STSR= 0
##$SW_p= 3612.71676300578
##$SYMM= 0
##$S_DEV= 0
##$TDeff= 0
##$TDoff= 0
##$TI= <>
##$TILT= no
##$TM1= 0
##$TM2= 0
##$TOPLEV= 0
##$USERP1= <user>
##$USERP2= <user>
##$USERP3= <user>
##$USERP4= <user>
##$USERP5= <user>
##$WDW= 1
##$XDIM= 8192
##$YMAX_p= 0
##$YMIN_p= 0
$$ End of Bruker specific parameters
$$ ---------------------------------
##NTUPLES= NMR FID
##VAR_NAME=  TIME,          FID/REAL,        FID/IMAG
##SYMBOL=    X,             R,               I
##VAR_TYPE=  INDEPENDENT,   DEPENDENT,       DEPENDENT
##VAR_FORM=  AFFN,          ASDF,            ASDF
##VAR_DIM=   8192,          8192,            8192
##UNITS=     SECONDS,       ARBITRARY UNITS, ARBITRARY UNITS
##FACTOR=    0.0002004,     1,               1
##FIRST=     0,             0,               0
##LAST=      1.6414764,     0,               0
##MIN=       0,             -87160,          0
##MAX=       1.6414764,     42713,           0
$$ Real data points
##PAGE= N=1
##DATA TABLE= (X++(R..R)), XYDATA
0@%%%%%%%%%%Qj6J6j6J6k4L2l2M0m8N6o5P3q8J03j15J31j50J68j90K15k42K72
33A44l05L39l79M24m70N21n78O40p08P84q68R61j065J181j314J466j642J847k088
52a110K383k750L220l848M732o088Q459j3813N0271j3943p0772L5641M3403L577
66C9362l9998l689K6129K0909j3406j5622p335K584k602M65J142K682J661O319
80A8601J853n654j0956m705N89M093Q87m42J91L438K356m504j2213n175R340J3460
96A1159j928j5330p950Q044Q507k617o328J590K753m172m124M743N984o137j1429
111a7235j568J0182R269q4o445n060j646K375R26n142m544N514J2341N086p939
126c970r819j970K004R92K345L768j006m192L182Q896P8j1239o908P075P737l765
$$ plain form
0 0 0 0 0 0 0 0 0 0 0 0 8 -8 8 -8 8 -16 16 -16 24 -24 32 -33 40 -48 55 -60 71 -79 89 -101 114 -128 144
33 144 -161 178 -201 223 -247 274 -304 336 -372 412 -456 505 -560 621 -693 773 -869 978 -1110
52 -1110 1273 -1477 1743 -2105 2627 -3461 4998 -8815 41456 27513 -43259 -7618 35785 39362
66 39362 -636 -4325 21804 42713 29307 13685 6350 8934 6332 6797 7939 10621 12282 18601
80 18601 20454 14800 3844 -861 -272 3821 4708 4266 4457 7895 10251 5747 -6466 -11641 -2301 11159
96 11159 9231 -6099 -14049 -6005 2502 -115 -6443 -4853 -2100 -6272 -10396 -5653 331 -5806 -17235
111 -17235 -18803 -8621 648 564 -5881 -10941 -12587 -10212 -9286 -14428 -18972 -13458 -1117 3969 -3970
126 -3970 -13789 -15759 -13755 -12763 -10418 -6650 -7656 -11848 -8666 230 308 -10931 -17839 -10764 -3027 -6792
142f792l928O767Q596l992j0620k117N923K857m40L968M410l859q371P36Q516
157A654K636q616m035J0083J0752l369j1843l486P362N838m530o997J601R382
171F432O913k145p230m539O06K077O52k69K590L699J240k052l005j728L9L2M05
188C717j25k15J194K611R42o54j151j599l691k930J799N804K111l807l205K845
204C646M095j949n611k871J017J215P66P5k87J24K384K689j248p932o462L464
220f885P136J217n861j959N747N259l717q097l036L585J875j055j893J253L613
235b818K858j71l432o257k267L739M296m66m518j1N362L939l260n168j783K303
251g654J161p12j514J170K230K284J385o26k754k795J49J471P70m68k49K971L136
$$ plain form
142 -6792 -10720 -3953 4643 651 -9969 -12086 -6163 -3306 -3746 222 4632 773 -7598 -6862 1654
157 1654 4290 -4326 -8361 1722 12474 9105 -2738 -6224 1138 6976 2446 -4551 -2950 6432
171 6432 13345 11200 3970 -569 37 2114 2766 2497 5087 8786 10026 7974 4969 3241 3280 3312 3717
188 3717 3592 3377 4571 7182 8124 7470 6319 4720 1029 -1901 -102 5702 7813 4006 801 3646
204 3646 7741 5792 181 -2690 -1673 -458 308 383 96 220 2604 5293 4045 -3887 -10349 -6885
220 -6885 251 1468 -4393 -6352 -605 4654 937 -7160 -10196 -6611 -4736 -5791 -7684 -6431 -2818
235 -2818 40 -131 -3563 -9820 -12087 -8348 -4052 -4518 -9036 -9047 -3685 254 -3006 -8174 -9957 -7654
251 -7654 -6493 -7205 -8719 -7549 -5319 -3035 -1650 -2276 -5030 -7825 -7676 -6205 -5435 -5903 -6152 -3181 -45
268d5L84k702j895m39k18j539Q69L031L139J223m40L65j017k991k374R82K966
285g01J904J40J155K576Rl124k895j88J667J153J152K180O50j544l90Q51j73k750
303A672j465L027M927R51l370l003j08J574L64j06O7R97Q25J155J21k654m123
320H51r63L997K763n61n72Q61J331j916m396j935K040K566N55o50J184J746j310
337E591l261k605n16J368J871J608L70j380j522L23j73j233j474k35J404J854
353A990N83r44k022j954p77K025K512J24k086j896P30J218j063k369n57K693K610
370H17O39j619j408j441k260j365J519L798J769o39J64K43j066l593k724L14K232
387d620J468K341L304J179l146n185j704J384J320k14N80L370L192l64k095k623
$$ plain form
268 -45 339 -2363 -4258 -4697 -4915 -6454 -5585 -2554 585 1808 1368 1733 716 -2275 -4649 -3667 -701
285 -701 1203 1343 2498 5074 5083 1959 -936 -1124 543 1696 2848 5028 5678 4134 3744 4595 4422 1672
303 1672 207 3234 8161 9112 5742 2739 2631 4205 4569 4463 4530 5527 6352 7507 7628 4974 851
320 851 -112 3885 6648 6087 5515 6376 7707 5791 1395 -540 1500 4066 4621 3971 5155 6901 5591
337 5591 2330 -275 -791 577 2448 4056 4426 3046 1524 1847 1674 441 -1033 -1268 136 1990
353 1990 2573 1629 -393 -2347 -3124 -1099 1413 1537 -549 -2445 -1715 -497 -1560 -3929 -4486 -1793 817
370 817 1456 -163 -1571 -3012 -5272 -6637 -5118 -1320 449 -190 -26 217 -849 -4442 -7166 -6852 -4620
387 -4620 -3152 -811 2493 3672 526 -4659 -6363 -4979 -3659 -3873 -3293 77 3269 2905 810 -1813
403a813k246j304J80L965K794P49q37l58n1j342j842p79J216Q92J784J691R22
420C621j504k309j285J418J621j45l24L30L60M61m77o91r36N62J173J088J6q73
438B106n49o73m84J59J208J366P45o90r72o00p0j059o14j07J386J862J563o92
456C885k103j447j023J65R5J141J102P98j53r1q61j625j284J7J055NR77J405Q82
475B940j814k880o90J471J079r91m29J704J774j118l061o57R96M58n11K42J084
492d03R47q83j652l84l11K59K57O61K00N27L63L80j096k419p87J262J972Q49j056
511a314k9Q95r7j450j496L80J944N96j149l83J340J456o13j817q10Q53R87l08
529a015j27n7Q59R13M19j010j587o0J535R84r39j449L21J998J101p71o79k74L21
$$ plain form
403 -1813 -4059 -5363 -5183 -1218 1576 2325 1488 1130 1079 -263 -2105 -2884 -1668 -776 1008 2699 3621
420 3621 2117 -192 -1477 -59 1562 1417 1093 1423 1783 2244 1767 1076 140 702 1875 2963 2979 2106
438 2106 1557 884 400 559 1767 3133 3878 3188 2216 1616 1546 487 -127 -234 1152 3014 4577 3885
456 3885 1782 335 -688 -523 -428 713 1815 2613 2460 2369 1508 -117 -1401 -1384 -329 -324 653 2058 2940
475 2940 1126 -1754 -2444 -973 106 -885 -1314 390 2164 1046 -2015 -2672 -1676 -1218 -1729 -1487 -403
492 -403 544 -339 -1991 -2375 -2686 -2427 -2170 -1509 -1309 -782 -419 -39 -1135 -3554 -4341 -3079 -1107 -258 -1314
511 -1314 -1343 -448 -545 -1995 -3491 -3111 -1167 -571 -1720 -2103 -763 693 80 -1737 -2547 -1694 -707 -1015
529 -1015 -1142 -1199 -340 573 992 -18 -1605 -1665 -130 854 -85 -1534 -1213 785 1886 1115 436 162 483
548D83p62o35Q81P80P85L57l71j61n13m09J79j7o59j07J124Q84K93l41m42k68
568A081n5p23q1J74M36R73K97l84o14m27k95M07L63o21m02o19J131M85L37j3m96
589I54k28j070o96N44O93k1k04j87R58L03p77o85l37K12l67p31L19J333M58Q17
609A288o39j295j746n33J135J290J15p05N42J110l38j289j639M80J201L51p53
626a425QJ195O80k28j730j388o0J270J423O0n82n3N07R5j264j415P89J846J396
645A124n93j008q60L36M09l04m98L11N42J003Q00l76o85j068k33o7L02J180J337
664A652M48n00j352n72ON97m17O53R34Q99M9r65j298J88M64L60p70P86R39M45
684B546l20q11J04q45k41K15J031Q06N61o39p76j121j047K54J667J406m43j005
$$ plain form
548 483 -279 -914 -33 747 1532 1889 1518 1357 844 435 614 597 -62 -169 955 1839 2132 1791 1349 1081
568 1081 1026 303 222 396 832 1805 2102 1718 1104 677 382 789 1152 531 129 -490 641 1126 1463 1450 954
589 954 726 -344 -1040 -496 197 176 -28 -215 743 1046 269 -416 -753 -541 -908 -1639 -1320 13 471 1288
609 1288 649 -646 -2392 -2925 -1790 -500 -385 -1090 -548 562 224 -1065 -2704 -2224 -1023 -672 -1425
626 -1425 -1417 -222 458 230 -1500 -2888 -2948 -1678 -255 -195 -777 -830 -323 -228 -1492 -2907 -2118 -272 1124
645 1124 531 -477 -1337 -1001 -592 -896 -1394 -1083 -541 462 1262 886 201 -867 -1100 -1167 -865 315 1652
664 1652 2100 1600 248 -324 -318 279 -138 515 1449 2348 2397 1432 134 322 786 1146 376 1162 2101 2546
684 2546 2226 1415 1519 674 433 648 1679 2485 3046 2407 1631 510 -537 -283 1384 2790 2347 1342
702A342k82J014l78j521j029P86J715J182or82j108n39K0k28j93j39R91J489Q52
721B986j292j508j008l09j83P86J137R87j91l76j016n49p1n21q2K9M93Q15P96
740I23R4j726j198l79Q24Q88k04m4L91M83r6j507o66m28J144L62O31J44j67l16
760h47j320l03J090J057o05p60q8J098P10p50j173q48M55J297P97N29k91j652
778a604n33R76M71n51m06N76J806p6o91r90j46Mr8M49R75Q75p87j54k95j14Q9
799b24j51l49N34O04J182J76l14j727m77N32M00L53N24K64o87J16P5K84r92o70
819e47N79J351L35o7m48k95J9l33k42K42K11k69O13N39m24p92j89J3N38l50L9
840E23Q32K3m22n33m4k39K31n08O59L80l35L06m48m98o09Q20M82k59j002L98R29
$$ plain form
702 1342 1060 2074 1696 175 -854 -68 1647 2829 2823 1841 733 194 214 -14 -207 -346 645 2134 2986
721 2986 1694 186 -822 -1131 -1314 -528 609 1596 1405 1029 13 -536 -607 -1128 -1210 -1181 -688 127 923
740 923 1017 -709 -1907 -2286 -1462 -574 -778 -822 -431 52 -44 -1551 -2217 -2645 -1501 -1139 -508 -364 -531 -847
760 -847 -2167 -2470 -1380 -323 -928 -1688 -1776 -678 32 -718 -1891 -2739 -2284 -987 -190 339 48 -1604
778 -1604 -2137 -1161 -690 -1241 -1647 -1071 735 659 -32 -1022 -1168 -1164 -1262 -813 162 1037 250 96 -199 -313 -224
799 -224 -375 -724 -190 414 1596 1772 1458 -269 -746 -214 186 539 1063 1327 640 756 831 1115 123 -547
819 -547 32 1383 1718 1651 1203 908 927 594 352 594 805 536 1149 1688 1264 472 283 296 834 484 523
840 523 1355 1378 956 423 379 140 371 -137 522 902 567 873 425 -73 -682 138 620 361 -641 -243 686
861F86q3o69o37J09K54p3M99j01l40q43N31J245j79j442p05R30J071p34p91K54
881a018M23m66m39Q13K73m4r41j5K89O07k98k32j83M9j15N85K10o89j78j96M96
902a069P10J06m35l83j077J009J133K07j111j078J007J238o9q58l18L52j82R11
920I3N54l47j413n55J249J337p50p32K65J173j88o13o5L03j74m04J34O35P25K35
940A462q13j043L04L50J353k24j404k2J130Q49j14j406o80K76Q75L64N85l93q99
959E50j65O92K83r66o65N29J095L63l97k84j21m34p16M13O44Q31l59o02j52N04
979A043l46l12j38j02J87M86M37R7p20o89k42K3R14J29m60n5j0M31M0j156r48
1000a391L20J135O34J50q54j42l33kK52k85L68NJ03o5K4k38K9k39p22p7O93J116
$$ plain form
861 686 603 -66 -703 -594 -340 -413 86 -15 -355 -1198 -667 578 399 -1043 -1748 -818 253 -481 -1272 -1018
881 -1018 -595 -1061 -1500 -687 -414 -458 -1399 -1414 -1125 -518 -816 -1048 -1231 -1182 -1297 -712 -502 -1191 -1369 -1565 -1069
902 -1069 -359 -253 -688 -1071 -2148 -1139 -6 201 -910 -1988 -981 257 188 -670 -988 -636 -818 93
920 93 647 300 -1113 -1668 -419 918 168 -564 -299 874 686 73 8 311 137 -267 -133 502 1227 1462
940 1462 649 -394 -90 260 1613 1389 -15 -37 1093 1942 1828 422 -258 18 893 1257 1842 1449 550
959 550 385 1077 1360 394 -271 258 1353 1716 1319 1035 914 480 -236 177 821 1652 1293 691 539 1043
979 1043 697 385 247 145 332 818 1255 1352 632 -57 -299 -276 638 767 307 252 242 673 713 -443 -1391
1000 -1391 -1071 64 698 848 -6 -148 -481 -483 -231 -516 -148 -143 -40 -105 -81 -319 -290 -529 -1251 -1328 -635 481
1022D81K78j023p82q3J09O83o8m79J93K76J058m57q25p94k9J027L87m9l00j69
1042e66L25K69q5n98k03J20K75N78K72K47n81q22k03K87N40M32R1M6j76m46J64
1063c4K09j76n62oR39J035l8p10q09l63O18L60k67m23l5N55J057l69p03r01j2
1084f35Q83N71K89l17k17k13k93k22K17L88K55m98pN72n8n7n80q43K58P52N75
1105H20N8n94l16L35j36j76m52J16L71K70j23K44l00n70o65L37O97N47k18p62
1125e17k2J38K70K6n89m09O21J46O63m6n68j59m43j23L42J48L97j67N9L15m94
1146d12K91m18k25K94J4J69K95k36j70j39j95M33j62k24K37K75J39j88Mm70J54
1167e34J5J04K4L63L25j1l37o05k62Q30P45m17q43L13O91j17l57l49K18N98k60
$$ plain form
1022 481 759 -264 -1046 -1129 -1020 -337 -405 -884 -691 -415 643 186 -639 -1433 -1462 -435 -48 -97 -397 -566
1042 -566 -241 28 -57 -655 -858 -738 -463 115 387 634 53 -769 -972 -685 -145 287 378 424 248 -198 -34
1063 -34 175 -1 -563 -569 370 1405 1367 657 -152 -515 103 463 196 -227 -262 293 1350 981 278 -623 -635
1084 -635 248 819 1108 791 574 361 68 -154 63 451 706 208 201 773 715 658 78 -765 -507 245 820
1105 820 878 284 -32 303 167 -9 -461 -345 26 296 173 417 117 -453 -1118 -781 -84 463 245 -517
1125 -517 -539 -401 -131 -105 -694 -1103 -482 -336 327 281 -287 -446 -889 -1012 -670 -522 -125 -292 -233 82 -412
1146 -412 -121 -539 -764 -470 -456 -287 8 -228 -398 -537 -732 -299 -461 -685 -448 -173 -34 -222 -218 -688 -534
1167 -534 -519 -415 -391 -28 297 286 -51 -656 -918 -88 657 240 -603 -290 401 284 -73 -422 -204 394 134
1188A34l22r5Q79K67p67n88Q2J140J80o70n16K36R43L83j010l86L8L64M44q5m67
1209A84Q4m4RL95J57k25O2n73j60L70O47j54k84o36K60M08K56j06l22o44L2L70
1231H6N69k28l26j45O8M62m06K94k87j13p7J31M69j88o47kJ57L10L54k87n26l39
1253f71r9R06L87o71n06k93R34M02J07r06j59J57R0J96QL54j9n34n85J11R15k58
1275a34j08o58J28J023L22m88r09j23P91N37m23j53j21K97J41j46k16Q8r6J7P6
1296a55K03P19n23j56l18j1J55P36l01n09m49Q92L55k61p52R2L72M39k34J58j69
1317B83j2l6k06K32J34J16l36J88j64K19L3l85R9j31L3O00J47m07M1k1j26k32
1339F9Mj08K04J30L35j35j08r4m17K11k18J58Q6K41n08J2n6L68k01k09k49M68
$$ plain form
1188 134 -188 -283 596 863 96 -492 -410 730 910 240 -276 -40 903 1286 276 -110 -72 292 736 651 184
1209 184 268 224 233 628 785 560 622 49 -111 259 906 752 468 -168 92 500 756 650 328 -316 -284 86
1231 86 655 427 101 -44 24 486 80 374 87 -26 -103 28 497 309 -338 -340 -183 127 481 194 -332 -671
1253 -671 -770 136 523 -148 -654 -947 -13 389 496 -410 -569 -412 -322 -126 -118 236 217 -317 -902 -791 124 -134
1275 -134 -242 -900 -772 251 573 85 -824 -947 -156 381 -42 -195 -316 -19 122 -24 -240 -152 -248 -231 -155
1296 -155 48 767 244 88 -230 -241 -86 650 349 -160 -609 283 638 377 -375 -283 89 528 294 452 283
1317 283 271 235 29 261 395 511 175 363 199 418 451 66 165 34 67 667 814 407 448 427 301 69
1339 69 73 -35 169 299 634 499 391 297 -120 91 -127 31 117 358 -150 -138 -194 174 -27 -236 -485 -17
1361a7J67K79n79j41j19J39k4P2J1j05M60j63l19r2R8k43O5q7L74J33l36K5k13
1384f15J80l56K92R7l2O9r3m5K85k59k36n66O60L14J1P0Rj59l05J30J57j28J79
1407c41L8n4L79k71J24l74k10M09LL06m1J33j22q9o6p4K51K36j58J71J29l61J50
1430A68K7j86Q0L07j73L36k48K98m40P2P6L16k70O7N0QK52K4j97l53K9M95J92
1453I30l29K01q3kJ11k23p0P2j87K83R8L1m2k51j69K52k2N4j75M6M9j09r8L37
1477G04k53k01o2K82o5r1J92k03j08l28K98M2J48r0n02n0K23J49j71j74m92K79
1499d73N94j03k86k44k07K26K39MN2m73K34k31K61R6l3m69J42j18J62L36l06k2
1521f19j39Q6R3qk36j15Q3N58k60Q7J4r4j90j38K48M27k13j78p6j51N75m86M05
$$ plain form
1361 -17 150 429 -150 -291 -410 -271 -295 -223 -212 -317 143 -20 -339 -431 -333 -576 -511 -598 -224 -91 -427 -402 -615
1384 -615 -435 -791 -499 -402 -434 -365 -458 -503 -218 -477 -713 -1279 -619 -305 -294 -224 -215 -374 -679 -549 -392 -520 -341
1407 -341 -303 -357 22 -249 -125 -499 -709 -300 -297 9 -32 101 -21 -110 -176 -250 1 237 79 250 379 18 168
1430 168 195 9 89 396 223 559 311 609 169 241 317 633 363 430 480 488 740 764 567 214 243 738 930
1453 930 601 802 719 717 828 605 535 607 420 703 801 832 790 539 370 622 600 654 479 525 574 465 367 704
1477 704 451 250 188 470 405 314 506 303 195 -133 165 207 355 265 -237 -287 -64 85 -86 -260 -752 -473
1499 -473 121 18 -268 -512 -719 -493 -254 -250 -198 -671 -437 -668 -407 -311 -344 -813 -671 -789 -627 -291 -597 -619
1521 -619 -758 -672 -579 -587 -823 -938 -855 -297 -557 -470 -456 -550 -740 -878 -630 -203 -416 -594 -670 -821 -246 -732 -327
1544c27k29J3J56J78j67l93N5L48K58n4O3j62j30R0M55k17j11j74nL11K14jok50
1568h5J38j18K65O2J83j27k92L70K05N2k91j51J46O3l81K30N11l01j94O7m3J01
1590D10m6L26l10K98l39m8L61o99L87M16m00J83n11J03P9K9L46k24j08j99rp2
1612b7L77k2l42q9J17j11K12o8L8l2L2m2m9q2n6K27L9l16pJ7l77N04J55P6m20
1637b46j39q0J08J94K19j25n92L59L68r2l69Q2l3p3P1MJ61p5K02k87Q3k68l4L35
1661b27j78N1rL59qk21j30K05L91o6o45N71n3j32j24M54k48N9n25Q2J76O50N6
1684D88m55k72j84Q99k00K14k18k5P5N9J0p9j89N3K12K24k46l08L16kK55k80m2
1707C05K9o7M02j29j8K77k39k12j07K53K83k31j51p2M32j90o5j97o4M0%K03P4
$$ plain form
1544 -327 -556 -543 -387 -209 -376 -769 -714 -366 -108 -162 -99 -261 -391 -301 154 -63 -174 -348 -353 -42 172 171 165 -85
1568 -85 53 -65 200 262 445 318 26 396 601 653 362 211 357 420 39 269 780 479 285 352 309 410
1590 410 364 690 380 678 339 291 652 -47 340 756 356 539 28 131 210 239 585 361 253 54 45 -27
1612 -27 350 328 -14 -103 14 -97 115 47 85 53 85 43 -6 -88 -144 83 122 -194 -201 -184 -561 -57 98 174 -246
1637 -246 -385 -465 -357 -163 56 -69 -661 -302 66 -26 -395 -313 -346 -419 -348 -344 -183 -258 -56 -343 -260 -528 -562 -227
1661 -227 -405 -354 -363 -4 -12 -233 -363 -158 233 167 -478 93 40 -92 -216 238 -10 49 -476 -394 -218 432 488
1684 488 33 -239 -423 476 276 490 272 247 322 381 391 312 123 176 388 612 366 58 374 372 627 347 305
1707 305 334 267 669 540 522 799 560 348 241 494 777 546 395 323 755 565 500 303 239 279 279 482 556
1730E56n13K06m2K11k34p7J82l6J19j85L64n51K94p78M46P2L00J47l55m07M1K84
1752D4m1o5J25l51J80L02l38r4K8J88l88l4L41k21J71L3k94K86J35m83n8j40L05
1775c69J81k48R5k3Rk03L73l73O2k09P9j42K12L60j63J75j52l06L23J1j13ln8
1798d82Mj46L76q7l25K87K72K2j83j72L01M05l07j45K0j00M06l36jQ5L09l58J59
1821Dl10M56n9J38J41l07j02L10J91K2o25M33j67L2j06J62R9j63J4J52M11n49
1843A77K46l97L01J40k29P3J42p6k58N34J2n58j13K80n3K54j1P1m70r4M54n0L13
1866F88m96l90N76Lk48j90lj63J55L19Q0j3m58j81M37j05j31j72m06L93qL21Q4
1889I2l40k0N1M6J89k34L4j16P8j26N1O6j99j21J56J3L7k5l94L97k45M65J0k74
$$ plain form
1730 556 43 249 207 418 184 107 289 253 372 187 551 0 294 -484 -38 34 334 481 126 -281 -240 44
1752 44 3 -62 63 -288 -108 194 -144 -238 -210 -22 -410 -444 -103 -324 -153 -120 -414 -128 7 -476 -534 -674 -369
1775 -369 -188 -436 -341 -364 -355 -558 -185 -558 -496 -705 -626 -768 -556 -196 -359 -184 -336 -642 -319 -308 -421 -424 -482
1798 -482 -478 -624 -248 -335 -660 -373 -101 -79 -262 -434 -133 272 -35 -180 -160 -260 146 -190 -191 -106 203 -155 4
1821 4 -306 150 91 229 370 63 -39 271 462 484 -141 292 125 157 51 213 312 149 163 315 726 177
1843 177 423 26 327 467 238 311 453 377 119 653 665 107 -6 274 221 475 464 535 65 -29 425 375 688
1866 688 192 -198 378 381 133 -57 -60 -223 -68 251 331 318 -140 -321 116 11 -120 -292 -698 -305 -313 8 92
1889 92 -248 -268 -217 -171 18 -216 -182 -298 -220 -346 -295 -229 -428 -549 -393 -380 -343 -368 -762 -365 -610 -145 -135 -409
1913d09N8l63J05O57J12n19l54J21K04P8J12k12j65l0K77J33K44k90m71J47N14
1934e1l2p2L0k95N9J87o7K02l59J07J67j79L95m1L3k28pQ5L79J52k94m38L25L08
1958C66J7K84m99k12J32N10Q2J5l83q4o4L93k0J7k58p8J35J76n5O9j65k09m0L61
1982D90L49j53J75p38M24j84L89j47j98P2j11K83j73M7k52k46M56N4k97p7l2j88
2004e7J42J98q2Q9o5j58j74L39P2m00K74l35q1N28k64N6j43k97O7K08Q0no7J42
2028F7l45m9J83K32k34J9l37R9k6P9QJ16K22j78l5o3m43J09K76k15j9K15K6k54
2052e47J41j85J05M14l88m9J07j42K76K3J99j22n19O25j03K3j1k86L03j75N1O0
2074b00J02M0l7K2j11J93r4qN8j13O2J9K66l40J33K11n9q5J0j03L15k42j2K07
$$ plain form
1913 -409 -351 -714 -609 48 160 -359 -713 -592 -388 -310 -198 -410 -575 -605 -328 -195 49 -241 -712 -565 -51
1934 -51 -83 -155 -125 -420 -361 -174 -241 -39 -398 -291 -124 -303 92 51 84 -144 -151 -66 313 465 171 -267 58 366
1958 366 383 667 168 -44 88 598 680 695 312 228 164 557 537 554 296 218 353 529 474 543 378 169 129 490
1982 490 839 686 861 123 547 363 752 605 407 479 368 651 478 525 273 27 483 537 240 163 131 -57
2004 -57 85 283 201 290 225 67 -107 232 304 -96 178 -157 -238 290 26 82 -61 -358 -291 -83 -3 -8 -75 67
2028 67 -278 -327 -144 88 -146 -127 -464 -365 -391 -312 -304 -188 34 -144 -179 -242 -685 -576 -300 -515 -534 -319 -293 -547
2052 -547 -406 -591 -486 -72 -460 -509 -402 -544 -268 -245 -46 -168 -687 -62 -165 -142 -153 -439 -136 -311 -260 -200
2074 -200 -98 -58 -95 -73 -184 9 -85 -93 -35 -148 -86 -67 199 -141 -8 203 144 59 69 -34 281 39 27 234
2098B34l12J72J98j79J7K25l46K54K25p2j30K38p1k26k20M48j05J4k76Q8J64j6
2120C24l1q8K5j31p3O4M8k65L21l17J37j64M32j21m7J62k02L29l25Nj72K52j3
2143A50j61p5K89k08j76K52k58K71m25L28K9k8l22J72j02K31k44J69Q1j64k10
2164d01J69j93k07K94K42k14J27k3k05J54K73j14m33M92j11p1l26M01j68J30r4
2185b78k30j2K94N3p0q0J45k68N15j85j44k07K21L1J14rk60L72Kk1k68K3o9J32
2209a99J56M3j73K00k00K32J92j83%L1J90l9j71O0J79k13J19j2N8k10M5j9J84
2232B70J98J9l95OK95P5p4j85K70O5j97j44J47R1j67L00l59N0M12l83j7O7k08
2255A36N0K12l87J51K96j08j57L03M1k60n1j05j58L48O4o3k19RK48m27K44J5j80
$$ plain form
2098 234 -78 94 292 113 130 355 9 263 488 416 286 524 453 227 7 455 350 364 88 176 340 324
2120 324 293 205 230 99 26 90 138 -127 194 -123 14 -150 282 161 114 276 74 403 78 83 -89 163 150
2143 150 -11 -86 203 -5 -181 71 -187 84 -341 -13 16 -12 -334 -162 -264 -33 -277 -108 -27 -191 -401
2164 -401 -232 -425 -632 -338 -96 -310 -183 -206 -411 -257 16 -98 -531 -39 -150 -221 -547 -146 -314 -184 -278
2185 -278 -508 -520 -226 -173 -243 -323 -178 -446 69 -116 -260 -467 -246 -215 -101 -110 -370 2 4 -17 -285 -262 -331 -199
2209 -199 -43 0 -173 27 -173 59 251 68 68 99 289 250 79 139 318 105 224 212 270 60 105 86 270
2232 270 468 487 92 98 393 468 394 209 479 544 347 203 350 441 274 574 215 265 677 294 277 344 136
2255 136 186 398 11 162 458 350 193 496 537 277 226 121 -37 311 375 312 93 102 350 -77 167 182 2
2278BQK02l21M59k08j11l10PP9L6J79j68k08K04o8J62p7J87m39J46K0k38oJ39
2302c24J70J73j97J1m4K03k70M1j09P8K92l55k79M63j86M37l51k82K16J93k67
2323c87M1O5M5j45O0J45j8K19p4j23j13n3K23L33j77k44k67K14j1K37K6q2Pk52
2347c31L19J05K7j52K18j50j52K55J6k82P9L45j93J71nJ72l43k44L15J82j07j16
2369A29k3J45q2K63k49r0n4J86J58j18l62J78J1m5L28N1J14m98j15M20l78L34
2391C03KP0j55J20J59k72j37j43L51k10K09j44om38J93O3k8J7O6k04K83j10m48
2414d59J70L99j49k88J30o1K22k73J11l72N06R9m31K37Q9K0m20O09k27j08j14
2435c10L2m0R2r0J26N6k88M26j81k9P3l88K0J02k0K22j48j02p9L25k34L60p3j13
$$ plain form
2278 2 10 212 -109 350 142 31 -279 -272 -193 -157 22 -146 -354 -150 -218 -56 -133 54 -385 -239 -219 -457 -463 -324
2302 -324 -154 19 -178 -167 -211 -8 -278 -237 -346 -268 24 -331 -610 -147 -333 104 -247 -529 -313 -120 -387
2323 -387 -346 -281 -236 -381 -321 -176 -194 25 -49 -172 -285 -338 -115 218 41 -203 -470 -256 -267 -30 -4 -86 -79 -331
2347 -331 -12 93 120 -32 186 36 -116 139 155 -127 -48 297 104 275 270 442 99 -145 170 352 245 129
2369 129 106 251 169 432 183 93 39 225 383 265 -97 81 92 47 375 426 540 42 -73 347 -31 303
2391 303 305 375 220 340 499 227 90 -53 298 88 297 153 147 -291 -98 -35 -63 -46 20 -184 99 -11 -459
2414 -459 -289 110 -39 -327 -197 -258 -36 -309 -198 -570 -64 35 -396 -159 -70 -50 -470 139 -88 -196 -310
2435 -310 -278 -318 -226 -316 -190 -134 -422 4 -177 -206 -133 -521 -501 -399 -419 -197 -345 -447 -526 -201 -435 -75 -148 -261
2459b61j53J01P2m0j68J65L01j43Q0m8l5o6N7o4l6LL7J77j88J39J86k56K80j63
2483b3j61J68k9n0J60j27P5O9j38mJ96J57Nk25J85j8M7J08k5l29R1M45m84L88
2507D81o45K62J80j90R5K08l05j50J74m6n9J16j12L90k2k37n9R1K18l25p9r4L36
2530B28k89J37K01j40j07J17J10R5j70o1k74O1J87j52M97n67j6J0L7k7J94N0j66
2553d5J09j79L25N5k36N3j44l39M29k33J91j57K54N8k69j71J22l6J41K39j35j32
2575a00k32K22M7K79l88j20J62k83J05J70j32J12k08K33O0P7k93K08j4L2J36R
2597H2qJ70l03r6k6L96J05k87K46k74L70j45J8k65K89J83l86J35j28J75J70k52
2619A69m46L15j63K16l3J39L5p7o4m3K55m6q4PP1k80K95j98K89j99j57R2j77L20
$$ plain form
2459 -261 -414 -313 -241 -281 -449 -284 17 -126 -46 -94 -129 -195 -138 -202 -238 -235 -198 -21 -209 -70 116 -140 140 -23
2483 -23 -184 -16 -45 -95 65 -62 13 82 -56 -60 136 293 298 73 258 240 287 395 370 41 132 577 93 481
2507 481 -164 98 278 88 183 391 86 -64 110 64 5 121 9 399 377 140 81 172 390 65 -14 -108 228
2530 228 -61 76 277 137 30 147 257 352 182 121 -153 -92 95 -57 440 -127 -143 -133 -96 -123 71 121 -45
2553 -45 64 -115 210 265 29 82 -62 -401 28 -205 -14 -171 83 141 -128 -299 -177 -213 -72 167 32 -100
2575 -100 -332 -110 -63 216 -172 -292 -130 -413 -308 -138 -270 -158 -366 -133 -73 4 -289 -81 -95 -63 73 82
2597 82 74 244 -59 -155 -181 215 320 33 279 5 375 230 248 -17 272 455 69 204 76 251 421 169
2619 169 -277 38 -125 91 58 197 232 155 91 48 303 257 173 180 251 -29 266 68 357 158 1 93 -84 236
2643B36j05N7K27m44j49L87Ml9J07k72k97L38K26j02k41J36O8k05K30l49r5l1
2665c13L02j27J36o8j54R7o5K81m59J86L21l01K32j90k28L97l26L1L94m09L33
2686G0J16n52n7N0K85q9o7j95K47J56k29J53l73J51J32Q6N7j14l32p2K76N0N1
2709b00O1j3k6j41L59k85k0K0k91N63J8N4l76M54l81J85J99NQ6k90J51L4q8J01
2733A79j22K0l81l5M09K50j40jJ71j1r1j04J90J76j64k45M26k69k1j89q5L3L07
2756C03j96L8O1M0k06p2N01p30o2M96M11l93o7M9K32l85K93j34j55j44L10k42
2778e2J44j41M70k07QJ03l18J13J7j73L9K22K8j16j33o5K38k57J69J7m87J76J79
2801b6J70m34K78j19n3K4J03j30P1k7p2P1r9j7M8q9L30K0o9j68n3K29J05k96j19
$$ plain form
2643 236 131 188 415 -29 -178 209 213 174 281 9 -288 50 276 174 -67 69 137 -68 162 -187 -282 -313
2665 -313 -11 -138 -2 -70 -224 -127 -192 89 -370 -184 137 -164 68 -122 -350 47 -279 -248 146 -263 70
2686 70 186 -366 -423 -373 -88 -177 -244 -439 -192 -36 -265 -112 -485 -334 -202 -116 -59 -173 -505 -577 -301 -251 -200
2709 -200 -139 -152 -178 -319 40 -245 -265 -245 -536 27 45 99 -277 177 -204 -19 180 185 271 -19 132 166 78 179
2733 179 57 77 -304 -339 70 320 180 179 350 339 248 144 334 510 346 101 527 258 237 48 -37 -4 303
2756 303 107 145 206 246 40 -32 469 -261 -323 173 584 191 124 173 405 20 313 179 24 -120 190 -52
2778 -52 92 -49 421 214 222 325 7 120 137 -36 3 225 253 137 4 -61 177 -80 89 106 -381 -205 -26
2801 -26 144 -290 -12 -131 -184 -160 -57 -187 -116 -143 -215 -144 -243 -260 -212 -301 29 49 -20 -188 -241 -12 93 -203 -322
2826c22P9p7K87l19O25l78q5J10j53L19m08K98m6l24K08M1K32j29R8p9j24J48
2848AK0j37L08Qj87J0l24K39q8J71k71L93j86j13M25k76r7J82K48k44l4l9J31
2871A40K82k29j51K50k89J88k8L22j22n4N4n02L34k9K22m09L43k63K26j84M00
2892E01j97k81L01j28m6J27J5p7LJ35p5j94M59k29j80n7J09J3l65L04k28J14o6
2915d2j48L8K70j26L53m76J58j65J41K63k38K7n84K23J55J78q8J12j57k66K42
2936a30J77j69P7lk70J86l06L49m4m0o5J1J56j7j28j36K8R8q1k15O02l90Q9m7
2960b68J2K06m37O9L29n3N8k01K61K12k72J99j42r6%M6k2J68Rl8j39k21K95j91
2984b16K11n7j72L04P9q3j84L45k36j34K15J12j00K61l06j09J24NK1J14R1N7m11
$$ plain form
2826 -322 -243 -320 -33 -352 273 -105 -190 -80 -233 86 -322 -24 -70 -394 -186 -145 87 -42 56 -23 -147 1
2848 1 21 -116 192 200 13 23 -301 -62 -150 21 -250 143 -43 -156 269 -7 -104 78 326 82 48 9 140
2871 140 422 193 42 292 3 191 163 485 363 309 363 -139 195 166 388 -21 322 59 285 101 501
2892 501 304 23 324 196 150 277 292 215 218 353 278 84 543 314 134 77 186 199 -166 138 -90 24 -42
2915 -42 -190 -152 118 -8 345 -131 27 -138 3 266 28 55 -529 -306 -151 27 -61 51 -106 -372 -130
2936 -130 47 -122 -45 -48 -318 -132 -438 -89 -133 -173 -238 -227 -71 -88 -216 -352 -324 -226 -307 -522 80 -310 -221 -268
2960 -268 -256 -50 -487 -418 -89 -142 -84 -285 -24 188 -84 115 -27 -123 -123 -77 -99 69 78 40 -99 -320 -25 -216
2984 -216 -5 -62 -234 70 149 66 -118 227 -9 -143 72 184 84 345 39 -70 54 59 80 194 285 342 -69
3007f9o1K52lk23J99J11l6qp9j8M1j8l4M3j53K47j64j3M8l6J78j1j28J85r2k72
3033a14MJ29j25q4O99l71Pk1q1J78o0p8N2k34L0J19L53n25l9J18J13j06j44M19
3057B39k35r5O8j31n6L0J24j18K79k84n4K04K63m13k7J39p8K56j24J9O5n6k46
3080b31J67R7k10J88J06l88K74o2J9J77j13J16q9j9j50l8K10O1l20j6l2K07j93
3103b39J26L9j18O2J17n2O9O8M1N7l47M95j44j80k58L55K74n77J64j57K07L48
3125C50m91m6P5J39Q2k34J54k29j33P50l51K51k33J99l61K59j33J94k21l3L73
3146C61l35L27r0l96J92j42j86M33J11K7l48R2k4j93J56Q4J02j13l78N89l13m6
3168i0K06M2q1j84J54l01J19k0K78l8P0rn89J91K66k69j05L19j63K27P9M9m9J8
$$ plain form
3007 -69 -130 122 119 -104 95 206 170 162 83 65 106 88 54 97 -56 191 27 14 62 26 204 193 65 250 158 -114
3033 -114 -110 19 -106 -190 509 138 145 124 43 221 161 83 135 -99 -69 50 403 -122 -161 -43 70 -36 -180 239
3057 239 4 -91 -23 -154 -210 -180 -56 -174 105 -179 -233 -29 234 -179 -206 -67 -145 111 -13 6 71 15 -231
3080 -231 -64 33 -177 11 117 -271 3 -59 -40 137 24 140 51 32 -118 -156 54 115 -205 -221 -253 -46 -239
3103 -239 -113 -74 -192 -130 -13 -65 4 72 113 170 -177 318 174 -6 -264 91 365 -212 -48 -205 2 350
3125 350 -141 -187 -112 27 109 -125 29 -200 -333 417 66 317 84 283 -78 181 48 242 21 -12 361
3146 361 26 353 263 -133 59 -83 -269 164 275 302 -46 46 22 -171 -15 69 171 58 -320 269 -44 -90
3168 -90 116 158 77 -107 47 -254 -135 -155 123 85 155 146 -443 -252 14 -255 -360 -41 -204 23 102 151 102 120
3192A20k03k74M79J59m53J98j62l8m0K44k78J3K79q7j3J4p1j30L76k6k61J05J72
3215A23m9j75k84M08j44L9r5j8L53R0l12j04K78l19J06P3J23m79L64k49M56q6
3237I9J42j30m21R8J95j08K36j81j74J89L3J55r3m0J49J20j21l74M17j8J25l66
3259f8P2J54k21J04M64p79J08K71J44m86J89K10J33j69m41N04k52R6k06L99k84
3280e8O2n5j7J55j31J43k2j50q7J30JJ70J03k03q6n7k27N39J6k78p3J97N0J0k04
3305g2K94l54J50j09J16Oq0O9l33J57%N3J00j45J23J26n7j73j70N4K92k05L13
3328A55k50K85k30J29k64j52p6L11o2K49mj62J93j31j76J26P2j52J59j9j71O6
3350a04K22l68J5J59m3j67N54k45l1k26Q9K93l61L09j96J33L3j19j2j43K22o7
$$ plain form
3192 120 -83 -357 122 281 -172 26 -136 -174 -214 30 -248 -235 44 -43 -56 -42 -113 -243 133 107 -154 -49 123
3215 123 74 -101 -385 23 -121 -82 -177 -195 158 248 -64 -168 110 -209 -103 -30 93 -386 -22 -271 185 99
3237 99 241 111 -310 -212 -17 -125 111 -70 -244 -55 -22 133 40 0 149 269 148 -226 191 173 298 -68
3259 -68 4 158 -63 41 505 -274 -166 105 249 -237 -48 162 295 126 -315 189 -63 33 -173 226 -58
3280 -58 4 -51 -68 87 -44 99 77 -73 -160 -30 -29 141 244 41 -45 -102 -329 210 226 -52 -125 72 122 132 -72
3305 -72 222 -132 18 -91 25 31 -49 20 -313 -156 -156 -103 -3 -148 -25 101 44 -129 -299 -245 47 -158 155
3328 155 -95 190 -40 89 -175 -327 -403 -92 -154 95 91 -71 122 -9 -185 -59 13 -139 20 1 -170 -104
3350 -104 118 -250 -235 -76 -119 -286 268 23 -8 -234 -145 148 -213 96 -100 33 66 -53 -65 -208 14 -53
3372e3Kp8rM72l51N3K95l01L96k73l63L89O2j44j78j71Q6K18Q0n6Q2m68K28n2
3396a34J85J85k07N1L0M0O3m14M31l12J03l7K5o6l9K56j40J68k17K21j95qJ33
3419A22M0k46M37M3n26Q0J10lj26j0L3K43k32J44m1j68K63p8j47J01j17K46k15
3442d7J45j02qk84N28j23j20J65j96J39K16j11o2kn3J1Q9l82J78J03k96L32k61
3465a41K12j96n3L05l6j56J64M7k53J88R6j30L76n91P7j71j06L76o1p2j67K9L62
3488I9k22K4m8P1R0j63J55J6j48L40m60K75L28o19J87M07l97L24k78OJ10j01l9
3511d3M9J96oj48j96K25K0J77k48j61m4K46NK0J63N0k13m9K14k46n0K3N1K4M2
3536A01J43q37M91J79k11n1K05m1J10J02j49O4j13K33m22K10l96N03m2l74L35
$$ plain form
3372 -53 -51 -129 -138 334 -17 36 331 30 426 153 -210 179 241 97 -81 -252 -166 52 132 76 158 -310 -82 -134
3396 -134 51 236 29 80 110 150 213 -201 230 -82 21 -16 9 -57 -96 160 20 188 -29 192 -3 -11 122
3419 122 162 -84 353 396 -130 -50 60 57 -69 -79 -46 197 -35 109 68 -100 163 85 -62 39 -78 168 -47
3442 -47 98 -4 -12 -296 232 109 -11 154 -42 97 313 202 140 138 85 96 185 -197 -19 84 -212 120 -141
3465 -141 71 -125 -178 127 91 -65 99 146 -107 81 177 47 423 -168 -91 -262 -368 8 -53 -125 -292 -263 99
3488 99 -123 -99 -147 -76 14 -149 6 22 -126 214 -246 29 357 -262 -75 332 -65 259 -19 -13 97 -4 -43
3511 -43 6 202 196 48 -148 77 97 274 26 -135 -179 67 72 92 255 305 92 43 257 11 -39 -16 35 59 101
3536 101 244 -593 -102 77 -134 -185 20 -21 89 191 42 106 -7 226 -196 14 -382 121 79 -295 40
3557D0k13L76p7j68k27L30j25J37jj91L42j61q8k4J69j01N0j60j10J96J66p6j24
3580d0rQ3l8K2j59j76K77L32l77L4k73J57K42J21J35n49n8L05j1j32J15k04Q0
3603a23L21j73L4k31J09J21n0j4k70K87k70K52j53K87k50j2K21j13J82k03O3r5
3625h0N5r8k9J40k7j5r7J83J57k64K10j53K17rr8j44K53l08K61j26J23j07r5J8
3649c3p7Q4K8M4J07k67R6j10j1J55K86j35k73K43j89J60k0j95J58k06L16j51M9
3672E9M7n5M2m3o5J67k81K31N0k78J3K3R5l75N35k07M45l24M0K7j9j43l4L99l85
3697c6J81r7J44k4m99K46j92L23j34q6K73p6q9N4J01l03K78k6O3l31L37k21O2
3720e2j61J51j58k6K85k77M49l38J33j71N4N8k68M64k20O5P3j66l7L13k52j85
$$ plain form
3557 40 -173 203 126 -42 -269 61 -64 73 72 -119 223 62 -26 -50 119 18 68 -92 -202 -6 160 84 -40
3580 -40 -49 34 -4 18 -141 -317 -40 292 -85 -51 -324 -167 75 196 331 -218 -276 29 18 -114 1 -203 -123
3603 -123 198 25 59 -172 -63 58 8 -6 -276 11 -259 -7 -160 127 -123 -135 86 -27 155 -48 15 -80
3625 -80 -25 -123 -152 -12 -39 -54 -151 32 189 -75 135 -18 199 190 92 -52 201 -107 154 28 151 44 -51 -33
3649 -33 -110 -26 2 46 153 -114 -18 -128 -139 16 302 167 -106 137 -52 108 88 -107 51 -155 161 10 59
3672 59 106 51 93 50 -15 152 -129 102 152 -126 -113 -90 5 -370 165 -42 403 79 119 146 127 -16 -50 349 -36
3697 -36 145 48 192 168 -331 -85 -277 46 -88 -174 99 23 -66 -12 89 -214 64 38 101 -230 107 -114 -52
3720 -52 -213 -62 -220 -246 39 -238 211 -127 6 -165 -111 -53 -321 143 -77 -12 61 -105 -142 171 -81 -266
3742b66k1M59k06jP8r0r4O9K32j22o1K58k51j92L52L3q8n2P0k63L58p9j12k4K47
3767B34j87K6j0p7Q3k08J94j8J2k57K16J25k36M4J55j48J56j93R3O9o1P7J2k76
3791a75L44J73k64J4J8p8K45R9m26J06l65K53n1K15K3R6j87O3j63L17k91J7j04
3814a21%K61m5l5j35q7K78l19K44o4K80k59l52M63k18L58l36O6o6P9N0Kn4Q6k26
3839a50ON3k23J82K14k81K90J15j11j22k74M14k84j56M91j35j54K3O9r0P9J9K55
3862B30k77J88j29k32K86j19m7J36j25N9M26l65Mn0j84K74j0K10j26Jj7L6k44
3885g5r4M21l49K60j20J54p7J82j37j90J76J9J9k7k86K23k16n8J55N4M3q1j01
3908a05K58m5j95oJ90K08N0j67k66J29K17j59J34j29R8O7k2l07o6N8J1K59l47
$$ plain form
3742 -266 -287 172 -34 -35 43 -47 -141 -72 160 38 -23 235 -16 -208 144 177 89 37 107 -156 202 123 11 -13 234
3767 234 47 73 63 -14 69 -139 55 37 49 -208 8 133 -103 -59 96 -52 104 -89 4 73 12 89 101 -175
3791 -175 169 342 78 92 110 32 277 376 -50 56 -309 -56 -107 108 131 227 40 103 -60 257 -34 -17 -121
3814 -121 -121 140 95 60 -75 -162 116 -203 41 -23 257 -2 -354 109 -109 249 -87 -21 -87 -8 42 44 -10 76 -150
3839 -150 -144 -91 -314 -132 82 -199 91 206 95 -27 -301 113 -171 -327 164 29 -125 -102 -33 -123 -44 -25 230
3862 230 -47 141 12 -220 66 -53 -100 36 -89 -30 396 31 35 -15 -199 75 65 275 149 150 133 169 -75
3885 -75 -169 252 -97 163 43 197 120 302 165 -25 151 170 189 162 -124 99 -117 -175 -20 34 77 -4 -105
3908 -105 153 108 -87 -93 97 305 355 188 -78 51 268 109 243 114 212 279 257 -50 -116 -58 -47 212 -135
3931a35J44j13P2M0K04l73J76nj95L19j48R6j15O1j04j03K43j71N7J44k61q8M9
3954b06L7J09k52R1L26J72k42j14M47o19L62l34KL06j35K49l02l0j88J86J1J49
3976B5J99J29m32j26J18Q6j7o0o2L82k03J9k40J16j54M38l1k68j95j07n6K09J64
3999f6N2J2j33M7J05J24j64j08K44J18r3j30J14j9l65J28PK67j67j59O22k05l55
4022a24J16j20K87j09l1j83L48k80k9L34j34J8O0j48n4Q9j01L94j66j64K87j33
4044A57l32L40k41L93j87o3j19k1J15j11j5k55N91k44K28l6K8m4K46j47k65l8
4066b0m0l00L02J26l54J56K01J70l26Q0J89j76j80M06l16J89l67K28L84l88j00
4087a36K76q5m24K86K7o2R0r9M08k89k17K39L4l16R0K13o0k98J99M27m78J26P4
$$ plain form
3931 -135 9 -104 -32 8 212 -161 15 10 -185 134 -14 82 -33 28 -76 -179 64 -107 -50 94 -167 -255 -206
3954 -206 -169 -60 -312 -221 105 277 35 -79 368 -251 111 -223 -221 85 -50 199 -103 -133 -321 -135 -124 25
3976 25 224 353 -79 -205 -87 -1 -18 -78 -140 242 39 58 -182 -66 -220 218 187 -81 -276 -383 -439 -230 -66
3999 -66 -14 -2 -135 -88 17 141 -23 -131 113 231 138 8 122 103 -262 -134 -127 140 -27 -186 436 231 -124
4022 -124 -8 -128 159 50 19 -164 184 -96 -125 209 75 93 153 5 -49 40 -61 333 167 3 290 157
4044 157 -175 165 -76 317 130 67 -52 -73 42 -69 -84 -339 252 8 236 200 228 184 430 283 18 -20
4066 -20 -60 -360 -58 68 -286 -130 71 241 -85 -5 184 8 -172 234 -82 107 -260 -32 352 -36 -136
4087 -136 140 55 -369 -83 -56 -118 -28 -127 281 -8 -225 14 48 -268 -178 35 -25 -323 -124 303 -175 -49 25
4110B5q6n0J91k6k49L41J74m48j03K37J3j89J48O2N6l04pK31o3P8j93R5Op3L11
4135A77O9k56j24m3K80j31p8J35l4j01j4M85m42K16j3j44L06j41J47m94K91J44
4157B35Mj10k3N5N6j38m0qQ9K3j91K74J4j79J20N8j94K57j33j94j8R7J1j58PN0
4183c6l3j15J8K37L57n41JK85k31r4J72j6o8O7j5R0l7K9j39q2J86p2K17k58P9
4208Aj05p6J67m88N29k63M37j87n3O5L8m7l02Q5Q3j46o7J92J53LN5j69J83m36
4232c48M08N8j17J77oM9j76k53K03J27on8j79J96m3oj65J22q5j75k15M51K16l97
4256b22J95M1J62j01k37l0J51J17j51K29j53j66J5q6J76J14R4m7j02N2O7m01K77
4279fj5K7k6J26N4l03r4M44k95r5K37j21J65K34l28J07OJ4J52l61o8L0L35k46
$$ plain form
4110 25 -61 -111 80 54 -195 146 320 -128 -231 6 19 -170 -22 40 96 -208 -215 16 -47 31 -162 -67 -61 -134 177
4135 177 246 -10 -134 -177 103 -28 -106 29 -5 -106 -120 365 -77 139 126 -18 288 147 294 -200 91 235
4157 235 239 129 106 161 217 79 39 31 120 143 -48 226 240 61 181 239 45 302 169 -25 -43 54 65 -93 -86 -36
4183 -36 -69 -184 -166 71 428 -113 -112 173 -58 -152 20 4 -64 3 -12 78 41 70 -69 -151 35 -37 180 -78 1
4208 1 -104 -180 -13 -501 28 -235 202 15 -38 27 65 18 -284 -199 -116 -262 -329 -137 16 19 74 -95 88 -348
4232 -348 60 118 1 178 172 221 45 -208 -5 122 116 58 -121 75 32 26 -139 -17 -102 -277 -492 -41 175 -222
4256 -222 -27 14 176 75 -162 -192 -41 76 -75 154 1 -165 -150 -236 -60 54 148 101 -1 51 118 -283 -6
4279 -6 -21 6 -20 106 160 -143 -237 207 -88 -183 54 -67 98 332 4 111 117 131 283 -78 -146 -116 219 -27
4303b7J87j63MM52l47j76mnK41j71J64k74L99J5l67J45J97r0J10j66op2j24J36
4327E8mp9Q0j78r4M14l10K25k84M0P6N8J09J55l57J42k2K2j5N2j36P3j70J85o
4352C4M4J83j88q5N3o1o7K5Q9o1J42j26N3mK00j53J00k35m1o2K88j48N4j61M94
4377C67m40k10J22j63K38j57L75k60N4J7P5j58J50j05K47n2l8j57RK12k07J28
4399D7l70M40J21n12L51m9L0pJ03m98J42L70j04r5K37J71l00k29L71k82lK98m04
4422a72J02k29M88l44K46qj58q7J18M00l11l11K46J35j65K52j47J48l53Q3J27
4443F0J48k10K25K7J28m10j5N3%J23k13J41j17nL5J36j51l3J00N4k23K74l88M04
4467A43O6j35j22l5kk33K45J67k28l04L69R4M5k48K60l08M13n2K1j35NQ6L4M4
$$ plain form
4303 -27 160 -3 1 453 106 -70 -74 -79 162 -9 155 -119 280 295 -72 73 270 180 290 124 118 46 -78 58
4327 58 54 -25 55 -123 -217 197 -113 112 -172 -132 -56 2 111 266 -91 51 29 51 36 88 -48 25 -145 40 34
4352 34 78 261 73 -12 41 -20 -87 -62 27 -34 108 -18 35 31 231 78 178 -57 -98 -160 128 -20 34 -127 367
4377 367 -73 -283 -161 -324 -86 -243 132 -128 -74 -57 18 -140 10 -95 152 100 62 -95 -86 126 -81 47
4399 47 -323 117 238 -274 77 28 58 51 154 -344 -202 168 64 -31 206 377 77 -152 219 -63 -66 232 -172
4422 -172 -70 -299 189 -155 91 83 -75 -162 -44 356 45 -266 -20 115 -50 202 55 203 -150 -67 60
4443 60 208 -2 223 250 378 -32 -47 6 6 129 -84 57 -60 -65 -30 106 -45 -78 22 76 -147 127 -261 143
4467 143 209 74 -48 -83 -85 -318 -73 94 -134 -438 -69 25 70 -178 82 -226 187 135 156 21 26 112 146 190
4491A90k33jj43M4L91k67m5J21k15J20J5o1M4K40q6o01N16N8j81j7J99k80K52
4514F0l88J07L40j32K85l66l2p5K00r4O0j59J72k09K22O5R8l85L51j58K93j99
4536E6M2N0m44K75P7qK90l08l1K05j94j21K72J48m44P3K60qj39r3j1J02j30K87
4560B06l08J37L2j67j5J39K08k94j91K61K01k31P7j1R6k03K29l37k8K51J25j21
4582E6j94R9K1O2j77K85l37K38K3q8l69M56k77J76K24m26L10q3K13k84M25m43
4604i0K28l43M77m09p3J07j31J81k37L50l64L18k1k54J23J31k44N0J40L39l51
4625g3r1J68l8J09l75K67j18K56j11j30pK46l49M99k10k66K84J2J39k54J96j63
4647im2j2K2J17K02l96J13r2Q0J92l23J26K29l53j11K59k24J97L5P0j41P5m0J14
$$ plain form
4491 190 -43 -44 -187 -143 248 -19 -64 57 -158 -38 -23 -84 -40 200 114 -487 29 87 -94 -111 88 -192 60
4514 60 -328 -221 119 -13 272 -94 -126 -201 -1 -95 -35 -194 -22 -231 -9 56 154 -231 120 -38 255 56
4536 56 98 148 -296 -21 56 48 338 30 -1 204 10 -111 161 309 -135 -62 198 190 51 -42 -53 49 -81 206
4560 206 -102 35 67 -100 -115 24 232 -62 -253 8 209 -22 55 44 140 -63 166 -171 -199 52 177 56
4582 56 -138 -39 -18 44 -133 152 -185 53 76 -12 -381 75 -202 -26 198 -228 82 -1 212 -72 353 -90
4604 -90 138 -205 272 -137 -210 -103 -234 -53 -290 60 -304 14 -7 -261 -138 -7 -251 -201 -61 278 -73
4625 -73 -164 4 -34 75 -300 -33 -151 105 -6 -136 -143 103 -246 253 43 -223 61 73 212 -42 154 -9
4647 -9 -51 -63 -41 76 278 -118 -5 -97 -17 175 -148 -22 207 -146 -257 2 -222 -25 10 80 -61 14 -26 88
4671H8K77k19J35j54k74J08J71K21l87N8j31N5j25M54l11L2J98l19K46j99K77
4692B01k80J08l02K10R3J4P3J07l47J48J19J23k20J11l1Ok34j38n5N65o9o3J07
4715B46k60M0m5J01k02L0k7J08m1O2L5Q0l54K75l01L31k81L52p5p2K24k99K41
4738A68o4J2J64k39oJ68j12P8j21R7l46M29m04N4J61j35k03K70J27n59M95J3R
4761E6r7J3j4O4k01N2NP8p3K08J84k71M18m88M48n86L58j97k43M76l6k62J08J21
4785A21k87Q9nN7j06K14k09K62l34M9N89j53n81lK58k49M36q8m72L77K25o0r7
4808C3K8j43L08j72P4k40j4j3K80k83J24J3J52k67J99j80M8j11L05j0l8p2o8J68
4832A21j39j48K57K53j81j05k46M47l14J38j94Q1L1J29Rq6J15n5J00l9J36m93
$$ plain form
4671 88 365 146 281 127 -147 -39 132 353 -34 24 -107 -52 -177 277 -34 -2 196 -123 123 -76 201
4692 201 -79 29 -273 -63 30 44 117 224 -123 25 144 267 47 158 127 133 -101 -239 -294 271 202 139 246
4715 246 -14 26 -19 82 -120 -90 -117 -9 -50 12 47 127 -227 48 -253 78 -203 149 74 2 226 -73 168
4738 168 104 116 280 41 35 203 91 169 48 145 -201 228 -176 -122 39 -96 -299 -29 98 -461 34 47 56
4761 56 -41 -28 -42 22 -179 -127 -122 -44 -117 91 275 4 422 -66 382 -204 154 -43 -286 190 154 -108 0 121
4785 121 -166 -77 -82 -25 -131 83 -126 136 -198 -149 440 287 -294 -297 -39 -288 148 60 -412 -35 190 130 33
4808 33 61 -82 226 54 128 -112 -126 -139 141 -142 -18 -5 147 -120 79 -101 -53 -164 141 131 93 21 -47 121
4832 121 -18 -166 91 344 163 58 -188 259 -55 83 -111 -30 1 130 139 53 168 113 213 174 310 -183
4854a83J27J25j34j20L82k76j12r5q6M36l1J4o8m4j88K51o8K2n7j4m2J37r0J9
4878i5J70k50R3K03m74J00M39k61K16j08k08M35L6j88j08P1L8r4k74RK45j3j37
4901a55Q2M79l11j84L28j45j32q8K43l0O3j67K99k78rL2p4k28L9L34K2k83o1L24
4925A00O1k99K65j05j27K01p1j41O7K59l76J90O5l65M08J13l04J63l19K41n7J45
4947A14lj31j0n9J86l77L50M4j57J19n0k5j71p6J05J91l29K87j94N4L8OK53k56
4971i1K7J7N0j11J52k89K59q3P3N89p69Q7L28q1l71M5J11nJ94k02m6O1q6J73j8
4996A4oJ54j77J83j29J06k43O3K30O7j74r9K10J6l62j8M19l69L7L95l47j79R5
5019a14K19n1k56J0L66m53k69M89j22M40k90j73K67Q2p1o1j45j43K07J79m3j33
$$ plain form
4854 -183 -56 69 -65 -185 197 -79 -191 -286 -372 64 33 47 -21 -65 -253 -2 -70 -48 -105 -119 -161 -24 -114 -95
4878 -95 75 -175 -82 121 -353 -253 186 -75 141 33 -175 260 296 108 0 71 109 15 -259 -250 -5 -18 -155
4901 -155 -73 406 95 -89 239 94 -38 -126 117 87 150 -17 282 4 -5 27 -47 -275 -236 98 120 -163 -224 100
4925 100 161 -138 127 22 -105 96 25 -116 -49 210 -166 24 89 -276 132 245 -59 104 -215 26 -31 114
4947 114 111 -20 -30 -89 97 -280 70 114 -43 76 26 1 -170 -246 -141 50 -279 8 -186 -132 -94 -88 165 -91
4971 -91 -64 -47 3 -108 44 -245 14 -69 4 593 -176 -89 239 158 -213 -168 -57 -62 132 -70 -116 -55 -141 32 14
4996 14 8 162 -15 168 39 145 -98 -35 195 262 88 -11 199 215 -147 -165 254 -115 -78 317 -30 -209 -114
5019 -114 105 54 -202 -192 174 -279 -548 -59 -181 259 -31 -204 63 145 74 13 -132 -275 -68 111 68 -65
5041f5K44j82J35o0q6K10M43o83N39j38k65k1j9l16J51m10M53N9K79m08r0K26
5063dn2J67l39N36m68R8m3Q8J66r9l17M20j68k68K79M2j09M0n5K08M0k63J48j77
5087a30n4J86o7K1K42l71K52M9j68J1q3N9K84k33j99K33R0j1q6q0j18J66r8j66
5111b71P6P9J58r7K40Q6m36M40l81Q0J19k58J75l2pj45j13K93j43L66m3k32k08
5134b54Q4J01k15K12K92j93k43k7M71oj97j07K7J56j86K0k28K67j0j38J47M5r0
5157g2j27L2J17K52n02J87M35k56l19K91k92J72PK6P5J78k78J95l73L71l67J03
5179a45O44n86L60k21r9O3j79q3Q4j75M91j95L58m32J85n9l2k8J3q8J11K3K82
5202B92m5l56m8M4j21J35N48o68J13J42l9L94n05K43k02J64O8j13m70L25n1j3
$$ plain form
5041 -65 179 -3 132 72 -14 196 639 -44 495 357 92 71 52 -264 -113 -523 -70 -11 268 -140 -230 -4
5063 -4 -56 111 -228 308 -160 -62 -105 -17 149 50 -267 153 -15 -283 -4 38 -71 -31 -86 122 162 -101 47 -130
5087 -130 -184 2 -65 -44 198 -173 79 128 -40 -29 -112 -53 231 -2 -201 32 122 111 25 -55 -173 -7 -105 -271
5111 -271 -195 -116 42 -55 185 271 -165 275 -106 -26 93 -165 10 -22 -29 -174 -287 6 -137 229 186 -46 -254
5134 -254 -170 -69 -284 -72 220 27 -216 -243 228 222 25 -82 -55 101 -85 -65 -293 -26 -36 -174 -27 18 -72
5157 -72 -199 -167 -50 202 -300 -113 322 66 -253 38 -254 -82 -75 -49 26 204 -74 121 -252 119 -248 -145
5179 -145 499 -87 273 52 -47 16 -163 -246 -162 -337 154 -41 317 -115 70 11 -21 -49 -36 -124 -13 10 292
5202 292 247 -109 -157 -113 -234 -99 449 -219 -106 36 -3 391 -114 129 -73 91 159 46 -424 -99 -150 -163
5224a63K54J04l64NL53l94J33J40k92N2K45L2q0j4o3RJ31k3m8j97L92o0k58j10
5248b16J40q5K65N1m13m0L94J77k34k6j63K14j83M1K58r2j51j12r7J69Q3j89K08
5271aj85J4L19k9kq0j9j72J69N4L5K1k24J49rJ39m77M15k75P7L94m25j6J15j7
5296c0R7j02R3M7k62M12m14M71l59L0o8o1K78k24K49M7n86M34J97l03m0K44k04
5319e4R5K39k81j8o8J2K07j82J07j23J85k60j59N00k73J75j49k46K35K11k15O
5341e6k72L8L10N3k8K16p7j57K04k93K04l78M10K95p59K32P4j23K12o1j20J31
5363E5Ok86K64LQ7J05p0j89J46j08j03N1j95J57j29J67J03L5o1j28j7j26J06K78
5387A51l19n4L38m8j77m3ML2n3L12m24K49M6K00l05j37L17K45k89k60K78j63N7
$$ plain form
5224 -163 91 195 -169 -164 189 -205 -72 68 -224 -172 73 105 25 11 -52 -43 88 65 17 -180 212 152 -106 -216
5248 -216 -76 -161 104 155 -258 -298 96 273 39 13 -150 64 -119 -78 180 88 -63 -175 -272 -103 -20 -209 -1
5271 -1 -186 -172 147 118 116 36 17 -155 14 68 103 124 -100 49 40 179 -298 117 -158 -81 313 -112 -128 -13 -30
5296 -30 67 -35 58 105 -157 255 -159 312 -47 -17 -85 -146 132 -92 157 204 -382 52 249 -54 -94 150 -54
5319 -54 41 280 -1 -19 -87 -75 132 -50 57 -66 119 -141 -300 200 -73 102 -47 -293 -58 153 -62 -56
5341 -56 -328 -290 20 73 45 261 184 27 231 -62 142 -236 174 469 -290 -58 16 -107 105 44 -76 55
5363 55 61 -225 39 42 129 234 164 -25 121 13 -90 -39 -234 -77 -206 -39 64 99 38 -90 -107 -233 -127 151
5387 151 -168 -222 116 68 -109 -152 -148 -116 -169 143 -281 -32 14 214 -91 -228 89 334 45 -215 63 -100 -43
5410d3p2P7Q6r5k11M24l40J86l6O3O2L3l91M58j24j59j1K2j74J62J30M8O4n3m31
5435c25M30o2J41p1J50l29qK41k85K17l9J70k95J03j14L18k93lM8j88J64L7M2
5458D9k61J72L4MJ2m1j23K36J8k31p1J86L2Q6j27J22L6k18L61m52J85k2j11k6
5482a50J5j22L67Jp2L0k34L23m14L77k07K02l43J37J0J56r8J98k19j93L76l05
5504a65K29j1l77L72r3K23j77O1k23J31K81l66j32L65J94l67j64j21J89J29L31
5525C09m42q6K26j92Q9k94N29K45n85L62j8l33J60l25M69k57J64l4k58K86j28
5546a13J31J02k85L02o7K2K95k70J6k12M3L80n78J31J09J7j31q1M15l07Q5N6R8
5569A58k31j37L26r7K18j88k17j89L95j51J03p4R6j00L98k66j29J88j53K72l92
$$ plain form
5410 -43 -115 -38 48 -47 -258 166 -174 12 -24 39 101 134 -257 201 77 -82 -93 -71 -245 -83 47 95 159 106 -325
5435 -325 105 43 184 113 263 -66 -74 167 -118 99 60 230 -65 38 -76 242 -51 -54 -6 -194 -30 7 49
5458 49 -212 -40 -6 -2 10 -31 -154 82 100 -131 -202 -16 16 102 -25 97 133 -85 276 -176 9 -13 -124 -150
5482 -150 -135 -257 110 111 39 69 -165 158 -256 121 -86 116 -227 -90 -80 76 -22 176 -43 -236 140 -165
5504 -165 64 53 -324 48 -45 178 1 62 -161 -30 251 -115 -247 118 312 -55 -219 -340 -151 -22 309
5525 309 -133 -219 7 -185 -96 -390 139 384 -201 161 143 -190 -30 -355 114 -143 21 -13 -271 15 -113
5546 -113 18 120 -165 137 70 92 387 117 133 -79 -36 344 -234 -103 6 23 -108 -189 226 -81 4 60 158
5569 158 -73 -210 116 19 237 49 -168 -357 38 -113 -10 -84 12 -88 310 44 -85 103 -50 222 -170
5590a70K86P2j80j18L35l17l4K52l9r0k32J37j38K42J45j88J62r8Jl7L13l43n6
5613i5J75p6J9j30L90l3k45j03Q4j57K8j8J40K2rl6k29K98j17O8p8m6j10M21J83
5638C46k92r9K76n04K23R4n5kJ04M9m1j70r7mj84J26K98j52m6J54P0O8k79q1J35
5663f3L3k30J69L2n3J0K22j46J16j18j82k6J25l1K63J11k50n5J45J08J93l54k44
5686b25K17j40k5L9J80k08J34J5j85K42j06J47K18k44l57J80L06l81M54m25K30
5707F6l7j88K15k04L10k4K6k50k3J50J47j37k43K88Q2j64Q5p7M1K75l51j72P6
5730a09OJ19Q9J53k38n7K61j01J44n21K50R1n9r0J29j42L68j67J16j01j62J53
5752A32l90K43J90k03K50l58J42n4j52J27j08J80q5j52k7j49M51K1J34l12K66
$$ plain form
5590 -170 116 188 8 -110 225 -92 -126 126 87 -3 -235 -98 -236 6 151 -37 125 27 28 -9 304 -39 -95
5613 -95 80 4 23 -107 283 250 5 -98 -14 -171 -143 -161 -21 1 -8 -44 -273 25 -92 -24 -102 -148 -258 163 346
5638 346 54 -45 231 -273 -50 44 -11 -13 91 140 99 -71 -168 -172 -356 -230 68 -84 -130 24 94 162 -117 -198 -63
5663 -63 -30 -260 -91 -59 -112 -102 120 -26 90 -28 -210 -236 -111 -142 121 232 -18 -73 72 180 373 19 -225
5686 -225 -8 -148 -173 -134 46 -162 -28 -13 -198 44 -62 85 303 59 -298 -118 188 -193 261 -164 66
5707 66 29 -159 56 -148 162 138 164 -86 -109 41 188 51 -192 96 178 14 99 22 63 338 -13 -185 -109
5730 -109 -103 16 105 258 20 -37 224 123 267 -254 -4 87 28 -62 67 -75 293 126 242 141 -21 132
5752 132 -258 -15 175 -28 222 -136 6 -48 -200 -73 -181 -1 -86 -238 -265 -414 37 58 192 -120 146
5773A46j40QJ94j90L2R6j72J94l31M01p7Lj31j49L00k11K72m09n5K60K57l17K70
5796B51n42L56j76L27l51J64J23l45K87n4o7j35L37k01J90m26M58l85J57L19j26
5817A61j95K08l3k43K22j05J29j75J50k40L6r9K93j15K6m10M78j27r5O19l41k1
5839A23n2j12L07j27j58j71Lj66O21L3l74o4j65J28K25L0L19j85n66L28k9P4l06
5862b84L30k60K80j30J00J49k11M15k61k93r4K20L04l49q5K0ljK14j26J13l73
5884c25M30j51L90k83Q2m09J10J97P2l47j0L4L85l21J52J44l88L69j9P1j94j10
5906a21N99m81j0J04j88K03LJ22k47K0K13l21J32K75k15j18R4j14j22L19J9j35
5928C1j15J40Q2J8j78k25K51j12jp9L47R5l09N9O7j72J62n8n3K93k11J01l33M3
$$ plain form
5773 146 6 14 208 18 50 146 -26 168 -163 238 161 164 33 -116 184 -27 245 -164 -219 41 298 -19 251
5796 251 -291 65 -111 216 -135 29 152 -193 94 40 -27 -162 175 -26 164 -262 196 -189 -32 287 161
5817 161 -34 174 141 -102 120 15 144 -31 119 -121 -85 -184 109 -6 20 -390 88 -39 -134 485 144 123
5839 123 71 -41 266 139 -19 -190 -187 -353 268 301 -73 -137 -302 -174 51 81 400 215 -351 -23 -52 22 -284
5862 -284 46 -214 66 -64 36 185 -26 389 128 -165 -259 -39 265 -84 -169 -149 -152 -153 61 -65 48 -325
5884 -325 105 -46 344 61 143 -266 -156 41 113 -234 -244 -210 175 -146 6 150 -238 131 112 183 -11 -121
5906 -121 478 -3 -13 91 -97 106 109 231 -16 4 217 -104 28 303 88 -30 64 -50 -172 147 166 31
5928 31 -84 56 138 156 -22 -247 4 -108 -109 -188 159 254 -55 4 71 -101 61 3 -50 243 32 133 -200 -157
5952a57J39J78l85L19j46j25K77m8l07J52J63J14k89r2mk78P72o24L42j12K18
5973A07j96J11j7L91l07K35n00K00l3ll45J38Q3J53o4l37M95j45J58k41L01m35
5995b51L14P3J60l48j52O1L4J00k67K25p4L52m9j25m37O70k94j08q2K64K10k28
6017D8r5R9q7J33j3k58K16N0k19rJ65j61j29J83M9n9l9J76N9k72N5n0N7J45j96
6042a52L11l27L14k06m6J89J27j17j02k70M15L6k01j4k4L17m22K35JK50k73j09
6064f8M29m70J71r2L02k41J0M2o0Qj7J21m81L70M4N2j92J5l6J47r0J9o1m6L85
6089B61l28J98j1j89K85k66p0K01K7p7j13J71j02NO0NK5k29J73j72Q8k8m8J76
6113D2l19N16J00o62M39J43j51j8m9j78J17KM1k52L72l04%K65Rj90J33J52L3l39
$$ plain form
5952 -157 -18 160 -225 94 -52 -177 100 52 -255 -103 60 174 -115 -207 -211 -489 283 -341 1 -111 107
5973 107 -89 22 5 396 89 324 -176 24 -9 -12 -357 -219 -136 17 -47 -384 111 -34 124 -117 184 -251
5995 -251 63 136 296 -52 -204 -143 -109 -9 -276 -51 -125 227 178 53 -384 286 -8 -116 -198 66 276 48
6017 48 -47 52 -35 98 85 -173 43 93 -126 -135 30 -131 -260 -77 -28 -87 -126 50 109 -163 -108 -158 -101 44 -152
6042 -152 159 -168 146 -60 -106 83 210 93 -9 -279 136 172 -29 -43 -67 250 -172 63 64 314 41 -68
6064 -68 361 -109 62 -30 272 31 41 83 23 31 14 135 -346 24 68 120 -72 -57 -93 54 -36 -17 -78 -124 261
6089 261 -67 131 120 -69 216 -50 -120 81 108 31 -82 89 -13 -8 52 57 82 -147 26 -146 -58 -86 -134 42
6113 42 -277 239 339 -323 116 259 108 90 41 -137 -20 -18 23 -229 143 -161 -161 104 113 -77 56 208 241 -98
6137i8N4J54k41L23m24J44n3K29M3n8J45l98K01j86L46l76K73Q5m16K06j37J45
6159c9K64J45o23J43K8K38n95K55J37J13j42K09r6m1K7j0K8J55j48k9l6J11K12
6182C06l91m1J13j25j94K95K56n08N37j27j16L1J28j37k42K62j36j69L01J80m06
6203a83L57l3j40J93j29o3j51K41j25LL5nJ8j85M00j96O5l41L04J23n8L9k39J61
6227I1mk74K76r5P4q0R4J05j17j08n6J63j10J55mj66o8R0J7j95J98mj35K90r3
6252D4J09k1k71k11K62O8R2k15K0Q3K31j86O5m91O96J65l37k02J50M0k26L54l59
6275a40q5K04OJ5j83j5L04l52L25j44J80j50J86k19L9j29L9Q7K19j59l37L75L55
6298D21m93N4P1j3P4j80K94j67J60l27j21L16P7R3n13L33O0n4J15m79L71l28L60
$$ plain form
6137 -98 -44 110 -131 192 -232 -88 -141 88 131 73 218 -180 21 -165 181 -195 78 163 -253 -47 -184 -39
6159 -39 225 370 -253 -110 -82 156 -439 -184 -47 66 -76 133 37 -4 23 13 41 196 48 19 -17 94 306
6182 306 -85 -126 -13 -138 -332 -37 219 -289 248 121 5 36 164 27 -215 47 -89 -258 43 223 -183
6203 -183 174 141 1 194 65 2 -149 92 -33 -30 5 0 18 -167 233 37 102 -239 65 188 130 169 -70 91
6227 91 87 -187 89 -6 68 -12 82 187 70 -38 -94 69 -41 114 110 -56 -124 -34 -17 -212 -14 -18 -153 137 44
6252 44 153 132 -139 -350 -88 -20 72 -143 -123 -40 191 5 70 -421 275 440 103 -99 51 91 -135 219 -140
6275 -140 -225 -21 -15 0 -183 -198 106 -246 79 -65 115 -35 151 -68 -29 -158 -119 -32 187 28 -309 66 421
6298 421 -72 -18 53 40 114 -66 228 61 221 -106 -227 89 166 259 -254 79 139 85 200 -279 92 -236 124
6321A24n6P6P2l68KK5N2J4J16q8q9L67o29L22J4Q1k02L59m7j80k3pP8J59k92j82
6347c02N19k20k65J26K6J67N9l06n5K99l3j05M5n8n7K79j8J99k48p6K38l81J44
6370b3J87j13J33p7P1j55qj71J76l6j95K55k88K39k09M43r5k29J40K0k32Jj1K45
6394F8l20K42q5m4J61n0K0k57K45m22L97R3m9J20j80J33o7K08j07j17R5k33K30
6417H1K60l79j40K6j33K13M6P8r6j01L30j65J62k51l6K70m26J21J35L9L3j82L30
6440B15k64OJ00l1l80J87K8J36m8JkK99k35Q0l4Rj21o4J18J67j53J81j67J81m
6465B05j13k6j29p4J6P3k02J68m9p2M45k61j65k7L86p6j51k9l17Q35n21m8P2K52
6489A92k52J35N4k06kp2K66qL9k00J40K02l39k64N01k67J56j68J51qj36J32rJ35
$$ plain form
6321 124 68 144 216 -152 -150 -125 -73 -59 57 -31 -120 247 -382 -60 -46 35 -167 192 145 -35 -58 -65 13 172 -120 -302
6347 -302 217 -3 -268 -142 -116 51 110 -196 -251 48 15 -90 -45 -103 -160 119 101 300 52 -24 214 -167 -23
6370 -23 164 51 184 107 178 23 15 -156 20 -16 -211 44 -244 -5 -214 229 134 -95 45 65 -167 -166 -177 68
6394 68 -252 -10 -95 -139 22 -28 -8 -265 -20 -442 -45 48 -1 119 -61 72 5 213 106 -11 84 -149 81
6417 81 341 -38 -178 -152 -285 -72 -26 52 -44 -145 185 20 182 -69 -105 165 -261 -140 -5 34 67 -115 215
6440 215 -49 -43 57 26 -354 -167 -139 -3 -51 -50 -52 247 12 92 58 67 -54 -118 0 167 14 195 28 209 205
6465 205 92 66 -63 -137 -121 -48 -250 -82 -131 -203 242 -19 -184 -211 175 99 -52 -81 -398 437 -84 -132 -60 192
6489 192 -60 75 129 -77 -79 -151 115 107 146 -54 86 288 -51 -315 186 -81 75 -93 58 50 -86 46 37 172
6513A72k15J48o3N4p6J38m79L67o3Q9p3L53k89j13p1L0J28J30m1l71J89j3K40
6536A71j28j9Q5j89L79r6n06L04l09J74R5Q4J8r3k83M68j65J96l4l88J30M8J65
6559A07j01j38j55m5K33J74m9L7j88R9M50l9m55M1k62K53o1P0J62r5j03l8J35
6582C2j15P3L2K43m52o3M33k55M8Q7l20J23N7k2J00N6k51K81Q2j82j99O1k10K56
6606a05P7P6K48l31O4R6j49R1QP8k62R9k20J70j37O8J2M7J52k82M41m02J35QL79
6631C61k88l31K99J72r7L2l97K5K80J12Ll69J73R9j82K97kl24K34nQ1j76J57j36
6655A8q0J49J1q6j3l5k1R0k4m46L42P6P7r8J6J91l72J04J45R4j62l18M98p9P5
6680A52k0j50l79M3K42M4l9J99k90L25k63K88p7J98m82J13R1J7N9j17n3K24k67
$$ plain form
6513 172 -43 105 42 96 20 158 -321 46 -17 72 -1 352 63 -50 -121 -91 37 167 126 -245 -56 -69 171
6536 171 43 24 109 -80 299 203 -303 1 -308 -134 -39 45 63 -30 -313 155 -10 186 152 -236 -106 -58 107
6559 107 6 -132 -287 -332 -99 75 26 63 -125 -26 424 385 -70 -29 -291 -38 -99 -29 133 38 -65 -103 32
6582 32 -83 -10 22 265 -187 -250 183 -72 -24 63 -257 -134 -77 -99 1 57 -194 87 169 -13 -212 -151 -361 -105
6606 -105 -28 48 296 -35 29 125 -24 67 75 153 -109 -10 -230 -60 -197 -129 -117 -70 82 -200 241 -161 -26 -18 361
6631 361 73 -258 41 213 116 148 -249 -224 56 168 171 -198 -25 74 -108 189 187 -137 97 92 173 -3 154 18
6655 18 -62 87 98 12 -1 -36 -57 33 9 -437 -95 -19 58 -40 -24 167 -205 -101 44 138 -24 -342 156 77 152
6680 152 132 -18 -397 -354 -112 -68 -107 92 -198 127 -136 152 75 273 -209 -96 -5 12 71 -46 -99 125 -142
6703a42n0M06n27M22k80K08J47l26L66j89j74N5j29L60j17j83M8q7k2J38l6K11
6725I9o5k44J25o1K7K10o8N9l48J62J62l1j23O9j32M00n7n7j61J05O2j86K7J95
6749A69k14J35J02M8l07O8%j07R7k75L20j89J00N7O6l9j47J01k02L40k30k27L55
6772B1J5mj93M48J6l20k9L32l21l0J44k39K91m22N13l71J81K04k03P3l37k49M73
6795gJ50Mk75K97j31k9O6n4p0o0K47Q4m29L43l42K98k72Q9J59r1%j24j61L57j32
6820h3m4M41k40kL99m80j08k21N82m8m21O52n16J10k45J22J74O2j00o1r9qK20
6843H6Ml7J20j41m3j80L99l67J25Q2J55J9n21M1N69k41J35j87j2J18r8k8L7qj08
6868h1K7K62l53L83k16k6J02k1l01J45k02L46k45M60n08L38K4j39R5K27k29J5
$$ plain form
6703 -142 -192 214 -313 109 -171 37 184 -142 224 35 -139 -84 -213 147 30 -153 -105 -192 -214 -76 -112 99
6725 99 34 -210 -85 -146 -119 91 23 82 -266 -104 58 27 -96 -27 -159 241 184 127 -34 71 133 -53 -26 169
6749 169 -45 90 192 240 -67 1 1 -106 -9 -284 36 -153 -53 4 70 31 -116 -15 -217 123 -107 -334 21
6772 21 36 32 -161 287 303 -17 -46 286 -35 -65 79 -160 131 -291 222 -149 32 236 33 106 -231 -480 -7
6795 -7 143 147 -128 169 38 9 75 21 -49 -109 138 222 -207 136 -206 92 -180 -91 68 -23 -23 -147 -308 49 -83
6820 -83 -127 314 74 72 471 -9 -117 -338 244 196 -225 427 -89 21 -224 -102 72 134 34 -27 -126 -134 86
6843 86 90 53 173 32 -11 -191 208 -159 -34 48 203 222 -299 -258 311 70 205 18 6 124 26 -2 35 27 -81
6868 -81 -54 208 -145 238 22 -4 98 77 -224 -79 -281 65 -180 280 -228 110 134 -5 90 317 88 103
6890A03J04k51j2M8j38J36K18J21n03p5J21L5O1M6L8l37L17j32om5K12j53J11
6913A9j39N0j0R9q6pj05K07j11q1J75JR0k25j47Q5J01K40l40J14L4p6n6R8j2K19
6939A37J50j80l61L27j49J59k82L17j19kJ26K25n12J65j94J2K23Q6k25J5N8R5
6961G1j07k0J10r8J87m6k46K15K2k06l1K98l65K87J39l46K3L14k50J7j4K97j54
6984I7k07K87K1k9j34J17j96J5k79J88J05K9J23l31N49o1k79k14j44M06r2j6J61
7007A16k55L18k01J12k20K47J1j77R3O4k36OJ87O1j25J48j01l8j52q5J96j97L31
7030A03l19K65J78m11K68j1l68K19O1L7J18j34p2j17K05M8J2k14N7L99l33j01
7052a10O5J48L94k39m41K27p9M19n10J87r7j12K03m2j83K2Q5r4J83k3j54K16L32
$$ plain form
6890 103 207 -44 -56 -8 -146 -10 208 329 -174 -249 -128 -93 -32 14 52 -285 32 -100 -106 -151 61 -92 19
6913 19 -120 -70 -80 19 -67 -74 -179 28 -83 -164 11 12 102 -123 -270 -185 -84 156 -184 -70 -36 -112 -168 -70 -82 137
6939 137 287 107 -254 73 -76 83 -199 118 -1 -3 123 348 -164 1 -193 -181 42 128 -97 -82 -24 71
6961 71 -36 -56 54 -44 143 97 -149 66 88 -118 -149 149 -216 71 210 -136 -113 201 -49 -32 -46 251 97
6984 97 -110 177 198 169 35 152 -44 -29 -308 -120 -15 14 137 -194 355 294 15 -199 -343 63 -29 -45 116
7007 116 -139 179 -22 90 -130 117 128 -49 44 108 -128 -122 65 126 1 149 48 10 -142 -227 -31 -228 103
7030 103 -216 49 227 -184 84 73 -295 -76 -15 22 140 6 -66 -183 22 70 82 -132 -75 324 -9 -110
7052 -110 -45 103 497 258 -183 44 -35 384 -126 61 -36 -148 55 13 -170 -148 -63 -157 26 3 -151 65 397
7075C97l85n6p9n4K96j0K22m67K39k28J54K36k20l04jJ46j69L09j02p7K85l43
7097b11J52K31o6l34O38m44m5L44k12j31j72N25l96K21j77J40k2j43O7kP0j81
7119a48J85J2j85K32j36k91L49j00Q6l99J31K65j35k05K74J15l1k19Q2q2j64Q81
7141E17n23K04m8j63l12M26l57M14J9o1j53K35j81j99R8K04oo4q9J33J66m56M1
7164a55q2K10J11q0M40n39N0J30k38j0L3O9JL72l21P8j83L27m07L31J47j65k04
7187h5j43J12J06O9k6k05L01k14jo8K19j57o1K76l50K7L50r7R4J9k25K19j37J41
7211A64m89M42r6j44K24k52J68q8L92k98o9Q2k8q6K86l31K67k7r8J12j20L77l82
7234Fr7J39j52J75L29l07m92K30J1J42j11L90n22J1K18J20R1k32j10J41j37J57
$$ plain form
7075 397 12 -44 -123 -177 119 109 331 -136 103 -125 29 265 45 -259 -260 -114 -283 26 -76 -153 132 -211
7097 -211 -59 172 106 -228 410 -34 -79 265 53 -78 -250 275 -121 100 -77 63 41 -102 -35 -37 33 -148
7119 -148 37 49 -136 96 -40 -331 18 -82 4 -395 -264 1 -134 -339 -65 50 19 -200 -118 -200 -364 517
7141 517 -6 198 150 -13 -325 101 -256 158 177 116 -37 198 17 -182 -84 120 114 50 -39 94 260 -196 -155
7164 -155 -237 -27 84 4 444 -95 -45 85 -153 -163 -130 -61 -60 312 -9 69 -114 213 -194 137 284 119 -85
7187 -85 -228 -116 -10 59 33 -172 129 -85 -86 -154 65 -92 -153 123 -227 -200 150 53 147 166 -59 160 23 164
7211 164 -325 117 21 -123 101 -151 17 -71 321 23 -46 36 8 -78 208 -123 144 117 19 131 11 388 6
7234 6 -91 48 -104 71 400 93 -399 -169 -158 -16 -127 263 -259 -248 -30 90 181 -51 -161 -20 -157 0
7256@o8r8L16k86P4J93l68K56l8L38m90K41q4L9J26m99O35m03J18K32j32l00M3
7279a55K00k18J0Q2j28K04P6k37J54L0J44j41j33L46j71K9m69M01R2k35k13K54
7301g8J0j25O29n34J63j02j51K91jj80K9J12j14j51l2J18J18Q9k07l5Q0M5k8j09
7325a63q6n8J61o5J95jj7M01j42l78L18k81K38k3k57K66k17n0NL59q9l12k1N9
7349a58K39R7k60Q0o0l06L25l44L05J56j64L4j17N23l96j57K65k12J02J7L09j19
7371A59m59M03j46j20M8J78P6M7l43n3j43M70j43k26P9K84N2j48N8l0j94J41k3
7394c3o6J49k6n6J46j59o2L4m32L61O1K23m44j2J98p2j7L66k32k31J53m20M71
7417a00J16L1k21o6J60L7O1k8Q4k34p7K58k28j39K01J18p8j26L90k60J69k40L85
$$ plain form
7256 0 -68 -166 150 -136 -62 131 -237 19 -19 319 -171 70 -14 25 151 -348 287 -116 2 234 102 -198 -155
7279 -155 45 -173 -163 -81 -209 -5 71 -166 -12 18 162 21 -112 234 63 92 -377 24 116 -119 -332 -78
7301 -78 -68 -193 436 -98 65 -37 -188 103 102 -78 -49 63 -51 -202 -234 -116 2 91 -116 -151 -71 -26 -54 -163
7325 -163 -249 -307 -146 -211 -16 -17 -34 367 225 -153 165 -116 122 99 -158 108 -109 -159 -154 205 116 -196 -217 -158
7349 -158 81 178 -82 -2 -62 -368 -43 -387 -82 74 -90 -56 -173 350 -46 -203 62 -150 -48 -31 278 159
7371 159 -300 103 -43 -163 -115 63 139 186 -157 -210 -353 117 -26 -252 -173 111 163 15 73 43 -151 -10 -33
7394 -33 -99 50 24 -32 114 -45 -107 -73 -505 -144 -83 140 -304 -316 -118 -190 -207 159 -73 -304 -151 -571 -100
7417 -100 16 47 -174 -240 -80 -43 18 -10 74 -160 -237 21 -207 -346 -145 -27 -105 -231 159 -101 68 -172 213
7440B13j94n6J92j0R5j60j55j16M09l17RJ63Q9l25K96k91L40n42L64j27J43l36
7462c16N30j92JK08j31K56l60K15J24m87K65j66J4n2K25j11j13J64k99J27q5L51
7484A68j51K6k12m4M9K93p3J47j08k0j20J89J1j6j12l9L15l40J94j14J96j44j61
7507f6J39j22k13K99J35k37J11j82K14k10L38l47J36j34J84j06L48O9n57N0J63
7528A2RP2p3K8k41J26J72k16p7M38J85l88l10L90o3j85l4j0K75k39K03p2j64K14
7552E2o0O3j83J18k4l26L99k83MJ59J76j11J30j18m2J70k38l0R3m7K06l48K4J99
7576a7o0l41M86k91L86r7k05J24K2L7j40O1j05N8P2R1j47j56J13J92N4k54K55
7599A38k30k7K95j65o8P2J44M0p4k38j33M70m39J54J58r4l1l5N7N0j6O4k04J76
$$ plain form
7440 213 19 -37 155 145 240 80 -75 -191 218 -99 -90 73 162 -163 133 -158 182 -360 4 -123 20 -316
7462 -316 214 22 23 231 100 356 -4 211 335 -152 113 -53 -39 -91 134 23 -90 74 -225 -98 -183 168
7484 168 17 43 -169 -213 -164 129 56 203 95 75 -45 144 155 139 27 -12 303 -37 157 43 239 95 -66
7507 -66 73 -49 -262 37 172 -65 46 -136 78 -132 206 -141 -5 -139 45 -61 287 356 -201 -151 12
7528 12 21 93 20 48 -193 -67 105 -111 -188 250 435 47 -263 127 64 -121 -155 -165 110 -129 74 2 -162 52
7552 52 -8 55 -128 -10 -34 -360 39 -244 -240 -81 95 -16 114 -4 -46 124 -114 -144 -51 -98 108 -240 -216 -17
7576 -17 -77 -418 68 -223 163 66 -139 -15 7 44 -96 -35 -140 -82 -10 81 -66 -222 -109 83 137 -117 138
7599 138 -92 -119 176 11 -57 15 159 199 125 -113 -246 224 -215 -61 97 3 -28 -63 -6 44 28 92 -112 64
7623F4K18j66p2j95L39m44K24J40k18j4P8l82M88k6j19J57k6J58j26k07m1J32
7645c8m4L49k65j34K20m9Jk0k94R9J56J7J48o7j10N3j9j42K05p4J46l32P6J48
7669C0l79K29L43k34n3J78r3j47J87j85J00k10j23O02l51L6m1l24L98K06k83P7
7691c7L58m85M60k26q0J12j28j47r7L05L30k22k54K00j53j97L72J6K8l7p8J02
7713A42O2o5j56K6j95N9L0Q7Q6l01n1k2K47L65l35M1k2K83l25J42M1l8J05l78
7737a72K25p8j30J8j72L12o6l4j41J3m4M06k02p9l1N9p2M31k56j1K1J25r7O8j42
7762d9rj78L06l32J06K89J92k12j29K19m78M84j39k99J33K02k83L15k21M4k95
7783c34L03p1K21j26q4K26r7L07l94o2mK81j32J16l37J71n6J34J31l42J72n6o0
$$ plain form
7623 64 282 116 44 -151 188 -256 -32 108 -110 -124 -46 -428 60 34 -85 72 46 204 78 -129 -170 -38
7645 -38 -82 267 2 -132 88 39 40 20 -274 -175 -19 -2 146 79 -31 22 3 -139 66 -8 138 -194 -118 30
7669 30 -349 -120 223 -11 -64 114 21 -126 61 -124 -24 -234 -357 245 -106 -70 -111 -435 -37 169 -114 -37
7691 -37 321 -164 296 70 -10 102 -26 -173 -270 35 365 143 -111 89 -64 -261 111 127 155 118 40 142
7713 142 204 139 -17 9 -186 -127 -97 -10 76 -225 -276 -298 -51 314 -21 20 -2 281 -44 98 139 101 206 -172
7737 -172 53 -25 -155 -137 -309 3 -63 -97 -238 -225 -269 137 -65 -144 -175 -116 -188 243 -13 -24 -3 122 25 93 -49
7762 -49 -58 -236 70 -262 -156 133 325 113 -16 203 -275 209 70 -229 -96 106 -177 138 -83 -39 -334
7783 -334 -31 -102 119 -7 -91 135 38 345 -49 -111 -115 166 34 150 -187 -16 -72 62 193 -149 23 -33 -93
7806i3J2j56j43J00M28l66K89o9j51J37j9j21J48l8Rj8K9l7J08M6j32O2p5J51
7830A01l50L65k78J83M8n4mn4l15L64l7J8o0J2K47l66L34k94n1L85m21J50L96
7853C19k54j07RN5M1m9k90L50Rk34J27J14j83j0K2N2j27L69k45J88m68J32K20
7876D0j42J3J03l0l3m9L28k12R4P7j81J04p0j93J75j56K78l03pM0j61Q1J82J20
7900I8k19K88l86L32m4j21K32l27J07r7J0J37N1k54J04n6L68l56J68j45j47O9
7922a88K70m6l4j43K44l12K54j47M3L40o8j82k76M61l68K5r5J43M6n1L4M5j05
7945a10P1J48l40K96k01m2j05K69N2J2j74L8r7q0N53l39J25j52l14N76j37o7J50
7968A32j33P4l49K99n3j60K51K4j64L57k80M8Q1k58J90KO0n15R5R4J00K23j17
$$ plain form
7806 -93 -81 -237 -380 -280 148 -218 71 2 -149 -12 -31 -152 -4 -42 -33 -51 -22 -59 49 95 -37 25 -50 101
7830 101 -249 116 -162 21 69 15 11 -43 -358 6 -31 -13 -73 -61 186 -180 154 -140 -191 194 -227 -77 319
7853 319 65 -42 -33 22 63 14 -276 74 83 -151 -24 90 -93 -103 -81 -29 -156 213 -32 156 -312 -180 40
7876 40 -102 -89 14 -16 -49 -98 230 18 112 189 8 112 42 -151 24 -132 146 -157 -164 -124 -285 -204 -22 98
7900 98 -121 167 -219 113 69 -52 180 -147 -40 -137 -127 10 61 -193 -89 -145 223 -133 35 -110 -257 -188
7922 -188 82 36 2 -141 103 -209 45 -102 -59 281 213 31 -245 216 -152 -127 -222 -79 -33 -84 -50 -5 -110
7945 -110 -39 109 -231 65 -136 -178 -283 -14 38 50 -124 -86 -183 -263 290 -49 76 -76 -390 186 49 -18 132
7968 132 -1 73 -276 23 -30 -190 61 85 -79 278 -2 46 127 -131 59 61 121 -394 -299 -205 -105 118 1
7991AJ87j12P1k26j5j1O9L18n71K07r7K53j11J7j40L35n5n3q8J06l99K77n3o5
8015a55N67l83Q4j07j48Q6J29j0m79M52J73k54r1J27l15M14k60J82Nj67K83K68
8037D01n82M59k67J04j09Q3j15k02L98m5l93K37j09O3J75q5O6r6L6K05l43N1J92
8060A24l46L15q5k21K10k2L9L66n77J49p4j6j69L37M0j80Q7j67K55j37m8K04n0
8083C4L7l20K25L0mJ86j66k35L42p3J0L26k91l27O08k41m3k15Q0J85j61m6j07
8106a66L11K04o22L09K6N9j92l0J02J81m08K82j12J59P2m15L83l21L73m97K72
8127c0P7n57O55r2J01k39J75L07l21n3J25k34L22l25L64j36n81N05k30M9K41j26
8149cj37J46l23M83n3j53R1L3r5K14l04j43K19j3J26j31q4j64M38k32j42N45k44
$$ plain form
7991 1 188 76 147 -79 -94 -105 -36 282 -289 -82 -179 74 -37 -20 -160 175 120 67 -21 85 -314 -37 -90 -155
8015 -155 412 29 113 6 -142 -56 73 63 -416 36 209 -45 -136 -9 -324 90 -170 12 17 -150 133 401
8037 401 -181 278 11 115 6 89 -26 -228 170 125 -268 -31 -140 -77 98 13 79 -17 19 224 -119 -68 124
8060 124 -222 93 8 -213 -3 -25 14 380 -197 -48 -122 -138 -307 30 70 -110 -23 -190 65 -72 -120 84 34
8083 34 71 -249 -24 6 2 188 22 -213 129 56 66 392 101 -226 382 141 98 -117 -37 148 -13 -59 -166
8106 -166 145 349 -273 36 62 121 -71 -101 1 182 -226 56 -56 103 175 -240 143 -178 195 -302 -30
8127 -30 47 -510 145 53 154 -85 90 397 76 23 148 -86 236 -89 275 139 -442 63 -167 -118 123 -3
8149 -3 -140 6 -317 166 113 -40 51 84 -11 203 -101 -244 -25 -38 88 -43 -127 -291 147 -85 -227 318 74
8172G4J94l26K08j42k4K05k85o5k39L79J31j27K8K3J96j09j77R6N9
$$ plain form
8172 74 268 -58 150 8 -16 189 -96 -161 -400 -21 110 -17 11 34 230 121 -56 40 99
8191I9
$$ Imaginary data points
##PAGE= N=2
##DATA TABLE= (X++(I..I)), XYDATA
0@%%%%%%%%%%%%pJ5j6J6j6J6k3L1l2L9m7N2o0P0p9Q8j02J17j31J46j62J81k02
35a06K24k51K80l10L43l79M21m67N15n69O32p04P85q76R82j107J256j438J666
54H97j966K372k955L883n588R747l9946n3604N7187N1649o449m4049r98L0917
68A097J4301k3169k0851l59R723K886K619K780L242M12J820k317p482q316P41
83b2873O837O693J300j020r2J901L69m722p870M89J2764J0269n889j4643k633
98a9120J2703R570m128p179J958M320k298k579N076N077m844p782L105J3134P202
113A4215n068q864l750L233L840K257k277p27O338J0333n09j1630q951K562P093
128H095L078J945K539j555l108J784O306k153j0650l513R571Q495l975n218N567
$$ plain form
0 0 0 0 0 0 0 0 0 0 0 0 0 0 -7 8 -8 8 -8 8 -15 16 -16 23 -24 28 -32 38 -41 47 -55 62 -69 77 -85 96 -106
35 -106 118 -133 147 -163 180 -199 222 -245 270 -299 333 -371 414 -462 520 -587 669 -769 897
54 897 -1069 1303 -1652 2231 -3357 6390 -33556 -87160 -29973 21676 15227 -28822 -29820 1097
68 1097 15398 -7771 -28622 -28981 -19258 -16372 -13753 -10973 -7731 -7319 -5499 -7816 -15298 -23614 -22873
83 -22873 -16036 -9343 -8043 -9063 -9155 -7254 -6885 -11607 -19477 -18988 -6224 4045 -1844 -16487 -19120
98 -19120 -6417 3153 -975 -8154 -6196 -1876 -4174 -6753 -1677 3400 -1444 -9226 -6121 7013 14215
113 14215 9147 283 -3467 -234 3606 5863 3586 2859 9197 19530 19021 7391 -1560 1002 8095
128 8095 11173 13118 15657 14102 10994 12778 19084 16931 6281 2768 12339 20834 16859 11641 17208
143A7208N453o739j0060N87Q794L716j892J74J588n178o668J837Q658J173q689
158I962k406R109P187p894j3101q38R629N097o515o061L568Q430K198p206r248
173A911k486L210L751P10p10J251R35j267m720l588j180J179R70N45q6m99R32
190H58O60j229k203k127k024j478q71L673M852r7n145l360K433L014l192n531
206a1767j011L608K791L94r32j72k28R36Q11l309n902k338O174P755r8o362j730
223a1380N329L383n480p542Q4O306L579j339j544K341K853N01k362m435l493J499
239a1700N742M252j282m020Q81N576J603m517n279O69L928K238l71p63J761K336
255A054J322j046j685k550j200J616L040J736j058L27K382J428j488l775j425
$$ plain form
143 17208 22661 15922 5862 6449 15243 18959 17067 17241 18829 13651 6983 8820 17478 18651 9962
158 9962 7556 16665 23852 15958 2857 2019 11648 16745 10230 4169 7737 16167 18365 11159 1911
173 1911 -575 2635 6386 7096 6386 7637 8572 7305 2585 -1003 -2183 -1004 -34 511 425 -74 858
190 858 1518 289 -1914 -4041 -6065 -7543 -8414 -4741 111 14 -5131 -8491 -6058 -3044 -6236 -11767
206 -11767 -12778 -9170 -6379 -5985 -6917 -7089 -7317 -6381 -5570 -8879 -14781 -17119 -10945 -3190 -3288 -9650 -11380
223 -11380 -6051 -2668 -8148 -15690 -15606 -9300 -5721 -7060 -8604 -6263 -3410 -2909 -5271 -9706 -13199 -11700
239 -11700 -5958 -1706 -2988 -7008 -6127 -551 1052 -3465 -8744 -8075 -4147 -1909 -2280 -3043 -1282 1054
255 1054 2376 1330 -355 -2905 -4105 -2489 551 2287 1229 1556 3938 5366 3878 103 -1322
270a322Q29J205J32J828L007K176j229k410j160r56k024l65K719L615R53j691
286E307N2Q80j458l890j507J510K701J494P19K51j043k271q48N89Rj786j91K917
304C435L481j131m940k771J277K232Q23r31J92J49L77k66j233k653k574J414M660
321A541J967k007k180j85M57k501k830M36L347K928o65j164q0J68j569k742j661
338f740J624K705K137J51j043k049r78K20P91n63q61P47J952J471o63j722j581
355d402p05J103K354J931r67k473j004J239J688o05j952Q52L230J852j358k385
371a602j672m25J11P84L107L400K80k220j628l04j238k145l21K650L780J685P58
388E000N88j325m649m033O22L860K969j88O87K411R25k588m001j698l40Q59K644
$$ plain form
270 -1322 -493 712 844 2672 5679 7855 6626 4216 3056 2100 76 -289 2430 6045 6998 5307
286 5307 5359 6239 4781 891 -616 894 3595 5089 5808 6059 5016 2745 1897 2486 2495 709 518 3435
304 3435 6916 5785 845 -1926 -649 1583 2406 1475 1667 1816 2193 1927 694 -1959 -4533 -3119 1541
321 1541 3508 1501 -679 -864 -407 -2908 -5738 -5302 -1955 973 308 -856 -936 -768 -2337 -5079 -6740
338 -6740 -5116 -2411 -274 -123 -1166 -3215 -4193 -3973 -3182 -3745 -4606 -3859 -1907 -436 -1099 -2821 -4402
355 -4402 -5107 -4004 -1650 281 -686 -3159 -4163 -2924 -1236 -1841 -3793 -2941 289 2141 783 -1602
371 -1602 -3274 -3699 -3588 -2804 303 3703 3983 1763 135 -169 -1407 -3552 -3873 -1223 2557 4242 5000
388 5000 5588 4263 -386 -4419 -3797 63 3032 2844 3531 5942 6867 4279 278 -1420 -1760 -901 1743
405A743L778J779j824k241j018j83j233j027P09J913J236Q46N22p93k266k244
421c03J07K084J679o55p95j65j03K22o07m40m56Q19R93J42n78j523p26k27K53
440b79N49J373J068o95j748j342l36kJ10K93L51J518J143j69k060k497j173Q66
458c030J244O08J272L06K72j036j094q34j038j04J208J233N04j0N05o8j962k295
476d319R2K992R27n79p38J410J166k338k174K88K010P57k99oR62M47j333j486
494b221j0O72J168M26M74k4l2J54j71j445j433P69K237K071k96j533m51M21l8
513G38j477k95J279J913L03j564j87J616M64j227j923J5J415J162o9p31O8N54
531B054N31l88j340j144P11J490R37j492j244Q72K037J93j638r64L5L90o43m0
$$ plain form
405 1743 5521 7300 5476 3235 2217 2034 801 -226 483 2396 3632 4478 5000 4207 1941 -303
421 -303 -196 1888 3567 2912 2117 1952 1849 2071 1464 1024 568 1387 2380 2522 1944 421 -305 -532 -279
440 -279 270 1643 2711 2016 268 -1074 -1410 -1412 -1302 -1009 -658 860 2003 1834 -226 -2723 -3896 -3030
458 -3030 -1786 -1178 94 400 672 -364 -1458 -2292 -3330 -3434 -2226 -993 -489 -499 6 -62 -2024 -4319
476 -4319 -4227 -1235 -308 -887 -1625 -215 951 -1387 -3561 -3273 -1263 -506 -805 -811 151 598 -735 -2221
494 -2221 -2231 -1559 -391 35 509 485 453 607 436 -1009 -2442 -1673 564 2635 2339 806 355 776 738
513 738 -739 -1034 245 2158 2461 897 710 2326 2790 1563 -360 -345 1070 2232 2163 1432 1500 2054
531 2054 2585 2197 857 -287 424 1914 2851 1359 115 987 3024 3217 1579 615 650 1040 397 357
549C57O18R02P09r17n67m98o26Q7J66J04n59K11J164N88m28j165k32n78l53k74
569a291K35P29N40K67n00q08l03n01J02O24j31j00j080O86P71M58l15r53k92k85
589b147l52K07L40O58J46n67M6J045k68j171q00J46M98M94k49M06J246J36k72
608d58j219j296o40M27J738J604J02j139M2L42k39j643p64J415J423L43q22Q4
626g00J150M3q55j706j15J031J828Q45o09q83q1N17o54n19m67J337J928P86j439
645A437j581l86O82Q13l09J64k17J076K05L96q05j281o27P03N48N96Q78N96k79
664B609j281j493J22O59Q16L9K54O53L4n04j343o94M01R08M70k41r7Q02o78l08
684A128j154OlK91N19N89M01m38q87j201k85N6J069J656K19j247j363l42J125
$$ plain form
549 357 975 1877 2586 1669 1102 604 -22 65 231 335 -224 -13 1151 1739 1311 146 -86 -664 -1017 -1291
569 -1291 -1056 -327 213 480 -20 -828 -1131 -1632 -1530 -906 -1037 -1137 -2217 -1531 -760 -302 -617 -1570 -1862 -2147
589 -2147 -2499 -2292 -1952 -1294 -1148 -1715 -1669 -624 -892 -2063 -2863 -2717 -2219 -1725 -1974 -1568 -322 -186 -458
608 -458 -1677 -2973 -3613 -3186 -1448 156 258 -881 -839 -497 -736 -2379 -3143 -1728 -305 38 -784 -700
626 -700 450 493 -362 -2068 -2183 -1152 676 1521 912 29 -52 465 -189 -708 -1175 162 2090 2876 1437
645 1437 -144 -530 152 965 656 820 603 1679 1884 2280 1475 194 -433 270 818 1414 2292 2888 2609
664 2609 1328 -165 -43 616 1432 1471 1725 2378 2412 1908 565 -129 272 1180 1650 1409 1312 2114 1436 1128
684 1128 -26 -20 -23 268 787 1376 1777 1339 452 -749 -1034 -978 91 1747 1966 719 -644 -986 139
703A39k59j273p4J299J543K81j257j499o67K58K29K2K88N60O79O39l60j392j838
722b682l48O88Q79J374Q37K23j044j579m10k17N77J00M61L56N72N62N60j596j292
741a979o37P32J700N50j41o09L54Q4k18j102n05O91Q51P27M57m08o47p85l97L38
761i44J591M93j99j010J06P34J40o41j218O21P40J021M63l09q15j172j55J347
779G93O73n83k45P21R85n30j328q89L89N72M07N61O40p1n89o83m0l35M05J48J37
800A138j30M41L00K75j369j450N03P25Q33K14K23m77o75k08M3J37m60n85P99J032
820A309L6q47o00k07L36k92O4P65m68K01o7O4m48p71l99R07P12m81k39L10Ko91
842h04m38M09k57L74k12M40J52j77p6k31n68k39O94Q37p52o83J09J095m5j281
$$ plain form
703 139 -120 -1393 -1467 -168 1375 1656 399 -1100 -1767 -1509 -1280 -1258 -970 -410 269 908 548 -844 -2682
722 -2682 -3030 -2342 -1463 -89 748 971 -73 -1652 -2062 -2279 -1702 -1602 -1141 -785 -213 349 909 -687 -1979
741 -1979 -2616 -1884 -184 366 225 -384 -30 54 -164 -1266 -1771 -1080 -229 498 955 547 -100 -885 -1282 -944
761 -944 647 1140 941 -69 37 771 911 270 -948 -327 413 1434 1897 1588 773 -399 -554 793
779 793 1466 883 638 1359 2344 1814 486 -403 -14 558 965 1526 2166 2095 1506 823 783 448 853 1001 1138
800 1138 1008 1449 1749 2024 655 -795 -292 433 1266 1480 1703 1226 551 343 386 523 63 -522 277 1309
820 1309 1345 498 -102 -309 27 -265 -201 564 96 297 230 294 -154 -925 -1324 -417 295 -186 -425 -115 -113 -804
842 -804 -1242 -833 -1090 -716 -928 -488 -336 -513 -589 -820 -1388 -1627 -933 -96 -848 -1531 -1422 -327 -372 -1653
862a653J97k37R00J66R6K3l99q67P97J125k64j759j3J689O04r06r69M49P04l81
882f98j02M72L50m39o97N98J22N55n01Q9k52J98O1L44J34k02n18K98Q68k35m7
903C98J77r94K84P35R25l94j642m7J007J214k30j146k93N41L55N55p9o11j178
922d23J55J502N53j008o33J88J141l71j132L03O20k15m05K78N33O54p22r83m53
941d18J32J103O98o00q09k64P59O00p19j237n45Q52J548K80n08q46p24p5O91M08
961C26r93n53J155N80N1q87m67j70Nm11M92J212R5o91o76j15L09K29l91J31j48
982i17L81R5O19q07o40o74K78P97M76K66l83n62M0N37l61o52j65N66J207L61n73
1003a11p26m77K30M0N26k7K44J87Q3J06k20j74j47k31l28L96P71O76O4j431n78
$$ plain form
862 -1653 -1456 -1693 -793 -627 -531 -508 -907 -1774 -977 148 -116 -1875 -1888 -199 405 -501 -1470 -1021 -317 -698
882 -698 -800 -328 22 -417 -1114 -516 -394 161 -340 -251 -503 -305 -244 100 234 32 -486 -188 680 445 398
903 398 575 -419 -135 600 1525 1131 -511 -558 449 1663 1433 287 -6 535 890 1445 1366 755 -423
922 -423 -268 1234 1787 779 146 334 1475 1104 -28 275 895 680 275 553 1086 1740 1018 35 -418
941 -418 -286 817 1515 915 106 -158 601 1201 482 -755 -1300 -448 1100 1380 872 26 -698 -773 -82 326
961 326 -667 -1220 -65 515 566 -321 -788 -958 -953 -1364 -872 340 435 -256 -932 -1047 -738 -509 -900 -769 -917
982 -917 -536 -441 178 -629 -1269 -1943 -1665 -868 -392 -126 -509 -1071 -1031 -494 -855 -1507 -1672 -1106 101 462 -111
1003 -111 -837 -1314 -1084 -1044 -518 -545 -301 -114 -31 75 -145 -319 -466 -697 -1025 -629 142 818 882 -549 -1127
1024a127O24L72O39k54p6q9R94L1m71j201J61M48J133K41o02o05K63K53o3k95
1044C76j19K87M0R70m49M79n50k53q34J08O38O19K0K73o62N5n88M9N87m78j14
1065D54L31P18Q1o1j460m79M79N82N29l26n55L12N25K11q53n33n70L95J043N51
1085A374m74m51l99j70r1P2M69Q0J12o30M5J11L81j93j033J8M66O20M62n28o49
1106d08o4K63k39r9j66M43N14l9k12j24l62n60j25L59J415l00n66p05K69M46j00
1127c60j58n52J89N79K71L86n74m29k04m05L99M12L60R4j07l59L0k50K43j77L66
1148b46J80J63O0l61j23m9K73k10N48q0m99k7M94N00m98l25q0L3L07J37j43K94
1170C48q5q7l44R9j31Q84N6o86j34J87N90l38m72k75O73K42l86k68L69N79j29
$$ plain form
1024 -1127 -503 -131 508 254 178 89 1083 1114 643 -558 -397 51 1184 1425 823 218 481 734 671 376
1044 376 257 544 584 1554 1105 1584 1034 781 -53 55 693 1312 1332 1605 943 998 410 459 1046 568 454
1065 454 785 1503 1584 1523 63 -416 63 645 1174 848 293 605 1130 1341 488 -45 -615 -220 823 1374
1085 1374 900 449 50 -120 -211 -139 330 410 522 -108 -63 48 429 236 -797 -779 -313 307 769 241 -408
1106 -408 -472 -209 -448 -547 -713 -270 244 205 -7 -131 -493 -1053 -1178 -819 596 296 -270 -975 -706 -260 -360
1127 -360 -518 -1070 -881 -302 -31 355 -219 -648 -852 -1257 -858 -446 -86 8 -99 -458 -428 -678 -435 -612 -246
1148 -246 -66 97 157 -204 -327 -376 -103 -313 235 155 -344 -371 123 623 125 -200 -280 -247 60 197 54 348
1170 348 263 176 -168 -69 -200 684 740 54 -80 107 697 359 -113 -388 285 527 141 -127 242 821 692
1191F92p83p77J014O19l75m70l89L69Q87r3j179p6R1P30O01j064j85m1K56L27
1211A54k09l8j74L4j02L1K85K72k08m54n24N17P52j03j53o44k79K09N28L55m43
1232a94l18m0m62J039J16m05l60r5N55R5K3j57n01K0O00N4M19o33m47j46N85M66
1254B14K01n08n98K58Q59L74o50q58J06M69N71l80P6M41j32n90k38M08P41l58
1274D06l27j21K24M57J71p28p16P35J010R2l82o18J10K06J21j17l28L3K34l1J92
1295F23K95L64r74N2n81Q22J20J93k52m53j08L93M92m94n59j13O10L49j88k50
1315C41k10j01P7j25K88M5j05K22l09O1k14l06j2J88J37o7L70J29j12m27l85J49
1337c66J45K94j21k00P5J18k42K95o03j22jJ52L19j17L11l89n42N65J10Lj27k58
$$ plain form
1191 692 -91 -868 146 765 390 -80 -469 -100 787 694 -485 -561 -470 260 861 -203 -388 -429 -173 154
1211 154 -55 -93 -267 -233 -335 -304 -19 253 45 -409 -933 -416 336 233 80 -564 -843 -634 -106 249 -194
1232 -194 -512 -552 -1014 25 141 -264 -624 -719 -164 -69 -46 -203 -704 -684 -84 -30 389 -244 -691 -837 -252 214
1254 214 415 -93 -691 -433 426 800 150 -708 -602 -133 438 58 134 575 443 -147 -385 23 764 406
1274 406 79 -42 182 639 810 82 -634 101 1111 1203 821 203 313 519 640 523 195 228 462 431 623
1295 623 918 1282 308 360 -221 601 721 914 662 209 101 494 986 492 -67 -180 430 779 591 341
1315 341 131 30 107 -18 270 315 210 432 123 184 -30 -336 -348 -160 -23 -90 280 409 297 -130 -515 -366
1337 -366 -221 73 -48 -248 -173 -55 -297 -2 -605 -727 -728 -576 -257 -374 -63 -452 -994 -429 -319 -316 -443 -701
1359g01K60M48k40n80r3j21N92J19k14m5K95l13m8l6K90l49L2J45K61k99N10l66
1381d53K53n11m1K87k7N00k6k50m0k1L33l02l1J2M42R0n1m0n41L08k41O52j89
1404A13K19n5J59K8k09J36k42L7R7J58L64O3m49j58J04k20J90P2K67r9k76L21
1426F20l0L5k41k80K01r7M29l0k20M02m99P3n9J04k70K27J83m3n9R6j40n35J21
1449a2n1M78k8m20K32J84k21l91j33L40L5m04L86M8j21Jm7k49J28M3K34M3q7k71
1473b83m8J92L6k58J05j43L46j92NJ30n01L34n61L95L36k54Q9l01JK93J12k05
1495c72r7L03J69rk47j89m94P87m03K63J52k06L15k07K42J3J9j44r6o5j7L45K59
1518C21l80P1M6N9pK0K65o87L90P6M17j13k96l3K05N1J1J42l34m0J81Q0P5J57
$$ plain form
1359 -701 -441 7 -233 -813 -906 -1027 -435 -316 -530 -575 -280 -593 -641 -677 -387 -736 -704 -559 -298 -597 -87 -453
1381 -453 -200 -711 -752 -465 -492 8 -18 -268 -308 -329 4 -298 -329 -317 125 215 164 124 -417 -109 -350 302 113
1404 113 332 277 436 464 255 391 149 186 283 441 805 868 419 261 365 145 335 407 674 575 299 620
1426 620 590 625 384 104 305 208 637 607 387 789 290 363 304 408 138 365 548 505 446 542 402 -133 -12
1449 -12 -63 415 387 -33 199 383 162 -229 -362 -22 13 -391 -5 43 -78 -77 -124 -373 -245 -202 32 75 -12 -283
1473 -283 -331 -139 -103 -361 -256 -399 -53 -245 -240 -110 -611 -277 -838 -443 -107 -361 -272 -573 -572 -279 -167 -372
1495 -372 -469 -166 3 -6 -253 -442 -936 -149 -552 -289 -137 -343 -28 -235 7 20 39 -105 -201 -266 -283 62 321
1518 321 -59 12 58 117 110 130 395 -292 98 174 591 478 182 149 354 405 416 558 224 184 365 445 520 677
1542F77o9k84J97J17J14O0p6k99K8K99P3l80j65Q6J94j30n9O0rk00L46J23Kl53
1566C52k2K1N7J25k89l7j46K1K09K97l49P8m16j77J92Q7J43j43N5k87J31k2K44
1589A24n26K49ln1l48M8J12J8j5K19K2k27j43k87N08J85k35j23k91K01J77L22
1611f4n62q7J94j17K26j65J57k35J76k28R5J06j12j03K74N6j47l4l38P5R2M63
1633b78Q0q9m17K62p5L39J39o0k77k76L09K7M67k70j64J26J5J6l3o8L96p7P6j15
1657E3j70K43L67m40J77k9j65K61k37K23J93Q4J07n80o3J81K27L6R9J16j72j72
1679C39j80M28N6Q9j98l70K53R4q8n2L18l26J13O5m31k03N40K0K13j14j95L09
1701F80k70j45Q7J1q8J02j51j6j60L92j66l48j26O4L35J21k75m5n2O8r6N5r5j57
$$ plain form
1542 677 608 324 521 638 752 812 736 437 465 764 837 457 292 378 572 442 383 443 434 234 580 703 705 352
1566 352 330 351 408 533 244 207 61 82 291 588 239 317 -99 -276 -84 3 146 3 58 -229 -98 -120 124
1589 124 -402 -153 -156 -207 -555 -507 -395 -377 -392 -173 -151 -378 -521 -808 -300 -115 -350 -473 -764 -563 -386 -64
1611 -64 -626 -713 -519 -636 -410 -575 -418 -653 -477 -705 -610 -504 -616 -719 -445 -389 -536 -570 -908 -833 -741 -278
1633 -278 -198 -287 -704 -442 -517 -178 -39 -99 -376 -652 -343 -316 151 -119 -283 -157 -142 -126 -159 -227 169 92 168 53
1657 53 -117 126 493 53 230 201 36 297 60 283 476 560 667 87 24 205 432 468 567 683 511 339
1679 339 159 587 643 732 534 164 417 511 423 371 689 363 476 541 110 -93 447 467 680 566 371 680
1701 680 410 265 352 363 275 377 226 210 50 442 276 -72 -198 -134 201 322 47 2 -50 18 -78 -23 -118 -275
1725b75J80n7K03o7j03P0J18J40m96m2L0J24j79L2L06j81R7n27j9M57M29l12o34
1748g06j1K88J98N3n4l32J46J63j12k81J68Q3L58l04J68k1j77M5M04o12K38p9
1770c77L89m12L59RJ14j8l45J5K09j20K84p5p2N0j76J99K44n1K91n36j84N75j35
1793B37J46Q8l8m50K66k03L43J1j11K16k01J3K91l55p0O14l05o9q9M6l2K4j01
1816B71K2L94j79j89j45L21M1j32l88L44j87J43O32p54P5k6K23j78O3j58k47K00
1838A46m6N24k74l77O8J81j46j59n1K77j57L82l93M8J68j85j7k51J04M07l65j68
1860b84j08K49J53L28o49l02K83j14N46l66l00K93p9J92k46O1k14N1j81J63L64
1881a60l11n3j34R17m96k3k16p4K82j98J16L05j70j83k55M03P8J0l6j66q9K01
$$ plain form
1725 -275 -95 -152 51 -16 -119 -49 69 209 -287 -329 -299 -175 -354 -322 -16 -197 -100 -627 -646 -189 240 -72 -706
1748 -706 -717 -429 -231 -178 -232 -564 -418 -255 -367 -648 -480 -397 -39 -343 -175 -196 -373 -328 76 -536 -298 -377
1770 -377 12 -400 -41 -32 82 64 -281 -266 -57 -177 107 32 -40 10 -166 33 277 226 517 -19 -203 372 237
1793 237 383 471 433 -17 249 46 389 400 289 505 304 317 608 253 183 797 492 423 334 380 348 372 271
1816 271 293 687 508 319 174 495 536 404 16 360 173 316 948 194 269 243 466 288 351 193 -54 146
1838 146 100 624 350 -27 41 222 76 -83 -134 143 -14 368 -25 23 191 6 -11 -262 -158 249 -116 -284
1860 -284 -392 -143 10 338 -311 -613 -330 -444 102 -264 -564 -271 -350 -158 -404 -343 -557 -506 -687 -524 -160
1881 -160 -471 -524 -658 259 -237 -260 -476 -550 -268 -466 -350 -45 -215 -398 -653 -250 -172 -162 -198 -364 -453 -252
1903b52P5Ql0J70k41j15R6N60j81j48j33j61M95J47m12k76M8P53O8l19J2j28J2
1926D8K50N51n01j81l52M58R0O4k39l5k09M22n1J87j47lk79J05N7R0p6Q3j36M6
1950B42J76M69m28k40n5L9J18j26K60m45r9J33M13K29o55j72L36j51P3K20m9l65
1972g7J28k38L34n1k21N4J67j89M09l87J75n94L20k49N38q8O4l03M8k37M98l7
1994F4m07J1q9K15k2o8j34J54l51L52K06j05n4K15n3q7K9k82J03m22M81o7J03
2017b08j28K1K58k97L97j69J88m3j66J09q7j95M9L25j40m02N85p3R5m2k41N7N8
2040d9j0k10L02j02Q0J71K09k07j69J10J24r4p0J36K31l9j14m3M0J85r7L13k58
2063D39j90KL00L6m26J00J05L3j70J68P5j27RJ33k77L69j53k00K64j48O4Lk5j39
$$ plain form
1903 -252 -177 -169 -199 -29 -270 -385 -289 271 90 -58 -191 -352 143 290 -122 -398 -350 403 471 152 164 36 48
1926 48 298 849 348 167 -185 273 363 427 188 153 -56 366 315 502 355 352 73 178 235 325 249 332 196 242
1950 242 418 887 459 219 164 203 321 195 455 10 -89 44 457 686 31 -141 195 44 117 337 288 -77
1972 -77 51 -187 147 96 -125 -71 96 -93 316 -71 104 -490 -170 -419 119 31 95 -208 -160 -397 101 64
1994 64 -343 -332 -421 -206 -228 -296 -430 -276 -627 -275 -69 -174 -228 -13 -66 -153 -124 -406 -303 -725 -244 -311 -208
2017 -208 -336 -315 -57 -354 43 -126 62 19 -147 -38 -125 -320 -271 54 -86 -488 97 24 119 77 -164 -107 -49
2040 -49 -59 -269 33 -69 11 182 391 184 15 125 249 155 85 221 452 413 299 256 296 481 384 697 439
2063 439 249 251 551 587 161 261 366 399 229 397 472 345 354 487 210 579 426 226 490 342 406 409 384 245
2087B45lP8j47M63m6j45l95J60K46k00Jl71M09l12K43Mn4J02Q3m05J62pJ13m8
2111A76k6l59J51J50j15K50m05J0j49M8J0J35m72N57J70l32R8l09j37L0L01q6
2133c04J80j64k45L81l7o00L68j75K10j38K67m0Q6j32k33J05j27K68J6O1l32K02
2155c83mJ63l61J11J25q7Q0O5J25m65K63L16j09J93k58j55P7j5L12J39o76N07
2177c7l61N41m71N67n06J56K10m47N02O1j75K31j29M5N5k87O6L27k73J13J35m6
2199B77Mp0J65k64Q2J45J30m47R2N80j26k69Jm53O20J03j80k36L8K6J11P6J78
2222E83j20J94n42l7qn2J39q7K8N42m79P4N6j54p2j41L67K54l84o0l14L38k3j51
2246d9J05m98M50K41j89P1j78J1j92K64m05K79J94k40Rl05N4M30l74k03K76M66
$$ plain form
2087 245 242 320 173 636 590 445 50 210 456 256 257 -114 295 -17 226 230 176 278 361 -44 118 111 224 176
2111 176 150 -209 -58 92 -23 227 -178 -168 -317 -269 -259 -124 -596 -39 131 -201 -103 -412 -549 -519 -218 -304
2133 -304 -124 -288 -533 -152 -189 -789 -421 -596 -386 -524 -257 -297 -211 -343 -576 -471 -598 -330 -314 -253 -585 -383
2155 -383 -387 -224 -585 -474 -349 -436 -356 -291 -166 -631 -368 -52 -161 32 -226 -381 -304 -319 -7 132 -544 -37
2177 -37 -398 143 -328 239 -267 -111 99 -348 154 215 40 271 142 187 242 -45 21 348 75 188 323 277
2199 277 281 211 376 112 194 339 469 22 114 694 568 299 300 -153 467 570 390 154 192 218 329 405 583
2222 583 463 657 115 78 70 18 157 70 98 640 161 235 291 137 65 -76 291 545 161 101 -213 125 102 -49
2246 -49 56 -442 8 249 60 131 -47 -36 -228 36 -369 -90 104 -136 -127 -432 -378 52 -322 -525 -249 217
2268B17k93j98M4J90k61m61O51O5nl98l11P56l89Q6K78m62K5P0j78K85jK6J60
2291a04j01m6K0j15o7p6N08k16J91k01J85n0r1j17L01j37J55r9n7K39k81RJ57
2314GJ80j89J88j0k20K11M1J81j81N3k13qM41k24Jr6q1j76K00q2J88J29o4q6J36
2339C26K4j43J76j22j91L36j99K42j51j20k03L22N3K46l57RJ10o1q0N1R4j02K29
2362D89p07N03K69K3l44m2j25O8L9n2K3N8l05L32P7j02k07J72k12m5M63m32l49
2385d06K71k44L15J97j68J22l00j24K47o6j03J1l9r2K63k4p4oj44L25k61Q4r3
2408c09K67m39K72J62j62K61q4l15K06N2o1k08K73o9k85L41r2k7j06J08K58l64
2430c21M72q8k10j14J68r0J34j06j17K33j38J5L17j64j76lJ70J47J16j87J3j58
$$ plain form
2268 217 -76 -274 -230 -40 -301 -762 -111 -46 -51 -449 -760 -4 -393 -307 -29 -491 -466 -396 -574 -289 -290 -264 -104
2291 -104 -205 -251 -231 -346 -413 -489 19 -197 -6 -207 -22 -72 -163 -280 21 -116 39 -60 -117 122 -159 -150 7
2314 7 187 -2 186 176 -44 167 208 389 208 261 48 40 481 257 258 162 81 -95 105 23 211 340 276 190 326
2339 326 350 207 383 261 70 406 207 449 298 178 -25 297 350 596 239 248 358 297 217 268 362 260 489
2362 489 -218 285 554 577 233 191 66 134 173 121 144 202 -103 229 306 204 -3 169 -43 -88 375 -57 -406
2385 -406 -135 -379 -64 133 -35 87 -213 -337 -90 -156 -259 -248 -287 -379 -116 -140 -214 -220 -364 -39 -300 -216 -309
2408 -309 -42 -481 -209 -47 -209 52 -32 -347 -141 -89 -150 -358 -85 -154 -439 -98 -190 -217 -323 -215 43 -321
2430 -321 151 63 -147 -261 -93 -183 -49 -155 -272 -39 -177 -162 155 -9 -185 -188 -18 129 245 58 71 -87
2452h7k28M14L02l17j86J93J24l4K01l22L7J75j79R2P1k38Q5P8l6P5J90l62R3
2475A41J76j43k36M61j33k35P2J96L2l9k8k21R6l30O8J65K74n45K73p5J39%P7
2498A85P3o8j44J63l55J64m33L06K71k98j92K48J58j62L13m11J12k44q6J17q9
2519c72M77l37K80j01m0j27l6j69N6J61J97k95M8J4P7k66L08l2j07J10o2N4L03
2542A41n91L94j4k83J45P1J12q0O3j62p4J19J32k24K80J1J63o11L82J46m69L76
2564B7r3K49p1K64m43q3L50k54K56l24J90K0K0j4l30N24k98M35m33J46J52m5j55
2587I0K93l40k5J32M3J90k70j7J8J5J10j64J18N5P3j67J37r0Q5p6P5J43j69k8
2611B31m9jJ66n3L27k70k56Q4K05l91J46K20j21l07O2K07k84K90k50R5p1Qk21
$$ plain form
2452 -87 -315 99 401 84 -102 91 215 181 382 60 97 272 93 185 256 18 103 181 145 220 410 48 141
2475 141 317 174 -62 399 266 31 103 299 331 292 264 43 139 -191 -123 42 316 -229 44 -31 108 108 185
2498 185 258 190 46 209 -146 18 -415 -109 162 -136 -328 -80 78 -84 229 -182 -70 -314 -400 -283 -372
2519 -372 105 -232 48 -53 -93 -220 -256 -425 -369 -208 -11 -306 -258 -244 -167 -433 -125 -157 -264 -154 -216 -162 141
2542 141 -450 -56 -70 -353 -208 -137 -25 -105 -42 -204 -278 -159 -27 -251 29 40 203 -408 -26 120 -349 27
2564 27 -66 183 112 376 -67 -150 200 -54 202 -122 68 88 108 94 -236 288 -10 425 -8 138 290 245 90
2587 90 383 43 18 150 193 383 113 96 114 129 239 75 193 248 321 154 291 201 286 210 285 428 259 231
2611 231 182 181 347 294 621 351 95 179 384 -7 139 359 238 -69 -7 200 -84 206 -44 51 -20 -12 -233
2634b33N03l34j12K84p7J1J64j25q2k41J04j86L29j34J71l01J53l45K27J07r5
2655b12k4l4K51J1K4k37R9q6n0K90j97J49k39L41m67K17j45K67L5N6k22J94R7
2678A18j92K16j80K53m39L65k66J8J04O6Jq1Mq2L12m11M12j08J17k41j56K17j9
2701B8Pp0J82J51j44J53K02m10j20J77K81k06j43k27qL10O6k39K68K55m39J65
2723B39l9J52k28K36m20M80l05L30r1j93J6j61j95M40k04L06k99J37j7n95L11
2744a00j11J33J47k11K42O9L7j85l37L27j33k04J35N09o35K75j26N4o1O3L38q
2766B18m05o6P4j4Q2K08k64l91M60q6M3q7K01l64O3j6J80k2j77O9O1j6k83L00
2790b32k88K88P2j89J67k3k01j71J98K97q0o1j0j36L07O8j43j78M20k33J0J47
$$ plain form
2634 -233 270 -64 -176 108 31 42 206 81 -1 -242 -138 -324 5 -129 42 -259 -106 -451 -224 -117 -212
2655 -212 -236 -270 -19 -8 16 -221 -122 -208 -258 32 -165 -16 -255 86 -381 -164 -309 -42 -7 49 -173 21 118
2678 118 -74 142 -38 215 -224 141 -125 -107 -3 63 64 -17 -13 -95 217 -194 218 110 227 -14 -170 47 28
2701 28 35 -35 147 298 154 307 509 99 -21 156 437 231 88 -139 -147 163 229 -10 258 513 74 239
2723 239 200 352 124 360 -60 420 115 445 354 161 177 16 -179 261 57 363 64 201 184 -411 -100
2744 -100 -211 -78 69 -142 100 169 206 21 -316 11 -122 -326 -191 318 -317 -42 -168 -114 -175 -112 226 218
2766 218 -187 -253 -179 -193 -111 97 -167 -558 -98 -184 -141 -228 -27 -391 -328 -344 -164 -186 -363 -294 -233 -249 -532 -232
2790 -232 -520 -232 -160 -349 -182 -205 -406 -577 -379 -82 -162 -223 -233 -369 -62 6 -137 -315 105 -128 -118 29
2812B9m26M56j53n5J41N5o4j60j37L24o9K95j11L9j88j04N2J60Rj57K1P0J53q8
2836I2L15j18k48p7K99j75K20k64P9J44J82m40K66P9j42J30j88Q0J73j33k13L4
2858I5K90l08o1L14l39N1K35k77J25k11L38L7j30L5l21K68J7l35K54J35j76L23
2880C59k79j89J18M9J47r9J31nk31K51k23k07J57k69N25l71J3L34l76L06l34o3
2902b56L4k42J97O0O8k4O6J8M4N1k76J07J24J49m22J42j98K50K3J08j83m4J71
2925c3J42m09J00k0J17K88k78M4K2R0l27O81n36J56l83L98k2K47n19K32j53K30
2947F7j03j83L91k98J82m22M80K10n60K46m7j77K14J09J74l50Q3P7j0k82K84J8
2969A03j52K64j53P6K74l72p7R8J16M9j12J5Q6J6j7j28K60m4J24n12L10M7m15
$$ plain form
2812 29 -397 59 -94 -149 -8 47 -17 -177 -314 10 -59 236 125 164 -24 -128 -76 84 93 -64 -43 27 180 92
2836 92 407 289 41 -36 263 88 308 44 123 267 449 9 275 354 212 342 154 234 407 274 61 95
2858 95 385 77 16 330 -9 42 277 0 125 -86 252 289 159 194 -127 141 158 -177 77 212 36 359
2880 359 80 -109 9 58 205 106 237 232 1 252 29 -178 -21 -290 235 -136 -123 211 -165 141 -193 -256
2902 -256 -222 -464 -267 -207 -139 -163 -97 -79 -35 16 -260 -153 -29 120 -302 -160 -358 -108 -85 23 -160 -204 -33
2925 -33 109 -300 -200 -220 -103 185 -93 -49 -27 63 -264 417 -119 37 -346 52 30 277 -242 -10 -163 67
2947 67 -36 -219 172 -126 56 -366 114 324 -236 10 -37 -214 0 109 283 -67 16 93 83 -199 85 103
2969 103 -49 215 62 138 412 40 -37 61 177 226 114 129 215 231 214 86 346 302 426 -86 224 271 -144
2992a44K64J05Ln3k4j47j04M55m9l53j1J84Qk76L04r9n2Q3j32q6L02j5Q0r8l57
3017b12K24k8R2j40n5J0j5L81l46j29R4OP0L98n57n6j23L98j05J20j51n21O29
3040a6j99L46N0k96j81L37l10Q2k7K37J43k88k61N22k0l04J6j30L11j43j96J94
3062a33l36K27J36l1j04K30K4o5j62M4J46J98l78N7j14N57m04K2l11M14j00P5
3084hk52J09J12j22L51o28M78j89L70j2j67j62L02r8J07l74L38k63J58oJ30J95
3106C69l99LO1n0K82j00j62K9p6M60o12N90k57l18K77oJM1j27N5l58J92K73j97
3130b9l0j80L4Q4M8m8j44K28k15K60l2J08n00K44%L87j79M4j33K94q5j54k69K75
3154Hr8j35R8j6K51k7o6nj16O7J69j81J21J60k20k5j37Q2l18K53j19QL6M70l79
$$ plain form
2992 -144 120 225 228 175 151 4 -100 355 306 -47 -58 126 134 -142 162 63 11 94 -38 -124 178 163 243 145 -212
3017 -212 12 -16 76 -64 -119 -109 -124 257 -89 -218 -124 -118 -48 350 -207 -263 -386 12 -93 27 -124 -645 -16
3040 -16 -215 131 181 -115 -296 41 -269 -187 -214 23 166 -122 -383 139 119 -185 -169 -299 12 -131 -327 -133
3062 -133 -469 -242 -106 -137 -241 -11 13 -52 -214 -170 -24 174 -204 -147 -261 296 -108 -86 -397 17 -83 -8
3084 -8 -260 -151 -39 -161 190 -438 40 -149 221 209 42 -120 182 84 191 -183 155 -108 50 44 174 369
3106 369 -30 -27 34 -16 266 166 4 33 -43 417 -195 395 138 -180 97 91 92 133 6 61 -297 -105 168 -29
3130 -29 -59 -239 -205 -121 -73 -121 -265 -37 -252 8 -24 84 -416 -172 -172 215 36 80 -53 241 156 2 -267 8
3154 8 -90 -225 -127 -143 108 81 15 10 -106 -39 130 -51 70 230 10 -15 -152 -70 -388 -135 -254 -246 -210 260 -119
3179a19Q2j06K92J4l65P7j36K45j03j99J12Q1j21J51K11J07q0j45j57K77k26j57
3201b65J94K39k93j73J55L42m81J88p7J89J46l21K44Q8l5l28L97J6l01k53M55
3222A26K8k92r6L75k8l13K22K53m3q4m1j12j69O8M54j28r2k28K61J92j11j88L3
3245H7O1r0l4L16j80j57L4k8L9J23k53K70J13k39m42K32j6M0J49M3p6J98k6j91
3269b7J65%k04J41j0j90j42N30p7m52J69J58j60j4K11m5k59L26j76J47%o7j97
3292a73O5O0k86O23j79l00K27l29N08k48L0j51K98j71j25L6k94L40N5j9l2j55
3314b20J71l5m4O8J35j25Q3j55k03M19n2j90Q1O3J23k87J49j16o4j19J06Q5k9
3337a56J89O8N4K8l00K47k07QR4oJ01j90K94j1k68J19J01R3l86K70j50p0J43O4
$$ plain form
3179 -119 -37 -143 149 163 -202 -125 -261 -16 -119 -318 -206 -125 -246 -95 116 223 143 -2 -159 118 -108 -265
3201 -265 -71 168 -125 -298 -143 199 -282 -94 -171 18 164 -157 87 175 140 -188 209 225 -76 -329 126
3222 126 154 -138 -234 141 113 -200 22 275 232 148 107 -5 -174 -106 348 220 128 -100 161 353 242 54 87
3245 87 148 58 24 340 160 3 37 9 48 171 -82 188 301 62 -380 -148 -164 -124 25 68 -8 190 164 -27
3269 -27 138 138 -66 75 65 -125 -267 263 186 -266 -97 61 -99 -113 98 53 -206 120 -56 91 91 24 -173
3292 -173 -108 -48 -334 289 110 -190 37 -292 216 -32 -2 -153 145 -26 -151 -115 -409 -69 -14 -33 -65 -220
3314 -220 -49 -84 -128 -60 75 -50 33 -122 -325 94 42 -148 -67 -4 119 -168 -19 -135 -199 -318 -212 -127 -156
3337 -156 33 101 155 183 -117 130 -77 -69 25 19 120 -70 224 213 -55 64 165 258 -128 142 -8 -78 65 129
3361A29m54O35j51O9j87mj60K09kj11j0K99k96%K5l15P6L45l6l08L34j48J24m1
3385B2Q3R0J9m33K27j47J21j39N8L00j80O9k18M37l46Q5L8k8l59L43J30k87p0
3408a85K39K9J36l5j97j09J33j05K70k51k32L21l04M13j98m8J25j18j86K78j5
3429c9j83j25M33j63j5J36j32j82mL16MJ58j92L0K0J5j90j36J84J13j50K27q9
3452C6l09L39P3j98k9K41l93J73K77k29J47l16P5J49j81K86j74K20l61K0M28l25
3474e1L84l71j1J92l11L73o6l41M69l08J76K2J2j16P3p9j18J50J59l78L77m45
3496b08K67j82K65L6k22K62J62j77m36K84qJ03%q7l55M77R3j74M2j71K09j28R6
3519A48l5k50K6K34n4P8k89M3J49J0q3M4l01K7K36M2r0m7J05j94N34m39k0L03
$$ plain form
3361 129 -325 310 159 228 41 37 -123 86 84 -27 -37 262 -34 -34 -9 -324 -248 97 61 -247 87 -61 63 22
3385 22 105 195 214 -219 8 -139 -18 -157 -99 201 21 90 -128 309 -37 48 86 58 -301 42 172 -115 -185
3408 -185 54 83 219 184 -13 -122 11 -94 176 -75 -307 14 -290 123 -75 -123 2 -116 -302 -24 -39
3429 -39 -222 -347 86 -77 -92 44 -88 -270 -274 42 46 204 12 42 62 77 -113 -249 -65 48 -102 125 36
3452 36 -273 66 139 -59 -88 153 -240 -67 210 -19 128 -188 -113 36 -145 141 -33 187 -174 -154 274 -51
3474 -51 333 -38 -49 143 -168 205 139 -202 267 -41 135 157 169 53 126 47 -71 79 238 -140 237 -208
3496 -208 59 -123 142 178 -44 218 380 203 -233 51 43 146 146 59 -296 181 274 100 142 -29 180 52 148
3519 148 113 -137 -111 123 69 147 -142 -99 50 60 -23 21 -280 -253 -17 25 -65 -112 -7 -201 333 -106 -126 177
3543A77m6l34R2N2k1J99j24J42j62j13Q7l5Rk39j79L56p0L71p0K8l06J12L7l11
3567c48L77l19L03k97L14j84K56l65M24l16j16L29j84K21l30K35j11L14l51O8
3587h0K12K2j27o0R6p0J15j0J51l76J89r8J91n89L70J58k0p1K3j20M9j12J41k73
3611b89J42J21j54P39p33L28k35K35l4p3k42K31O4j41J22J52k07J41J07j89L54
3632D39l33Q0k05jK89J02k29k74l1J5M35r8k1k55J2L12ql7j63j09L30n31L76k08
3656a13K23J8J84k34MN8j57j22J59o7m3K23k14r7R5N5J21k1J42l94J5K7L9m1k8
3681a68J43j31K00n28M54J58m70J56M8k85M02q4K01p7M2l40J24K13J22r1j23J16
3703H2j33l97L80J23o3j27M23l19k4r0l03O21l91L9J46l95M10M3J79o01N25o6
$$ plain form
3543 177 131 -203 -111 -59 -80 119 -5 137 -25 -138 -51 -86 -77 -316 -495 -139 -209 162 92 120 -186 -74 -37 -348
3567 -348 29 -290 13 -284 30 -154 102 -263 161 -155 -271 58 -126 95 -235 0 -111 203 -148 -80
3587 -80 132 154 27 -33 63 -7 108 98 249 -127 62 -36 155 -434 -64 94 74 3 26 -94 -45 -157 -16 -289
3611 -289 -147 -26 -180 559 -174 154 -81 154 120 47 -195 36 100 -41 81 233 26 167 274 85 439
3632 439 106 186 -19 -20 269 371 142 -132 -163 -148 287 189 168 -87 -75 237 229 192 29 -80 250 -281 95 -113
3656 -113 110 128 312 78 82 140 -17 -139 20 -47 -90 133 -81 -178 -83 -28 93 72 214 -180 -165 -138 -99 -140 -168
3681 -168 -25 -156 44 -484 -30 128 -342 -186 -138 -423 -21 -105 96 19 61 -279 -155 58 180 89 -34 82
3703 82 -51 -448 -68 55 -8 -135 288 -31 -55 -145 -448 173 -218 -179 -33 -428 -18 25 204 -397 128 62
3725F2j45k77L01N28n56J01K58m20K42p0J63p6j80J43o1J0P1J99J06n53L86k51
3747a9K63k43R1j11j26J41j05j39M21m80M60j52L5J21J25k20Q2N2r1O8j57j68
3769a52J35L02n26K41j59J73q5N8J81j39k2k1J47m69K47k6R7O3k7k64M73k51R8
3792G4j19K97q5j67j21J35j54J86k28O4k88K25L42q3J5j37MJ58j64k00J89k14
3814b71K01J47r1m8o5J22j9nn8j66L94j18M7j24l98L61j1K54o8L5l01kJ01J86
3838A03k84L74j87O4l0p5LK52k45K08l15M38n62J80j8N4L3l7J44j09K27n5j71
3861hk9m9j59L13k58K63Q3q9J46k36o0J86Q5Q7n19N23k66j08K22J67k90K09Q5
$$ plain form
3725 62 -83 -360 -59 469 -87 14 272 -148 94 24 187 111 -69 74 13 23 94 293 399 -154 232 -19
3747 -19 244 1 92 -19 -145 -4 -109 -248 173 -307 153 1 36 157 282 62 144 196 105 173 16 -152
3769 -152 -17 285 -241 0 -159 14 -71 -13 168 29 7 -14 133 -336 -89 -115 -18 45 18 -246 227 -24 74
3792 74 -45 252 167 0 -121 14 -140 46 -182 -118 -406 -181 161 78 93 -44 -40 118 -46 -246 -57 -271
3814 -271 -70 77 -14 -62 -127 -5 -24 -29 -87 -253 141 23 70 -54 -452 -91 -102 152 84 119 -182 -184 -83 103
3838 103 -181 193 6 70 40 -35 -32 220 -25 183 -132 306 -256 -76 -94 -40 -7 -44 100 -9 218 163 -8
3861 -8 -37 -86 -245 68 -190 73 156 67 213 -23 -83 103 188 275 -244 279 13 -95 127 294 4 213 298
$$ [...]
8191H2
##END NTUPLES=NMR FID
##END=
