##TITLE=1H_SL62-SeO2-f3-4
 CDCl3, 8 sc, 
 5.6.2020
##JCAMPDX= 6.0         $$ Bruker NMR JCAMP-DX V2.0
##DATA TYPE= NMR FID
##DATA CLASS= NTUPLES
##ORIGIN= UXNMR, Bruker Analytische Messtechnik GmbH
##OWNER= root
$$ XWIN-NMR		Version 3.5
$$ Fri Jun  5 11:29:17 2020 Russian Standard Time (UT+4h)  she@DPX200
##.OBSERVE FREQUENCY= 200.1315
##.OBSERVE NUCLEUS= ^1H
##.DELAY= (6, 6)
##.ACQUISITION MODE= SIMULTANEOUS
##.ACQUISITION SCHEME= undefined
##.AVERAGES= 8
##.DIGITISER RES= 18
##SPECTROMETER/DATA SYSTEM= spect
##.PULSE SEQUENCE= zg30
##.SOLVENT NAME= D2O
##.SHIFT REFERENCE= (INTERNAL, D2O, 0, 15.7039)
##AUDIT TRAIL= $$ (NUMBER, WHEN, WHO, WHERE, WHAT)
$$ ##TITLE= Audit trail, XWIN-NMR		Version 3.5
$$ ##JCAMPDX= 5.01
$$ ##ORIGIN= Bruker BioSpin GmbH
$$ ##OWNER= she
$$ F:/spectra/data/she/nmr/H-F/1/audita.txt
$$ ##AUDIT TRAIL=  $$ (NUMBER, WHEN, WHO, WHERE, WHAT)
(   1,<2020-06-05 11:28:14.42 +0400>,<she>,<DPX200>,
      <created by zg, POWCHK disabled, PULCHK disabled
       configuration hash MD5:
       00 E9 B6 7A A2 85 ED C7 34 08 36 98 17 FE 4E 26
       data hash MD5: 16K
       01 44 EC C0 91 4B 2D 70 B4 12 0C 8F A6 91 AF 60>)
$$ ##END=
$$ 
$$ hash MD5
$$ D9 A6 90 CA 9B E5 4F DE 24 08 C3 7A 7C 95 2C C8
##$RELAX= 
##$RELAX= 
##$RELAX= 
##$RELAX= 
##$RELAX= 
##$RELAX= 
$$ Bruker specific parameters
$$ --------------------------
##$DU= <F:/spectra>
##$EXPNO= 1
##$NAME= <H-F>
##$PROCNO= 1
##$TYPE= <nmr>
##$USER= <she>
##$AMP= (0..31)
100 100 100 100 100 100 100 100 100 100 100 100 100 100 100 100 100 100 
100 100 100 100 100 100 100 100 100 100 100 100 100 100 
##$AQSEQ= 0
##$AQ_mod= 1
##$AUNM= <au_zg>
##$AUTOPOS= <>
##$BF1= 200.13
##$BF2= 200.13
##$BF3= 200.13
##$BF4= 200.13
##$BF5= 200.13
##$BF6= 200.13
##$BF7= 200.13
##$BF8= 200.13
##$BYTORDA= 1
##$CFDGTYP= 0
##$CFRGTYP= 5
##$CHEMSTR= <none>
##$CNST= (0..31)
1 1 145 1 1 1 1 1 1 1 1 1 1 1 1 1 1 1 1 1 1 1 1 1 1 1 1 1 1 1 1 1 
##$CPDPRG= <>
##$CPDPRG1= <>
##$CPDPRG2= <>
##$CPDPRG3= <>
##$CPDPRG4= <mlev>
##$CPDPRG5= <mlev>
##$CPDPRG6= <mlev>
##$CPDPRG7= <mlev>
##$CPDPRG8= <mlev>
##$CPDPRGB= <>
##$CPDPRGT= <>
##$D= (0..31)
0 1.2 0 0 0 0 0 0 0 0.06 0 0.03 0 0 0 0 0.0002 0 0 0 0 0 0 0 0 0 0 0 0 
0 0 0 
##$DATE= 1591342093
##$DBL= (0..7)
120 120 120 120 120 120 120 120 
##$DBP= (0..7)
150 150 150 150 150 150 150 150 
##$DBP07= 0
##$DBPNAM0= <>
##$DBPNAM1= <>
##$DBPNAM2= <>
##$DBPNAM3= <>
##$DBPNAM4= <>
##$DBPNAM5= <>
##$DBPNAM6= <>
##$DBPNAM7= <>
##$DBPOAL= (0..7)
0.5 0.5 0.5 0.5 0.5 0.5 0.5 0.5 
##$DBPOFFS= (0..7)
0 0 0 0 0 0 0 0 
##$DE= 6
##$DECBNUC= <off>
##$DECIM= 24
##$DECNUC= <off>
##$DECSTAT= 4
##$DIGMOD= 1
##$DIGTYP= 9
##$DL= (0..7)
0 120 120 120 120 120 120 120 
##$DP= (0..7)
150 150 150 150 150 150 150 150 
##$DP07= 0
##$DPNAME0= <>
##$DPNAME1= <>
##$DPNAME2= <>
##$DPNAME3= <>
##$DPNAME4= <>
##$DPNAME5= <>
##$DPNAME6= <>
##$DPNAME7= <>
##$DPOAL= (0..7)
0.5 0.5 0.5 0.5 0.5 0.5 0.5 0.5 
##$DPOFFS= (0..7)
0 0 0 0 0 0 0 0 
##$DQDMODE= 0
##$DR= 18
##$DS= 0
##$DSLIST= <SSSSSSSSSSSSSSS>
$$ [...]
##$SUBNAM2= <"">
##$SUBNAM3= <"">
##$SUBNAM4= <"">
##$SUBNAM5= <"">
##$SUBNAM6= <"">
##$SUBNAM7= <"">
##$SUBNAM8= <"">
##$SUBNAM9= <"">
##$SW= 24.9337058887773
##$SWIBOX= (0..15)
0 0 2 0 0 0 0 0 0 0 0 0 0 0 0 0 
##$SW_h= 4990.01996007984
##$TD= 16384
##$TD0= 1
##$TE= 0
##$TE2= 300
##$TE3= 300
##$TEG= 300
##$TL= (0..7)
0 120 120 120 120 120 120 120 
##$TP= (0..7)
150 150 150 150 150 150 150 150 
##$TP07= 0
##$TPNAME0= <>
##$TPNAME1= <>
##$TPNAME2= <>
##$TPNAME3= <>
##$TPNAME4= <>
##$TPNAME5= <>
##$TPNAME6= <>
##$TPNAME7= <>
##$TPOAL= (0..7)
0.5 0.5 0.5 0.5 0.5 0.5 0.5 0.5 
##$TPOFFS= (0..7)
0 0 0 0 0 0 0 0 
##$TUNHIN= 0
##$TUNHOUT= 0
##$TUNXOUT= 0
##$USERA1= <user>
##$USERA2= <user>
##$USERA3= <user>
##$USERA4= <user>
##$USERA5= <user>
##$V9= 5
##$VALIST= <valist>
##$VCLIST= <CCCCCCCCCCCCCCC>
##$VD= 0
##$VDLIST= <DDDDDDDDDDDDDDD>
##$VPLIST= <PPPPPPPPPPPPPPP>
##$VTLIST= <TTTTTTTTTTTTTTT>
##$WBST= 1024
##$WBSW= 4
##$XGAIN= (0..3)
0 0 0 0 
##$XL= 0
##$YL= 0
##$YMAX_a= 308104
##$YMIN_a= -174069
##$ZGOPTNS= <>
##$ZL1= 120
##$ZL2= 120
##$ZL3= 120
##$ZL4= 120
##$ABSF1= 10
##$ABSF2= 0
##$ABSG= 5
##$ABSL= 3
##$ALPHA= 0
##$AQORDER= 0
##$ASSFAC= 0
##$ASSFACI= 0
##$ASSFACX= 0
##$ASSWID= 0
##$AUNMP= <proc_1d>
##$AZFE= 0.1
##$AZFW= 0.1
##$BCFW= 1
##$BC_mod= 2
##$BYTORDP= 1
##$COROFFS= 0
##$CY= 11.3945322036743
##$DATMOD= 1
##$DC= 2
##$DFILT= <>
##$DTYPP= 0
##$F1P= 16.9975609425685
##$F2P= -3.02152046262296
##$FCOR= 0.5
##$FTSIZE= 0
##$FT_mod= 4
##$GAMMA= 1
##$GB= 0.15
##$INTBC= 1
##$INTSCL= 1
##$ISEN= 128
##$LB= 0.24
##$LEV0= 0
##$LPBIN= 0
##$MAXI= 10000
##$MC2= 0
##$MEAN= 0
##$ME_mod= 0
##$MI= 1.114404
##$NCOEF= 0
##$NC_proc= 0
##$NLEV= 6
##$NOISF1= 3.799351
##$NOISF2= 2.8
##$NSP= 1
##$NTH_PI= 0
##$NZP= 0
##$OFFSET= 15.70392
##$PC= 1
##$PHC0= -9801.934
##$PHC1= 29.60082
##$PH_mod= 1
##$PKNL= yes
##$PPARMOD= 0
##$PSCAL= 0
##$PSIGN= 0
##$REVERSE= no
##$SF= 200.130013532006
##$SI= 16384
##$SIGF1= 3
##$SIGF2= 2
##$SINO= 400
##$SIOLD= 16384
##$SREGLST= <1H.CDCl3>
##$SSB= 0
##$STSI= 0
##$STSR= 0
##$SW_p= 3612.71676300578
##$SYMM= 0
##$S_DEV= 0
##$TDeff= 0
##$TDoff= 0
##$TI= <>
##$TILT= no
##$TM1= 0
##$TM2= 0
##$TOPLEV= 0
##$USERP1= <user>
##$USERP2= <user>
##$USERP3= <user>
##$USERP4= <user>
##$USERP5= <user>
##$WDW= 1
##$XDIM= 8192
##$YMAX_p= 0
##$YMIN_p= 0
$$ End of Bruker specific parameters
$$ ---------------------------------
##NTUPLES= NMR FID
##VAR_NAME=  TIME,          FID/REAL,        FID/IMAG
##SYMBOL=    X,             R,               I
##VAR_TYPE=  INDEPENDENT,   DEPENDENT,       DEPENDENT
##VAR_FORM=  AFFN,          ASDF,            ASDF
##VAR_DIM=   8192,          8192,            8192
##UNITS=     SECONDS,       ARBITRARY UNITS, ARBITRARY UNITS
##FACTOR=    0.0002004,     1,               1
##FIRST=     0,             0,               0
##LAST=      1.6414764,     0,               0
##MIN=       0,             -174069,         0
##MAX=       1.6414764,     308104,          0
$$ Real data points
##PAGE= N=1
##DATA TABLE= (X++(R..R)), XYDATA
0@%%%%%%%%qJ6j6J7k5L2l7M5n5O8q0R4j11J29j48J72k02K31k62L00l42L88m38
31b32M92n52O19o91P71q59R54j061J178j304J444j600J770j961K174k410K679
48A411k985L336l745M230m813N525o426P609r233J1624j5521K3218o5164K30784
62A79850Q5274l33205p4396K18350Q8057k10593j04910J13183R1609n8116j3162
73a8059N8507q683o9277J7456O0720l1597q0222J9732P6292Q720m2545J0092L7581
86C8717j9211n3351M943M6064J8764k7541j3561J9139L700l4103k5762K2130K7191
99G119q777j1662K9620K2874l5301k9843L4668L2731l8882m3514L4457N0169k0918
112B2741l7224K0123J2205m3849j2305O4650K2893p2949l4015P8189M6025p7237
$$ plain form
0 0 0 0 0 0 0 0 0 0 -8 8 -8 9 -16 16 -21 24 -31 37 -43 51 -60 69 -79 93 -109 122 -140 160 -182 206 -232
31 -232 260 -292 327 -364 407 -452 502 -559 619 -685 759 -841 929 -1032 1142 -1268 1411
48 1411 -1574 1762 -1983 2247 -2566 2959 -3467 4142 -5091 6533 -8988 14230 -50934 179850
62 179850 265124 -68081 -142477 75873 163930 -46663 -151573 -38390 53219 -4897 -18059
73 -18059 40448 31765 -37512 -20056 40664 9067 -71155 -51423 24869 33589 -8956 1136 38717
86 38717 19506 -33845 -28902 17162 35926 8385 -5176 13963 17663 -16440 -42202 -20072 7119
99 7119 -1658 -13320 16300 39174 3873 -25970 8698 41429 2547 -40967 -6510 43659 22741
112 22741 -14483 5640 17845 -26004 -38309 26341 49234 -23715 -57730 20459 66484 -10753
124a0753o0466N9740O6766k8525m1017K2595J5816l0806k899L9428j6014o8555
136e4690n961P7297L1268n1816l3751L7151L2277k0428l2081k034J7379J7082
148A1693J0751j2759k8767k811K7957R806k1908j1094J9664R441k0990j7617J3277
161a3357J1935r690j0527J2881K0424K024q432J684O772j0129k5254o301J8532
174i438P808j4994m96L4211J3496m0165l2049L0437L7659k5799m3294J7051M8226
187B2653j170l2250N080K7782r276k5863O320J5655j9646j7244K5648K6294k1085
200B898k6577J4423K3763r296j4507R225J0125p882n48J6779k275k6452l214K2147
214H609J744k4158l528K9019J4875k0760j4789J2098O268j5855j1837J3988J5914
$$ plain form
124 -10753 -71219 -11479 55287 26762 -14255 8340 24156 -6650 -9549 29879 13865 -54690
136 -54690 -60651 16646 47914 -3902 -37653 -502 31775 11347 -20734 -22768 -5389 11693
148 11693 22444 9685 -19082 -21893 6064 15870 -6038 -17132 2532 11973 -9017 -26634 -13357
161 -13357 -1422 -11112 -21639 -8758 11666 13690 5258 6942 13714 3585 -21669 -27970 -9438
174 -9438 -1630 -16624 -17120 17091 30587 -9578 -41627 -11190 26469 670 -42624 -25573 22653
187 22653 21483 -10767 -5687 22095 12819 -13044 -6724 8931 -10715 -27959 -2311 23983 2898
200 2898 -23679 -9256 14507 5211 -9296 -71 10054 2172 1624 18403 16128 -10324 -13538 8609
214 8609 10353 -13805 -17333 11686 26561 5801 -8988 3110 9378 -6477 -18314 -4326 11588
227A1588j350n984Q478J1985r189j6098l188O832p759j0616P969K1601J387j8514
241b858k96J7874m56k3163n703K2436J1464j6072r321J4595Q112j6142j0141J1182
255A511O936j0283m805J0886O319r123q792J800K335k159N43L943K614N096R095
270A5916k091j4159o928N719M04j0090l292J3018O019n748k208P709O20r404l223
285g738R324J418j1035k578J0502O469p412m577Q983O741q716r855K293M741n735
300g175o541L825Q517L273p65J718L344k702n453k142n86j678p77O979O655j850
316D642m172K66L9p736l238O685N057l650L083R252J526j2889r288Q603P931q918
332b807o526J3331J3237r623j5207M806R139r444j2044J0457J6465l921j1151
$$ plain form
227 11588 10238 4254 12732 24717 15528 -570 -3758 3074 -4685 -15301 -7332 14269 15656 -2858
241 -2858 -3154 14720 14264 -8899 -14602 7834 19298 3226 -6095 8500 16612 470 -9671 1511
255 1511 8447 -1836 -6641 4245 10564 1441 -7351 -5551 -3216 -5375 -4832 -889 1725 6821 15916
270 15916 13825 -334 -7262 -1543 -1139 -11229 -14521 -1503 4516 -1232 -3440 4269 4889 -4515 -7738
285 -7738 1586 3004 -8031 -10609 -107 6362 -1050 -5627 3356 10097 1381 -8474 -6181 -1440 -7175
300 -7175 -13716 -9891 -1374 1899 1134 2852 6196 3494 -1959 -4101 -4687 -6365 -7142 -163 6492 4642
316 4642 470 736 775 -6961 -10199 -3514 1543 -2107 976 10228 11754 -1135 -10423 -1820 6111 -2807
332 -2807 -9333 3998 17235 7612 -7595 -2789 6350 -3094 -15138 -4681 11784 7863 -3288
345c288O451J3444p823j7880J861J5210l55j3516L664J4741j291j4542k445J0295
359D526j335q457K132J1802J532r639r31N468j652q020J51J1496K896p164j189
374A616N847L66j3470m682M685O077l264J001Q304L531m330j847Q12o218q835
389a0407K695Q970K093m312K244R283N34j2644q019L862M779o717l900R163Q361
404E985j198n260Q44M524l419o433j166M359J004j408j224L603O06k979r85J619
420a528j546j219K820J757m84l385J418J106L04J31k30J453j567l30j81o61k907
437e049j038K520K923J009r37J691k646k710P37K202J203p14L161L859n97o346
453g32n489O23L800l77k285K516M493L272j567k327k162k839j382O90J910L804
$$ plain form
345 -3288 3163 16607 8784 -9096 -7235 7975 7620 -5896 -2232 12509 11218 -3324 -5769 4526
359 4526 3191 -5266 -3134 8668 10200 561 -370 5098 3446 -4574 -4423 7073 9969 2805 1616
374 1616 7463 7829 -5641 -10323 -5638 439 -2825 -1824 6480 10011 5681 3834 4646 -1572 -10407
389 -10407 -7712 1258 3351 -961 1283 10566 11100 -1544 -9563 -5701 -922 -7639 -11539 -2376 5985
404 5985 4787 -473 371 4895 1476 -4957 -6123 -1764 -760 -2168 -3392 211 817 -2162 -3147 -1528
420 -1528 -3074 -4293 -1473 284 -200 -3585 -2167 -1061 -757 -626 -856 597 -970 -1300 -1481 -2142 -5049
437 -5049 -6087 -3567 -644 365 -572 1119 -1527 -4237 -3500 -1298 -95 -809 2352 6211 5614 -732
453 -732 -6221 -5598 -1798 -2175 -4460 -1944 2549 5821 4254 1927 -235 -3074 -4456 -3766 -1856 1948
469A948L597K903j48m854o325m80K883j835p9K530M440k082k535J033K802q98
485B900k550J896K070j749N38K388K36n434l888M642K423m884p73P829M693p458
501B879j0709L135P059l53m380M142P562k291p289j213O289l1q184k635O615L515
517D111l927l620M753L943m643n700O49L955q42L647M270j119q681l378O417N424
533E259o668l533O406M418p241p855L058N866l95k926K736K933k512k010M240
548A776J629n759m356L472M726j577o30K429Q9p365m137L271P024j673k358O082
564B643L052q078q084M208R020n19m868J803N778k309p205J614M763k501p682
579h365P06Q011M356m027j052L058r05n309k350M630M642K044p88l493k262j192
$$ plain form
469 1948 5545 8448 8300 3446 -2879 -3359 -476 -2311 -2390 140 4580 2498 -37 996 3798 2900
485 2900 350 2246 4316 2567 3105 5493 5729 295 -3593 1049 3472 -1412 -2185 5644 10337 2879
501 2879 -7830 -4695 2364 2011 -2369 1773 9335 7044 -245 -1458 4831 4800 -3384 -6019 596 4111
517 4111 184 -3436 1317 5260 617 -5083 -4434 -479 -1321 2326 6596 5477 -3204 -6582 -165 5259
533 5259 -1409 -4942 1464 5882 -1359 -9214 -6156 -290 -685 -3611 -875 2058 -454 -2464 1776
548 1776 3405 -2354 -6710 -3238 1488 -89 -719 1710 1799 -5566 -9703 -6432 592 -1081 -3439 2643
564 2643 5695 -2383 -10467 -6259 2761 2242 -2626 -823 4955 2646 -4559 -2945 1818 -683 -8365
579 -8365 -7659 352 4708 681 -371 2687 1782 -3527 -5877 -1247 3395 5439 4651 1158 -1104 -2296
595b296m50L99K480M718J148p787l264M875O011l699p059J485P706N23l997O06
611A399M620R13l445p087j283Q33M202M800J303m367j796N21J073j651j104K694
627A625L978q98n907j744M354M372k740n141Q32M228k98l616J776L370j869o962
643d640j219M179K139J075L368M793n540p727n26M705j243k781N268L629l795
658A685n184N015J931p442l421P202M721p442l631R353P602r896j0421M295P665
673B032l565m257P313N875o753q821L558P167m914n140M196P872j750o998k505
688f690P836L054n920n127L388O016k164n091K089O796k939q891j52P630K578
703B413j871qJ211l347m039K173L198j348J31N737J738p284l636N034J877m716
$$ plain form
595 -2296 -2746 -2347 133 4851 5999 -1788 -5052 -177 5834 2135 -4924 -3439 4267 4790 793 1399
611 1399 6019 6932 3487 -3600 -4883 -4050 152 4952 6255 1888 92 613 1686 35 -1069 1625
627 1625 5603 4705 -1202 -2946 1408 5780 3040 -2101 -1269 2959 2661 -955 821 4191 2322 -4640
643 -4640 -5859 -1680 459 1534 4902 9695 4155 -3572 -4098 607 -636 -3417 1851 5480 1685
658 1685 -3499 1516 3447 -3995 -7416 -214 4507 -2935 -6566 2787 10389 493 -9928 -5633 2032
673 2032 -1533 -5790 1523 7398 645 -8176 -4618 2549 -2365 -7505 -3309 4563 2813 -4185 -6690
688 -6690 1146 4200 -1720 -6847 -3459 2557 393 -4698 -2609 4187 1248 -7643 -7795 -165 2413
703 2413 542 534 1745 -1602 -5641 -3468 -270 -1618 -1487 4250 5988 -1296 -4932 102 1979 -2737
719b737k333O621K202p123j22R459P92r227k138N941J233o655J026R289J89n372
735A045j33K664m699k866M103O393m135o471L823O409k992p128L117O107j562
750C675l595J302K491j948k403J160n32j557L469J720j695j428R70J057k465l041
766b820J485M029M53l565N4K089q0k744R9J522J074k203j035L307K956l985m954
783d318K660N966k461p260K552R299p16j1100j660R002K274q854r77R611K643
798F661j0563j660O560L20o427M82P902K021q487l12M554j810n145K363N912k269
814A02n536M400N487l667p065J520N781j840o140M078P763j547m392k025L427
829C46q33m660N54M732K105k262N36J277o05n947J046L717J132k892R20M601K89
$$ plain form
719 -2737 -5070 1551 3753 -3370 -3492 5967 6759 -2468 -4606 1335 2568 -4087 -3061 6228 6417 1045
735 1045 912 3576 -1123 -3989 114 6507 2372 -4099 -276 6133 3141 -3987 -870 5237 3675
750 3675 80 1382 3873 1925 -478 682 150 -1407 2062 3782 2087 659 1629 2686 221 -2820
766 -2820 -1335 2694 3147 -418 -364 1725 1645 -1099 -1000 522 1596 -607 -1642 1665 4621 636 -4318
783 -4318 -1658 4308 1847 -5413 -2861 6438 5722 -5378 -7038 1964 4238 -4616 -5593 4018 6661
798 6661 -3902 -5562 998 1318 -5109 -4627 3275 5296 -3191 -3503 1051 -759 -5904 -3541 2371 102
814 102 -5434 -1034 4453 786 -6279 -4759 1022 -818 -6958 -2880 4883 3336 -1056 -3081 346
829 346 -487 -5147 -4593 139 2244 -18 518 1795 1190 -4757 -3711 6 1138 -1754 -834 3767 4056
846D056o220m263M917M761m339l133N083M884k588o853J886M914k205n100L033
861a167O528j404m897K254K118l258l998M221L039k320j608K370L370m053k523
876a328J402P14l124J350N733J045m691j240L838k163m356O53N640r73j720J430
892B210J216j226m650P49M027j79k945o71O165J396p192j477L619J459m359j764
908c622L878L669j667k311K088j449l158j693K545K140P60k614L711P54m408j632
924c009J085K307k692r21M376J437m039k501M190N21l365j625M842J037m315O80
940a992L709O07n256k494M780K432l483k682N126K555m794l392M078K493n247
955c560p42L739L205l109k640K705L208l319m114J546O636l614k901J946L929
$$ plain form
846 4056 -2164 -6427 -1510 3251 -1088 -4221 862 5746 3158 -3695 -1809 3105 900 -4200 -1167
861 -1167 5361 3957 -940 1314 3432 174 -3824 397 3436 1116 -492 1878 5248 1195 -1328
876 -1328 74 788 -2336 -986 4747 5792 1101 -139 3699 1536 -2820 -2167 3473 2500 780 2210
892 2210 3426 2200 -2450 -1701 2326 2147 -798 -1469 4696 6092 -1100 -2577 1042 2501 -1858 -3622
908 -3622 256 3925 2258 -53 2035 586 -2572 -4265 -1720 420 1180 -1434 2277 3031 -1377 -3009
924 -3009 -1924 383 -2309 -3230 1146 2583 -1456 -3957 233 754 -2611 -4236 606 1643 -2672 -1992
940 -1992 1717 2324 -2932 -5426 -646 1786 -1697 -4379 747 3302 -1492 -4884 -806 1687 -3560
955 -3560 -4302 -563 2642 -467 -3107 -402 2806 -513 -4627 -3081 3555 -59 -2960 -1014 2915
970B915j515l043M63K489j649l211J784L409n3l281J002J759K33j156j15J318
986A349r64m20J208J229k593k147J866L235k528j735K480L026j750j977k84K216
1002B211k337r47L400J473j874l655K936K714j853k112J579N38j500j511J286
1017C48L141n25r08k87P23j938q08R78K115J42j049j174o94k175P00Q18J524m83
1035D48J5J557J137k711l53L75N78j521j313K190O24r39j61J988j422k657j616
1052c781K593K965j845r97K034k4k572k081L951J581k724o80K413P56k990l080
1068d481M495J687l813l301K914L422j56k673Q33J161k204j507J058L221n43j419
1084a306J184J050o88j710K22J501j509j514R82j62L66r48J985L252j063m020
$$ plain form
970 2915 1400 -1643 -1180 1309 -340 -3551 -1767 1642 1589 -1692 -690 1069 1302 146 31 1349
986 1349 385 -35 1173 2402 -191 -2338 -472 2763 235 -1500 980 4006 2256 279 -5 2211
1002 2211 -126 -1073 2327 3800 1926 -1729 1207 3921 2068 -44 1535 2073 573 -938 348
1017 348 3489 2964 2056 1769 2492 554 -254 724 2839 2981 1932 758 64 -2111 -1411 -593 931 448
1035 448 463 2020 3157 446 93 468 1046 -475 -1788 402 1026 87 -74 1914 492 -2165 -3781
1052 -3781 -1188 1777 -68 -1065 969 945 -1627 -3708 243 1824 -900 -1580 833 1589 -1401 -4481
1068 -4481 14 1701 -2112 -5413 -2499 923 767 -1906 -1073 88 -2116 -3623 -2565 656 113 -1306
1084 -1306 -122 928 240 -1470 -1248 253 -1256 -2770 -1788 -1950 -1584 -2532 -547 2705 1642 -2378
1100b378K49K810P87r43l29K229k502j580O2K053P40k124l98K646O33n106r19
1117d070M682K548j924l399L545J361l69q04O06m23j963j091K06J850r99p1K343
1134B028P85j342k925J298K518p90l25r50J443L7j781j19J713J131k632l01k43
1151d55J015ON44q54k16j400J106K010q17j122N63K455k06k411j350K170M75q69
1169F44j547k70j651R06J476J862q56l466J515J360j421r33K026J681R47j773
1185E00o70K92j699Q99p66R44j687q4k17J093K74j193J051O39j320J450l38Q26
1203fJ186J91k490j702K98Q11K108j552K70J90j16Kk736P78J007K850j214j575
1221a700J97K698J314j868k297K131L95r80k416J976J164l44j715N92rj896M70
$$ plain form
1100 -2378 -2129 681 1468 525 196 2425 -77 -1657 -1595 458 1198 -926 -1324 1322 1955 -3151 -4070
1117 -4070 612 3160 1236 -2163 1382 2743 2374 1570 2176 1753 -210 -1301 -1095 755 -244 -315 2028
1134 2028 2813 1471 -1454 -156 2362 1572 1247 297 1740 1777 -4 -123 1590 2721 89 -212 -455
1151 -455 560 566 1110 256 40 -1360 -254 1756 939 -183 380 2835 2629 218 -1132 1038 1513 644
1169 644 -903 -1173 -2824 -1918 -442 1420 564 -2902 -1387 -27 -1448 -2381 -355 1326 2273 500
1185 500 -170 122 -1577 -678 -1444 -500 -2187 -2271 -2488 -1395 -1121 -2314 -1263 -624 -1944 -494 -832 -6
1203 -6 1180 1371 -1119 -2821 -2523 -1712 396 -1156 -886 -696 -812 -810 -3546 -2768 -1761 1089 -125 -1700
1221 -1700 -1503 1195 2509 641 -1656 475 870 -110 -2526 -550 614 270 -1445 -853 -862 -2758 -2288
1238b288L754N08j785N08J604j109k233M66K303P9k384R68K001N90m974M21J647
1255G6R51l808J078K841J570L80j698Q82J202k904j00m87L46J722J190k053j775
1272e87O55J034p94j443Q52P94J440l39r21m39J690j35j763j224K337K627j619
1289B165j495j258J724j655l067P41K933J092k419J488K082o05l180o8L714m60
1305A732j939j588L213N60k475q09J247k01j611J159n37R95j642j48J902q31j797
1322b770J791J003K90k5J828n89k784k076L492j098j900l89R91J891j027k31J355
1339b48P62j204m06n27J970L53j302K92J117L00j711R4j06k20J007k469J476n61
1357a383n30Q05L49J247j47j542K438P16j839n51J584k42l085O5J929J423j924
$$ plain form
1238 -2288 1466 1974 189 697 2301 1192 -1041 -575 1728 1807 -577 391 2392 2982 -1992 -1571 76
1255 76 1027 -2781 -1703 1138 2708 3088 1390 2272 3474 570 470 -17 329 2051 3241 1188 -587
1272 -587 68 1102 308 -1135 -283 511 1951 1612 691 252 1942 1807 44 -1180 1157 3784 2165
1289 2165 670 -588 1136 -519 -3586 -2845 88 1180 -1239 249 2331 1726 -1454 -1522 2192 1732
1305 1732 -207 -1795 1418 1978 -497 -1306 -59 -260 -1871 -712 -1249 -254 -1896 -2044 -142 -973 -2770
1322 -2770 -979 24 314 289 2117 1528 -1256 -3332 160 -938 -2838 -3227 -2236 -345 -1372 -1603 -248
1339 -248 514 -690 -1096 -1623 347 700 -602 -310 807 1107 -604 -510 -616 -836 171 -2298 -822 -1383
1357 -1383 -1913 -1108 -759 488 341 -1201 1237 1953 114 -437 1147 905 -2180 -2115 -186 1237 -687
1374f87M95Q92J959l002L8J416L5k558L94K918n06r38R59J605p26l485K535J420
1392B764k035k684M17L717j080m047K879M519l427j650J094M676l184l562N00
1407a103K650l61l142K280K397j540j115j35K793j150k431P58J949M06l208R23
1423b9J158K12l60p21J885M4k669P44l52j093j523K40K068P61q25J361M66j90
1441A177k369j866L562L42k892n44M143K5l458o98L756P19l657r22M141n54m161
1458c256m96L189J218k782P6M113l18l096J271K571j823m067L34K821J32k989
1474c102P32L246L31l209Q61L459j329k824R1K170j412j530J512K982j643j721
1490a386K026R63Q8l203K6J564N25j922l68J699J383p03Q58K83j64k111L22J479
$$ plain form
1374 -687 -192 700 2659 -343 -305 1111 1146 -1412 -1018 1900 1394 456 1415 3020 2294 -1191 1344 2764
1392 2764 729 -1955 -1538 2179 1099 -2948 -69 4450 1023 -627 467 5143 1959 -1603 -1103
1407 -1103 1547 1186 -1956 324 2721 1181 66 -69 2724 1574 -857 -99 1850 2256 -952 -29
1423 -29 1129 1341 981 260 2145 2189 -480 264 -88 -1181 -2704 -2464 -396 365 -460 901 1367 1177
1441 1177 -1192 -3058 504 846 -2046 -2590 1553 1578 -1880 -2578 1178 1897 -1760 -2682 1459 905 -3256
1458 -3256 -3752 -563 655 -2127 -2051 2062 1744 -1352 -81 2490 667 -3400 -3066 -245 -113 -3102
1474 -3102 -2370 876 1207 -2002 -1141 2318 989 -1835 -1744 426 -986 -2516 -1004 1978 335 -1386
1490 -1386 640 1603 1691 -1512 -1486 78 603 -1319 -1687 12 1395 692 1550 1833 1669 -442 -120 1359
1508A359j267k536O16K343N55k400O60J783J354l087r74L673J05k499j720K079
1524D4L95J159r81J718l44o70j243K326j497j398j68J484j978j745K479M050L28
1541C959k725m2N13m57j472K19k3R76k019P26J247O58l088K784J297j350k693
1558a490R10P57o44o98P11J174o25j075n7K256m05r78r51J259n8k658n93K549
1576f16M0M15j6R82J520m84k322j59L29q98o69K363R18k194L05M1K23o32k352
1595c206K822P67m58k215j00J180L28j25K244L19M5j445n62m07j82l90R08j258
1613a735k34j292M341M42j362m05J757R52k183k906K134J584j121k53n29J832
1629A022j60j705L87J743r82r41j692K584o05j634L833j36l28k01L77J051j584
$$ plain form
1508 1359 92 -2444 -1828 515 1070 -1330 -670 1113 2467 -620 -1594 2079 2184 -315 -2035 44
1524 44 439 1598 617 2335 1991 1321 78 2404 907 -491 -659 825 -1153 -2898 -419 3631 3959
1541 3959 1234 1192 1705 1248 -224 -5 -28 948 -1071 -345 902 1560 -1528 1256 2553 1203 -1490
1558 -1490 -580 177 -467 -1165 -454 720 95 -980 -1037 1219 814 -164 -1115 144 86 -2572 -3165 -616
1576 -616 -576 -161 -177 805 2325 1841 -481 -640 -311 -1209 -1878 485 1403 -791 -486 -445 -222 -854 -3206
1595 -3206 -384 383 -75 -2290 -2390 -1210 -882 -1007 1237 1556 1601 156 -406 -813 -995 -1385 -477 -1735
1613 -1735 -1969 -3261 1080 1522 160 -245 1512 2464 281 -2625 -491 1093 -28 -281 -810 1022
1629 1022 862 -843 -456 1287 305 -636 -2328 256 -349 -1983 1850 1714 1386 1185 1562 2613 1029
1646A029r6k75j049q4q43J357P23m34L8q6J663j177k039J784j07l40r7K78J810
1665B055j460Q13O2K360l634m08L27O47q22j415J223J59n78l0R15N32K021k344
1683D23J587n90j395q45O28M42m26o81P14M20j466L41J189O78j270k692J123J859
1701C9k44j320Q11K142j767J06N51k16O67j326q78L63j216r41P99K334M43j824
1719a477R43P27n73j818J880J237l456Q09N70J690j827O8J213N95j930k8Q64J118
1737F05k239j578K058Q43o35m66L133o85q87J180m79j280j170J051J120n38k125
1754b092N56Q92K097l897J741N31J871j306j575O85J249Q49n18j259Q80O61j183
1771A82m36R65j146k35J43M07M24p69r23K604n69L51Q21o06m44N44K46n99K67
$$ plain form
1646 1029 933 658 -391 -475 -1318 39 762 328 366 280 1943 766 -1273 511 404 64 -33 245 2055
1665 2055 595 1408 1470 3830 196 -212 115 762 -60 -1475 -252 -93 -671 -701 214 746 2767 423
1683 423 2010 1420 25 -820 -192 250 -176 -857 -143 277 -1189 -848 341 1019 -251 -2943 -1820 39
1701 39 -205 -1525 -714 1428 -339 -233 318 102 769 -557 -1435 -1072 -2288 -3229 -2430 -96 347 -1477
1719 -1477 -534 193 -380 -2198 -318 919 -2537 -1728 -1158 532 -1295 -1227 -14 581 -1349 -1377 -513 605
1737 605 -1634 -3212 -1154 -311 -946 -1412 1721 1036 149 1329 850 -430 -1600 -549 571 33 -2092
1754 -2092 -1536 -644 1453 -2444 -703 -172 1699 393 -1182 -497 752 1601 1083 -176 704 1365 182
1771 182 -254 711 -435 -670 -527 -120 304 -465 -1388 1216 647 998 1819 1213 769 1313 1559 960 1227
1790A227r98K08J16O1n23l90J200q89O6J86n64m90J36J220P85r74P16J32L28o53
1810I00M84o67j047p19m67L3J532k141P51J923n38K012j036o01q6o67L39n57j163
1829a715O36J164q64p34J012j150J135o85J254j135j127J192K01M55k74p56J630
1846B39J129n75r94Q81q2o06j324n2l6J272j083J82J143L20p37J69p90J8M26m80
1866i80j88j36J260m77J350j963M53J220j480l3J337j410j565L533j328K14l17
1883e10J892o05m28o73K030q28j204J526l52p84o71J566M18p93j171K254r93j090
1901d16L04K16j8J323r13O16M40q08k77R88M4p75q45N94n52Q25J01q56R56j488
1921e41J367o13R05M70Q26r31l07p33J05l27j74M17J107j309M51m0o4j088N17
$$ plain form
1790 1227 229 437 553 614 91 -299 901 12 78 264 -300 -790 -654 566 1351 377 1093 1225 1553 900
1810 900 1384 717 -330 -1049 -1516 -1483 49 -2092 -1341 582 44 2056 1020 419 333 -334 5 -552 -1715
1829 -1715 -1079 85 -779 -1513 -501 -1651 -516 -1201 53 -1082 -2209 -1017 -816 -361 -635 -1391 239
1846 239 1368 793 -201 680 598 -8 -1332 -1384 -1420 -148 -1231 -1049 94 414 -323 -154 -944 -926 -500 -980
1866 -980 -1168 -1304 -44 -521 829 -1134 -681 539 -941 -974 363 -1047 -2612 921 -407 -193 -510
1883 -510 1382 777 349 -324 1706 878 -326 1200 848 64 -607 959 1377 584 -587 1667 674 -416
1901 -416 -112 104 86 1409 496 1112 1552 744 467 1455 1499 724 -121 473 -79 746 847 -9 947 -541
1921 -541 826 213 1118 1588 2414 1483 1176 443 548 221 47 464 1571 262 713 673 609 -479 38
1940C8l07J92m88N6J022J19n1Q7q58J524r07j314L21O1R50m24k30M00k71J416
1960A336k541k62K028r39M21j477J207M63p11k14P59J011j518J28M16l97k034
1977b324K009M56p61j894J673P61q92p78J522K305k062j011N83Q00j408j522J352
1994a191J106p45M88k39K96J19q09K49O83j39n69J036J29k47R10j275N43m60J207
2013A092k530J661n67l56J386J14k62l47j58K25L78J057j131J96K96m90o74j05
2031b15J127q03O95m78J899j645J109j442J79L26p9p92L43m4O07J286j056p93
2049B24L00J169m05j180k25Q35p99r98Q41Q20p11K22O43R27n99j046l43J70M91
2068C36j153L59J052o3o49R72O07j570n70Q05r27O92r45K38O17O50j51j5l20Q3
$$ plain form
1940 38 -269 -77 -565 -509 513 632 581 668 -190 1334 427 -887 -566 -505 445 21 -209 191 -80 1336
1960 1336 -1205 -1467 561 -378 43 -1434 -227 236 -475 -689 70 1081 -437 -309 107 -290 -2324
1977 -2324 -315 141 -620 -2514 -841 -80 -972 -1750 -228 2077 15 -996 -413 387 -1021 -2543 -1191
1994 -1191 -85 -830 -342 -581 -285 -166 -975 -726 -43 -182 -751 285 414 167 1077 -198 345 -115 1092
2013 1092 -1438 223 -344 -700 686 800 538 191 33 258 636 1693 562 758 1054 564 -110 -215
2031 -215 912 109 804 326 2225 580 1689 247 426 752 673 -119 224 180 787 2073 1017 224
2049 224 524 1693 1288 108 -117 718 -81 -1079 -238 582 -129 93 736 1663 1064 18 -325 -155 336
2068 336 -817 -458 594 531 -118 854 1461 -109 -679 126 -801 -109 -1054 -816 -199 451 300 285 -35 48
2088D8k56J29l1j09J85q25K45P72m41o7jP40j009J98R80o56j20j173J893Q59k572
2109a211k89K052L94j806q04J044J080j183n65Q16N3m08r0N77J722j154r76O03
2127a45K67j192J77Q63q9K5o43R86j77r02L71J786j192p97k09R38L40j162Q01
2146D6R11k95r81N35M83J07k08l91M09q82j78j04M80R64m65J53R74K82j952m83
2166e95K041l29j602k74J414J089j003j092J093J725j923n36L91N36p08K39l85
2183H1J168j306k18J501p8o07j423J198L2l85R6J185p52j76o90Q81j49j090O14
2202a18J525o21j700M04Q78Q6j507P35R69J32j794oK401n60j432l21J260n21j200
2221a390K48J055L38j048Q7K204n16k093k75J449N12r36l40O68L26j163L46J264
$$ plain form
2088 48 -208 -79 -110 -219 -34 -859 -614 158 -283 -350 -351 389 -620 -422 558 -98 -218 -1391 502 1361 -1211
2109 -1211 -1500 552 946 -860 -1664 -620 460 -723 -1288 -472 -419 -827 -917 -340 1382 228 -748 -145
2127 -145 122 -1070 -893 -30 -119 -94 -737 249 72 -830 -459 1327 135 -662 -871 67 407 -755 46
2146 46 957 662 -319 216 699 806 598 207 616 -266 -444 -548 -68 896 431 584 1558 1840 -112 -595
2166 -595 1446 1117 -485 -759 655 1744 741 -351 742 2467 544 8 399 935 227 466 81
2183 81 1249 -57 -275 1226 1148 541 -882 316 348 -37 59 1244 492 316 -374 507 358 -732 -118
2202 -118 1407 786 -914 -510 368 454 -1053 -318 651 783 -1011 -1017 1384 824 -608 -929 331 -190 -1390
2221 -1390 -1142 -87 251 -797 -710 1494 978 -1115 -1390 59 571 -365 -705 -37 289 -874 -528 736
2239G36n6j619K28j20J447j098n32L98L79k90n39J202O41j446j36P82L65j385
2257a043M76J083p2j258K25P73Q8p99j336K778k11j203o20N79J054j208P0L76
2275b48N26n46O9R31O43j440k95j19K67j09o07J162J100j328q41J874m66n92q71
2294h90J495R32j537r8O74L57m28o16R01k19n4q74J145L46q30q22J579q09o11
2313c59R97K00L34p07j420J035R58l94j090O24M72l22j225P28P66q05P62K02n16
2332B40o71q5O47Q90L76j357J220j340K32j146L43R59m21j048R61M28l70o42k38
2351a022J157r35q5M75J507j304j27m58K211r39j291L88J198q75j304J604M84
2368F84j681n97J569m24p18k34J051J461j161p59Q19M21q78k51M27J004q35j441
$$ plain form
2239 736 680 -939 -711 -831 616 -482 -1014 -616 -237 -527 -1066 136 777 -669 -805 -23 342 -1043
2257 -1043 -567 516 444 -814 -589 184 272 -527 -1863 915 704 -499 -1119 -540 514 -694 -624 -248
2275 -248 278 -268 -199 732 1375 -65 -360 -479 -212 -321 -928 234 1334 6 -835 1039 573 -19 -890
2294 -890 605 1537 0 -98 576 933 505 -111 790 571 517 -357 788 1134 304 -518 1061 252 -359
2313 -359 638 838 1172 465 -955 80 1038 644 -446 178 650 328 -897 -169 597 -208 554 756 240
2332 240 -431 -516 131 1021 1397 40 1260 -80 152 -994 -651 308 -113 -1161 -200 228 -142 -784 -1022
2351 -1022 135 -800 -885 -410 1097 -207 -334 -792 1419 480 -811 -423 775 -100 -1404 200 684
2368 684 -997 -1594 -25 -449 -1167 -1401 -350 1111 -50 -809 10 431 -447 -698 -271 733 -102 -1543
2386a543L45J281p07L29J100o46J62p85N17l14N90o25Q8N72L05l08L18j77o72
2405a70o12J113o7r15K47P24L12p36r1J450r2j737j47Q72J394l98o37K51K57j151
2425a33k01P16Q01o59j196J022K17j109p27K113L34k38j005J125J91j99j319L99
2443A32J028p63k44L37L3r83O85n27M9n4J98J276q14K44j358R51N66q35J76K49
2463C46m81J63L0M90n44l11k86Q12r87O70r49J282k17n00L83N92n44O1j84J83
2483IO30p14o97J191o14M01l19o14L85l08n83L73R03m06P7J022n35J20k63n21
2503d63L05L37l82o59P81l23j49K39K05o69q7O1O98M30q99J06K17J61l6K15M07
2524D95m5p86R52k8j570P56M01k13m82J12O08K39J41l30m94P38q73M72R8k30J081
$$ plain form
2386 -1543 -1198 83 -624 -295 805 159 321 -464 53 -261 329 -296 -208 364 669 361 679 502 -170
2405 -170 -782 331 264 -651 -404 320 632 -104 -195 1255 1163 -574 -721 151 1545 1147 510 761 1018 -133
2425 -133 -334 382 1183 524 -672 350 567 -542 -1269 844 1178 940 -65 1060 1251 1052 -267 132
2443 132 1160 397 153 490 523 -460 225 -302 -253 -307 -109 1167 353 597 -761 190 756 -79 97 346
2463 346 -135 28 58 548 4 -307 -593 219 -768 -98 -1047 235 18 -482 -99 493 -51 10 -174 9
2483 9 639 -75 -772 419 -195 206 -113 -727 -342 -650 -1233 -860 43 -363 -286 736 201 321 58 -463
2503 -463 -158 179 -203 -862 -81 -404 -553 -314 -109 -778 -865 -804 -106 324 -575 -469 -252 -91 -127 88 495
2524 495 450 -336 616 588 -982 -226 175 -38 -520 -408 200 439 580 250 -244 494 -379 93 191 -39 1042
2545A042j128M45O4l66Q6o9K01O14j49r48Q67m47M02k83M83k9j56o20K79j08Q74
2566A054r81p6K007j762l93l43O68r45O94N79q92J633j187O65k16o09P20K02o24
2585A94N49j150Q64r67j6J218m96m71K17N81n26O20o08mK2Q5k27k85J315j341
2605d26lj82M77qO20m28m0O46j60m40j98n41j06M76m8K26j84R18j554Q86o7N72
2627D36j304P06J76m63o7Q7O6K36Q42j101N74k95J191j536N56N4n54J215r69n06
2647f56K1L3P01M45j053K71J85J02j70m36P21l47M20O50j87q86o7k4O45n47M63
2668B84o08M34o97n67J787m84J056o5j165n14N60K94n90J667p82k076J340O78
2686E52K47m97M50j217P44l32R87o04L93j064l7J172m62M4j76o2J219q76q54j65
$$ plain form
2545 1042 -86 359 423 57 143 74 275 889 740 -208 659 212 614 331 814 785 629 9 288 180 1054
2566 1054 73 -3 2004 242 -151 -494 174 -771 -77 502 -390 1243 56 721 505 -104 616 818 194
2585 194 743 -407 457 -510 -526 692 196 -275 -58 523 -3 617 9 5 27 112 -115 -400 915 -426
2605 -426 -429 -611 -134 -142 478 50 10 656 496 56 -142 -683 -789 -313 -361 -135 -319 599 -955 -69 -136 436
2627 436 -868 -162 14 -449 -516 -429 -363 -127 715 -386 188 -107 1084 -452 104 158 -396 819 -150 -656
2647 -656 -635 -602 99 544 -509 -238 -53 49 -121 -557 164 -183 237 887 700 -186 -253 -277 368 -179 284
2668 284 -324 110 -587 -1154 633 149 1205 1140 -25 -539 21 315 -275 1392 610 -1466 -126 552
2686 552 799 302 752 -465 279 -53 934 330 723 -341 -378 794 332 376 200 138 1357 481 -373 -538
2706e38J022p21N12l16J72L48n95j17k02P02k6l9o48m53Q00J200j133k21m16P31
2726F2l9q43J51R3M36K39r48OJ091K16j095J081P32j687J119n01m39L79p82k6
2746g55j90R7r64K106m85l75J5N00L2l89n50J091k15L81r56J065p24L83q24P31
2766b6k27p04K33k60P71j334J956j158R82j035N55N41N13j678N70J379m56q16
2784a94p94J294j98Q37K77q79r2m30p51J565J07k270J96L007J86k261N86P65j71
2803G80N18j293L95l23J616j939M99M73l45q18R3J37j69J252o38m21Q13N63k24
2822I69R5j876J026K79L45j198P67N87p87m31l78J118l04R1m09J71R10j014K11
2841A72O46K15j026l84J13R00o90m52j03R84q81K96N36m94m18n7L41M91M76q40
$$ plain form
2706 -538 484 -237 275 -41 131 479 -116 -233 -435 267 241 202 -446 -899 -99 1101 -32 -253 -669 62
2726 62 23 -820 -669 -576 -140 99 -849 -843 248 464 -631 450 1182 -505 614 113 -326 53 -729 -755
2746 -755 -945 -848 -1812 294 -191 -566 -551 -51 -19 -408 -958 133 -82 299 -657 408 -316 67 -757 -26
2766 -26 -253 -957 -724 -984 -213 -1547 409 -749 233 -802 -247 294 807 -871 -301 1078 622 -194
2784 -194 -988 306 108 945 1222 343 251 -179 -930 635 742 -1528 -1332 1675 1861 -400 186 951 780
2803 780 1298 5 400 77 1693 -246 253 726 381 -437 -344 -207 -376 876 238 -183 630 1193 969
2822 969 1064 -812 214 493 838 -360 407 994 207 -224 -602 516 212 303 -106 65 975 -39 172
2841 172 818 1033 7 -377 -264 636 -54 -506 -609 375 -506 -210 326 -168 -586 -643 -302 189 665 -175
2861a75n6L33p31M97K74k71l06O19p32j90j78r25J658p43O59J005L88Q2j091j066
2881i49J246P35j179j409J06O11J10J12P91j89q29P59N0J23q12j34J483J97p29
2900I3J68L8M0q32M11P50m74J98k251K479j731J198o40R81k82m94O51m24L41k49
2920b9L42J857o05k229k02J17J792j449m5P08L63j787J272M48K91k200j37J281
2938b12J673o5r59N64p8q85L10j108J543l95j036O17R65j156m03O77J25J257j519
2957h5M0Q46n31j81K72M07j62o97L15R33n44m07j44n10P49j610J724n25n70K248
2977A568k473K161j118J057o83o2q35q8M55J54n14o70J350q1q35O34K45o86L56
2996f5O1M08j900P89R96m47Q37j7j392J327k94n91r99k05J488m75m15p7Q87K41
$$ plain form
2861 -175 -231 102 -629 -132 142 -129 -435 184 -548 -738 -916 -1841 -183 -926 -267 738 1126 1208 117 -949
2881 -949 297 1032 -147 -1556 -1450 -839 -729 -617 174 -15 -844 -85 -35 88 -724 -858 625 822 93
2900 93 261 299 339 -493 -82 668 194 392 -1859 620 -1111 87 -553 428 146 -348 303 -121 220 -29
2920 -29 313 2170 1565 -664 -866 -749 1043 -406 -451 257 620 -1167 105 553 844 -1356 -1493 -212
2938 -212 1461 1396 437 1001 923 38 348 -760 783 388 -648 -31 934 -222 -625 52 177 1434 -85
2957 -85 -45 801 270 89 361 768 606 -91 224 1157 613 206 62 -448 301 -1309 415 -110 -680 1568
2977 1568 -905 1256 138 1195 512 450 -385 -473 -18 136 -378 -1048 302 221 -614 20 265 -421 -65
2996 -65 -4 404 -1496 -707 289 -158 679 662 -730 597 303 -288 -1287 -1492 -4 -479 -894 -971 -84 157
3016A57o04Q0P35p07P7N9L25Lm33r41R08L58l26j085K113j310N96j67n5j585L99
3037a403J220M37m46M94M36l19Q49j398P69o10L08j007Q64m50o46L57R12j20k44
3056Cr49Q92J471o61r00o15P41R32o72r60J441j106N32L49K34k02k307J470L47
3075D0j35j96O16N53j200m5P52N44l91k64O46q54o16N30o00R44K14j098J700q18
3095C22m64p3O42J57o71k99L48K50q41L87Q69l2J54j868J430J032j581j093J181
3114a50n90R49r54N0J384r46K37l44n02k15P19j70Q59r14M81p2K6L7M91o66L90
3135A00j373R98J36O51k536J110O98l02l9J00J316J51l78j676o38N68L64r3Q91
3154D8N26r4o00n80O77j54m04N65O18j039o7P5J86P60n29o96J419j119R80N09
$$ plain form
3016 157 -447 -367 368 -339 -262 -203 122 125 -308 -1249 -341 17 -309 -1394 719 -591 5 -162 -217 -1802 -1403
3037 -1403 -183 254 -192 302 738 419 1268 -130 639 29 337 -670 194 -256 -902 -545 367 247 3
3056 3 -946 -54 1417 756 -144 -759 -18 914 242 -718 723 -383 149 498 732 530 -1777 -307 40
3075 40 -95 -291 325 878 -322 -367 385 929 538 274 920 66 -550 -20 -620 324 538 -560 1140 322
3095 322 -142 -215 427 584 -87 -386 -38 212 -629 -242 627 595 749 -1119 311 1343 -238 -1331 -150
3114 -150 -740 209 -745 -695 689 -257 -20 -364 -866 -1081 -362 -532 327 -587 -106 -178 -152 -115 376 -290 100
3135 100 -1273 -275 -139 512 -2024 -914 -216 -518 -557 -457 859 1010 632 -1044 -1682 -1114 -750 -843 48
3154 48 574 480 -120 -700 -23 -177 -581 -16 602 -437 -504 -429 -243 517 -12 -708 711 -408 572 1081
3174A081n76o19n14L51N51k73j7m3L45j75O28r58L2m39Q94k25J26J53J36K75p48
3195a5K44N30r62P61q2M96m52r3J68j923K500j073L05j180R66P01M6o79o8k1K94
3216D63l73K40J62Q7O7j095J772k041N76j115L36P87k43j50O14o71J033p55Q81
3235E75j064P19M63k16l63R04j394N09O63q57J046j605N38M60q22O51p17rK63
3254b56J244j509J11J243j253P5j81M01l98K80k4L62k51j77j376K150m30j335
3272a324J430m68n17M15L36K48L60o03J228p99j756R80K74M45L26l87r92J280
3290D76j484P53l96O04p0l11Q0l55L14J048l00J87j453J329j438P66m26j86K242
3309A380j143r98J330j175J345p74N29p04q2P93j145L40K06J607j198O9j042O
$$ plain form
3174 1081 505 -114 -628 -277 274 1 -16 -59 286 111 739 -219 -187 -626 268 43 169 322 458 733 -15
3195 -15 229 759 -203 558 476 972 520 427 595 -1328 1172 99 404 -776 190 891 937 258 190 169 463
3216 463 90 330 492 579 646 -449 1323 -718 -142 -1257 -921 -134 -377 -527 87 -584 449 -306 575
3235 575 -489 230 693 477 114 1018 -376 133 796 -61 985 -620 -82 378 -444 207 -510 -519 -256
3254 -256 988 -521 -410 833 -420 -345 -526 -125 -523 -243 -267 95 -156 -333 -1709 441 11 -1324
3272 -1324 106 -362 -879 -464 -128 120 480 -123 1105 306 -1450 -470 -196 249 575 188 -804 476
3290 476 -1008 -255 -651 -47 -117 -428 -348 -703 -389 659 359 546 -907 422 -1016 -250 -676 -862 1380
3309 1380 237 -761 569 -606 739 -35 494 -210 -292 501 -644 -304 -98 1509 311 380 -662 -656
3327f56Q77P32o23j146J345N85j132Q13O50m03r90j207L82M96q84J436O36m73
3345D38K5K01l2M35l93o50jj13k13Q90j414M60R76n71R90p54j21k03n22P54J199
3366A381k198j22K36L58L6p31Q06M72l8Q72m51j571P15L24j0j001J299o55K18
3385f0j105J425K70j377l67L92J150k75j184L19j5R89l74r14P17J121l92J87j215
3404g08Q61n12L53o02j511J360P17m63R62p81L91o40p69K122j254J175j299M88
3422a10N49K5r79J133k7r08K87r9o19J087p8o92J67N8p7Q57O9k700K798o75o14
3443e48N74pl30l40M05R22n35J086o6q55j29j58n96J523j54j061o43J461J80j880
3463a151Q38R98n20l63J027r89J477q09l00k73r8R05j191l3O98O8j41L04j336
$$ plain form
3327 -656 221 953 330 -816 529 1114 -18 795 1445 1042 52 -1155 -773 -277 -1161 275 911 438
3345 438 463 664 632 1067 674 24 23 -90 -303 587 -827 -367 609 38 1028 274 153 -50 -572 182 1381
3366 1381 -817 -939 -703 -345 -309 -1040 -234 238 200 1072 621 -950 -235 89 79 -922 377 -278 -60
3385 -60 -1165 260 530 -847 -1214 -822 328 53 -1131 -812 -827 162 -212 -1126 -409 712 320 507 -708
3404 -708 153 -359 -6 -608 -2119 -759 -42 -505 457 -324 67 -573 -1342 780 -474 701 -598 -110
3422 -110 439 464 -515 618 591 -317 -30 -129 -748 339 261 -431 -264 -206 -283 574 643 -2057 741 66 -548
3443 -548 26 19 -311 -651 -246 676 141 1227 1161 306 177 19 -577 946 792 -269 -912 549 729 -1151
3463 -1151 -313 685 165 -198 829 -160 1317 508 208 -65 -163 742 -449 -482 216 284 143 447 -889
3482h89K40J247l19j88P74p09o79L89r90J018j97M59j555J559N01P16k460J280
3500A97L59q95k23l81K375j279j00n13J071j50m54j18j03o0l78k82J484p91k05
3519d46j52R23p77J16k27P34q28j19L25J06L61J65l84l27O95K71l02o36J67P13
3539C78j307J136J93j063O06l5j4J89k16J82R88o92mN37j097LL16K35k34P9J51
3560C31q96j0P46k99K82j09q55R82o58J354q91j42J36M94o9lQ18k061O90L96K0
3581B56l18K12p74J647j481j78K38P80J94k93n19N00j06m25J26p8Q09l99J203
3600A394j493j13J120n61m2l88J43q3N91o59NN72q92m25l15J798p29l24P44j280
3620i37J703n22o22M6P84p25l74J19O90L21n19j35M14m40l28p48J370J110j604
$$ plain form
3482 -889 -649 598 279 91 865 156 -523 -134 -1124 -106 -303 156 -1399 160 661 1377 -1083 197
3500 197 556 -339 -562 -943 1432 153 53 -460 611 461 7 -111 -214 -274 -652 -934 550 -241 -446
3519 -446 -598 325 -452 -336 -563 171 -657 -776 -451 -345 16 181 -203 -530 165 436 134 -502 -335 378
3539 378 -929 207 400 -663 -57 -92 -106 83 -133 49 1037 345 341 878 -219 -216 100 335 101 180 331
3560 331 -565 -575 171 -128 154 45 -810 172 -486 868 -23 -165 -29 465 396 393 1211 -850 -160 236 256
3581 256 -62 150 -624 1023 -458 -636 -398 382 576 283 -236 264 158 -267 -141 -219 590 191 1394
3600 1394 -99 -212 908 347 305 -83 60 -23 568 -91 -86 486 -406 -831 -1146 652 -77 -401 343 -937
3620 -937 766 244 -378 -332 452 -273 -647 -528 162 483 -36 -171 243 -197 -525 -1273 97 1207 -397
3639c97J091j140L03l91m85J708j600R62l53P27o19j156N78L92m21L92ML53l43
3658c95L77p6M59q94J89j85J169n62l09M4J009k83m55m13N10j29m98n70J078J014
3678A080o33L6j024J409q93k41Mk47Q36p40J66P22j174N30k2J009j281L40j45
3697b68J185j030m9R95m8j479O57J41M00q99O48m91O89j33o00J331q72J49O72
3716I98j506J15N29k60N78J39o18J25n65P71l73Q88m20K70l47m60L29R91k010
3735h26n0J011O68O6j548L96M14O79j415J025j44p37J10L64Q65k73q68j92K29
3754b26P71l4r42K47n91J886j661O18K05j20j330J187m92O17l89Q43K5l66r9p10
3774e61M28j85N54o69M45j115Q04K36m1o78P49q8O49j258N12P24k71k61J42K15
$$ plain form
3639 -397 694 -446 -143 -534 -1019 689 -911 51 -302 425 -194 -1350 -772 -380 -801 -409 -405 -52 -395
3658 -395 -18 -94 365 -529 -340 -525 644 82 -227 -183 826 543 88 -325 185 56 -442 -1012 66 1080
3678 1080 447 483 -541 868 -25 -266 -262 -509 327 -413 -247 475 -699 -169 -191 818 -463 -123 -268
3697 -268 917 -113 -162 833 785 -694 -37 104 504 -395 253 -238 451 318 -282 1049 177 326 998
3716 998 -508 -393 136 -124 454 593 -25 100 -465 306 -67 821 401 671 324 -136 193 1184 -826
3735 -826 -876 135 803 869 -679 -283 131 810 -605 420 276 -461 -351 13 878 605 -263 -455 -226
3754 -226 545 511 -431 -184 -775 1111 -550 68 273 153 -1177 10 -482 135 -254 589 614 248 149 -561
3774 -561 -133 -318 236 -433 12 -1103 -299 -63 -104 -782 -33 -121 528 -730 -218 506 235 -26 116 331
3794C31L2j363O34K60l78p35Q91Q03j54n74L90p54J677j387K25M8k09J01N19m27
3814g0m18Q48l40j92J124r79J45k6L46q41Q30o45L88N37j31k70K43r87M54k72
3834b56Q5q64O72k56Q46m97J83o50L94L88k14M21j21n97k63J623K41p35j030J338
3854G08k10m66K60J64n48l2o02J555j716n08J835j086m13O53J599k55j066L8J301
3873A211k136J270K5RJ146j713j7J24q7N74j181L30J764j574O25j22j84j14q10
3892h60J154J09p38Q97l90J53k99p2K78o33Q39j118P07P9k40O86p20m17P92j295
3912a088L95M60j22mQ8N0J346q71p03l12J036j180R17K1L07k85o93K0M46R1m1
3933a22N51j558J145l89m81J08O81J01j83j38O81P3p03m5m07N1M01l5J4m56R86
$$ plain form
3794 331 363 -1000 -366 -106 -484 -1219 -328 475 321 -253 137 -617 1060 -327 -102 -54 -263 -162 357 -70
3814 -70 -488 360 20 -172 952 -27 118 92 438 -403 427 -218 170 707 576 306 549 -438 16 -256
3834 -256 -171 -1035 -363 -619 227 -270 -87 -737 -343 45 -169 252 131 -466 -729 894 1135 400 -630 708
3854 708 498 32 292 456 -92 -124 -726 829 -887 -1395 440 -646 -1059 -406 1193 938 -128 -90 1211
3873 1211 -925 345 370 379 1525 -188 -205 -81 -168 406 -775 -445 1319 -255 370 248 64 -50 -860
3892 -860 294 403 -335 562 172 325 26 -46 232 -401 438 -680 27 106 -134 552 -168 -585 207 -1088
3912 -1088 -693 -233 -355 -359 -271 -221 1125 254 -449 -761 275 -905 12 33 340 55 -638 -618 -172 -81 -122
3933 -122 429 -1129 16 -373 -854 -746 -65 36 -147 -285 396 469 -234 -279 -686 -635 -234 -269 -255 -711 275
3954B75q53O79o11J378k27o31P58o78j07k11q79K58O69J153o09j74J76k38k93
3973a65J145o38k72J18n8k16j79J402m33o35O72l97l65K69q43K72L31K68j85j48
3993e7m00J083p68L78q4K1Q59q15k92P50j078K75k92O79J28k40K26q2j505J995
4013G81q44M00J58M09j413o8J245l45M77o93J61j40M25K02n00l26P21j369P36
4032A7L13k96j197Q88Q69r85M77j48j98q79Q94mo95J265p63J060k94k51l52j6
4052b95O38q19J119j504k15O34R01o71r7n68J99Q43k34J74J43m60J019r68k87
4071d48J611j282p35J639j468Q34K14Q60j676L07M04m61J088o03m08k52k29Q49
4089B44o39J83M80J86k82M17o74O84o11M36k16Jk36pn40J045k35n6l05k97p0J442
$$ plain form
3954 275 -578 101 -510 868 641 10 768 90 -17 -228 -1107 -849 -180 973 364 190 366 128 -165
3973 -165 980 342 70 188 130 -86 -265 1137 704 69 741 344 -21 248 -595 -323 8 276 91 -57
3993 -57 -457 626 -142 236 152 173 1032 217 -75 675 -403 -128 -420 259 387 147 373 291 -1214 781
4013 781 -63 337 495 904 -509 -577 668 323 800 107 268 128 553 755 255 -71 650 -719 17
4032 17 330 34 -1163 -275 594 -391 86 -62 -260 -1139 -245 -249 -944 321 -442 618 324 73 -279 -295
4052 -295 343 -476 643 -861 -1076 -442 459 -212 -309 -877 -678 165 -69 105 248 -212 807 -161 -448
4071 -448 1163 -119 -854 785 -683 151 365 1225 -451 -144 260 -201 887 284 -124 -376 -605 244
4089 244 -395 -212 268 454 172 589 -85 599 -12 424 208 209 -27 -34 -574 471 236 180 -125 -422 -492 950
4111I50j585N71O15j348J744k54j257O77L90j391P78L66k24j11o72L93o82P97
4129b43O81j030Q47l14l79K55L8M53j36N3L61j009l02J38P64q74K86P95N73q73
4149H4q21J03K64Q74q92N15m37O16j162R95J153k206P63o3J05N54n15k36N3k41
4169d94J694j057J80m15k93J212n11j027P81l00j48P31q94M04L8P86n47j45K39
4188B34j348L5O19O59Q07n74j421J369j124J195l33j22l55Q25j254J054J24q6
4206C04j087M59J031p90o4J60j70N05J98o05N65l85m7k20M09r9J97j070R2O66
4226D9L14j86j61p5L57N94q19j58K2J433p07J61L60j808K429j748l0L05m73o29
4246g70N50n66J42P44o86M68L60J041j566j12O21K78k9j14n72O39p48j2j08L27
$$ plain form
4111 950 -635 -64 551 -797 947 693 -564 113 503 -888 -110 256 32 -79 -751 -358 -1040 -243
4129 -243 438 -592 255 -59 -438 -183 -145 308 172 225 586 -423 -725 -587 177 -697 -411 384 957 84
4149 84 -737 -634 -370 504 -388 127 -310 306 -856 139 1292 -914 -151 -214 -109 445 -70 -306 -253 -494
4169 -494 1200 143 323 -92 -385 827 316 -711 70 -230 -378 353 -541 -137 -99 687 140 -5 234
4188 234 -1114 -1079 -460 199 1006 432 -989 380 -744 451 118 -4 -359 466 -788 266 390 304
4206 304 -783 -324 707 -83 -147 13 -157 348 546 -59 506 121 74 -146 263 164 361 -709 -617 49
4226 49 363 177 16 -59 298 892 73 -85 -63 1370 663 824 1184 -624 1805 57 27 332 -141 -770
4246 -770 -220 -786 -644 100 -586 -118 242 1283 -283 -395 226 504 475 361 -211 428 -320 -332 -440 -113
4266a13N69l23k18m86Q24n72p02R14m20o31M15R91K84J1r88O43M71r52p06P35
4286b54K59K23N60o38J62j107J102N44p05k38l89J136o50NK9N47r29J001j198
4305e40O07M75m92l04R94j452Q21n05O18L70j163J148m83k84R08n54n62M56j14
4324e6K69p3k44n5J091j080J26KO10j115l3O57n65Q6O28q82N34J025K55j479j8
4345c17l81K16Q69k15P47j640J213l00n25N27p25P29J20o78Q08m15j234J569j78
4364A90p40k81O19j57O59N74J96r10K10Oj180N76J73N20L26r80J30j3r43J430
4384D05p7J3l90p82J207P78j520P02l19K32n67k41Q31j130N47l30J158o41j29
4403b53K74j267J550m70p8L2o33J334m58M76r39M23o84N85l47M79O2k21j017J233
$$ plain form
4266 -113 456 133 -85 -571 253 -319 -1021 -107 -527 -1158 -743 248 532 543 -445 198 669 -283 -989 -254
4286 -254 5 228 788 150 312 -795 307 851 146 -92 -481 655 5 10 39 586 -343 658 -540
4305 -540 67 542 50 -254 740 -712 109 -396 222 592 -571 577 94 -190 718 164 -398 58 -56
4324 -56 213 140 -104 -159 932 -148 -22 -20 590 -525 -558 99 -466 -380 248 -634 -100 925 1180 -299 -317
4345 -317 -698 -482 387 172 919 -721 492 192 -333 194 -531 198 318 -360 448 33 -1201 368 190
4364 190 -550 -831 -212 -369 290 864 1060 150 360 366 -814 -238 -65 455 781 -199 -69 -82 -1025 405
4384 405 328 341 -49 -831 376 1154 -366 336 17 249 -318 -559 272 -858 -311 -641 517 -124 -253
4403 -253 21 -1246 304 -166 -244 -212 -845 489 31 507 -432 -9 -693 -108 -455 24 86 -135 -1152 81
4423H1p11R99Q7j114Q8P68o5j003P52N44j116Q53o88P34N55q82p7P3p20M35n0
4444d57L26L61j522J084m31q8j75J399j1n21k36Q48l59P03N88n05o53m77M56L64
4464F94j791L20J090q1J047k303M59K79P77q78L88k30M14j16n46J7P81K40M7J4
4484F22j046M49l27l13L51N77R29j441M03P20j384O61M1L27o85P03k98m10l29
4503d50L29N83n67j58J015l70o21K01N95o04K62l52K4M00L50M70r48j39N53m83
4523I0K48j33n15O66o32M89k45p90R35K22j111J774j246M05L40q29k5K08q5j050
4543a284J119J32N57j532N82R45J90q99J64P52q46J16Q96q11P05j512J487m50
4561C11p66Q71j211J199j306R29N90O11j047o33L33N09p40L82K62r79K90N9K08
$$ plain form
4423 81 -630 369 456 -658 -570 198 133 -870 -118 426 -690 163 -525 209 764 -118 -195 -122 -842 -407 -457
4444 -457 -131 230 -1292 -208 -639 -727 -902 497 486 -35 -271 577 218 921 1509 1004 351 -126 330 694
4464 694 -1097 -777 313 232 1279 -1024 -565 -286 491 -387 1 -229 185 69 -477 -460 321 561 608 622
4484 622 -424 25 -302 -615 -264 313 1242 -199 204 924 -460 201 242 569 -116 587 289 -121 -450
4503 -450 -121 462 -105 -263 752 382 -239 -38 557 -47 215 -137 -113 287 637 1107 159 20 573 90
4523 90 338 205 -310 356 -276 213 -32 -822 113 335 -776 998 -248 157 497 -332 -357 -149 -234 -1284
4543 -1284 -165 -33 524 -1008 -426 519 709 -190 -26 726 -120 -4 892 81 786 -726 761 311
4561 311 -455 416 -795 404 -902 27 617 1228 181 -452 -119 390 -350 32 294 -685 -395 -336 -128
4580a28q82L82O91J06j19j490R0J421m15k49M26L68j49j81l41O56o72J219j200
4599d67J090j083N27l14J01n40O14k12l4m15L8Q71Q18j661J091j218O71O39m19
4618I7K92l51j96O00p11N6P8N80k01N40j218J2P54j9l48k66M80k43m42N47o06
4639e65J048M60q28l83K77m4N62n75N01q50O52l02P8n76L4P82K02M41j598R37
4659B53k97J373q28j265j20R15n10L1L91J1M11j030Q97L34m65M88j222J541r88
4678h0O10r42L69O36l98j87L38m06M46J75P6j781j76J954j264q49J495n35O37
4697A18K74q92K93N56o71o42M32m24N48l93R51M13k45j499K030o43r81J132p66
4716d09p19Q9P06R24m97n46r7J126n82N59o78N53k64K39K87K96o58m46Qm08R06
$$ plain form
4580 -128 -1010 -628 63 169 50 -1440 -1350 71 -344 -593 -167 201 52 -129 -470 186 -486 733 -467
4599 -467 623 -460 67 -247 -146 -686 -72 -284 -318 -733 -695 176 994 -667 424 -794 -123 516 97
4618 97 389 38 -158 442 -269 -213 -135 445 244 784 -434 -422 332 313 -35 -301 179 -64 -506 41 -565
4639 -565 483 943 115 -268 9 -35 527 -48 453 -397 255 -47 31 -545 -511 271 473 914 -684 253
4659 253 -44 1329 501 -764 -884 31 -479 -448 -57 -46 365 -665 232 566 101 589 -633 908 -80
4678 -80 530 -412 -43 593 195 8 346 -60 386 561 637 -1144 -1320 634 -630 -1479 16 -519 118
4697 118 392 -500 -207 349 -322 -964 -532 -956 -408 -801 150 563 318 -1181 849 206 -775 357 -409
4716 -409 -1128 -1039 -333 591 94 -452 -549 577 -5 554 -124 429 165 404 691 987 329 -117 -109 -517 389
4737C89p8J20j38N72r49k72J215q63O27k14o75J533j84j536J352P3j352P39Q43
4756A202j879M06J136q21n57J85k5N06m61P52l44n8p32N21N29K67j056o1K14P01
4776D25k24p9n91Q44Q08p65n7j482J497K10j45m79p1K11o75O18k24P7J797j598
4796I7m74J110l01l51o59J268n79k94N04N42j214P54l25p01M65k18O42k90l13
4815c37L20Q26j258N78o41K08R42k72M01p02k49l17J10j00O08r78J098n87p1J209
4835G88j564J422l41K00K22r91n77K88O16l07j65q6n31J126O34r10j93J779j349
4854F1k60O48L52q14j24N81k99M24J49r74L02m5j026J332m07l23R99p9p79j1M80
4875A87N82j86o87l47M23L32M89j000J264l73l99k35L72j862O89Q11M41n60j01
$$ plain form
4737 389 311 431 293 865 -84 -356 859 -4 623 409 -266 1267 1083 -453 899 972 -380 359 1202
4756 1202 -677 -271 865 44 -513 -328 -353 153 -308 444 100 42 -690 -169 360 627 -429 -490 -276 425
4776 425 201 122 -469 375 1183 418 361 -1121 376 586 441 -38 -109 102 -573 45 -179 -102 1695 97
4796 97 -377 733 432 81 -578 690 111 -183 321 863 -351 403 78 -623 -158 -376 266 -24 -337
4815 -337 -17 809 -449 129 -512 -304 638 366 767 65 -184 -501 -391 -491 117 -861 237 -350 -421 788
4835 788 -776 646 305 505 727 -264 -841 -553 63 -244 -409 -495 -1026 100 734 -176 -369 1410 61
4854 61 -199 449 801 -13 -137 444 145 569 718 -256 46 1 -1025 307 -100 -423 576 497 -282 -293 187
4875 187 769 583 -104 -451 -28 304 793 -207 1057 684 285 50 422 -1440 -751 60 501 -59 -160
4894a60J70Q73j211J78N73N72j441K72Q48j346K33N68Q61j415L63k8l26oM41r87
4914i68P57Q17l25q9L21l38l85M49j49J87J58r23J286L54j145j88P07P2j700J034
4934f8j4n90J587q44j54q34J768r10L8j94L59M84r25l59Q24K0j23L79o01j710
4954a867J726N08p75N03M98o72m01R37k89J155j077o20R4O0L52p8J018n53j106
4973e87O50Q6k06q34J68n07O48M78O82j077O55L9r83J805j347m22P69Q48j089
4992b24k89k37J715j489Q99j33r8L40j976J964k59N34k26j794J762l04j466P63
5010e18L74l49Q72k46K07K72k06j49p75l4l20K71O89o81P19L15N75r66m06P34
5030C78n23J204j82m06j015P80O71k82m86Q10k062N84Q17O69J17r26J385J76j921
$$ plain form
4894 -160 10 883 -328 -150 423 995 -446 -174 674 -672 -439 129 990 -425 -62 -90 -416 -422 19 -968
4914 -968 -211 606 281 192 513 175 -210 239 90 277 435 -488 798 1152 7 -181 526 598 -1102 -68
4934 -68 -82 -672 915 71 -83 -917 851 -59 -21 -215 144 628 -297 -656 168 188 65 444 -157 -1867
4954 -1867 -141 367 -408 95 593 -79 -480 457 168 1323 246 -374 -280 -220 132 54 1072 519 -587
4973 -587 63 149 -57 -891 -723 -1230 -582 -104 578 -499 156 195 -788 1017 -330 -752 17 865 -224
4992 -224 -513 -750 965 -524 375 242 144 484 -1492 472 213 747 521 -1273 489 185 -1281 -518
5010 -518 -144 -493 379 133 340 612 406 257 -518 -552 -872 -601 88 -593 126 441 1016 50 -356 378
5030 378 -145 1059 877 471 -544 236 907 625 139 949 -1113 -529 288 957 1074 148 1533 1709 -212
5049b12J738j208j96J41r97J403r42P00j004j240J997j23o48M41k5p94N63J26
5067b80K49R46n00J02k87q81J468j091Q58qk82j447K393k116Q13k48N55j583Q24
5086e15K94O10p23K57M6p81N7M41M04j249J122j025R46O31k83k95K19p71k86J011
5106A10K70P6p20P58p64R99q50j96L24j28l17j19M68k93K73N58o70l90K6J126
5126E41m90m92q56J547Q10k45k50r80P08J77K27K42j537K216k092P60o9k89l4
5145a06M58O54r53k26J766o8j610J92n7P07P4o50K7q28P20l92L51l67l5M73l59
5166b29M51J056j491M12j06n8L46m94N01m51q08J060k18K75j315M24L70k25n47
5185a047Q92O74o51j16J071r65J40L43k13J92M05o38O15k18k73qp50P92M99n02
$$ plain form
5049 -212 1526 318 122 263 -734 669 -273 427 -577 -1817 180 57 -591 -150 -175 -969 -406 -280
5067 -280 -31 915 415 517 230 -651 817 -274 584 576 294 -1153 1240 -876 -63 -311 244 -1339 -515
5086 -515 -221 389 -334 -77 -31 -812 -755 -314 90 -1159 -37 -1062 -116 515 232 -63 156 -615 -901 110
5106 110 380 456 -264 494 -270 729 -121 -317 7 -121 -438 -557 -89 -382 -109 449 -221 -611 -585 541
5126 541 51 -441 -1297 250 1060 815 565 -415 293 470 697 939 -598 1618 -474 286 217 -72 -106
5145 -106 352 1006 53 -173 1593 1525 -85 107 50 757 831 181 208 -620 100 -292 59 -308 -343 130 -229
5166 -229 222 1278 -213 199 93 35 381 -113 388 -63 -871 189 -29 246 -1069 -645 -275 -500 -1047
5185 -1047 -155 519 -132 -248 823 -142 -2 341 128 320 725 87 702 484 211 203 -547 245 744 242
5205B42K11m15k93m79P29j39J935k145o68R67K17J05m74q42J775r05N28R85q49
5224D85j087P14Q93n38j728J528L88p82K54J71k383J556J86Q00l51L51P22j547
5242c68K03j87J115q54j38l8M76P3q60KN15l08R49p3m31J022j074O36k86j019
5262f45P74J88j161N40j91J381n60j505K201n3n30n32m95l67J003Q00p58N96q96
5281b10K6J246j390k6k50J208o62M31J001j502R84j090j97L57K99K19j370O21
5299c05k51J488q44p16P94m71M22M25j60l86N26j103R10Q98p28n95M51j46O63
5318H72r18N44j31j037M02K26K87k94K35p7nq8J15j39J070j437n02J888j291m13
5338f93j44P89Q7M22n96k0J303k3j038L81j177O87p74Q68O10j198n4P40J74j21
$$ plain form
5205 242 453 38 -255 -734 -5 -144 1791 -354 -1022 -55 162 267 -207 -1049 726 -179 349 1334 485
5224 485 -602 112 1005 467 -1261 267 655 -127 127 298 -2085 -529 -343 457 106 457 1179 -368
5242 -368 -165 -352 763 -91 -229 -267 209 282 -578 -576 -61 -369 580 507 76 1098 24 660 374 -645
5262 -645 129 317 -844 -304 -495 886 326 -1179 1022 969 439 -93 -588 -955 48 848 90 686 -210
5281 -210 -184 1062 -328 -354 -604 604 -58 373 1374 -128 856 -234 -431 -74 225 444 -926 -305
5299 -305 -556 932 88 -628 166 -305 117 542 382 -4 522 -581 329 1227 499 -96 355 209 872
5318 872 -46 498 367 -670 -268 -42 245 -49 186 109 104 16 131 -8 1062 -375 -877 1011 -280 -693
5338 -693 -837 -48 39 461 -135 -155 1148 1125 87 468 -709 -22 -796 72 682 -516 -570 170 344 223
5358B23q77O90K54n75O76l39k13k87O05K25l95J273p85R42r63o87N45N05q79J083
5378A021q58K16q21J293P4o49j621J136P24m34P0Q0n6J19N18j283K0K46K62n59
5398e02L73R74l68q2p34j611J096J410m49k94K21N72N53o69k90l45K11m50O35
5417B51J258j215r69P90N57n24j49Q9k40P57m09j52O04q71j69P46N83p90J13Q3
5437C43j279P21N40J078j109j405J934j283K37R40q9j390J402r80N53J128j761
5454d20k0l60J608j14L95p67Q27j713m15K022j199q79K301q00j280R11m60l39
5472g02J368j384J052j061L42L08J44j208J772o81l40K65l27M41K91l05K7J78
5490A80m10K43m42P71O21j62j410O05m30J257j891P38K07R58o36Kj007K91Q53
$$ plain form
5358 223 -654 36 290 -285 391 52 -161 -448 157 382 -13 1260 475 1417 454 -233 312 817 -62 1021
5378 1021 163 379 -442 851 925 276 -1345 -209 515 81 151 231 175 294 812 -471 -451 -205 57 -502
5398 -502 -129 845 477 395 -339 -1950 -854 556 107 -187 34 606 1159 490 200 -145 66 -384 251
5417 251 1509 294 -675 115 672 148 -1 88 -152 605 196 44 648 -223 -392 354 937 147 260 343
5437 343 -936 -215 325 1403 294 -1111 823 -460 -223 717 628 -762 640 -340 213 1341 -420
5454 -420 -440 -800 808 694 1089 322 1149 -564 -979 1043 -156 -1035 1266 466 -814 97 -363 -702
5472 -702 666 -718 334 -727 -385 -77 67 -1141 631 -50 -390 -125 -452 -11 280 -25 2 180
5490 180 -230 13 -429 342 963 801 -609 -4 -434 823 -1068 -330 -123 835 199 201 -806 -515 338
5509C38l54K40J11k0J0J76p33m80J596k62k29l22p7N96j08j731J714l43P39q58
5529CJ128j559K0P94k92L91m70k79N69J60o95O95K43m36k45P11L00j707J176o61
5549a54l7J299r33n29l35L18R66q04N5n98O91l06m67J766j90j303Q93m8M18o38
5569F4k22O17K71j010Q96k13L3q97N54l18k057K388m9L4J4K23r17P83j514J331
5589A1Q04m42k41q91R54n39M47k95K08j658J263O44k99L27o75O65j36o5N6j55
5609a7J163j266j400R32R4O84R6l51K73o19j12N62p04J93R88q42P80p4p72M79
5629H7K00K05N31j890J905j64j351M46K8P6N50j131K03N08K29J58k11m69O10p14
5649a94J233m53m15J87J40J38J66r43N07p94L62K45M36j62j811J096o08M51l24
$$ plain form
5509 338 -16 224 335 315 325 501 -232 -712 884 622 393 71 -6 590 482 -1249 465 122 861 3
5529 3 1131 -428 -408 386 94 485 15 -264 305 465 -230 465 708 272 27 738 1038 -669 507 -154
5549 -154 -191 1108 175 -354 -689 -371 595 -209 -154 -752 -61 -367 -834 932 742 -561 332 284 702 64
5569 64 -158 459 730 -280 616 403 436 -461 93 -225 -2282 106 57 91 105 328 -589 194 -1320 11
5589 11 815 373 132 -759 195 -344 103 -192 16 -1642 -379 265 -34 293 -382 283 147 82 138 -17
5609 -17 1146 -120 -1520 -588 -494 190 286 -65 208 -411 -523 39 -665 -472 516 -326 454 380 -392 87
5629 87 287 492 1023 -867 1038 874 -477 -31 -3 73 623 -508 -305 203 432 590 379 -90 520 -194
5649 -194 1039 586 171 358 498 636 802 -141 366 -428 -66 179 615 453 -1358 -262 -870 -419 -743
5668g43P80j34M61o13Q23Q3j390K87J095l98m54Q93l85OJ252j332J258l48j412
5687b71J196l28j335J068K07M69n43k088J224L6k20K6J293q25R55r73J10j42K71
5706A30M92l78j17j46K3r48K274j315N07q54L57M17L75r72P9Q22q50L73o94p3
5726d98j023K109p56K48N34r32L85K45p68L24J94l54n9m28M10M83q75J329r31
5745c63J05K0J293j330n60J086m6j244J061o29J191j591J193M66j05M00j112Q10
5763F45K71l34j21n73J758j525R29n86L42o22m50P44m14L75j450J998j361J632
5781A258j304K97N46k221P04M81R12l00p37N58P92p53J4l72J58Q61j223K65j107
5800a171K051j74r17N18o1K9L54R85j058k19N79j253O90l31K40m35N24k76l36
$$ plain form
5668 -743 37 -97 364 -249 574 657 -733 -446 649 251 -203 690 305 311 1563 231 1489 1141 -271
5687 -271 925 597 -738 330 537 1006 463 -1625 -401 -365 -585 -559 734 -91 864 -109 1 -141 130
5706 130 622 244 127 -19 4 -944 1330 15 522 -332 25 442 817 -155 -76 746 -104 269 -425 -498
5726 -498 -1521 588 -168 80 614 -318 67 312 -456 -132 62 -292 -351 -779 -369 114 -761 568 -363
5745 -363 -258 -238 1055 -275 -835 251 205 -1039 22 -607 584 -1007 186 652 547 947 -165 645
5763 645 916 582 461 -112 1646 121 1050 464 806 184 -266 478 64 439 -1011 987 -374 1258
5781 1258 -46 251 797 -1424 -720 -239 673 373 -364 194 986 233 247 -125 33 894 -329 -64 -1171
5800 -1171 880 706 -211 307 246 275 629 1614 556 337 916 -337 353 22 262 -173 351 75 -261
5819b61O45P02j239m36J742j225R41k041J138q25J063j166R02J82l55J164j499
5836e68J161m97j271P59J78j311J6K122K41Q30q00j830J625J59j482l93M38J477
5854H54r23O4O62k07j81m80j07m63M18o56J776O38k631K353k01J15k015J318p00
5873c66jL87l68n9R68O25j533M28P38m99r1k91K43k45k15O80k34r22K15J715j192
5894a7m84k62N33o16k90O07J263O96j197o59J676r67L69n84j23m27J67J061p17
5913B9J93l53K45j002J035L16j72q11J022o43k95J282o95j01L61j049p40K055
5931F77j446J745j272J73j47J212j025O44n51J026l27n92l67J223j257P35j045
5948e94J065k6n81J410k810J359R49o19J079j168L10j035N12J10m45Q49j747N59
$$ plain form
5819 -261 384 1086 -153 -589 1153 -72 869 -1172 -34 -859 204 -962 -60 122 -233 931 -568
5836 -568 593 96 -1175 -416 -238 -1549 -1533 589 830 1660 860 -970 655 814 -668 -1061 -623 854
5854 854 -69 -5 657 450 269 -211 -318 -781 -363 -1019 757 1395 -1236 1117 916 1031 -984 334 -366
5873 -366 -367 20 -348 -407 561 1186 -347 81 819 320 229 -62 181 -64 -279 401 167 -755 -540 1175 -17
5894 -17 -501 -763 -230 -846 -1136 -529 734 1430 233 -426 1250 283 652 68 -55 -482 -315 746 29
5913 29 222 -131 114 -888 147 463 291 -520 502 -141 -436 846 151 50 411 -638 -1378 677
5931 677 -769 976 -296 -123 -270 942 -83 561 10 1036 709 117 -250 973 -284 451 -594
5948 -594 471 445 -136 1274 -1536 -177 772 153 1232 64 374 -661 -149 -39 -484 365 -1382 -823
5966h23J256p01J03r57J263r0L04j20p4K77p20R14j558J305K89j554P77M18p42
5985d33L59Q98j504J713p69n83J236k586M05K33Q30L64N54j008k59L52N82j115
6003g31J279l65o6L45P70j254J097j504J506p98j290J377m66R30n16n97K30m73
6021e26j40J262m80J210j281p96J355r45O35l55K09k94M89O95k66n06j98j97Q41
6040G12o72J189k96o32m64j213N10Q73L99o89Q28O08j552Q13n74K60R10j239O90
6059D61p68P33j45N5O02j294J889j599K72j592J006J15l0k65Q12o20J005j403
6077g66J17M29n36J266n73m60J833k229K495j933L35j15L87j20n81p34K082l35
6095E62J018j455P79M15M68j646L88m88O16r04p1J821j088L25q32j23L79Rl06
$$ plain form
5966 -823 433 -268 -165 -1122 141 51 355 235 161 438 -282 632 -926 379 668 -886 -109 309 -433
5985 -433 -74 824 -680 1033 264 -319 917 -1669 -1264 -1031 -201 163 717 -291 -550 -198 384 -731
6003 -731 548 183 117 462 1232 -22 1075 -429 1077 279 -1011 366 -100 830 314 -283 -53 -526
6021 -526 -666 596 116 1326 45 -751 604 -341 294 -61 148 -146 343 1038 772 266 68 -129 712
6040 712 40 1229 933 301 -163 -1376 -866 7 406 -283 545 1153 -399 414 -160 100 1010 -229 461
6059 461 -307 426 281 336 938 -356 1533 -66 206 -1386 -380 -265 -295 -560 252 -368 637 -766
6077 -766 -649 -220 -756 510 -63 -523 1310 -919 1576 -357 -22 -137 250 130 -451 -1185 897 562
6095 562 1580 125 904 1319 1787 141 529 41 657 -247 -318 1503 415 740 -92 -215 164 173 -133
6114a33m01l06O60P98j100L27j8q57Q06J797j827J465q94N52j055O10n26m89Q23
6133B32j836J505J080j402m07J065MP47q6l28O58j506J549k42l92p59m15J301
6151G68j260N90m8J157j025J75p19j88J553j720O29l62R58j5j662P69O45o00M75
6170A20j70O66j294O81J790k027l60M97J94o73p07K002k22R16j431N66q2j112
6188f46R57j883K083M62q03M62P28j076j83j01J210q82j311J192k59k10j108R94
6206c74J05N44m49L76j80o24N63L1o14J280q74o51L70N16l85j369K470K77j475
6225d63O96Q6p5j340K18P98j723L750k585J878j193O5m02k12Q5N46n19n15J627
6244G22L50j749J946o46j078K96P78j448J214M29k51m09j538J818k40K01j102
$$ plain form
6114 -133 -534 -840 -180 618 -482 -155 -173 -1030 -224 1573 -254 1211 317 869 -186 424 -102 -591 232
6133 232 -1604 -99 981 -421 -828 237 241 988 902 574 1232 -274 1275 1033 641 -118 -533 768
6151 768 -492 98 50 1207 182 357 -362 -550 1003 -717 -88 -450 508 493 -1169 -400 245 -355 120
6170 120 -50 616 -678 3 1793 -234 -594 -97 97 -576 -1283 719 497 1413 -18 548 466 -646
6188 -646 311 -1572 511 973 170 632 1360 284 101 0 1210 328 -983 209 -50 -260 -1368 -374
6206 -374 -269 275 -174 202 22 -602 -39 -8 -622 658 -216 -867 -497 19 -366 -1735 735 1012 -463
6225 -463 233 319 244 -1096 -878 -80 -1803 1947 -638 1240 47 112 -290 -502 -417 129 -390 -905 722
6244 722 1072 -677 1269 623 -455 -159 619 -829 385 814 563 154 -1384 434 194 395 -707
6261g07R57k53k07k9P7R00j7q01J35J17L89j695P65P87p64J157n67n13N86J67
6281D84J4Q88j435N0J327p46j24q17K070j318o69O21k09p76J342p47p87j8R8O23
6301a29J124J48j167O2m68J25l89P88r21J436j297Q09O49j479J171m78J665j120
6319E29j020M45j94Q64o33K45l11J75N88j247J15M64n3j69n9j89j268J099n8P96
6339A19R58k264J379q88K89j71R46m94K0j70J208j893P74M99j795J447j53O7n03
6358f25N99R6Q47j46m64o55N53M84L3q08o31J789j638O36m26O90L69m70j62L52
6378D23p15K490j932q69O50J061n94n89r77L212k788M05n16J644r70j79O01o96
6396c39L42P96L21j014J023j284Q01J42m75j360Q71j255J353l74P13j046O05R11
$$ plain form
6261 -707 250 -3 -210 -239 -162 738 721 -80 55 172 561 -1134 -369 418 -346 811 244 -269 317 484
6281 484 498 1386 -49 1 1328 582 458 -359 1711 393 -276 345 136 -640 702 -45 -832 -850 -752 -129
6301 -129 995 1143 -24 38 -430 -305 -694 94 -827 609 -688 121 770 -709 462 -16 1649 529
6319 529 -491 -46 -240 624 -9 236 -75 100 688 -559 -444 20 -33 -202 -261 -450 -1718 -619 -677 119
6339 119 1077 -1187 192 -696 -407 -578 368 -126 -106 -276 932 -961 -187 312 -1483 -36 -189 -122 -625
6358 -625 -26 70 917 771 307 -348 205 689 722 -86 -717 1072 -566 70 -356 334 703 233 71 423
6378 423 -292 2198 266 -603 47 1108 514 -75 -1052 2160 -628 -223 -739 905 -65 -244 357 -339
6396 -339 3 799 1120 106 1129 -155 646 788 313 -1047 -176 -1431 -78 -452 261 -785 -180 731
6414G31L79k198J953p29j774R66J176m06Q53n31K13P30j08p96r77O76N33j535
6432h44R7l57J812j070j31M88p85K81R21K54j229q3J300j745P14J502j327J001
6450G99n11l84k23M6p93M62Q54o50J056o3q59k94k79q69J957p98R93l24q16J389
6470F93j280J475k58j092Q98J56k02N24K26j35r1j511R97J234k498j62R93J387
6488A354j077L96j377J113p81O72r45J073k01r05O6p90J777j072K170j395K37
6505C15K58l49n55P49p80J22L9M81mP3q03P05K65j320P04L45J074j183j24K9J6
6526E7K57R18j821J327j347j59J570j007p44N53M88O24l90J55J03p4j2p64J050
6545G84l68N36n17j021J281J194j100n56J028k16n09J91k69r09L24J25l43N15
$$ plain form
6414 731 1110 -1088 865 136 -1638 -672 504 98 951 420 633 1363 1255 459 -518 158 691 -844
6432 -844 -747 -1104 708 -362 -493 -5 -790 -509 412 666 -563 -646 654 -1091 -377 1125 -202 799
6450 799 288 -96 -319 -273 -1066 -604 250 -400 656 593 -266 -560 -839 -1708 249 -549 444 120 -696 693
6470 693 -587 888 630 -462 436 592 390 914 1140 1005 914 -597 400 1634 -864 -1026 -33 1354
6488 1354 277 673 -704 409 -372 300 -645 428 227 -678 -612 -1402 375 -697 1473 78 315
6505 315 573 224 -331 418 -362 -240 -201 280 276 349 -454 251 516 -804 -100 245 1319 136 12 41 57
6526 57 314 1232 -589 738 -609 -768 802 -205 -949 -396 92 716 326 481 584 510 498 -266 784
6545 784 416 952 435 -586 695 1889 789 233 1261 1045 536 727 458 -451 -127 -2 -345 170
6563A70p01M32l84n1O47l38N53M10j375J231K34r61K47N55L95j74j679K23J310
6582G44r69P72j102J72J96N55j168J09J419o10l86J561j023m05K54L44m2j114
6600f93J59J57Q93l13o74R26K39j584J051q63J168q14J569j375m86J453j706Q26
6618f7j93m31J901Q12k219l30P29k04L25m17K33J51r37J252n77L93l92n63J023
6637D89j705J034M4n03R58K69j191O04K4N25n94P45j481P96p71J234n18Q47j215
6656d09J544J7k249J642m68K52K04k76l1r36Q80J97nk60Kj73M20j47k16L68p73
6677d17Q28Q71k13m37k49j803K722r0q44K56q25R29j220J130l6K40n36q15R6M88
6697G5L52r98l20J978j400J055j034M47n33P23Q84k417J524k3j095J123p6N16
$$ plain form
6563 170 -531 -99 -483 -534 113 -225 328 738 -637 594 828 -133 114 669 1064 890 -789 -566 744
6582 744 -225 547 -555 -383 -187 368 -800 -691 728 118 -268 1293 270 -135 119 463 421 -693
6600 -693 -534 -377 516 203 -471 455 694 -890 161 -702 466 -348 1221 -154 -640 813 -893 -67
6618 -67 -260 -691 1210 2022 -197 -527 202 -2 323 -94 139 290 -647 605 28 421 29 -534 489
6637 489 -1216 -182 -138 -641 317 586 -605 -1 23 548 -46 699 -782 14 -757 477 -41 806 -409
6656 -409 1135 1152 -1097 545 77 329 533 257 226 -710 170 367 362 102 104 -69 351 204 -12 356 -417
6677 -417 411 1282 1069 632 383 -1420 1302 1212 368 624 -201 728 -492 638 602 842 306 -509 -413 75
6697 75 427 -571 -891 1087 -313 742 -292 155 -378 345 1229 -1188 336 313 -782 341 265 781
6715G81M69j941J446j11r51K16J212j326p72O13Q59j146O91Ko13K094j751J624
6733A396p63j40J046m19Q76k210K23J10J50m05n7J07o37l99J183l40R25j411J137
6752C72j327J041L04j552J449q80m89M31O47j34l92Q15M29j63q68J757j000m0
6770D00J75q86R87o61O32j632J967k12j292Q32k78j041O52J21N7J82J271q13M12
6789H73j270M53L5R33j210J06l00k39P48J13q71O34l85J083j912K44J49J495n14
6808A65L78r83q74J547p39Q07k28p62O57Q37j116n14K62J039j92j26M64o81J87
6827A28j142J735j76q32J353j284L89O49J32j944J829j002o06k00L87j72j57J444
6845E31j400P65O70j508K652p47j323J57K6O73J82P78K64j140q09J812k476N03
$$ plain form
6715 781 1250 -691 755 644 -307 -91 1121 -205 -977 -364 495 -651 40 42 -571 1523 -228 1396
6733 1396 633 493 1539 1120 1996 -214 9 119 269 -136 -193 -86 -723 -1122 61 -279 646 -765 372
6752 372 -955 86 390 -1162 287 -593 -1082 -651 -4 -138 -530 285 714 551 -317 1440 440 400
6770 400 575 -311 676 15 647 -985 982 770 -522 310 32 -1009 -357 -236 -179 3 1274 461 873
6789 873 -397 56 91 1024 -186 -80 -380 -619 129 242 -629 5 -380 703 -1209 -965 -816 679 165
6808 165 543 -440 -1314 233 -506 301 73 -689 -32 805 -311 -825 -563 476 284 158 622 -59 128
6827 128 -1014 721 545 -287 1066 -218 171 820 952 -992 837 -165 -771 -971 -584 -756 -913 531
6845 531 -869 -104 566 -942 1710 963 -360 -203 -177 496 678 1456 1720 580 -229 1583 -893 -390
6863c90n06J002j004J551j684J179r12R52m55Q34j85j404J985k51J048k870J873
6880G63k252J289O06j927J745j64J916j766j356M92N84J038r15K58k53O02L98
6897A058k63r06Q32l035L224L52j085k39M72j147Q87L36l98O36m11R5p68R54K64
6916H58j233J752j310O7J026o99j008Q3O25K5l89K25n1O57j28l62K94l88m20L93
6936A7j69M83M86j026l13N04O58M38n40r15L13M1P36r61R65l25j594Q77K455j415
6956G15M06j467J108O18j529Q54q34J376j905R53o56J231j162J703j893M09L20
6973B47N88r68J47r0Q42k76j656R39j000J078O30o01k20p22L83J229o80p90J210
6992B90j078J554J031k160L6l06N71q07J124j156K89l45k8J417J064j382n52J278
$$ plain form
6863 -390 -896 106 -898 653 -1031 148 -764 188 -267 567 382 -1022 963 712 1760 -1110 763
6880 763 -1489 -200 406 -1521 224 60 1976 210 -1146 -654 -70 968 53 311 58 660 1058
6897 1058 795 -111 721 -2314 910 1262 177 -62 410 -737 150 486 88 724 313 408 -360 594 858
6916 858 -375 1377 67 134 1160 461 -547 -464 161 186 -203 22 -29 628 500 138 432 44 -376 17
6936 17 -152 331 817 -209 -522 -18 640 1078 538 -377 -64 -23 713 -248 717 392 -1202 -325 2130 715
6956 715 1121 -346 762 1380 -149 705 -129 1247 -658 295 -361 870 -292 1411 -482 -73 247
6973 247 835 -133 14 -76 766 490 -1166 -227 -1227 -149 481 -120 -340 -1062 -679 550 -130 -920 290
6992 290 -788 766 1797 -363 -327 -633 -62 -869 255 -901 -612 -957 -985 432 1496 114 -438 840
7010H40j401P98o13K13L89r69J361n73J382j553j2j298Q90Q6K78P45M10r98o8
7029i3L72M73k11m60L05j446J675l37L51o41M5N52k49m51o48J634j417J519o27
7048C46o66q38J737j474p5R40k07j268K000K81r95Q23J55j233K12m33Q49k2O05
7067G37Q44q68R7o83k8O56L38o09L28o93K93j241N74m85M08J52j08J710j57l54
7087I11M50j299O47n63J137n51l80j074K29J030K53j208j89l32J557r07q26J178
7105F3M35r87J301q43j013K271j759J850j24m32n80Q27j717k75R51Q5j163J4R25
7124a71L34O37j002o40J65K053j041R47n91k51L40j674n24J785r60J471m23K23
7142F78K06m14k6j10p77L46J331q28J468j233k05R4j24j119J719p33o06p23M15
$$ plain form
7010 840 -561 237 -376 -163 226 -743 618 45 1427 -126 -138 -1436 -546 -460 -182 563 973 -25 -93
7029 -93 279 752 541 81 386 -1060 615 278 629 -12 33 585 336 -115 -763 871 -546 973 346
7048 346 -320 -1158 579 -895 -970 -30 -237 -1505 495 776 -219 604 759 -474 -262 -695 154 132 737
7067 737 1581 713 810 127 99 755 1093 484 812 119 412 -829 -255 -740 -332 -180 -288 1422 1265 911
7087 911 1361 62 709 146 1283 732 352 -722 -493 537 790 -418 -607 -939 618 -289 -1115 63
7105 63 498 -489 812 -31 -1044 1227 -532 1318 1194 762 182 1009 -708 -983 -32 53 -1110 -1096 -171
7124 -171 163 800 -202 -842 -677 1376 335 1282 691 440 780 -894 -1418 367 -593 878 455 678
7142 678 884 470 444 334 -443 -97 1234 406 1874 641 436 530 406 -713 1006 273 -333 -1056 -641
7161f41K58J638M60q37j340P64P31q04m23M74k033K008K86q43J083r73R23p23
7179HJ467j741J214k905K481k04J043j539Q95o90l58P73r64p95Q20J053q34m18
7197f94J241m43m00J603J07j755R14P60k388L040k291P20j081l2R55j218K15P60
7215A3j52j152J452r29K224j294J190n21k64J256o83j227P10p13n88P47j064J957
7233I62o37m12o03J451j894J812j281J381j936R37L17p78P49j069J074L94j663
7250a196L8J238L17k06n12j78r8k62O38R57O8j730P55n8J789j549j643J779l14
7269a67P1P78O00M48k769O84P30l12o29P72k48L80q15J070m44R3j27J54l9n29
7289b99J726k262R66L84L33l99k526K337O27j469K7Q57m17J147j152l93K16n74
$$ plain form
7161 -641 -383 1255 1715 878 -462 302 1033 229 -194 280 -1753 255 541 -302 781 -192 731 8
7179 8 1475 -266 948 -1957 524 320 1363 -176 719 29 -329 444 -520 -1315 -495 558 -276 -694
7197 -694 547 104 -296 1307 1414 -341 573 1333 -1055 1985 -306 414 -667 -699 256 -962 -747 13
7215 13 -139 -1291 161 -768 1456 162 1352 831 567 1823 1140 -87 623 -90 -678 69 -995 962
7233 962 325 -87 -690 761 -1133 679 -602 779 -1157 -220 97 -681 68 -1001 73 467 -1196
7250 -1196 -1158 80 397 191 -321 -499 -597 -859 -221 736 804 -926 -171 -229 1560 11 -1632 147 -167
7269 -167 -96 682 1282 1730 -1039 -355 375 63 -566 206 -42 338 -477 593 149 242 115 269 230 -299
7289 -299 1427 -835 131 515 848 449 -2077 260 887 -582 -555 302 -115 1032 -120 -513 -297 -871
7307h71J328k90J607l017J262J576p9p58j786J525K62K18j947n30K027n73l28
7324c74N80k11Q80n36j30O50r6k066K075K5M22j763L40Q55k524K344l90M92L55
7343I28j370R34P1k60r63J767l40j066ml80J084m66m83J319p59k36k17J385k058
7362a114R55N28l78j62J020J36o77L3K26P2j686J20p32L645k076O38M4j858R06
7381c60j19J51l38k41J730j457L87j083J128j91j048K210p57J74m21m9J341m57
7399F00l91J85K89j037j36l16Q60l89j03Q81j68m16k42k87J064r24K64q79m90
7418a635J408N49n39j62n37K50P71L18n30K86l28P74m54J140q03J9K60m39p88
7437d40J15O82j066K05K34J474p56L76r17J639j768J03Q26p12P68l64r49J064
$$ plain form
7307 -871 457 167 1774 -1243 19 1595 1516 758 -1028 497 759 977 -970 -1500 527 -46 -374
7324 -374 206 -5 875 339 209 859 763 -1303 772 797 1219 -544 -204 651 -1873 471 81 573 928
7343 928 -442 492 563 303 -660 1107 767 -299 -303 -683 401 -65 -548 771 12 -224 -441 944 -1114
7362 -1114 -159 369 -9 -171 849 985 308 341 567 639 -1047 -927 -1659 1986 -90 548 592 -1266 -360
7381 -360 -479 -328 -666 -907 823 -634 -247 -1330 -202 -393 -1441 769 12 186 -235 -284 1057 600
7399 600 209 394 683 -354 -490 -806 54 -335 -438 443 275 -141 -383 -670 394 -530 -266 -1145 -1635
7418 -1635 -227 322 -217 -379 -916 -666 105 423 -107 179 -149 625 171 1311 508 527 787 348 -440
7437 -440 -325 357 -709 -504 -270 1204 448 824 -93 1546 -222 -119 707 -5 763 399 -550 514
7455E14m24K84Q80k581Q66M05J88n08R20p44j104R79M15l01q51K047J83j306R88
7474H50o14n26oO26J97j040J452j76k18n96l18P7k34j42R49q76k05P88M30n52
7494a34j995J633j05n14J488M04l01n18L69p58J99K18n18K018j715L23J16r49
7512g39M77n27J839p34m69J350j761p89J381p75J362L75r30l43l82J559k34k45
7530D15j97k81M83O29j112Q8K52n05Q06j592M57k97l26J765m78k80K2M49m75m22
7550e99p1J238L47l68n00M68j57L27p93l46M27M85J65N65j299N03j117P11L73
7569C59L68n1j390R87J23p0j778K456j727J080n22J325j243j66L70N39q81P38
7587E17l40l71J271p61r97K93J065k52l32P57j69q60J05J63o2l34Q20j044N49
$$ plain form
7455 514 90 374 1254 -1327 -461 -56 132 -376 544 -200 -1304 -325 90 -211 -1062 985 1168 -138 850
7474 850 236 -290 -296 330 527 -513 939 763 545 -51 -369 -292 -526 -668 281 -595 -800 -12 418 -134
7494 -134 -2129 -496 -601 -1115 373 777 476 -42 327 -431 -232 -14 -532 1486 -229 94 210 -739
7512 -739 -262 -789 1050 316 -153 1197 -564 -1353 28 -747 615 990 60 -283 -665 894 660 415
7530 415 218 -63 420 1049 -63 25 277 -228 578 -1014 -557 -854 -1180 585 107 -173 -151 298 -177 -599
7550 -599 -670 568 915 547 47 515 358 685 -108 -454 -27 458 623 1188 -111 392 -725 -14 359
7569 359 727 676 -714 273 396 326 -1452 1004 -723 357 -165 1160 -83 -249 121 660 -221 517
7587 517 177 -194 1077 316 -681 -388 677 425 93 850 681 -179 -74 89 27 -307 513 -531 18
7606A8n7J23j78n02J582k765K737j108J047j290l75J086q76R39j158J739j271
7623c09P32j50M77r77n84Q63P71p33o17M1P73O79j009k57o2lj60m86J108Q8OJ62
7645C53L72M96j001o25R17r42J7Q15O89q81p94M29n9l65Q50j70o51J42O10N66
7665G68j107j075k28J588Q82r02m29O10k24lN24l49R7K0j057J746j114O02q98
7684e49l97K12P81j35m5R90j82n95q70P66M85j371J424j53j130L07J092J32j356
7703e94J544j025L18j149J338m32N33N24j633J165j936Q42J8O41q18P29o80R76
7721C61R6m40N73n17J05r08J646m68M38O29j683J27n36J214n8k94J81K73N61l30
7741I70j306M30J62L3p89K043q95o84r55Q18o46J498j161M90P75j031J3j162N14
$$ plain form
7606 18 -39 84 -94 -596 986 -1779 958 -150 897 -393 -768 318 -558 381 -777 962 -309
7623 -309 423 273 750 -227 -811 52 823 90 -527 -486 287 966 -43 -300 -362 -365 -525 -1011 97 185 191 353
7645 353 725 1221 220 -405 512 -430 -413 402 1091 210 -584 -155 -214 -579 271 101 -550 -408 202 768
7665 768 -339 -1414 -1642 -54 828 -74 -503 107 -117 -120 404 55 152 172 -885 861 -253 349 -549
7684 -549 -946 -734 47 -88 -133 857 675 80 -790 -24 461 -910 514 361 -769 -462 630 762 -594
7703 -594 950 -75 243 -906 432 0 533 1057 -576 589 -1347 -505 -487 154 -664 65 -615 361
7721 361 457 17 590 73 178 -730 916 448 886 1515 -168 -41 -577 637 579 285 466 739 1300 970
7741 970 -336 94 256 289 -500 1543 648 -36 -991 -173 -819 679 -482 8 783 -248 -235 -1397 -883
7760h83q53J623NJ09j016J549l61M55p99K91n00M29j042J684q92K77R62j573J235
7779G00k265Q56R59j109L13M7m42K261j308J073q67q44O93k34R84n14q01L71Q53
7798G26n01r81N24M9J21N64k41k013J734j89k67j81J020l74l1j029J633P31j117
7817A78J38j074L95P52R1M79Q4j149m87K208k141Q60n95J42R21p45N16r20o32
7836i79Q83L49Q1m75j022N28O33m09NM8N06k11O08j094L03K241k226j210R44l02
7856g99m6J429j071n33m92R16J847j027j03n02L32M86k68J50L94q9P9j007q06
7875a110R25R1n20Q23R65q91j017O7O07k57J81L7o49L44P35r11n83J727n59P79
7895G84k913J554J33j90M6L61J41n62J27J43k4K91M03m21L15J433l193J009M49
$$ plain form
7760 -883 -1736 -113 -108 1 -1015 534 173 628 -171 120 -380 49 -993 691 -201 76 1038 -535 700
7779 700 -1565 -709 250 -859 -546 -499 -941 1320 12 1085 218 -626 67 -167 817 303 -498 -127 726
7798 726 225 -756 -232 -183 -62 502 261 -1752 -18 -207 -474 -655 365 -9 -40 -1069 564 1295 178
7817 178 316 -758 -363 389 480 959 1043 -106 -593 1615 -526 334 -261 -119 802 57 573 -347 -979
7836 -979 -96 253 334 -141 -1163 -635 -2 -411 -406 -358 148 -63 545 -549 -246 1995 -231 -1441 -497 -799
7856 -799 -845 584 -487 -1020 -1512 -596 1251 224 121 -381 -49 437 169 319 713 624 703 -304 -1110
7875 -1110 -185 -94 -614 209 1174 283 -734 -667 -60 -317 -136 -99 -748 -404 331 -580 -1163 564 5 784
7895 784 -2129 -575 -442 -632 -586 -225 -84 -646 -519 -376 -400 -109 294 -127 188 1621 -1572 -563 -114
7914a14p1N00J491j456n00M3r36J417k81m83l19J391j7M63q99r32Q61p31K33k4
7934c64O64K04q78O62J41O14j292J65R37j915L9J688p68q9J047O8j383p35J770
7953E75p23J07J079q93q73j24J474n94j23R05q48m60Q63p20J383k45r69J198K3
7972A035m31j11R8m51J069j466m34P46m5J63j575J759j447N42J147L2r37P11j421
7991a016J094p16M44j368J963j28n27K41j489J426r9P35R4j458J303p66Q02j315
8009g80l62J522J72l33m25J32j037R10j51K45J501j976N21R34q35Q65j203K87
8027a3Kp08m5J386j46j481N79J887n71j824J197m48O3r8m8N07L30n98J490q55
8047F06k06K54l18r63J4Q6P35n83N78N6r40J846j838K55J199r78m26R62q67L31
$$ plain form
7914 -114 -185 315 1806 350 -150 -107 -1043 374 93 -390 -709 682 665 1128 229 -703 158 -573 -340 -364
7934 -364 300 504 -374 288 429 1043 -249 -84 853 -1062 -1023 665 -103 -192 855 923 -460 -1195 575
7953 575 -148 -41 1038 145 -728 -852 622 28 -95 810 -38 -498 365 -355 1028 783 -186 1012 1035
7972 1035 604 493 591 140 1209 -257 -691 55 10 173 -1402 357 -1090 -548 599 631 -306 405 -1016
7991 -1016 78 -638 -194 -1562 401 273 -254 -13 -1502 -76 -175 560 654 -804 499 -267 535 -780
8009 -780 -1142 380 552 219 -206 -74 -1111 -201 -352 -107 1394 -582 -61 873 38 903 -300 -13
8027 -13 -11 -719 -764 622 476 -1005 -426 1461 890 -934 263 -185 -122 -220 -268 239 569 -29 1461 606
8047 606 400 654 336 -627 -613 -527 208 -375 203 259 -681 1165 -673 -418 781 -197 -623 339 -528 -197
8067a97n92J46J491j108p21Q49k70J16l71M34J241q00k31j005J435m63j146J694
8085E02k388J512P10L55o01j839K716m14n26J17K293k828M79q71J55j91O77O56
8103E14r41L03k28J534j222N82M0m63N94N2k71m53J133q42j522K119k200J483
8121B12N59k44j116N91J38j188O59m1J764r54k82r04K17J18K61k40k45J487N14
8140A306r98K9j22n50J125j424J594n24j678J695l71J586j726p41J160q52m13
8157i04J744J83J07j041R7J84r4p12J068j001k91J920O73j499l90n24O04O38n01
8176B61j329J395j84j17R62j95p93k4M18q48J124k31O04j254J392
8191A181
$$ plain form
8067 -197 -789 -643 848 -260 -981 -132 -402 -286 -657 -223 1018 218 -13 -1018 417 -46 -1192 502
8085 502 -1886 -374 336 691 90 -1749 967 553 27 144 2437 -391 88 -783 -628 -819 -142 514
8103 514 -427 -124 -352 1182 -40 542 582 119 713 765 494 41 1174 332 -1190 929 -1271 212
8121 212 771 527 -589 2 140 -1048 -389 -430 1334 380 98 -806 -589 -471 -210 -450 -695 792 1306
8140 1306 308 337 215 -335 790 -634 960 436 -1242 453 82 1668 -58 -799 361 -491 -904
8157 -904 840 1023 1130 89 186 370 276 -436 632 -369 -660 1260 1933 434 44 -480 124 762 261
8176 261 -1068 327 143 26 988 793 0 -24 394 -454 670 439 1043 -211 1181
8191 1181
$$ Imaginary data points
##PAGE= N=2
##DATA TABLE= (X++(I..I)), XYDATA
0@%%%%QqQj6J6k4L2m0M8n6P2q8J04j23J47j74K04k37K74l18L67m20M80n45O17
29C28o98P86q84R92j111J241j383J539j711J901k108K333k582K861l168L509l892
46b047M322m810N368o016O777p687Q799j0185J1978j4401J7875k3309L3066n5958
60c6228K02110J42222m23532n8641K34891R4663k33480q3584J56489J19608q4447
71C0071m3434M4668J812p2981J4949N9341k0948p0824L2843Q2541J51o2771l32
84d914L1449j7026m6767J4886N1277R551m0199j8894J8114M543k7231j2147L2047
97e311L2226j1496j6683J8340J4342l5298k8048L3053L1431l8938l8808L7484
109g706N1201k9097m6735J6426K3196k9844j0421N6842J8345o9804k9627P7744
$$ plain form
0 0 0 0 0 0 8 0 8 -8 8 -16 16 -24 24 -32 40 -48 56 -67 80 -94 110 -127 147 -171 196 -224 256 -289 328
29 328 -370 416 -468 524 -587 654 -729 810 -901 1000 -1108 1225 -1357 1504 -1664 1845 -2047
46 -2047 2275 -2535 2833 -3183 3594 -4093 4706 -5479 6499 -7902 9973 -13336 19730 -36228
60 -36228 165882 308104 -115428 -174069 60822 155485 -77995 -161579 -5090 114518 30071
71 30071 -13363 31305 33117 -39864 -24915 34426 13478 -57346 -24503 58038 58189 -4582 -4914
84 -4914 26535 9509 -37258 -22372 28905 38456 -1743 -20637 -2523 2020 -25211 -37358 -5311
97 -5311 26915 15419 -1264 17076 31418 -3880 -31928 1125 32556 -6382 -45190 -7706
109 -7706 43495 14398 -32337 -15911 7285 -22559 -32980 23862 42207 -27597 -57224 20520
121B0520M0444p9087n2715P1375O7717m4672n7399K1487K5691k8652r008L2522
133H223r122n2421R863P8861K2452o3853l5218M3791L1194k9944l2814J1170K5777
146G959R922l357j6633k1283L239L0025P628k5288j1586K0092R457k0824j3040
159b3689J9000J7391r635q398J3620J5889n870j6695m335K738r554j6126K883
172b2781K5119J1396j2769l390K1907M517l8088k4134L5443L6383k6973l8692
184c2062K3085M8816j0286m0690J280K6524r603k6918P472J8944j2867j3050K3757
197D402K3032k3010k5845J7523K4540r691j9513R125J3432r972o196J1506m227
210E106k2141q07K4722K717k1338k01K6846R001k6176j5645J4008R462j2657p442
$$ plain form
121 20520 60964 -18123 -70838 537 68254 23582 -33817 -12330 13361 -15291 -24299 8223
133 8223 -899 -53320 -43457 35404 57856 -5997 -41215 2576 33770 3826 -28988 -17818 7959
146 7959 17881 14524 -2109 -23392 -20153 9872 17500 -7788 -19374 718 10175 -10649 -23689
159 -23689 -4689 12702 3067 -5331 8289 24178 18308 1613 -2722 16 -9538 -25664 -22781
172 -22781 2338 13734 965 -2425 19482 23999 -14089 -38223 -2780 33603 6630 -32062
184 -32062 -8977 39839 29553 -11137 -9857 16667 7064 -19854 -12382 6562 -6305 -19355 4402
197 4402 27434 4424 -21421 -3898 20642 10951 -8562 563 13995 4023 -2173 9333 5106
210 5106 -17035 -17842 6880 9597 -11741 -11942 14904 23905 -2271 -17916 -3908 5554 -7103 -14545
224a4545J7760J5806n169j2143M006M592j1211j6465J627J1617k471m750J0552
237g94J8497m336k0326j026J6907j382k0876k819K4787R193k0672j0842J4889
250A200P524j5592q813J3519Q130j0429n420J1388N484j0606r395O438N917o02
264a257J441L762J646J369J474p221j4972l654R812N024o582m72J4034N958q967
279A395n299O435N98r313k478Q788L207q764k069J2146M300q714n155P205L521
294E803r904q412N374O626l086l305P731P987J736n089p85Qm149n434p44K869
310b774R47J687N427L497l730n693j465R87k680j426Q685N329k840k018N902n24
326I311j3898m910R543R567p499o882J1727R774j3163j6263O661J2096n046j0554
$$ plain form
224 -14545 3215 19021 13852 1709 5715 10307 -904 -17369 -15742 -4125 -6596 -11346 -794
237 -794 17703 13367 -6959 -7985 8922 7540 -13336 -16155 8632 17825 -2847 -13689 1200
250 1200 8724 -6868 -15681 -2162 5968 -4461 -9881 1507 6991 -3615 -13010 -6572 -655 -1257
264 -1257 184 3946 5592 6961 8435 1214 -13758 -17412 -7600 -2576 -9158 -9630 4404 10362 1395
279 1395 -3904 2531 3129 -6184 -8662 126 3333 -5431 -7500 4646 8946 232 -4923 2282 5803
294 5803 -4101 -12513 -7139 -513 -3599 -6904 827 8814 10550 5461 4676 4684 535 -4899 -5643 -2774
310 -2774 -1827 -140 5287 8784 5054 -639 -2104 -1117 -3797 -5223 3462 8791 5951 3933 9835 9311
326 9311 -4587 -9497 46 9613 2114 -4768 6959 16733 3570 -12693 -6032 6064 1018 -9536
340i536J1782J6025o515j4742M539J1846r763j7108O873J6163p93j3122J708J1758
354I115k052j4253j651J2323K479r719J687J1206L03j1277l959O839N16o086K612
369a917R677L97r816j784L905j481j0872j200J0133Q122k894n92N831q37n839
384H33n796K77l071l957N729J0378J018m653j625N229l260j3127l146P216Q579
399F24l114l104Q979N805l215r058m56L366k364o103K487O097J658l765Q4K918
415H39j472j603p88K529m07m98Q30L095j603k275j51L857K21k541j44J245j717
432e83j897J021n10R8K21L315L811k118o90q92q97j293J201L324J44o42r0J919
450E442j480p028l876L531N745p5p13K014M502qm335l452k435L91Q49J919L306
$$ plain form
340 -9536 2246 18271 11756 -2986 1553 13399 3636 -13472 -6599 9564 8771 -4351 -2643 9115
354 9115 7063 -7190 -8841 3482 5961 -3758 -2071 9135 9438 -1839 -5798 1041 1557 -4529 -1917
369 -1917 7760 8157 -1659 -3443 462 -1019 -11891 -13091 -2958 5164 2270 1678 7509 6672 833
384 833 -4963 -4686 -7757 -11714 -5985 4393 5411 758 -867 4362 1102 -12025 -15171 -7955 624
399 624 -2490 -5594 3385 9190 5975 -3083 -3539 -173 -2537 -8640 -6153 -56 1602 -2163 -2079 839
415 839 -633 -2236 -3024 -495 -902 -1400 -570 2525 922 -1353 -1504 2353 2574 33 -111 1134 -583
432 -583 -2480 -1459 -1969 -1871 -1650 1665 5476 3358 2668 1776 879 -414 787 4111 4255 3613 3523 5442
450 5442 3962 -3066 -6942 -3411 2334 2259 1546 3560 8062 8054 3719 267 -2168 -1777 -928 991 4297
467D297K465j54M46k532n917m863J708M528J186j138L309J924j712m171N86L873
483C835j757k560L20K954j133k591K106J4m197k608N289L025m442M37M210L398
499F300q888p980N432R945j713m627J876N802l039r173o48N950J049o474j970
514h158P604M314m893l523M751K866n785m991L328O522qM12J368k707q955n56
530h411P586M487o723k503N109L344q233n392O297R532k722m433K102L204k843
545D01l376K557K457m513m566O178M608j816l286J991M7o256k607Q203N778k170
561C630l220L654J118o881p556Q159R167j781p024P73N264l938o459J247O934
576C087k649m965K523Q573K169n645k528J559q95l414N60N034M978k102l172l226
$$ plain form
467 4297 6762 6608 7054 4522 -1395 -6258 -4550 -22 1164 26 3335 5259 3547 -624 -38 3835
483 3835 2078 -482 -162 2792 1659 -932 1174 1188 -3009 -5617 -328 2697 -1745 -1308 2902 6300
499 6300 -2588 -10568 -5136 4809 3096 -1531 345 6147 3108 -6065 -6713 -763 286 -6188 -8158
514 -8158 -554 3760 -1133 -4656 95 2961 -2824 -7815 -4487 2035 2027 2439 3807 1100 -7855 -8411
530 -8411 -825 3662 -3061 -5564 -455 2889 -5344 -10736 -4439 5093 2371 -2062 40 3244 401
545 401 -2975 -418 2039 -2474 -7040 -862 3746 1930 -1356 635 682 -5574 -8181 22 5800 3630
561 3630 410 4064 5182 -1699 -9255 -1096 8071 6290 -734 39 5303 1365 -5094 -3847 3087
576 3087 438 -4527 -2004 6569 8738 3093 565 2124 1229 -2185 -1625 3409 8387 6285 3113 -113
592a13l068J266J534K850J756K136k076o884j708O827M525m273o534L637O473
607F348N44n379j160L972j012n963l681J869L500M019L842k520m693k835J112
622b037L453j302j434K458L104k783n628l04M890K954l678m544J618L879L56l534
638b532p7L842k396n744K190N784K809k127J177J166o494o793K070P578j069k295
654b911L896K689m816m440L390K721n789j952P324M586p214l652J0207L132j1000
669c829q088O119R877l098m569N252M072p348q388N539Q442l822n334O108O221
684G154l459q731O76O608K187n833l751N018M519j659o096K959N615k143p939
699d875N95Q295L029m205k711P31j118l103L220L729l44k104L682O0o560l820
$$ plain form
592 -113 -3181 -1915 -381 2469 4225 6361 4285 -2599 -4307 2520 7045 2772 -3762 -125 6348
607 6348 6892 1513 353 4325 3313 -2650 -6331 -4462 -962 3057 6899 4379 -314 -3149 -2037
622 -2037 1416 114 -1320 1138 4242 1459 -4169 -4473 417 3371 -307 -4851 -3233 646 1002 -2532
638 -2532 -2609 1233 -1163 -6907 -4717 1067 3876 1749 2926 4092 -2402 -9195 -7125 453 -616 -2911
654 -2911 985 3674 -1142 -5582 -2192 529 -5260 -7212 112 4698 -2516 -6168 4039 7171 -3829
669 -3829 -11917 -5798 4079 981 -3588 1664 5736 -1612 -10000 -4461 3981 159 -5175 933 7154
684 7154 3695 -5036 -4360 2248 4435 -1398 -5149 -131 4388 2729 -3367 -408 5207 3064 -4875
699 -4875 -4280 4015 7044 2839 128 859 -259 -3362 -142 3587 3243 1139 4821 4881 -1679 -5499
715e499N612N825p030j633P419J862o516j612O664R42q329k809Q331J213n799
730a359J800O233n45p428m88L880l027l671O487N528n688o828M268O425m894o755
746f062L626O928j197n263J706J999k292k052J563N53l99J829J428k563k687J274
762a609J956k947k136K902M536o39l967n91K367k05l479N52K545J345l290l25
778b985L352J845l789m299L565N373j873p052K756Q603k064j0488q08J0070K208
793D414j0005j31R556J787r666k903P518K630o631k43P433P36p872j114N380m6
809H43n139K772O342k003n777J780N511l947o354K520P287j995n055L241O684
824F710k518n882j509L680J56j815R85L997J673l584n18N61k211k309K050M057
$$ plain form
715 -5499 113 5938 -1092 -2725 4694 6556 40 -1572 5092 6034 -2295 -5104 3227 4440 -1359
730 -1359 441 6674 6129 -1299 -1787 2093 -934 -4605 1882 7410 1722 -5106 -838 5587 693 -6062
746 -6062 -2436 4492 3295 -1968 -262 1737 -555 -2607 -1044 -491 -890 939 2367 -196 -2883 -1609
762 -1609 347 -2600 -4736 -1834 2702 2063 -1904 -2495 -128 -333 -3812 -3260 -715 630 -2660 -2985
778 -2985 367 2212 -1577 -5876 -2311 3062 1189 -5863 -3107 5496 3432 -7056 -7864 2206 4414
793 4414 -5591 -5722 3834 5621 -4045 -6948 570 3200 -3431 -3674 3759 4495 -3377 -4491 889 843
809 843 -4296 -1524 4818 2815 -2962 -1182 4329 382 -5972 -3452 3835 1840 -3215 26 6710
824 6710 4192 -1690 -3199 481 637 -1178 -193 3804 5477 1893 1375 1936 -275 -2584 -534 3523
840C523J152l731J8K619J391p281j822N334M436l926m086N988M125m157p483J122
856b778P797k536m031K914N069k897m504N01K882l527l253M543K906j219k752
871h85K676J669l743l553K861K739k434Q04M084K92n887j131J863L45l326O83
887b943N242J54k657o99K920l000m663K503M740p2m863J637M425j036n585k588
903f485M959K731m378n09M794K173k715l494J025J624l426o75L827L881k243k932
919a843K331J84l729k245L162J567j780l08L423J466l012m736M785J447l316j521
935d125M332K532l102q52K723j92l463j351L568M119n669j634M690K714m953m185
951d848L689L986k607l251N334L434l688m289L001J709l048l682M701M240l448
$$ plain form
840 3523 4675 944 962 3581 4972 -2309 -4131 1203 5639 1713 -2373 3615 7740 3583 -3900 -2778
856 -2778 5019 2483 -1548 1366 6435 3538 -966 -465 2417 -1110 -4363 180 3086 1867 -885
871 -885 1791 3460 -283 -3836 -975 1764 -670 134 4218 4510 -1377 -2508 -645 -300 -3626 -2943
887 -2943 2299 2453 -204 -903 2017 -983 -5646 -3143 1597 1525 -3338 -1701 2724 1688 -3897 -6485
903 -6485 -1526 1205 -3173 -3682 1112 3285 570 -2924 -1899 -275 -3701 -4376 -549 3332 1089 -1843
919 -1843 488 672 -3057 -5302 -2140 -573 -2353 -2661 762 2228 -784 -5520 -735 712 -2604 -4125
935 -4125 207 2739 -363 -1215 1508 1316 -2147 -3498 70 4189 -1480 -3114 1576 4290 -663 -4848
951 -4848 -1159 2827 220 -3031 2303 5737 2049 -2240 761 2470 -578 -4260 441 4681 1233
966A233l356J532N471l108m652J979L729n51l331J786L332j684k673O8K750j193
982A332j186M71R38q69j176K387J127k995k582K974K139j938j210K246J712l271
998I9k456K019Q57q19j214J743L326m622p93K480K825k930l218N14K260q75j276
1015b080K074K473n33k836o15Q83n30n92R34J834j38k054O2k11j359R58K236J072
1033A578k368l93K526j241j086j536J262J732j262r46J903R0p28j021J223j102
1049a369l154J231L220J435j194o53R31J044l375n9K554J053k034k183K608J197
1065A252m482o35K802L089l151k268K328N588k688l331J513J844j669j504J899
1080E87J531L97k564n84L74L98j017J304J06K44j420Q47K644J73k484J999K000
$$ plain form
966 1233 -2123 -591 4880 1772 -2880 -901 2828 2277 -1054 732 4064 2380 -293 -225 2525 1332
982 1332 146 617 1555 686 -490 1897 3024 29 -2553 421 2560 622 -588 1658 3370 99
998 99 -2357 -338 519 -300 -1514 229 3555 -1067 -1860 620 3445 515 -2703 -2189 71 -804 -2080
1015 -2080 -6 2467 1934 -902 -1517 -634 -1164 -1756 -822 1012 874 -1180 -1118 -1329 -2688 -1730 506 1578
1033 1578 -790 -1183 1343 102 -984 -2520 -1258 474 -788 -1734 169 259 -469 -1490 -267 -1369
1049 -1369 -4523 -3292 -72 1363 169 -484 447 1491 -1884 -1943 611 1664 -370 -2553 55 1252
1065 1252 -3230 -3865 -1063 2026 -1125 -3393 -1065 4523 1835 -1496 17 1861 192 -1312 587
1080 587 2118 2515 -49 -633 -259 139 -878 426 532 776 -644 203 2847 3020 536 2535 4535
1097D535k026m807M91K533K310k298p84K626k362l347K056L286P87k972j31M088
1113C985j403l307j153M337J889k018l116J553J968N19j871j8l3l162k59O31K860
1130A402M81j465K445j476j243m67k94L995p95j825o15J003j002r51L37J27K160
1147A817l087q25P59J849l98J22n58N66j288P84J605Q09l154K036J04j067j747
1164a673r18K080q73q49J679j768l46J386K803M73k338j651N75K066q55j011J876
1181F56J135j594j487j834K574j330m47J318N85o81J87q97J846j26O56r57R65
1198E69M16m67M83q4N62j096k481j353J145K688o4n6o59l26J024o05j472J75L966
1217B365J114j294j928J115J866j045k245j831J709J350k002K94J773J72j348
$$ plain form
1097 4535 2509 -2298 -1807 726 3036 738 -46 2580 218 -3129 -1073 2213 3000 28 -103 3985
1113 3985 2582 -725 -1878 2459 4348 2330 -786 767 2735 3254 1383 1365 1332 -1830 -2089 -1458 1402
1130 1402 1883 418 2863 1387 144 -323 -617 3378 2583 758 143 1146 144 -807 -470 -343 1817
1147 1817 -1270 -2095 -1336 513 115 237 -321 245 -1043 -259 1346 2155 -999 1037 1141 74 -1673
1164 -1673 -2591 -511 -1384 -2233 -554 -2322 -2668 -1282 1521 1994 -344 -1995 -1420 646 -209 -1220 656
1181 656 1791 197 -1290 -3124 -550 -1880 -2327 -1009 -424 -1105 -918 -1815 31 -95 561 -396 569
1198 569 985 518 1001 917 1479 383 -2098 -3451 -2306 382 318 262 -397 -723 301 -304 -1776 -1601 2365
1217 2365 3479 2185 257 1372 3238 2193 -52 -1883 -174 1176 -826 -532 1241 1413 65
1232F5n23p79J872l23K37K918l11r10j594J239o10k732M45J715J347l060J444
1249D40P25n89l119P94K370P00l351K377J947L050l563j972R48R2q73j586k49
1266a859J382K083q41j653r64J907n85j01p62Q77J764J407k379q40N53P01j03
1283E87j943j30J726J395j528l214J39J316m9k160J606L456J646k354j215J930
1299A208p58l744o9L825N53k579l28K051P07l209l41J338J821k433N79P35O68
1316B4j388Q03J491m7j801J402J102p02k27o44O44k410k34o61K705j695J162J735
1334A259J035j952j429K928j037r47P18K64J75o56m29J301O57j404o86m28P25
1351I4J338j029r09J213M34j233J281P65j00m74m58J729r71j552k146L068P43
$$ plain form
1232 65 -458 -1237 635 312 549 3467 3156 2246 652 1891 1281 -1451 -1006 709 2056 -1004 440
1249 440 1165 576 -2543 -1749 621 1321 -2030 347 2294 5344 1781 -191 757 849 -24 -1610 -1859
1266 -1859 -477 1606 765 -888 -1852 55 -530 -631 -1393 -516 1248 2655 276 -564 -11 690 587
1283 587 -1356 -1486 240 1635 107 -3107 -2968 -1652 -1701 -3861 -2255 1201 2847 493 -722 1208
1299 1208 450 -3294 -3363 462 1015 -1564 -1892 159 866 -2343 -2684 -1346 475 -1958 -1379 -644 24
1316 24 -1364 -561 930 883 -918 484 1586 884 657 13 657 -1753 -1987 -2648 57 -1638 -476 1259
1334 1259 2294 342 -1087 1841 804 -143 575 839 1014 358 -71 1230 1887 483 -203 -631 94
1351 94 1432 403 -506 707 1141 -92 1189 1954 1854 1380 922 2651 1680 128 -2018 1050 1793
1368A793k897N31J620J088k539O20K203j056j405K65Q23J418j994P2K289j088
1384A743k618L57K689j900k378J686J870j392l344L352K559k454k061K975L664
1399D748l046l443J389K972k127m594J807L300j434j412J375L205k073k542Q66
1414a009K556j593k954R08K973k32k283M48K893q94q2k045L690j285l272j004
1430c185O84J544n48j08J412J318j348j145O65J324j572j182K790J21m454R98
1446b686M087n82l366P37L250L17k788k210K904R07m235O97M518R57l921J259
1462a55K297M27l927P76J770j268k002n78K956J259l418K290L001j302k239l89
1478e02R69n12j409M58J003O13j873O53L207j267j056K91J262l14k855M96J052
$$ plain form
1368 1793 -1104 -573 1047 2135 -404 216 2419 1363 -42 223 1046 2464 470 542 2831 1743
1384 1743 -875 -518 2171 271 -2107 -421 1449 57 -3287 65 2624 170 -1891 1084 4748
1399 4748 1702 -1741 -352 2620 493 -4101 -2294 1006 -428 -1840 -465 2740 667 -1875 -1009
1414 -1009 1547 -46 -3000 -2092 881 649 -1634 -1186 1707 813 731 -1314 2376 1091 -2181 -3185
1430 -3185 -2501 -957 -1505 -1613 -201 1117 -231 -1376 -711 613 -959 -2141 649 770 -3684 -2686
1446 -2686 1401 819 -2547 -1810 1440 1757 -1031 -3241 -337 570 -3665 -2968 1550 2507 -1414 -155
1462 -155 2142 2569 -1358 -582 1188 -80 -2082 -2660 296 1555 -1863 427 3428 2126 -113 -502
1478 -502 467 -45 -1454 -996 7 620 -1253 -600 2607 1340 284 575 1837 1523 -1332 -836 216
1495B16J94o55k15K101J013n22j279P60r67j270N40J681j974q73J359J768R55
1512B832l269j97K437J144l293j772K288J423k327n85J717J899j622j742K556
1527A489q59j658m04R34M18l136n8N055q40j372Q81L403j289l437j99J243r4j975
1545a898R89k02M16j637J807J209k67j203o50J800k53k094M84K498m81k124M26
1562a180K137r40j858J028K055k449j116j088K698m37o34M42K817L06m12j267
1578A02M40J75k55k203j344J724K17K74J418K042k493j139J553N21j666m97K490
1595A359P73k298m61J420l99J793k81j62J06r61q56l44K26j653K489M28k18k163
1613a202K522J738L57k299j0J359o73j840j200J532J425L58k566P3J150k35M56
$$ plain form
1495 216 410 -245 -460 1641 2654 2132 853 1613 646 -624 -84 1597 -377 -1250 109 1877 2832
1512 2832 -437 -634 1803 2947 -346 -2118 170 1593 -734 -1319 398 2297 675 -1067 1489
1527 1489 630 -1028 -1432 -498 -80 -3216 -3274 1781 941 -431 450 3853 2564 -873 -1072 171 77 -1898
1545 -1898 -909 -1111 -695 -2332 -525 684 417 -786 -1436 364 111 -1983 -1499 999 518 -1606 -1180
1562 -1180 957 17 -1841 -813 1242 -1207 -2323 -3411 -713 -1150 -1784 -1342 1475 1781 1369 102
1578 102 542 717 462 -1741 -3085 -1361 -1144 -870 548 2590 97 -1042 511 1032 -634 -1131 1359
1595 1359 2132 -166 -627 793 394 2187 1906 1744 1850 889 33 -311 -85 -1738 751 1179 961 -1202
1613 -1202 1320 3058 3415 1116 1106 2465 1792 -48 -1248 284 1709 2067 -499 -426 724 489 945
1630I45n79Q74j368o36K30J595n08K20K046P11j088k392J599N39j107j947K5O98
1648a43q03j366K775J098m74k23q48J581j402q1k23J776j999j402K309j33R33
1665A375j712K159r32j856j86r5J136j218N5J538o62n39r20K919J138r51j824
1682e75n36O42q87P01j000K506k250Q51r08J743q33j0J679N30k282j714K658m27
1700a12J187j161J173O78p28j623l03J008j960J208j546R28p87r8K932K160k462
1717D94p60K138j81p50p19L4r83J066O52o16j397J017K0J974R3k953o22K623j60
1736I70n37K86K70O64p38O71J81K96K33j348k272K554j654j178K313L60k645K520
1754I46J902j914r95J90K432m31k523L17o16J778k30K80L28k00o89n68p54P58
$$ plain form
1630 945 366 1240 -128 -764 -534 1061 553 773 2819 3530 2442 50 1649 2188 1081 -866 -841 -143
1648 -143 -946 -2312 463 1561 1087 864 16 1597 195 114 -109 1667 -332 -1734 575 442 1375
1665 1375 -337 1822 890 -966 -1152 -1247 -111 -1329 -1274 264 -398 -937 -1857 1062 2200 1249 -575
1682 -575 -1111 -469 -1356 -655 -1655 851 -1399 -548 -1456 287 -546 -556 1123 1653 -629 -2343 315 -112
1700 -112 1075 -86 1087 1765 1037 -586 -889 119 -1841 -633 -2179 -1251 -2038 -2136 796 2956 494
1717 494 -266 1872 1691 941 222 256 -727 339 991 375 -1022 -5 15 1989 2082 -871 -1493 1130 970
1736 970 433 719 989 1653 915 1586 1767 2063 2296 948 -1324 1230 -424 -1602 711 1071 -1574 946
1754 946 2848 934 -61 129 2561 2130 -393 -76 -692 1086 856 1136 1464 1264 575 7 -747 11
1772A1l36j151K431j654J356o25J575K68m47j367J129j064P77r29k06J293k362
1789a301j282K485j181R80K17l77n7p9O13j661K472j664M65N64M6m57N17n37N04
1808B67j193J2j814J615K75j19q39R07L65q9Q21Q65K61q77o74o01P97l96J091
1827F74r52K2m33q1j737Q81K61L50m59J460l21p64J288R78j29p32j040J033J000
1846A299k002l70R86j309J105o03L78L86r51R84O61l31R07M8j029N09l31O06r09
1865C4L36J025k2m99M00j336K2j068q87J395J564L57j224N12l8n6L35L6r85R63
1885H64K91l01j765M77M38J528j567J935L91n47J7j255J43L49j89k07m00O59p16
1904A45KL00J91k72m44M13p05M10O01j174J272j190J321O3l41j46k99Q92l02j146
$$ plain form
1772 11 -325 -1476 955 -699 657 32 1607 1875 1428 61 1190 126 903 -26 -232 1061 -1301
1789 -1301 -2583 -98 -1279 -299 -82 -459 -516 -595 18 -1643 829 -835 -370 194 240 -217 300 -237 267
1808 267 -926 -914 -2728 -1113 -838 -957 -1796 -889 -524 -613 208 1073 1334 457 -217 -818 -21 -417 674
1827 674 -278 -256 -689 -770 -2507 -1626 -1365 -1015 -1474 -14 -335 -1099 189 1167 1038 306 -734 299 1299
1846 1299 -703 -1073 -87 -1396 -291 -894 -516 -130 -1081 -97 564 233 1140 1188 159 668 337 943 34
1865 34 370 1395 1373 874 1274 -62 -40 -1108 -1995 -600 964 1321 97 609 571 515 850 886 -99 864
1885 864 1155 854 -911 -434 4 1532 -35 1900 2291 1744 1761 506 649 998 809 602 202 861 145
1904 145 147 447 638 366 -78 335 -370 40 641 -533 739 -451 870 933 592 446 147 1039 737 -409
1924d09J880j423O4j015o74K200j960N79J328q94P75k28n17K90k90R64p17k43
1942b90J29O71L4L1j00K63j544l91R1J12l84J336M55j173k65J702M4n59q58J203
1962E07r19m08M16j86J660j022k7P02r4j422m73J030J314k526R90P78j58o63R23
1981D22O92j373k75Q10N41l9j555K95K90j270L61J890J97r96L75M45k55k92l32
2000f9J32J619p55J22n30K98J247j267m22o70O4P88J081j179Q9l93N69l97L41
2019F68o95q40R04J334J44j590J582j37l10j675J738k72m14P93l20N49o67N05
2037A297j852Q98m02l20P55p2r28P06L10L43o30r82J294m53n74j185K021p14O4
2056d24J4J163P38k158O27P05q42j442M92R03j309k4J616L72j7j538O40R5k03
$$ plain form
1924 -409 1471 48 112 -903 -1577 623 -1337 -758 570 -324 451 223 -294 -4 -294 670 -47 -290
1942 -290 -161 510 544 575 475 738 -806 -1197 -1106 -994 -1378 -42 413 -760 -1025 677 721 162 -696 507
1962 507 -412 -820 -404 -590 1070 48 21 723 629 -793 -1266 -236 1078 -1448 -458 320 162 -501 422
1981 422 1114 -259 -534 276 817 778 -777 -482 -192 -1462 -1101 789 986 -10 365 810 555 263 -69
2000 -69 63 1682 927 1049 519 817 2064 797 375 -295 -231 557 1638 459 548 155 724 327 668
2019 668 -27 -867 37 1371 1515 -75 1507 1370 1060 -615 1123 851 437 1230 910 1459 792 1297
2037 1297 -555 343 -59 -379 376 304 -624 82 392 735 105 -877 417 -36 -610 -1795 226 -488 -424
2056 -424 -410 753 1491 -667 -40 665 -177 -1619 -1127 -224 -1533 -1557 59 431 414 -1124 -484 -389 -592
2075e92m15K99J00J30O48p31J05K80J16o77n34R46J0K7M4J38p5k41J38N5j0p11
2097i50J070k57mK58o21J737j845K76J332m85k20r04J412k76q00n58J240J56j245
2116f84o30J843J007j012o58J52R94r40l54P96j02J7O34n41R01j514q07J165J8
2135B85q83O77Q93j050N41m25P72J05j056J18R30L80j556O5J590l53n4q37J42
$$ plain form
2075 -592 -1007 -708 -608 -478 170 -561 -456 -176 -60 -737 -1271 -325 -315 -288 -244 -106 -181 -422 -284 -229 -239 -950
2097 -950 120 -137 -141 117 -504 1233 -612 -336 996 511 291 -613 799 523 -277 -835 405 561 -684
2116 -684 -1314 529 1536 524 -134 18 1012 72 -282 514 412 429 1063 522 1423 -91 -898 267 285
2135 285 -598 79 972 -78 463 38 810 915 -141 -23 907 1287 -269 -204 1386 1033 979 142 284
$$ [...]
8191E76
##END NTUPLES=NMR FID
##END=
