##TITLE=1H_SL62-SPh
 CDCl3, 8 sc, 
 14.3.2019
##JCAMPDX= 6.0         $$ Bruker NMR JCAMP-DX V2.0
##DATA TYPE= NMR FID
##DATA CLASS= NTUPLES
##ORIGIN= UXNMR, Bruker Analytische Messtechnik GmbH
##OWNER= root
$$ XWIN-NMR		Version 3.5
$$ Thu Mar 14 15:58:46 2019 Russian Standard Time (UT+4h)  she@DPX200
##.OBSERVE FREQUENCY= 200.1315
##.OBSERVE NUCLEUS= ^1H
##.DELAY= (6, 6)
##.ACQUISITION MODE= SIMULTANEOUS
##.ACQUISITION SCHEME= undefined
##.AVERAGES= 8
##.DIGITISER RES= 18
##SPECTROMETER/DATA SYSTEM= spect
##.PULSE SEQUENCE= zg30
##.SOLVENT NAME= CDCl3
##.SHIFT REFERENCE= (INTERNAL, CDCl3, 0, 15.7039)
##AUDIT TRAIL= $$ (NUMBER, WHEN, WHO, WHERE, WHAT)
$$ ##TITLE= Audit trail, XWIN-NMR		Version 3.5
$$ ##JCAMPDX= 5.01
$$ ##ORIGIN= Bruker BioSpin GmbH
$$ ##OWNER= she
$$ F:/spectra/data/she/nmr/H-F/1/audita.txt
$$ ##AUDIT TRAIL=  $$ (NUMBER, WHEN, WHO, WHERE, WHAT)
(   1,<2019-03-14 15:57:42.23 +0400>,<she>,<DPX200>,
      <created by zg, POWCHK disabled, PULCHK disabled
       configuration hash MD5:
       00 E9 B6 7A A2 85 ED C7 34 08 36 98 17 FE 4E 26
       data hash MD5: 16K
       76 BE C9 26 0E 9F 8A 81 A1 09 F1 FB 2A 63 BE 94>)
$$ ##END=
$$ 
$$ hash MD5
$$ DC 45 62 2D 1F 95 B9 73 9B 8C F1 3D 47 C8 D5 32
##$RELAX= 
##$RELAX= 
##$RELAX= 
##$RELAX= 
##$RELAX= 
##$RELAX= 
$$ Bruker specific parameters
$$ --------------------------
##$DU= <F:/spectra>
##$EXPNO= 1
##$NAME= <H-F>
##$PROCNO= 1
##$TYPE= <nmr>
##$USER= <she>
##$AMP= (0..31)
100 100 100 100 100 100 100 100 100 100 100 100 100 100 100 100 100 100 
100 100 100 100 100 100 100 100 100 100 100 100 100 100 
##$AQSEQ= 0
##$AQ_mod= 1
##$AUNM= <au_zg>
##$AUTOPOS= <>
##$BF1= 200.13
##$BF2= 200.13
##$BF3= 200.13
##$BF4= 200.13
##$BF5= 200.13
##$BF6= 200.13
##$BF7= 200.13
##$BF8= 200.13
##$BYTORDA= 1
##$CFDGTYP= 0
##$CFRGTYP= 5
##$CHEMSTR= <none>
##$CNST= (0..31)
1 1 145 1 1 1 1 1 1 1 1 1 1 1 1 1 1 1 1 1 1 1 1 1 1 1 1 1 1 1 1 1 
##$CPDPRG= <>
##$CPDPRG1= <>
##$CPDPRG2= <>
##$CPDPRG3= <>
##$CPDPRG4= <mlev>
##$CPDPRG5= <mlev>
##$CPDPRG6= <mlev>
##$CPDPRG7= <mlev>
##$CPDPRG8= <mlev>
##$CPDPRGB= <>
##$CPDPRGT= <>
##$D= (0..31)
0 1.2 0 0 0 0 0 0 0 0 0 0.03 0 0 0 0 0 0 0 0 0 0 0 0 0 0 0 0 0 0 0 0 
##$DATE= 1552564661
##$DBL= (0..7)
120 120 120 120 120 120 120 120 
##$DBP= (0..7)
150 150 150 150 150 150 150 150 
##$DBP07= 0
##$DBPNAM0= <>
##$DBPNAM1= <>
##$DBPNAM2= <>
##$DBPNAM3= <>
##$DBPNAM4= <>
##$DBPNAM5= <>
##$DBPNAM6= <>
##$DBPNAM7= <>
##$DBPOAL= (0..7)
0.5 0.5 0.5 0.5 0.5 0.5 0.5 0.5 
##$DBPOFFS= (0..7)
0 0 0 0 0 0 0 0 
##$DE= 6
##$DECBNUC= <off>
##$DECIM= 24
##$DECNUC= <off>
##$DECSTAT= 4
##$DIGMOD= 1
##$DIGTYP= 9
##$DL= (0..7)
0 120 120 120 120 120 120 120 
##$DP= (0..7)
150 150 150 150 150 150 150 150 
##$DP07= 0
##$DPNAME0= <>
##$DPNAME1= <>
##$DPNAME2= <>
##$DPNAME3= <>
##$DPNAME4= <>
##$DPNAME5= <>
##$DPNAME6= <>
##$DPNAME7= <>
##$DPOAL= (0..7)
0.5 0.5 0.5 0.5 0.5 0.5 0.5 0.5 
##$DPOFFS= (0..7)
0 0 0 0 0 0 0 0 
##$DQDMODE= 0
##$DR= 18
##$DS= 0
##$DSLIST= <SSSSSSSSSSSSSSS>
##$DSPFIRM= 0
$$ [...]
##$SUBNAM2= <"">
##$SUBNAM3= <"">
##$SUBNAM4= <"">
##$SUBNAM5= <"">
##$SUBNAM6= <"">
##$SUBNAM7= <"">
##$SUBNAM8= <"">
##$SUBNAM9= <"">
##$SW= 24.9337058887773
##$SWIBOX= (0..15)
0 0 2 0 0 0 0 0 0 0 0 0 0 0 0 0 
##$SW_h= 4990.01996007984
##$TD= 16384
##$TD0= 1
##$TE= 0
##$TE2= 300
##$TE3= 300
##$TEG= 300
##$TL= (0..7)
0 120 120 120 120 120 120 120 
##$TP= (0..7)
150 150 150 150 150 150 150 150 
##$TP07= 0
##$TPNAME0= <>
##$TPNAME1= <>
##$TPNAME2= <>
##$TPNAME3= <>
##$TPNAME4= <>
##$TPNAME5= <>
##$TPNAME6= <>
##$TPNAME7= <>
##$TPOAL= (0..7)
0.5 0.5 0.5 0.5 0.5 0.5 0.5 0.5 
##$TPOFFS= (0..7)
0 0 0 0 0 0 0 0 
##$TUNHIN= 0
##$TUNHOUT= 0
##$TUNXOUT= 0
##$USERA1= <user>
##$USERA2= <user>
##$USERA3= <user>
##$USERA4= <user>
##$USERA5= <user>
##$V9= 5
##$VALIST= <valist>
##$VCLIST= <CCCCCCCCCCCCCCC>
##$VD= 0
##$VDLIST= <DDDDDDDDDDDDDDD>
##$VPLIST= <PPPPPPPPPPPPPPP>
##$VTLIST= <TTTTTTTTTTTTTTT>
##$WBST= 1024
##$WBSW= 4
##$XGAIN= (0..3)
0 0 0 0 
##$XL= 0
##$YL= 0
##$YMAX_a= 135575
##$YMIN_a= -92816
##$ZGOPTNS= <>
##$ZL1= 120
##$ZL2= 120
##$ZL3= 120
##$ZL4= 120
##$ABSF1= 10
##$ABSF2= 0
##$ABSG= 5
##$ABSL= 3
##$ALPHA= 0
##$AQORDER= 0
##$ASSFAC= 0
##$ASSFACI= 0
##$ASSFACX= 0
##$ASSWID= 0
##$AUNMP= <proc_1d>
##$AZFE= 0.1
##$AZFW= 0.1
##$BCFW= 1
##$BC_mod= 2
##$BYTORDP= 1
##$COROFFS= 0
##$CY= 11.3945322036743
##$DATMOD= 1
##$DC= 2
##$DFILT= <>
##$DTYPP= 0
##$F1P= 18.9103706918063
##$F2P= -1.10871071338519
##$FCOR= 0.5
##$FTSIZE= 0
##$FT_mod= 4
##$GAMMA= 1
##$GB= 0.15
##$INTBC= 1
##$INTSCL= 1
##$ISEN= 128
##$LB= 0.24
##$LEV0= 0
##$LPBIN= 0
##$MAXI= 10000
##$MC2= 0
##$MEAN= 0
##$ME_mod= 0
##$MI= 1.114404
##$NCOEF= 0
##$NC_proc= 0
##$NLEV= 6
##$NOISF1= 3.799351
##$NOISF2= 2.8
##$NSP= 1
##$NTH_PI= 0
##$NZP= 0
##$OFFSET= 15.70392
##$PC= 1
##$PHC0= -9222.874
##$PHC1= 19.60026
##$PH_mod= 1
##$PKNL= yes
##$PPARMOD= 0
##$PSCAL= 0
##$PSIGN= 0
##$REVERSE= no
##$SF= 200.130013532006
##$SI= 16384
##$SIGF1= 3
##$SIGF2= 2
##$SINO= 400
##$SIOLD= 16384
##$SREGLST= <1H.CDCl3>
##$SSB= 0
##$STSI= 0
##$STSR= 0
##$SW_p= 3612.71676300578
##$SYMM= 0
##$S_DEV= 0
##$TDeff= 0
##$TDoff= 0
##$TI= <>
##$TILT= no
##$TM1= 0
##$TM2= 0
##$TOPLEV= 0
##$USERP1= <user>
##$USERP2= <user>
##$USERP3= <user>
##$USERP4= <user>
##$USERP5= <user>
##$WDW= 1
##$XDIM= 8192
##$YMAX_p= 0
##$YMIN_p= 0
$$ End of Bruker specific parameters
$$ ---------------------------------
##NTUPLES= NMR FID
##VAR_NAME=  TIME,          FID/REAL,        FID/IMAG
##SYMBOL=    X,             R,               I
##VAR_TYPE=  INDEPENDENT,   DEPENDENT,       DEPENDENT
##VAR_FORM=  AFFN,          ASDF,            ASDF
##VAR_DIM=   8192,          8192,            8192
##UNITS=     SECONDS,       ARBITRARY UNITS, ARBITRARY UNITS
##FACTOR=    0.0002004,     1,               1
##FIRST=     0,             0,               0
##LAST=      1.6414764,     0,               0
##MIN=       0,             -92816,          0
##MAX=       1.6414764,     135575,          0
$$ Real data points
##PAGE= N=1
##DATA TABLE= (X++(R..R)), XYDATA
0@%%%%%%%%Lj1J6j6J6j7K5l2M0m8N6o5P4q9J04j20J37j55J76k01K29k58K90l26
32a72L65m10M58n10N68o31P02p78Q62r56J057j170J295j435J593j774J980k215
50a171K495k828L231l735M382n251O494q427J1882k0029P8382P0150l0887J5997
64A20685l594J983j2219M036k018j655j0126K097n35k378r549j853k47j121p429
79G6077l142j167j851q369m106p4m98o999n985j582P90m904o131k523j7l804o867
96A8848k463J336k186n857m383R37j027m678l916L68n70m269l532M17R60k365
112a2380m365j033K083p66l343j208K159K1k762j140K522J572k181k089J970L220
128a7720n17j900J736L237K2j650J477M289J494k303R2M273L265p52m45L459K946
$$ plain form
0 0 0 0 0 0 0 0 0 0 3 -8 8 -8 8 -9 16 -16 24 -24 32 -33 41 -48 56 -64 73 -82 94 -107 122 -136 154 -172
32 -172 193 -217 241 -269 299 -332 370 -408 454 -502 555 -615 680 -755 838 -936 1044 -1171
50 -1171 1324 -1504 1727 -2008 2374 -2877 3617 -4810 7072 -12957 65425 135575 104688 120685
64 120685 117091 119074 106855 110891 108873 107218 97092 99189 98654 96276 86727 84874 84627 83506 76077
79 76077 72935 71768 69917 61548 57442 57368 56870 49871 43886 42304 43094 38190 32059 29536 29519 25715 18848
96 18848 16385 17721 15535 9678 5295 6232 5205 527 -3389 -3021 -3591 -7860 -11392 -10975 -10015 -12380
112 -12380 -16745 -17778 -15695 -16461 -19804 -21012 -18853 -18832 -21594 -22734 -20212 -18640 -20821 -22910 -20940 -17720
128 -17720 -18237 -20137 -18401 -15164 -15142 -16792 -15315 -11026 -9532 -11835 -11743 -7470 -4205 -4957 -5402 -1943 1003
145A003j84j00L248L909l2j232K047M486K009j445J287L690J854r90M95M161K611
162B6817j077o62L043L490k70j045J594K966J18j302J535L411J63k543J42K808
178C9188J197j353r92J752O77j787j323K120R74j400k632M78J686r71k341m84
194C4789P41p85k533r11J418l01k808k641M54Q33k107k460o40K58j502k852l71
211A8582P79j327l515j447Q47j10k889j955Pl67k638j668N05K72k120l175l07
228e26Q59r58k750r01N49j105k523o01J182m12k835j507R13M35j608j941J90Q40
246a2699j747j492N34J499j190k678j67J751J20j875o20J205J05j508m81J631
262a7612N48j390j666J042J984j003j290P86J052j29j337N45J716lj764L4J712
$$ plain form
145 1003 819 719 3967 7876 7844 6612 8659 13145 15154 13709 14996 18686 20540 19550 20045 24206 26817
162 26817 25740 25078 28121 31611 31341 30296 31890 34856 34974 33672 35207 38618 38781 36238 36380 39188
178 39188 40385 39032 38040 39792 40469 38682 37359 39479 40453 39053 36421 36899 38585 37614 35273 34789
194 34789 35530 34745 32212 31301 32719 32418 29610 26969 27423 28256 26149 23689 23049 23307 21805 18953 18582
211 18582 19361 18034 14519 13072 13919 13809 10920 8965 8972 8605 5967 4299 4804 5076 2956 -219 -526
228 -526 333 -625 -3375 -4276 -3727 -4832 -7355 -7956 -6774 -7186 -10021 -11528 -10615 -10180 -11788 -13729 -13539 -12699
246 -12699 -14446 -15938 -15404 -13905 -15095 -17773 -17940 -16189 -16069 -17944 -18564 -17359 -17254 -18762 -19243 -17612
262 -17612 -17064 -18454 -20120 -19078 -17094 -18097 -19387 -18601 -17549 -17678 -19015 -18470 -16754 -16757 -18521 -18487 -16775
279a6775Q86p41o76O58R50p98k29J317J065n80j237O95J551N50j130k34J298M22
297a3008p51J30J426O77j120r49R56J520k3j019N38M13L09q77L42J492m6j271
315a1261j55J300M20l14q90N77P24o61r6L69R96q07j589Q01J134J77j351J4P87
334i825j61p29k21J006N53j505r98Q18Q64m23j514P11K50n53p72L32P76l51j466
353a3208r3J042L03j091m13N23Rp55N9O15N25j263r32Q43J259m39n85m73P55J30
373a3189n68L58J059l08p54m05J110P17k38j87J78N81p7l68P01Q63l80n9j43J529
393i580O84m01k08O63O7N20L27M28J014n16l52R93Q92L45m64K27O96M65J50N10
413c540J008L15p69l35J241J067n1m53P63M01j01J61K84Q37k23m98P3J198O11
$$ plain form
279 -16775 -15889 -16630 -17306 -16648 -15698 -16496 -16725 -15408 -14343 -14923 -16160 -15465 -13914 -13364 -14494 -14728 -13430 -13008
297 -13008 -13759 -13629 -12203 -11526 -12646 -13595 -12639 -11119 -11142 -12161 -11623 -11210 -10901 -11778 -11436 -9944 -9990 -11261
315 -11261 -11416 -10116 -9696 -10010 -10900 -10323 -9599 -10260 -10356 -9987 -8991 -9798 -11387 -10586 -9452 -9275 -10626 -10612 -9825
334 -9825 -9986 -10715 -10936 -9930 -9377 -10882 -11880 -11062 -10198 -10621 -12135 -11424 -11174 -11727 -12499 -12167 -11391 -11742 -13208
353 -13208 -13301 -12259 -11956 -13047 -13460 -12937 -12928 -13683 -13624 -13009 -12484 -13747 -14679 -13836 -12577 -13016 -13601 -14074 -13319 -13189
373 -13189 -13757 -13399 -12340 -12648 -13402 -13807 -12697 -11980 -12218 -12405 -12227 -11646 -11723 -12091 -11390 -10527 -10907 -10966 -11109 -9580
393 -9580 -8896 -9297 -9505 -8842 -8775 -8255 -7928 -7500 -6486 -7002 -7354 -6361 -5469 -5124 -5588 -5361 -4665 -4200 -4050 -3540
413 -3540 -2532 -2217 -2986 -3321 -2080 -1013 -1064 -1517 -754 -353 -454 -293 -9 828 605 107 180 1378 1989
432A989q26j16N58N7m72N2P86J40j016o16P78P78q02k83o10J10j73k25l6k17L
453a41j143k55M51J25j049n25k36p3p14m55J10l42r59j076J02K87m58j198n45
472h094l69l21q30k78Q2o50j293o21R3P1p25r99r35p4l42l07p89N14q94j489j8
493a8268J61R5p84o80k22Q3j65n65j29j25l81r38M8P69m95l87o53M26J91o51K41
514b2429K39L53j089k0O95P36n84k54L68O07k13Q0O94L03r8r0N01Q73P86m94M5
535a8991R49P87K28J65J151J66J18K46J057Q48O72j70M47J006O00O27O80Q12L87
554h215j54Q71J334O77N71J88N31R54M89P27Q12N86M30J44Q80J122M84K28K57
573B916M09R13N25K20R64J6j58L76O17J001j26J97j98M51L00J15N17j66K19n39
$$ plain form
432 1989 1163 1047 1605 1662 1190 1242 2028 2168 1152 536 1314 2092 1290 1007 397 507 334 109 73 -144 -141
453 -141 -1284 -1539 -1088 -963 -2012 -2537 -2773 -2846 -3560 -4015 -3905 -4247 -5206 -6282 -6180 -5893 -6351 -7549 -8094
472 -8094 -8463 -8784 -9614 -9892 -9810 -10460 -11753 -12374 -12281 -12210 -12935 -13934 -14869 -14943 -15285 -15592 -16381 -15867 -16761 -18250 -18268
493 -18268 -18107 -18012 -18796 -19476 -19698 -19615 -19780 -20345 -20474 -20599 -20980 -21918 -21870 -21101 -21596 -21983 -22636 -22210 -22019 -22670 -22429
514 -22429 -22190 -21837 -22926 -22946 -22251 -21515 -22099 -22353 -21985 -21378 -21591 -21511 -20817 -20514 -20612 -20702 -20201 -19328 -18542 -19036 -18991
535 -18991 -18042 -17255 -17027 -16862 -15711 -15545 -15427 -15181 -14124 -13276 -12604 -12774 -12327 -11321 -10721 -10094 -9414 -8602 -8215
554 -8215 -8369 -7498 -6164 -5487 -4916 -4728 -4197 -3243 -2754 -2027 -1215 -629 -199 -55 825 1947 2431 2659 2916
573 2916 3325 4238 4763 4983 5947 5963 5805 6181 6798 7799 7673 7870 7672 8123 8423 8538 9055 8889 9108 8569
593H569J66L96K19j66l85q8n6q1k50n3K58n32q96k60K64j5p86q84k9l28L1p65
615D329k83m82j068l15k34J0p60j223o89k6l48m53n64p88n81p97j20j90m45o98
635e725p00n13J76p97l42k61m44o91k69l72L81k11q75j75l40L34k96J00q5m26
655a1531l80K44Q5M79j94p7N0L89L04M01L43J99LL82K75R46N02M20K06L06Q79
676e769N94O58O08P06L73M77R37Q90R10J6P48J151O89R31O23P76P77M56O45J150
696H346J135P27n9Q32R60J029K19O18J130l0O05O68J341M91K37N8R64N49L69L38
716B0527Q43L60j33M01M58R06m0K65K8K65M26K07L84O7Q0p04M02P25r1k32m59
737B4685L38q4J13j9m52N2p37k18K64j9k33n16j23m19j92k51l95o3q51q8k30l6
$$ plain form
593 8569 8735 9131 9350 9184 8799 8711 8655 8574 8324 8271 8529 7997 7101 6841 7105 7090 6304 5420 5391 5063 5094 4329
615 4329 4046 3564 2496 2181 1947 1957 1197 -26 -715 -741 -1089 -1542 -2106 -2894 -3475 -4272 -4392 -4582 -5027 -5725
635 -5725 -6425 -6938 -6762 -7559 -7901 -8162 -8606 -9297 -9566 -9938 -9557 -9768 -10643 -10818 -11158 -10824 -11120 -11020 -11105 -11531
655 -11531 -11911 -11667 -11582 -11103 -11297 -11374 -11324 -10935 -10631 -10230 -9887 -9688 -9685 -9303 -9028 -8082 -7580 -7160 -6954 -6648 -5769
676 -5769 -5175 -4517 -3909 -3203 -2830 -2353 -1416 -526 384 400 1148 2299 2988 3919 4542 5318 6095 6551 7196 8346
696 8346 9481 10208 10149 10981 11941 12970 13189 13807 14937 14907 15512 16180 17521 18012 18249 18307 19271 19820 20189 20527
716 20527 21370 21730 21597 21998 22456 23362 23322 23587 23615 23880 24306 24513 24897 24964 25044 24340 24742 25467 25376 25144 24685
737 24685 25023 24939 25052 25033 24581 24633 23896 23678 23942 23923 23690 23174 23051 22632 22440 22189 21794 21731 20880 20792 20562 20526
759B0526m61m92n38k13j95j88l56J0l42r67Nk46M2r2n24o19l97j73K94k31l10
780A4533n48l91l31K55k93m26l96l14k12j03j16m45L4m74o13j16M0j31l8p52n22
801H641j47L2n06PO3q96m27M2L19m55q45l0l49l45r8j26m36n79o07J62p7k15n01
824B627n18p93J57j65n44k58m22o30k33l68K75n29q38m78m03j08l68j93k58m87
844d534n19l14j12k41J12p73j75m82n0O8J81o99m77q6m76K56j5k45j61m83O58
865h567l77J0J3k49k20Q2K30J64J77q0j26k0L02K48J57L26k16J06J60N67K82M34
887f597j90j60O27N11O40O9O0L39L10M08O03L44J34n0K01N37O87Q6L57L46n8O02
909a94K31P73J80l36L08K23P22L75J69l4O1K26M29K27M86k76k53O4M57L54K6R2
$$ plain form
759 20526 20065 19573 19035 18822 18627 18439 18083 18093 17751 16784 16789 16543 16585 16493 15969 15350 14953 14780 15074 14843 14533
780 14533 13985 13594 13263 13518 13225 12799 12403 12089 11877 11774 11658 11213 11247 10773 10160 10044 10084 9953 9915 9163 8641
801 8641 8494 8526 8020 8027 8090 7194 6767 6809 7128 6673 5828 5798 5449 5104 5006 4880 4444 3865 3258 3420 3343 3128 2627
824 2627 2109 1316 1473 1308 764 506 84 -546 -779 -1147 -872 -1401 -2239 -2717 -3120 -3228 -3596 -3789 -4047 -4534
844 -4534 -5053 -5367 -5479 -5720 -5608 -6381 -6556 -7038 -7088 -7020 -6839 -7538 -8015 -8101 -8577 -8321 -8336 -8581 -8742 -9225 -8567
865 -8567 -8944 -8934 -8921 -9170 -9390 -9308 -9078 -8914 -8737 -8817 -8943 -8963 -8661 -8413 -8256 -7930 -8146 -8040 -7880 -7313 -7031 -6597
887 -6597 -6787 -6947 -6320 -5809 -5169 -5100 -5040 -4701 -4391 -3983 -3380 -3036 -2902 -2952 -2751 -2214 -1527 -1441 -1084 -738 -796 -194
909 -194 37 810 990 654 962 1185 1907 2282 2451 2417 2478 2704 3133 3360 3846 3570 3317 3381 3838 4192 4218 4310
931D310J41l67j68K55J08K02j86k74k75j62L69J64l90l82j32m83L42j68j18p45
951B041l23j18m0J61m58n28l93J05o47q0J82n20n84l94r3p9m0n03j36o00k66l06
973c619M9l54n57j41n45L85o9m97k51k40k42m93J65L14j96o42m08K34j86L59k68
994g202k90J16l80J01K52k74J71j11j14o5J11j7J15O3l61N41J97K21K73l01J61
1015f793l27N63N17kM06l52K42Q0L78J51L28j84m4L40O01J35L58j49K83J78K81
1036c010L94N8Q3k20K78L63K83K39L72k65l25K16O88J00N8K25k99J87L62l4N33
1057B86m84j8L04N0K09pj45K12p92O58L12K29n92K68n43K33J83m07N36n77j46
1078b31j79J33r8K30j56k79k0j13N0k4k00l72k41J08J46o6k3m31q8j71J12j33
$$ plain form
931 4310 4451 4084 3916 4171 4279 4481 4295 4021 3746 3584 3953 4117 3727 3345 3213 2730 3072 2904 2786 2041
951 2041 1718 1600 1560 1721 1263 735 342 447 -200 -280 -98 -618 -1202 -1596 -1689 -1768 -1808 -2311 -2447 -3047 -3313 -3619
973 -3619 -3570 -3924 -4481 -4622 -5167 -4782 -4851 -5348 -5599 -5839 -6081 -6574 -6409 -6095 -6291 -6933 -7341 -7107 -7293 -6934 -7202
994 -7202 -7492 -7376 -7756 -7655 -7403 -7677 -7506 -7617 -7731 -7796 -7685 -7702 -7587 -7524 -7885 -7344 -7147 -6926 -6653 -6954 -6793
1015 -6793 -7120 -6557 -6040 -6042 -5636 -5988 -5746 -5666 -5288 -5137 -4809 -4993 -5037 -4697 -4096 -3961 -3603 -3752 -3469 -3291 -3010
1036 -3010 -2616 -2558 -2475 -2695 -2417 -2054 -1771 -1532 -1160 -1425 -1750 -1534 -846 -746 -688 -463 -762 -575 -213 -247 286
1057 286 -198 -216 88 138 347 340 195 407 -385 273 585 814 222 490 -53 180 363 -44 492 -85 -231
1078 -231 -410 -277 -375 -145 -301 -580 -600 -713 -663 -687 -887 -1259 -1500 -1392 -1246 -1312 -1335 -1766 -1854 -2025 -1913 -2046
1100b046J04k71k19j62K5K77j85j4m36K45n27L35L73l89n77K71j78L09J37k6O6
1121b888m83j97J25O41j06Kn46R1K71Q9L55k48P4k09K74L28P9j41k16l0K6N10
1143b199K07j70L41p6l27L92K32l8j12m2M6J25J35K57l51P05o50J63L25o5l0j3
1165a145j12J08J7J30l31N16l95P3k76K74J56l95M9k08J86j13M23k83m74J76j30
1186a754j26n1J09k66r8j34j73L6P1n05J58j64l78K65n4J53o66k59jJK38m77J67
1209c908l30k67J43p1L3k2m56l6L0j50J18K32l35j96k3m9L10l26M3l19K18J15
1231e246p8J86K6l73l14N77J05Q6J75k64J57m7M78l3j03L07m20R4M64L17J75l22
1253d053K63K59J75j05M44J30R2l29O16j94N11K29J90m09J79L08K60M43n6L9R6
$$ plain form
1100 -2046 -1942 -2213 -2432 -2594 -2569 -2292 -2477 -2491 -2927 -2682 -3209 -2874 -2501 -2890 -3467 -3196 -3374 -3065 -2928 -2954 -2888
1121 -2888 -3371 -3568 -3443 -2802 -2908 -2906 -3452 -3361 -3090 -3001 -2646 -2894 -2820 -3029 -2755 -2427 -2348 -2489 -2705 -2735 -2709 -2199
1143 -2199 -1992 -2162 -1821 -1897 -2224 -1832 -1600 -1638 -1750 -1792 -1746 -1621 -1486 -1229 -1580 -875 -1525 -1362 -1037 -1102 -1132 -1145
1165 -1145 -1257 -1149 -1132 -1002 -1333 -817 -1212 -1139 -1415 -1141 -985 -1380 -1331 -1539 -1353 -1466 -1043 -1326 -1800 -1624 -1754
1186 -1754 -1880 -1931 -1822 -2088 -2186 -2320 -2493 -2457 -2386 -2891 -2733 -2897 -3275 -3010 -3064 -2911 -3577 -3836 -3837 -3836 -3598 -4075 -3908
1209 -3908 -4238 -4505 -4362 -4433 -4400 -4422 -4878 -4914 -4884 -5034 -4916 -4684 -5019 -5215 -5238 -5287 -4977 -5303 -5260 -5579 -5361 -5246
1231 -5246 -5324 -5138 -5112 -5485 -5799 -5222 -5117 -5031 -4856 -5120 -4963 -5010 -4532 -4565 -4668 -4361 -4781 -4687 -4223 -3906 -3731 -4053
1253 -4053 -3790 -3531 -3356 -3461 -3017 -2887 -2795 -3124 -2508 -2702 -2191 -1962 -1772 -2181 -2002 -1694 -1434 -991 -1047 -1008 -912
1274i12M55K00K06K64k55RL68N54J26K78k39K84j0O1M79N52l62J49l8J95O08m2
1296B930J93p0k1L4N91K87Q6l31K78k3O3N17Pj35J57p9L30N8J37J61k83k1L96
1319E262L4Q4L6J75k04L6j39N33k47o7k35K28L56k8q7j98m9ml8p7O8K5k54J47
1343E357j96j41K34k88pm81K15l81p8M2m6n53O0k62l9m3n20M8n09J92j63j35l06
1366B000k21l54j48m7L3o1m05k39n49j81J25l22m86j45l19j76K45k33k88l74j61
1387b306k42k18J52j39k13m57j66L6j4k82K70n73j62j02n5N84l83j10j06L21L5
1408d130J0M5k43J77l71N68J65L88k25j33K34M55j04K48L86j80L09M36L94K88
1428a283j14K27L84J67L99N06K00J7K34K51P36N48K48J42M15k8M84O3O96L89K01
$$ plain form
1274 -912 -457 -257 -51 213 -42 -33 335 889 1015 1293 1054 1338 1328 1389 1868 2420 2058 2207 2169 2364 2972 2930
1296 2930 3123 3053 3032 3066 3657 3944 4030 3699 3977 3954 4017 4534 4541 4406 4563 4484 4814 4872 5009 5170 4887 4866 5262
1319 5262 5296 5380 5416 5591 5387 5423 5284 5817 5570 5503 5268 5496 5852 5824 5737 5539 5490 5486 5448 5371 5439 5464 5210 5357
1343 5357 5161 5020 5254 4966 4959 4478 4693 4312 4234 4276 4230 3677 3737 3475 3436 3393 2873 2921 2412 2604 2441 2306 2000
1366 2000 1779 1425 1277 1230 1263 1202 797 558 9 -172 -47 -369 -855 -1000 -1319 -1495 -1250 -1483 -1771 -2145 -2306
1387 -2306 -2548 -2766 -2614 -2753 -2966 -3423 -3589 -3553 -3567 -3849 -3579 -4152 -4314 -4416 -4471 -3887 -4270 -4380 -4486 -4165 -4130
1408 -4130 -4120 -4075 -4318 -4141 -4512 -3944 -3779 -3391 -3616 -3749 -3515 -3060 -3164 -2916 -2530 -2710 -2401 -1965 -1571 -1283
1428 -1283 -1397 -1170 -786 -619 -220 286 486 503 737 988 1724 2272 2520 2662 3077 3049 3533 3596 4292 4681 4882
1449D882K04J23P09J57J65K00L28L56J55K66L35R8p2j7N29J31N63m4J47l42N39
1470I412pmO4nj94K01m5J36j75K49j73m49q4K53r8l73j13n9k09j84n80K98l87
1493G474n48j55j36j82j86m40o22j27k67nk74m46m80n35Q4k18j34m61o13n80k0
1514A129l73k5k59m16l61l91l2m57K6j83n79k44j96L2Mj72o57J07l22O5j19q0
1536c503j39K8l76L99j65J01j57l1N7r6L2N38k77j37J50q2K23M29J30k51J26M70
1558b531k6L82J29K25k49Q3N40K26J68N96j66o2K96M20J39m1M84L7J6L56N57j96
1580A383J83k9k28N74M01J57k76Q4K75J49L42J07k63k8o3N81k63M43j10l72j46
1601B901M3M92k43M03o02l23K55q8K28l81K85l96j82r2K40p5m09k69O7Q1m41l10
$$ plain form
1449 4882 5086 5209 5918 6075 6240 6440 6768 7124 7279 7545 7880 7978 7906 7889 8418 8549 9112 9068 9215 8873 9412
1470 9412 9405 9401 9465 9460 9266 9467 9422 9558 9383 9632 9459 9010 8926 9179 9081 8708 8595 8536 8327 8143 7563 7861 7474
1493 7474 6926 6771 6635 6453 6267 5827 5205 5078 4811 4806 4532 4086 3606 3071 3155 2937 2803 2342 1729 1149 1129
1514 1129 756 731 472 56 -305 -696 -728 -1185 -1159 -1342 -1921 -2165 -2361 -2329 -2325 -2497 -3154 -3047 -3369 -3304 -3423 -3503
1536 -3503 -3642 -3614 -3990 -3591 -3756 -3655 -3812 -3843 -3786 -3882 -3850 -3312 -3589 -3726 -3576 -3658 -3435 -3006 -2876 -3127 -3001 -2531
1558 -2531 -2557 -2175 -2046 -1821 -2070 -1987 -1447 -1221 -1053 -457 -623 -685 -389 31 170 129 613 650 666 1022 1579 1383
1580 1383 1566 1537 1309 1883 2284 2441 2165 2249 2524 2673 3015 3122 2859 2831 2768 3349 3086 3529 3419 3047 2901
1601 2901 2944 3436 3193 3596 2994 2671 2926 2838 3066 2685 2970 2574 2392 2300 2540 2465 2056 1787 1854 1935 1494 1184
1623A184M30m56j40m82N35l89Q5o7n14N8j79q7K75po51l55L18m5K29l24l06J44
1645g44k17p5L89J4k19k05q2P8M38J84r3p6j89o9j49N08N1J49k82M94j48J50L78
1668B85K25j47j17L1M73N3mL9j47N04J9K42J36L40j40k82M08L67J75q6k19L10
1690B465K06K45j70J86K56k49L9K26J67j7j90K24J78j53o9J58R0m88K70k97j1
1711C066L52l15K25n65J80k10M15n0n05k79J27k36k00j18j25j41k48k24M9k97
1731I01K6l22k78j68j50om59N2n95K5n72L2n7l94q6n67R6j42r8j93k08q11K69
1754c705L41m03k32j52p4j38r9J50k72n15J67k71J10P3l1l78jk25k86K77J65J37
1776e362l23n2j36K25J92j32N30m15L30n04L40r6K77R5J75K88q1M91J01m6K08
$$ plain form
1623 1184 1614 1158 1018 536 1071 682 767 700 186 244 65 -22 253 246 -405 -760 -442 -487 -258 -582 -888 -744
1645 -744 -961 -1036 -647 -633 -852 -1057 -1139 -1061 -623 -439 -532 -608 -797 -866 -1015 -507 -456 -307 -589 -95 -243 -93 285
1668 285 510 363 246 277 750 803 799 838 691 1195 1214 1456 1592 1932 1792 1510 1918 2285 2460 2374 2155 2465
1690 2465 2671 2916 2746 2932 3188 2939 2978 3204 3371 3354 3164 3388 3566 3413 3344 3502 3592 3104 3374 3077 3066
1711 3066 3418 3103 3328 2763 2943 2733 3148 3098 2593 2314 2441 2205 2005 1887 1762 1621 1373 1149 1198 901
1731 901 927 605 327 159 9 3 -456 -404 -999 -974 -1546 -1514 -1571 -1965 -2051 -2618 -2522 -2664 -2762 -2955 -3163 -3974 -3705
1754 -3705 -3364 -3767 -3999 -4151 -4225 -4363 -4462 -4312 -4584 -5099 -4932 -5203 -5093 -5020 -5051 -5429 -5430 -5655 -5941 -5664 -5499 -5362
1776 -5362 -5685 -5737 -5873 -5648 -5456 -5588 -5058 -5473 -5143 -5647 -5307 -5403 -5126 -5031 -4856 -4568 -4649 -4158 -4057 -4103 -3895
1797c895K1N9M40K31L0k20L79L52J42P54m85R6K91K99J72M2M16K95J36M1L92K62
1819B50K83j4J58l7N49M8K09J29J81N4L26J73l8N9J30rO7J51M22K5P7n5J38j55
1843C121L80M47m12J05j35J03N66o9m63O7m15N46J9k62J65j66l21L41l80L82p9
1864C540k69m64J61j72K72J17p55N9M3m62J11P6j16m99r3P2k31l92J25j8m65j65
1886D75p5J10o26N8l28j59j26P9k91L3n04p5k04j10l27O7l27l38M7k77k26R8n08
1909c534j04l27p4K60l21m59j44j97PP8l43J5j63j75K22m41L6j46l8k72j3R4r8
1932f137j33O4l67K56J8J46l98L7K43l47J68q0L70m91L57j44nK50K45m15Q2K68
1954f013J39N5K63q3J32k25M62O1J19j05N27o0j32Q52m61L65L64k25L38P8K94
$$ plain form
1797 -3895 -3874 -3815 -3375 -3144 -3114 -3334 -2955 -2603 -2461 -1707 -2192 -2096 -1805 -1506 -1334 -1292 -876 -581 -445 -404 -12 250
1819 250 533 519 677 640 1189 1237 1446 1575 1756 1810 2136 2309 2271 2330 2460 2451 2518 2669 3091 3116 3193 3138 3276 3121
1843 3121 3501 3948 3536 3641 3506 3609 4175 4106 3643 3710 3295 3841 3860 3598 3763 3597 3276 3617 3237 3619 3540
1864 3540 3271 2807 2968 2796 3068 3185 2430 2489 2532 2070 2181 2257 2141 1642 1549 1621 1390 998 1123 1105 640 475
1886 475 400 510 -116 -58 -386 -545 -671 -592 -883 -850 -1354 -1429 -1633 -1743 -2070 -2003 -2330 -2668 -2621 -2898 -3124 -3026 -3534
1909 -3534 -3638 -3965 -4039 -3779 -4100 -4559 -4703 -4900 -4893 -4815 -5158 -5143 -5306 -5481 -5259 -5700 -5664 -5810 -5848 -6120 -6133 -6039 -6137
1932 -6137 -6270 -6206 -6573 -6317 -6299 -6153 -6551 -6514 -6271 -6618 -6450 -6530 -6160 -6651 -6294 -6438 -6443 -6193 -5948 -6363 -6281 -6013
1954 -6013 -5874 -5819 -5556 -5639 -5507 -5732 -5270 -5209 -5090 -5195 -4668 -4728 -4860 -4008 -4469 -4104 -3740 -3965 -3627 -3549 -3255
1975c255J61J05L22R2K0L46J11J23L19O8k05O83k49P33L8P0k28L27N90J69Q1N2
1997D73k36K82L49J37K90J77k92J09R2M40m9J08q5j52J83K65j37J78l17K67N6
2018B138J80k36L32j01l36J36L14j94J05m5m02Q4k61M37l91K69l51q2k17J06p3
2039A412k85J2j38l8j34p3l3k28j0m04N2j51K82o03k62J5O2J29k38j14K12j027
2061a562J57o1P9r3J27l51j54m2n9p5j94j02R9j20L66k06K36n42O7p5L8L70P1
2084b026j11m06L06M6L30k07J87l90J65M18R8L81j1J08m59K71M5L18K10N48k87
2105d66PM18k03O89r0n7Q7J50L27K55j03P5L77P1M85J91P0J55J51J11O4j25N51
2128C190N1J52K21k61M25M6j3L44J57n3K09L53j09j19J17O0j04K33K30k03j35
$$ plain form
1975 -3255 -3094 -2989 -2667 -2575 -2555 -2209 -2098 -1975 -1656 -1588 -1793 -1110 -1359 -626 -588 -518 -746 -419 171 340 421 473
1997 473 237 519 868 1005 1295 1472 1180 1289 1381 1821 1772 1880 1795 1643 1826 2091 1954 2132 1815 2082 2138
2018 2138 2318 2082 2414 2313 1977 2113 2427 2233 2338 2293 1891 1975 1714 2151 1760 2029 1678 1596 1379 1485 1412
2039 1412 1127 1139 1001 963 829 756 723 495 485 81 133 -18 264 -339 -601 -586 -524 -395 -633 -747 -535 -1562
2061 -1562 -1405 -1466 -1387 -1480 -1353 -1704 -1858 -1900 -1959 -2034 -2228 -2330 -2231 -2351 -1985 -2191 -1955 -2497 -2430 -2505 -2467 -2097 -2026
2084 -2026 -2137 -2543 -2237 -2191 -1861 -2068 -1881 -2271 -2106 -1688 -1590 -1209 -1220 -1112 -1571 -1300 -1255 -937 -727 -179 -466
2105 -466 -459 -41 -244 445 355 298 385 535 862 1117 1014 1089 1466 1537 2022 2213 2283 2438 2589 2700 2764 2639 3190
2128 3190 3241 3393 3614 3353 3778 3824 3811 4155 4312 4259 4468 4821 4712 4593 4710 4770 4666 4899 5129 4926 4791
2149D791LJ13K37J92J32m09K4j3Rj90N4K5j09k62k82L83j10l78j64K18j50j83
2171C931N5m4r6m86k66M55j64l28j75k5j86j09q2n4l77m0k93l95K91k21k30J37
2193A298m30k69J15J34l85J41l95k47j51J57J31j73l66m83N88J87l69k91J18n25
2213a215K89M3p0k12J58j13m0J1n6K94j8n82N06m1J24k64k47K37j81O1J14k39
2235a441M31K1k82P7p9L51j57J75k68P2q7J14j38L17m02J33k82M60q8M36l35j10
2257a082J54k1L0J39k87j91l25L90r6J03j62j20Q3k12P1j4q3j16jj07J94J10m99
2280b042j49K40m07P0j06j5o0l98k02kk86L49l89O4L8l24j25k19P1l83O8L3kj84
2304d360j9j53O3l9q9J89k56j14m15K37j3J10J37r1k21J08n0K80L8k24N36n05
$$ plain form
2149 4791 4794 4907 5144 5336 5468 5059 5083 5070 5079 4889 4943 4968 4859 4597 4315 4698 4588 4210 4046 4264 4114 3931
2171 3931 3986 3942 3846 3360 3094 3549 3385 3057 2882 2857 2671 2562 2480 2426 2049 2009 1716 1321 1612 1391 1161 1298
2193 1298 868 599 714 848 463 604 209 -38 -189 -32 99 -74 -440 -923 -335 -148 -517 -808 -690 -1215
2213 -1215 -926 -883 -953 -1165 -1007 -1120 -1160 -1149 -1205 -911 -929 -1511 -1005 -1046 -922 -1186 -1433 -1196 -1377 -1316 -1202 -1441
2235 -1441 -1010 -989 -1271 -1194 -1273 -922 -1079 -904 -1172 -1100 -1187 -1073 -1211 -894 -1296 -1163 -1445 -985 -1073 -637 -972 -1082
2257 -1082 -928 -949 -919 -780 -1067 -1258 -1583 -1193 -1289 -1186 -1348 -1468 -1385 -1597 -1526 -1540 -1623 -1739 -1740 -1847 -1653 -1543 -2042
2280 -2042 -2191 -1951 -2358 -2288 -2394 -2409 -2469 -2867 -3069 -3071 -3357 -3008 -3397 -3333 -3295 -3619 -3744 -3963 -3892 -4275 -4207 -4174 -4176 -4360
2304 -4360 -4379 -4532 -4469 -4508 -4597 -4408 -4664 -4778 -5193 -4956 -4969 -4859 -4722 -4813 -5034 -4926 -4976 -4696 -4658 -4882 -4346 -4851
2326d851M07j22L11K52k02l6J31J69K04j6M95k9j77K16N63J98m1P6J06L75K51
2347a720J64M70K4j53M57K14K22L60K44m4N56M0M57M9r2M39N92r7M17m6K21M07
2369C181L50j80K95L98J6K55K05k16N36J2L83L15j67M01J14q6J96M8J9j51K81
2390F205K07J95J30O6l66J6J19J39q2J60l16rl9L87q1K7m16M2K47n20M1K1j84
2413E989k17j16j49q7K30k10l00l42J07n63J82l07m2k06m92M29k72j51m34k66
2433B783J13k76J35j06m88k71p7j99k1j98k66M36q49l7J73L4j40m34K37l57j78
2454A4J72j71m37P1j30J96k81l7K20k46j59L21j99L05k01j74j6k71L85K47k06
2475e97O1l5mK30Q0p7l22K39J67j16K05J31j07O1K37P6j2K01j0K23k32L59j11
$$ plain form
2326 -4851 -4444 -4566 -4255 -4003 -4205 -4241 -4110 -3941 -3737 -3753 -3258 -3287 -3464 -3248 -2685 -2487 -2528 -2452 -2346 -1971 -1720
2347 -1720 -1556 -1086 -1062 -1215 -758 -544 -322 38 282 238 794 834 1291 1340 1248 1687 2279 2182 2599 2553 2774 3181
2369 3181 3531 3351 3646 4044 4060 4315 4520 4304 4840 4852 5235 5550 5383 5784 5898 5812 6008 6056 6075 5924 6205
2390 6205 6412 6607 6737 6803 6437 6453 6572 6711 6629 6789 6473 6464 6425 6812 6731 6758 6342 6384 6631 6111 6152 6173 5989
2413 5989 5772 5656 5507 5420 5650 5440 5140 4798 4905 4342 4524 4217 4175 3969 3477 3906 3634 3483 3049 2783
2433 2783 2896 2620 2755 2649 2161 1890 1813 1614 1593 1395 1129 1565 716 679 852 886 746 312 549 192 14
2454 14 186 15 -422 -351 -481 -285 -566 -603 -383 -629 -788 -467 -666 -361 -562 -736 -752 -1023 -638 -391 -597
2475 -597 -536 -571 -575 -345 -265 -342 -664 -425 -258 -374 -169 -38 -145 -84 153 229 217 418 408 631 399 758 647
2498F47K21J79N3n8M22m16K20R1k45M26j06L04j44J12K59j82N8J5K4K59J87k88
2520B038K23k58OM18p2j93q2O6k16L22k04J40j25k09J04j48J92J82l41l08J53
2541A688J75kq3K20o09J56M0j77K70l76l85J93r7J84p1l29p4J39j09n3J18J73
2563I91k07n53l98J56L24l5K87n08JN11n05l8P4k57k55J81P1J88j58j5k09j07
2585d61O5K24j90J97j20k16j3j11L33r3k52J12O3n1K34k52Q9l71L01J95pj71j1
2608e06k25n4L21O6pM0q7k41j57K20r4K81m47J79j00p9K4K81N9K23l64j60L52
2631d75o17K16j10J8l72J09L00k5k84k7R3Q9l00J61k17j73j64J90K66m90J01m4
2653a755j69j03J4J73l12K30m74J06Q0J07L6m93O6J14l0j65J7N0K1k27L22j8j48
$$ plain form
2498 647 868 1047 1100 1042 1464 1048 1268 1359 1114 1540 1434 1738 1594 1706 1965 1783 1841 1856 1880 2139 2326 2038
2520 2038 2261 2003 2009 2427 2355 2162 2080 2146 1930 2252 2048 2188 2063 1854 1958 1810 2002 2184 1843 1535 1688
2541 1688 1863 1861 1778 1998 1389 1545 1585 1408 1678 1302 917 1110 1013 1197 1126 797 723 862 753 700 818 991
2563 991 784 231 -167 -11 313 278 565 57 58 569 64 26 100 -157 -412 -231 -160 28 -130 -145 -354 -461
2585 -461 -396 -172 -362 -165 -285 -501 -514 -625 -292 -385 -637 -525 -462 -513 -279 -531 -442 -813 -512 -317 -324 -495 -506
2608 -506 -731 -785 -464 -398 -405 -365 -452 -693 -850 -630 -724 -443 -890 -711 -811 -890 -866 -585 -526 -303 -667 -827 -475
2631 -475 -1092 -876 -986 -968 -1340 -1231 -931 -956 -1240 -1267 -1174 -1085 -1385 -1224 -1441 -1614 -1778 -1588 -1322 -1812 -1711 -1755
2653 -1755 -1924 -2027 -2013 -1840 -2152 -1922 -2396 -2290 -2210 -2103 -2067 -2560 -2494 -2380 -2410 -2575 -2558 -2508 -2487 -2714 -2392 -2410 -2558
2676b558j88m5Q1J80k89L0L07l31P1R9l66Q1K11R9k50L19k11K29n9O1o3j39N4
2699b677K97J24o3k90K93R5l6j29M13N8j1l27L62J34n4K54M4m04J45L52n2K40
2721a232Q4k74M01j86K22K15k57J5K14J00K10k01M58m66k18N91j79L15J12j49
2741b25J13l3L52k7J34j11J08k15KK48J52j03k56j00K68K78m3J4K6l30M85j64
2763E73j95K81m3l32L19O4j74M43k93P4k25J2N3K81m15k70K10P1l25J68M6M1k67
2786I7p4q9k02P0j54J15Q6k30k18L26m28J02k74j27r7J63j63J8k99j0j08L57k15
2809a354J5n64K9k09J26N6m08K51l08K63j25qJ59k08m40J71k63K40j27K01k20
2830b723J5j93K22Jk3j18j55L93j97O7k69M08J22j23K15O8K68l98K74j36M3M18
$$ plain form
2676 -2558 -2746 -2791 -2710 -2530 -2819 -2789 -2482 -2813 -2742 -2643 -3009 -2928 -2717 -2618 -2868 -2549 -2760 -2531 -2590 -2529 -2592 -2731 -2677
2699 -2677 -2380 -2256 -2319 -2609 -2316 -2221 -2257 -2386 -1973 -1915 -1926 -2253 -1891 -1757 -1811 -1557 -1513 -1917 -1772 -1420 -1472 -1232
2721 -1232 -1148 -1422 -1021 -1207 -985 -770 -1027 -1012 -798 -698 -488 -689 -231 -697 -915 -324 -503 -188 -76 -225
2741 -225 -112 -145 207 180 314 203 311 96 98 346 498 395 139 39 307 585 542 556 582 252 737 573
2763 573 378 659 616 284 603 667 493 936 643 717 492 504 557 838 423 153 363 434 109 277 323 364 97
2786 97 23 -66 -268 -198 -352 -237 -151 -381 -599 -273 -701 -599 -873 -1000 -1097 -934 -1097 -1079 -1378 -1388 -1496 -1139 -1354
2809 -1354 -1339 -1903 -1874 -2083 -1957 -1901 -2309 -2058 -2366 -2103 -2228 -2236 -2077 -2285 -2725 -2554 -2817 -2577 -2704 -2503 -2723
2830 -2723 -2708 -2901 -2679 -2678 -2701 -2819 -2974 -2581 -2778 -2711 -2980 -2572 -2450 -2573 -2358 -2290 -2022 -2420 -2146 -2282 -2239 -1821
2852a821J46k98j5J65Q8O14j23J86PJ75k70M80J76K88l06O3K28J57Q6K74J2J26
2874D38K5K86J77j28K70J02j46L43J25L4P9k34R6j92N37J50l74K81l08J66L66
2895B093O6l5j40j69K6l9j75N21m50J45k21o5qK00m03K44m77j7j09l1J41k83o46
2918A68jl5mK43m38l75k35K21K9n21n0l40M6j22m28J89q3l55j64j49q5j79M2m82
2942c108J87l91n2K37k37j70k29m0k35Q5J3Q8j02l33J46p0k29KP76o52j31o3L15
2965d193p8L33j60k71L70j1Q3N20m23M26m68J96O02j5K15k08K10L90K7K43q2j5
2987b309K85M1L98QK54L34J79j96K38L27M32j05N2L59K43J66J77J91J71l3K2K91
3009A525M29O7l69O40k7J38M32j61J39K04q3J36K95K7nJ79n6k5K35j8K70K2k96
$$ plain form
2852 -1821 -1675 -1973 -1988 -1823 -1735 -1121 -1244 -1058 -1051 -876 -1146 -666 -490 -202 -508 -445 -217 -60 26 300 312 438
2874 438 463 749 926 798 1068 1170 1024 1367 1492 1526 1605 1371 1467 1275 1812 1962 1588 1869 1561 1727 2093
2895 2093 2159 2124 1984 1815 1841 1802 1627 2148 1698 1843 1622 1557 1549 1749 1346 1590 1113 1096 987 956 1097 814 168
2918 168 167 132 128 371 -67 -442 -677 -456 -427 -948 -998 -1338 -1292 -1414 -1842 -1653 -1736 -2091 -2255 -2404 -2489 -2668 -2626 -3108
2942 -3108 -2921 -3312 -3364 -3127 -3364 -3534 -3763 -3803 -4038 -3953 -3940 -3852 -3954 -4287 -4141 -4211 -4440 -4438 -3662 -4314 -4445 -4508 -4193
2965 -4193 -4271 -3938 -4098 -4369 -3999 -4010 -3927 -3407 -3830 -3404 -3872 -3676 -3074 -3089 -2874 -3082 -2872 -2482 -2455 -2212 -2294 -2309
2987 -2309 -2024 -1983 -1585 -1577 -1323 -989 -810 -1006 -768 -441 -9 -114 -62 297 540 706 883 1074 1245 1212 1234 1525
3009 1525 1954 2021 1652 2292 2265 2403 2835 2674 2813 3017 2934 3070 3365 3392 3387 3566 3510 3485 3720 3702 3972 3994 3698
3032C698K20M54k69l8K3J55m73K17k79N52l45n0m09K88K32j66P8k45J99j5J39
3053C966l55J04l37Mn5k15K51j93J64j30m67K63m5k50L4j0j92k00L7m6J29J54
3075B611m77J10j26K02n65K21j6j07j3N2r9j8L00l32K01j65J04J73n51J55N09
3096B169l96jK15N3l96P0J93m0r6K95o9KJ30k1J64n0j14R8rK81K50J68k38l6K75
3121B897q6M4M34l5m93M48Nj01O09kl11j37O5M61j52L63l89J84J15K48j15R0r9
3144D043K55j25kl2J60l0J89R1k95L16k50J00j35n7P0r1K82m78L65k21j8j91Q6
3167D032j79J55q1l73J66l57J92j95l29J8l70L77j87r8j56J23l09k78K33n01q3
3188A800j91n1m0m3k88j91o0n60k64O6P6m31L08m97j55r2p9J50l37j65j41m25
$$ plain form
3032 3698 3918 4372 4103 4065 4088 4243 3770 3987 3708 4260 3915 3865 3456 3744 3976 3810 3888 3643 3842 3827 3966
3053 3966 3611 3715 3378 3382 3327 3112 3363 3170 3334 3204 2737 3000 2955 2705 2739 2729 2537 2337 2374 2328 2457 2611
3075 2611 2134 2244 2118 2320 1755 1976 1960 1853 1840 1892 1793 1775 2075 1743 1944 1779 1883 2056 1505 1660 2169
3096 2169 1773 1772 1987 2040 1644 1714 1907 1867 1771 2066 1997 1999 2129 2108 2272 2222 2108 2206 2197 2478 2728 2896 2658 2622 2897
3121 2897 2811 2855 3289 3254 2761 3209 3214 3113 3722 3720 3409 3272 3337 3798 3646 4009 3620 3804 3919 4167 4052 4142 4043
3144 4043 4298 4173 4171 4139 4299 4269 4458 4549 4254 4570 4320 4420 4285 4228 4298 4207 4489 4011 4376 4155 4137 3946 4032
3167 4032 3853 4008 3927 3554 3720 3363 3555 3360 3031 3049 2679 3056 2869 2771 2615 2738 2429 2151 2384 1883 1800
3188 1800 1609 1558 1518 1475 1187 996 936 376 112 178 254 -177 131 -366 -521 -613 -692 -542 -879 -1044 -1185 -1610
3210a610K39L1j47k75m16J11K99l53j98P1l47j89K72l08R3M1j89j89J19K25j97
3231b917L45m58J08J77j72R6J47k2O5R3p3%O28k55k10J70p9M28K15n32N25L06
3253a415K24R3L8k37J97R6J45K31K01j02L24k88K95K98j35J85J96K01O6m4K77
3274H46J55%n6Mm3K00M24k70K12p9J92j29O6l12K19P6j43J89l5k9R8m82J88M3
3298A334K65k66k36J21j86k74j7j21l9q7Q0k78n87K65k76j49j36l74j48K49j79
3319a039l04m65N3Ql13j66J99n21j91n5q3p8m64j36M08o75M6k45J68j62n01J84
3341d332J12k93j21N5n0l41j27K64m14N28o07K5n7%K75j66j55p5K3J73p3O2j27
3364e421L71l64J89l1O36M4j36kK7j81Q45J81l36k39N06K38k8L47j9M4j8K65K52
$$ plain form
3210 -1610 -1371 -1340 -1487 -1762 -2178 -2067 -1768 -2121 -2319 -2248 -2595 -2784 -2512 -2820 -2727 -2686 -2875 -3064 -2945 -2720 -2917
3231 -2917 -2572 -3030 -2922 -2745 -2917 -2821 -2674 -2696 -2631 -2538 -2611 -2611 -1983 -2238 -2448 -2278 -2357 -1929 -1714 -2246 -1721 -1415
3253 -1415 -1191 -1098 -1060 -1297 -1100 -1004 -859 -628 -427 -529 -205 -493 -198 100 -35 150 346 547 613 569 846
3274 846 1001 1001 945 949 906 1106 1530 1260 1472 1393 1585 1456 1522 1210 1429 1505 1362 1551 1516 1487 1585 1103 1291 1334
3298 1334 1599 1333 1097 1218 1032 758 741 620 581 494 574 296 -291 -26 -302 -451 -587 -961 -1109 -860 -1039
3319 -1039 -1343 -1808 -1755 -1747 -2060 -2226 -2027 -2548 -2739 -2794 -2877 -2955 -3419 -3555 -3147 -3822 -3776 -4021 -3853 -4015 -4516 -4332
3341 -4332 -4220 -4513 -4634 -4579 -4629 -4970 -5097 -4833 -5247 -4719 -5326 -5301 -5358 -5358 -5083 -5249 -5404 -5479 -5456 -5283 -5356 -5294 -5421
3364 -5421 -5050 -5414 -5225 -5256 -4620 -4576 -4712 -4714 -4687 -4868 -4023 -3842 -4178 -4417 -3911 -3673 -3701 -3354 -3373 -3329 -3347 -3082 -2830
3387b830M06K35k14J58K20L47J8J37rK13o3J63M66M00l12P9J59L95k4K27K05j00
3409B76O2K84L4J33mJ70L83n11K01K63P5J03O9o1O0K86j17K32k1j33l74K06L36
3432A952j40l49L91k6m34M81j21Qn37K87l66M61j61j29j97j2M1j36l0l74K87l03
3454E93l9k92O7K6k15m23Q5J35k66l32NQ6n44J12P2m46Q6k62k68J52l66L00p01
3477b435K72l76r2J79m70K70m30k9J15k92p7K19l19j29O5j14r7n4j22j97K68l00
3499d145j51N32m07J12j29o7K22k2j09K00p7J14q2m7L10k47J76q5P2Pl3O08k84
3522c532J94j51K91K43m02L48L45j23J49rR6K17o3L72J18k3K74L07P1j61J12K33
3544a094L10J40P4K03k11K16J92o4K56j4L49j31n8J16K08J7k20M40K58p9L28j17
$$ plain form
3387 -2830 -2424 -2189 -2403 -2245 -2025 -1678 -1660 -1523 -1532 -1319 -1382 -1219 -753 -353 -665 -586 -427 -32 -56 171 376 276
3409 276 338 622 656 789 785 955 1338 827 1028 1291 1366 1469 1538 1477 1537 1823 1706 1938 1917 1784 1410 1616 1952
3432 1952 1812 1463 1854 1828 1394 1875 1754 1762 1225 1512 1146 1607 1446 1317 1120 1108 1149 1013 983 609 896 593
3454 593 554 262 329 355 140 -283 -198 -63 -329 -661 -656 -570 -1114 -1002 -930 -1376 -1290 -1552 -1820 -1668 -2034 -1734 -2435
3477 -2435 -2163 -2539 -2631 -2452 -2922 -2652 -3082 -3111 -2996 -3288 -3365 -3146 -3465 -3594 -3529 -3643 -3740 -3794 -3916 -4113 -3845 -4145
3499 -4145 -4296 -3764 -4171 -4059 -4188 -4255 -4033 -4055 -4164 -3964 -4041 -3927 -4009 -4056 -3746 -3993 -3817 -3902 -3830 -3823 -3856 -3248 -3532
3522 -3532 -3338 -3489 -3198 -2955 -3357 -3009 -2664 -2787 -2638 -2647 -2551 -2334 -2397 -2025 -1907 -1930 -1656 -1349 -1278 -1439 -1327 -1094
3544 -1094 -784 -644 -570 -367 -578 -362 -170 -234 22 8 357 226 168 284 492 509 289 729 987 908 1236 1119
3566A119j75p2K41K95Kj55K10m93K38q8K19J71j47j97M7J66j20j59M8P2k07rM38
3589A444m14J04k3k49K12K59m63J30j24k13N9N6M6j97l56L03j08j65r7j92L71
3610C83k43O0P6j66O1j46J55j96J69j68P3j85L60n60L56Q6j9M1M4k40l4O9J71
3633A47J91k14J60J18m27P34N4l28J95j59J04mK84L07j54k44L46r4J55J94J03
3654A468p6J44j50N3L91l13K96K42j28Q4J00J43M3l53M64j37J31J14kJ42j81J90
3676B665l10M31N6j80J97l72M67q0K00j12j13N6j71J52M55k37m49J22l8P3m2O7
3698B837j55R0oK22l68J65j2j3l11j60K13k4J38l96k9J14m2k23J11o4P1Kl89k07
3722A564M47j81j60J81K6J13l52Q6j43J91k45K06L8P2k20l52L86P9j05j07J83
$$ plain form
3566 1119 944 872 1113 1408 1410 1255 1465 972 1210 1122 1341 1512 1365 1168 1215 1381 1261 1102 1150 1222 1015 1006 1444
3589 1444 1030 1134 1111 862 1074 1333 870 1000 876 663 722 778 824 627 271 574 466 301 204 12 383
3610 383 140 200 276 110 171 25 180 -16 153 -15 58 -127 233 -327 29 115 96 137 181 -59 -93 -24 147
3633 147 338 124 284 402 -25 709 763 435 630 471 575 571 855 1162 1008 764 1110 1016 1171 1365 1468
3654 1468 1392 1536 1386 1439 1830 1517 1813 2055 1927 2011 2111 2254 2297 1944 2408 2271 2402 2516 2514 2656 2475 2665
3676 2665 2355 2786 2842 2662 2859 2487 2954 2874 3074 2962 2849 2905 2734 2886 3341 3104 2655 2777 2739 2812 2770 2837
3698 2837 2682 2772 2766 2988 2620 2785 2773 2760 2449 2289 2502 2478 2616 2220 2191 2305 2263 2040 2151 2087 2158 2160 1771 1564
3722 1564 2011 1830 1670 1851 1877 1990 1638 1724 1581 1772 1527 1733 1771 1843 1623 1271 1657 1736 1631 1524 1707
3743A707Q3m82N14k39Jj46J03K40j63j28P5K27K0q1J06J44j69J7J15j30K5m7K44
3766B036O1k56M29j51j56J20r3K57j72l8M4n7K27k7j0j80p4J44j68L27j11j7K3
3789B158n1o5K38j79K87k67k07J84K08j65J24n8k84P3k22K71q8r7m13K49j67J79
3811A708Q8L6j71Ro4n4mo4m88q0R1L04k59K8nl89J27O0j22J1k79k05P9j14N9L3
3837C35k78N9j43q5q9J28j57j26k15J00Q5l1k70r4k18J10j56M8J02r7j84k51j4
3860a441n6K12m7k29k68N77l69k9L53j54l98K20L8J70P4k92j20k7J05k1K78r7
3882a521k98K65j04J51l89L18J94j76Q4L53j29k40K73l9l1K70J52j76J9K50L9
3903g35J23J71j18Q5N6L38k07K66K45q6k0J17J36J38K96l82J40K19j4N08k9M0
$$ plain form
3743 1707 1790 1308 1822 1583 1584 1438 1541 1781 1618 1490 1565 1792 1812 1731 1837 1981 1812 1829 1944 1814 1839 1792 2036
3766 2036 2097 1841 2270 2119 1963 2083 1990 2247 2075 2037 2081 2024 2251 2224 2214 2034 1960 2104 1936 2263 2152 2135 2158
3789 2158 2107 2042 2280 2101 2388 2121 1914 2098 2306 2141 2265 2207 1923 1996 1774 2045 1957 1860 1447 1696 1529 1708
3811 1708 1796 1832 1661 1670 1606 1552 1548 1484 996 916 1007 1311 1052 1080 1075 686 813 873 751 762 483 278 357 243 302 335
3837 335 57 116 -27 -112 -201 -73 -230 -356 -571 -471 -386 -417 -687 -781 -999 -889 -1045 -997 -895 -992 -1176 -1427 -1441
3860 -1441 -1497 -1285 -1332 -1561 -1829 -1252 -1621 -1650 -1297 -1451 -1849 -1629 -1591 -1421 -1347 -1639 -1759 -1786 -1681 -1702 -1424 -1521
3882 -1521 -1819 -1554 -1658 -1507 -1896 -1578 -1384 -1560 -1476 -1123 -1252 -1492 -1219 -1258 -1289 -1019 -867 -1043 -1024 -774 -735
3903 -735 -612 -441 -559 -474 -418 -80 -287 -21 224 138 118 235 371 509 805 423 563 782 768 1276 1247 1287
3925A287k30M18j94j18L93k84%n2N66k18K97j63j01K60l15k8J96J67J04J5k13
3946A787K19J13j75j0K6J67l10k0j30j11K26j68l55k6L34P8k54o90M76k42p9J52
3968A008r7m9j72q5k08J36l07Q9k31M1o0O7j64Kl55J0q9j66K2l4k5k1k65k7K98
3993f82m34J88k53k47J66j43O9q4j01J49ok97O3R6j33j22K81l06K75j6M3J13m41
4016a822K4L55R2l01k26K89j39K33o9P9K05m26K08J57j83K22n9j02J58k49k8M03
4038a179R4o1J54j41J70J96j59j02p4K11K75p9r2mO0Q6Q8k48K66N9l02mJ74P0
4062e42k43J01p5L17j90J51l8n77L60n9lM1J27k71J52k93J74Q1l6j2j67p0R1j74
4086a155K03j06k5j47j32J40k1k3jm9k66K1j30K39R6J59k35k40M36l57K40L1n9
$$ plain form
3925 1287 1057 1475 1281 1163 1556 1272 1272 1220 1786 1568 1865 1702 1601 1861 1546 1518 1714 1881 1985 2000 1787
3946 1787 2006 2119 1944 1934 1960 2127 1817 1797 1667 1556 1782 1614 1259 1233 1567 1645 1391 701 1177 935 856 1008
3968 1008 911 862 690 605 397 533 226 315 84 125 65 132 -32 -30 -385 -375 -464 -630 -608 -642 -667 -688 -953 -980 -682
3993 -682 -1116 -928 -1181 -1428 -1262 -1405 -1336 -1420 -1521 -1372 -1378 -1675 -1612 -1516 -1649 -1771 -1490 -1796 -1521 -1537 -1494 -1381 -1822
4016 -1822 -1798 -1443 -1351 -1652 -1878 -1589 -1728 -1495 -1564 -1485 -1280 -1706 -1498 -1341 -1524 -1302 -1361 -1463 -1305 -1554 -1582 -1179
4038 -1179 -1085 -1146 -992 -1133 -963 -767 -926 -1028 -1102 -891 -616 -695 -787 -791 -731 -645 -557 -805 -539 -480 -782 -786 -612 -542
4062 -542 -785 -684 -759 -442 -632 -481 -519 -1096 -736 -795 -798 -757 -630 -901 -749 -1042 -868 -787 -823 -835 -1002 -1072 -981 -1155
4086 -1155 -952 -1058 -1083 -1230 -1362 -1222 -1243 -1266 -1267 -1316 -1582 -1561 -1691 -1452 -1356 -1197 -1432 -1672 -1236 -1593 -1353 -1322 -1381
4109a381k7l38L70k97J17M2L8l14J27K67j65J65m79K08K35p2L44k67J1M0j68J67
4131a377o0lqK28j26K67m9J09k92J19K05j67K65J83p3j05k8j47K98J84j89rM6
4154g29L11l86K0K40l55M57j75j5L46n68K46J07L6k8j16R5j23K42l65J3P2M79
4176a96m12j12J9q7K59J09j90J38p8m76K29J17q8L17k84N5l5K3j11l46L36P4k20
4199i59L2j38j7J25k16m6K62j82k10K38m87K29j94J25J08p0Qk51J97R1j06k03
4221a664J17j20Q3j3J72m17L77m82L51j63k9j03L7j00K30M3j9j85k2K0P1j6q7
4244a919K12j60J45k96R3Q5M49l34N6N0k01K53J79P7L14m68K3n6L94J14k1J02
4266i09k7J3k04K80j18M02M11l08j17J23J16r9M43m20O55l13L25N4K11l91M25
$$ plain form
4109 -1381 -1408 -1746 -1376 -1673 -1556 -1514 -1476 -1790 -1663 -1396 -1561 -1396 -1875 -1667 -1432 -1504 -1160 -1427 -1416 -1376 -1544 -1377
4131 -1377 -1437 -1440 -1448 -1220 -1346 -1079 -1128 -1019 -1311 -1192 -987 -1154 -889 -706 -779 -884 -912 -1059 -761 -577 -766 -775 -729
4154 -729 -418 -804 -784 -544 -899 -442 -617 -632 -286 -854 -608 -501 -465 -493 -609 -514 -637 -395 -760 -747 -675 -196
4176 -196 -608 -720 -701 -788 -529 -420 -610 -472 -550 -1026 -797 -680 -768 -451 -735 -680 -715 -692 -803 -1149 -813 -739 -959
4199 -959 -927 -1065 -1082 -957 -1173 -1219 -957 -1139 -1349 -1111 -1598 -1369 -1563 -1438 -1330 -1400 -1392 -1643 -1446 -1355 -1461 -1664
4221 -1664 -1547 -1667 -1584 -1597 -1425 -1842 -1465 -1947 -1596 -1759 -1788 -1891 -1854 -1954 -1724 -1681 -1700 -1885 -1907 -1887 -1816 -1832 -1919
4244 -1919 -1707 -1867 -1722 -2018 -1925 -1840 -1391 -1725 -1669 -1619 -1820 -1567 -1388 -1311 -997 -1465 -1442 -1498 -1104 -990 -1011 -909
4266 -909 -936 -923 -1127 -847 -965 -563 -152 -460 -577 -454 -338 -437 6 -414 241 -72 253 307 518 127 552
4287E52k78M88J56j51K06J55N7j27J16k4J42L04r3J00r0J43Jj4J4K51J34m5J56
4310B153j15J35q1K6K40J99l82L42j20k00o7J93q5J75J05n3K6k39J28M3j26l52
4332A945L75K31l68k34J52j07N9L05l61j61k07m7M1J59j43j41j0j89r9k37R7j28
4354I32K4k1j11l13m0J97l13jk31J94J94k39j90l7j38l43M08j70j64J14M2p4j80
4377d60K10k54mj92M17r5l9n32L27l53L09KK34j88J67L5j7k16m6NM37l30k17L04
4401d96K3N16k49o2R2M01m31o5M87l63L09J4mJ73N76l40k6k10K55K66j23o4M35
4424A114l50M15J83M3j24k98L83j22L95j63k1j23K53k64m0M86J50q3m0O2j06J77
4446A927j58K6K64n6J29Lj65O8n7K00n8l83N04l34Q8M5l36K4L88k58j0j4%l30
$$ plain form
4287 552 274 762 918 767 973 1128 1185 1058 1174 1150 1292 1596 1503 1603 1513 1656 1657 1643 1657 1908 2042 1997 2153
4310 2153 2038 2173 2092 2118 2358 2557 2175 2517 2397 2197 2130 2323 2238 2413 2518 2465 2491 2252 2380 2423 2297 1945
4332 1945 2320 2551 2183 1949 2101 1994 2053 2358 1997 1836 1629 1582 1623 1782 1639 1498 1488 1299 1200 963 1060 932
4354 932 956 935 824 511 471 668 355 354 123 317 511 272 82 45 -93 -436 -28 -198 -362 -248 -206 -280 -460
4377 -460 -250 -504 -508 -700 -283 -378 -417 -949 -622 -975 -666 -664 -430 -618 -451 -416 -433 -649 -695 -690 -253 -583 -800 -496
4401 -496 -473 43 -206 -268 -176 225 -206 -271 216 -147 162 176 172 345 921 581 555 345 600 866 743 679 1114
4424 1114 764 1179 1362 1405 1281 983 1366 1244 1639 1476 1455 1332 1585 1321 1281 1767 1917 1834 1794 1856 1750 1927
4446 1927 1769 1795 2059 2003 2132 2135 1970 2038 1981 2181 2123 1740 2244 1910 1998 2043 1707 1731 2119 1861 1851 1837 1837 1507
4470A507L81p6LP6k68J33j71K34k01Q5k10Q6j51j32k7k4N0k3k7k5j30J83k25j13
4494I35j59M35l11p4K41l46rL5M6j16k25j46K67J75l65L43K89k74o18L05K46N
4516F79q9k54N4j11J77n3j44j03k31K77k43M60k80J27j28j78N5o1p8K59j99P3
4538Ik3k98J41K39l83j66J88j66P2M43n32K5J46j09L28l95Pj12K86m0j80kJ26
4561c96o1L45m54j77K59k02N3Mj29K78k92J01j8J57l8J88q2mO9j03pl91K92L08
4585c00k30M6L73jk55j69K86j33L94l44P2j07K62p1J30o9j98J61M4J86O4j06k71
4608b36L43K01j31o5K30l0N7l39N34l7l03M42o04M81Q9k51J89J75j91k12J55M46
4630I43l41J94k19j8j59N3K51j1j81K02l2j8k09j09L78j56k56L50k74J46k94p2
$$ plain form
4470 1507 1888 1812 1815 1891 1623 1756 1585 1819 1618 1703 1493 1579 1428 1296 1269 1245 1295 1272 1245 1220 1090 1273 1048 935
4494 935 776 1211 900 826 1067 721 712 747 793 677 452 306 573 748 383 726 1015 741 123 428 674 679
4516 679 590 336 390 279 456 403 259 156 -75 202 -41 419 139 266 138 -40 15 -46 -124 135 -64 9
4538 9 -14 -312 -171 68 -315 -481 -293 -459 -387 56 -476 -451 -305 -414 -86 -481 -474 -586 -300 -340 -520 -522 -396
4561 -396 -457 -112 -566 -743 -484 -686 -633 -629 -758 -480 -772 -671 -689 -532 -570 -382 -464 -468 -399 -502 -509 -900 -608 -300
4585 -300 -530 -484 -111 -112 -367 -536 -250 -383 11 -333 -261 -368 -106 -177 -47 -116 -314 -153 -109 77 141 35 -236
4608 -236 107 308 177 112 342 312 369 30 564 527 224 666 62 543 632 381 570 745 554 342 497 943
4630 943 602 796 577 559 400 453 704 693 512 714 682 664 455 346 724 568 312 662 388 534 240 168
4652A68R0K08L7L6n7j41J44m10L00r7j1M4j89O4J53j7l26K6j41q8M44k29O8Q6
4676A62k22j65k5m2L36j76j92J03n6k8M8L0n05M64l22K78j61l0J66l18L22j66
4698d99k20M2o9j37J62k53K03K39j72k39K16r3n3k26J56J90m18K47L01n11K13
4719i21k57K41J51j78j2j68j0K31m35J69K33J63q8l14K38k79Q1K01j74q6J23J5
4741a076k84L15J3l55K56j79J39j83J46J67l66Pp2L88j58J05l2r3j38R7M1j60
4763a422K14N3r5j84K55j46K31l93k6O8K70j20K0P5m60L20J38K9j25r3Q4K62k20
4786a265j58K88R5O8k63j18J82mj19k4J15j24K12j08J96r5r3M3J7J95k22N2J10
4809a020j56N4j13N45n47J69M63j99j05J83j97J97Q4l48L58N1P6j51J25k79M41
$$ plain form
4652 168 258 466 503 539 482 341 485 75 375 278 267 311 122 186 339 322 -4 22 -119 -207 237 8 76 162
4676 162 -60 -225 -250 -292 44 -132 -324 -221 -277 -305 -257 -227 -732 -268 -590 -312 -473 -503 -337 -655 -333 -499
4698 -499 -719 -677 -746 -883 -721 -974 -771 -532 -704 -943 -727 -820 -873 -1099 -943 -753 -1171 -924 -623 -1134 -921
4719 -921 -1178 -937 -786 -964 -976 -1144 -1154 -923 -1358 -1189 -956 -793 -881 -1195 -957 -1236 -1155 -954 -1128 -1214 -1091 -1076
4741 -1076 -1360 -1045 -1032 -1387 -1131 -1310 -1171 -1354 -1208 -1041 -1407 -1400 -1472 -1084 -1242 -1137 -1169 -1262 -1400 -1303 -1262 -1422
4763 -1422 -1208 -1155 -1250 -1434 -1179 -1325 -1094 -1487 -1513 -1445 -1175 -1295 -1275 -1200 -1660 -1340 -1202 -1173 -1298 -1391 -1307 -1045 -1265
4786 -1265 -1423 -1135 -1040 -972 -1235 -1353 -1171 -1175 -1294 -1318 -1203 -1327 -1115 -1223 -1027 -1122 -1215 -1172 -1155 -960 -1182 -1130 -1020
4809 -1020 -1176 -1122 -1235 -690 -1237 -1068 -605 -804 -909 -726 -923 -726 -642 -990 -632 -581 -505 -656 -531 -810 -369
4830c69k29Kk5R3j47jM16k78Q2j5J96j90K85k3r2J85j48p1r3J47J54L26k28j21
4854a44r2J34Q6j66j1K7J33J70n1Nl1N2j16k44M82j67l2K13k22j65M56j77j5K6
4878A51n46L1K53J06J23l05Q0o5K52k13N6j15K17k42J51l20Q0J82l44K98j01L87
4900A16l16mk89K13J75r1Q7k41j56r1J95K4J13j62L22m02p3N8N58p10L12J04m33
4923f91K39mq7L16k23j03K75k02k3L57j48l21K75n5L12p3l53J88K27q0j03J18
4945a59o0pJ10p4K05K0j29j73J04J63m9J97l13J52J91o8QJ57n2J47K3j55J15P9
4969D32J28r7j61J49J03k52K42K19l31J23o9j56J82K18j42n7R1k0M4L34k42QJ78
4992I24m38j00L44J07j01K02l85N1j64M71K9n8l92R5l3J31K32l17J40J25k74M5
$$ plain form
4830 -369 -598 -596 -621 -528 -675 -676 -260 -538 -456 -471 -275 -465 -180 -203 -295 -110 -258 -329 -422 -275 -121 205 -23 -144
4854 -144 -236 -102 -16 -182 -193 -166 -33 137 86 91 60 112 -4 -248 234 67 35 248 26 -139 317 140 125 151
4878 151 -395 -364 -111 -5 118 -187 -107 -172 80 -133 -77 -192 25 -217 -66 -386 -306 -124 -468 -170 -271 116
4900 116 -200 -204 -493 -280 -105 -196 -109 -350 -506 -597 -402 -378 -265 -427 -105 -507 -580 -522 36 -674 -362 -258 -691
4923 -691 -452 -456 -543 -227 -450 -553 -278 -480 -503 -146 -294 -615 -340 -395 -83 -156 -509 -321 -94 -174 -277 -159
4945 -159 -219 -226 -116 -190 15 35 -94 -267 -163 0 -49 148 -165 -13 178 110 118 275 223 370 393 238 353 432
4969 432 560 463 302 451 554 302 544 763 432 555 486 330 512 730 588 531 622 602 646 980 738 746 924
4992 924 486 386 730 837 736 938 553 604 440 911 940 882 490 585 552 683 915 598 738 863 589 634
5014F34Q0k35L95k63Q4n5k34K70J18k43L44l9p6J07m04J29L0K8j91j1L01l99L26
5037F96K3K94l55J26o9k10K72r5OK28k4j86j25N9P3m0P0j4L1J15J64k18L8P1l46
5062E84L98k85K80Q7l47J80J95l60P0k04N87n11R2J00K26j58j02M04k22p0J15
5083A059n8n4M9j68J48O5j93k5J0K69j51J7m1j49L84k26j93m9j28M3K71n01L44
5106G23k73L05j43r6J97j24k06K12J46q0N2k30m64L22Q0L5q8j07k1j37R6J78l15
5129F2J58j9R0l25j74K79J39n8k14J04n0J88mp3l6o2k3M5qJ33k10L18j70Qj15
5154a7J23M1k5j12L35k50n3L9j36L2L14l7j47L76k9m38K02J41JO7m5L2K23n1J25
5179G11j42m2L7j26M64j67M5j33p2K37O8k4j18K23J63k08NJ7p5k1P9K37N4J51
$$ plain form
5014 634 714 479 874 611 695 640 406 676 794 551 895 856 780 887 483 612 642 670 479 468 769 370 696
5037 696 719 1013 658 784 715 505 777 682 688 916 892 706 581 640 713 673 743 729 760 875 1039 821 859 930 584
5062 584 982 697 977 1064 717 897 1092 732 802 598 1185 674 766 866 1092 934 832 1236 1014 944 1059
5083 1059 1001 947 996 828 976 1041 848 823 833 1102 951 968 927 778 1162 936 743 694 566 609 880 379 723
5106 723 450 755 612 516 713 589 383 595 741 661 713 483 19 341 421 456 368 261 240 103 199 377 62
5129 62 220 201 291 -34 -208 71 210 152 -62 42 -8 180 176 103 67 5 -18 27 19 152 -58 260 90 98 -17
5154 -17 106 147 122 10 345 95 42 81 -55 -23 291 254 107 483 454 16 218 359 360 427 382 414 637 586 711
5179 711 569 527 564 438 902 735 780 647 575 812 880 856 738 961 1124 916 921 938 863 842 921 1158 1212 1363
5203A363l24R8Q8l49R3K37L0j12J89n58K59J53k77L01jj52j14Q6J62k12J56nJ83
5226A294o48J95M4L28k47j01m11K06K40k27j89n2K58k77j54R7j24J98n2l74P0
5247G4R6N9k44Q3k49J25j10R5k12J18k22j50J17j81K3j53R8l29N08k08j90J89
5269f63M6k87N0j22k77K79j57k9j53M50j79k03J17j27K15n8k12J18O3J05n69N30
5291a063pk3k63J91j33l8l9J33M3k22M5q4K70m6J94k37K91n1k51K66R0l43K58
5314a019k5R2J57k57J29p9j23L10o7L22m37M33k20J88k39J7%l7J23j13j57N81
5336d21j07l33L17k54R4J04J71m07L91l44L24j11J12r0O7l6pL30l08P7k32J84
5358d79P0P2j73N29l75J38j62k55M84k96K74Pl45N37m76M27j99q4M0KL1K8P0o1
$$ plain form
5203 1363 1039 1137 1225 876 969 1206 1236 1124 1313 755 1014 1167 890 1191 1190 1038 924 1010 1172 960 1116 1111 1294
5226 1294 646 841 885 1213 966 865 454 660 900 673 484 432 690 413 259 356 232 430 378 4 74
5247 74 170 229 -15 68 -181 -56 -166 -71 -283 -165 -387 -537 -420 -601 -578 -731 -633 -962 -454 -662 -852 -663
5269 -663 -617 -904 -854 -976 -1253 -974 -1131 -1160 -1313 -863 -1042 -1245 -1128 -1255 -1040 -1098 -1310 -1192 -1129 -1024 -1593 -1063
5291 -1063 -1070 -1093 -1356 -1165 -1298 -1336 -1375 -1242 -1199 -1421 -1376 -1460 -1190 -1236 -1042 -1279 -988 -1039 -1290 -1024 -934 -1277 -1019
5314 -1019 -1044 -952 -795 -1052 -923 -1002 -1125 -815 -882 -560 -997 -564 -784 -596 -835 -818 -818 -855 -732 -845 -1002 -421
5336 -421 -528 -861 -544 -798 -704 -600 -429 -836 -445 -789 -465 -576 -464 -554 -487 -523 -530 -200 -508 -431 -663 -479
5358 -479 -409 -337 -510 19 -356 -218 -380 -635 -151 -447 -173 -166 -511 26 -450 -23 -222 -306 -266 -264 -233 -205 -135 -196
5382a96j59K74J17m45j31L13j40J0R3O3L7J37k59J41P5J04r6j95K85m8K1k50j7
5405b66l8L92j78j12K49k38n5J12j37R8J32J2o6j83K09o9Q9J02j58J63k06J58
5427A0k09K14j08L69p3l09L5k85K87J48r6Nj53K92l6j89K2jK54n18L64R3j5k09
5451a08P5Nm1j41M3K6K81m33K51k89M47j76k72K54k77j08M11j30nj43K92j34j2
5474a84j06Q5L5k84R4R1N5J66j13J07Q0P5m57p3L81j70Nj2j81J36M60n60K11j
5498a60m15k3K29j55L43J43k18j8k90J95J84N3o9J8j45N3k45K66k47J82j9J33
5520b05J03j89R0J9j11K58k91J20K71k92k3L76k06L0J25j31j33r4K55J90k07j59
5542b04O1O2L0J69j44K36J64j51j51o5J3J66q2J20J4l6M3R0o4j00O8j81K26p9
$$ plain form
5382 -196 -355 -81 36 -409 -540 -227 -367 -357 -264 -201 -164 -27 -286 -145 -70 34 -62 -257 28 -20 1 -249 -266
5405 -266 -304 88 -90 -202 47 -191 -246 -134 -271 -173 -41 -29 -95 -278 -69 -138 -49 53 -105 58 -148 10
5427 10 -199 15 -93 276 203 -106 -71 -356 -69 79 -17 -12 -165 127 91 -98 -76 -77 177 -341 23 116 101 -108
5451 -108 -33 -28 -69 -210 -167 -141 140 -293 -42 -331 116 -60 -332 -78 -355 -463 -52 -182 -187 -330 -38 -172 -184
5474 -184 -290 -205 -170 -454 -360 -269 -214 -48 -161 -54 26 101 -356 -429 -48 -218 -213 -225 -406 -270 190 -370 -159 -160
5498 -160 -575 -598 -369 -524 -181 -38 -256 -274 -564 -369 -185 -132 -201 -183 -328 -275 -520 -254 -501 -319 -338 -205
5520 -205 -102 -291 -201 -182 -293 -35 -326 -206 65 -227 -250 126 -80 -50 75 -56 -189 -283 -28 162 -45 -204
5542 -204 -143 -81 -51 118 -26 210 374 223 72 7 20 186 104 224 238 202 245 335 271 171 239 58 284 205
5566B05r3k99M84m2k94L63j68L49J7k94j18M40r0k55K92J19j14j37K84l72J00
5587C77N6J83J28k65J38n1R6j5R3o4n8N9JJ62k54k9N63k06m01K75j90L65k28P3
5611H08K87l79J94l11J96R7j13j62K98q7N9k80r5Q3K76N7k21j9l01J00K35k30
5633D92Q7j33K43k80K22k37o9p9k68j05N95k91J79j95J11l07N6k63k5J95k80J50
5655b02o1k19K38k42L08m08mJ82q6M0k67oj18J92j18L5Rj27kk65P3o7Q7p4k44
5680a346L32j69K56k90k26L45l94K84P5j92j58L38j12q8J53M1J14l48L23j83J5
5701a230Nk9o6O6M4J46K17j18O8j01p2M04m8p1J04J02p7K41r0m10M49k7j65O37
5725b1k94K31k05K36N8o3L59J46P9n93K64K72k75M87n47K52Q1N25n10P5K52k33
$$ plain form
5566 205 112 -187 297 255 -39 324 156 505 522 228 110 550 460 205 497 616 502 365 649 277 377
5587 377 433 616 744 479 617 566 662 647 740 676 618 677 678 840 586 557 1120 914 513 788 598 963 735 808
5611 808 1095 716 910 599 795 892 779 617 915 828 887 607 512 595 871 928 707 688 387 487 722 492
5633 492 579 446 689 409 631 394 325 246 -22 -127 468 177 356 161 272 -35 21 -242 -267 -72 -352 -202
5655 -202 -263 -482 -244 -486 -178 -586 -590 -408 -494 -454 -721 -727 -845 -653 -771 -736 -727 -854 -856 -1121 -1048 -1115 -1028 -1102 -1346
5680 -1346 -1014 -1183 -927 -1217 -1443 -1098 -1492 -1208 -1133 -1325 -1483 -1145 -1257 -1345 -1192 -1151 -1037 -1385 -1062 -1245 -1230
5701 -1230 -1225 -1254 -1320 -1254 -1210 -1064 -847 -965 -897 -998 -1070 -666 -714 -785 -681 -579 -656 -415 -505 -915 -466 -493 -658 -21
5725 -21 -315 -84 -289 -53 5 -58 301 447 526 -67 197 469 194 681 134 386 467 992 482 557 809 576
5747E76L07j00L06m22l6M28K28m45l1RQ4R0J61J6n41J19M72r9l10L1J75p1L5J61
5771A143K05m3n94l9L46j58L06k53k58J37J08m7p7j31j18r3J09l06J97J00J45
5792F79j73j42L80p43J87J89l63J18J56k52j47M78n07J82o8Q9j45j66J32l05K78
5813a43m52K52l4j79j33L02k04K2p1L16k84J02lj51Q9j58m8N9p2P3J00p0J2R8
5837e77j49q1J1R6j03J11J37K5r5k6R6K02n01O38j92l04J44Q7r9M4Q7r8J00J79
5861b68p5j20J12j46l7M72j08m2K48p0j50o8O03m55k27j00M03pl23K68N1l4l15
5884c88N61k20l57J72K80k84l7O3k8p7m4p6J04M07j46Rm14J60m1K38l11L71P6
5907A8o3j75l9L13k28n7m9K50m12L20J98k21k55J67j1r3K05k36j61K72J5j97j3
$$ plain form
5747 576 883 783 1089 667 631 1059 1287 842 811 820 904 994 1155 1171 630 749 1221 1122 812 843 1018 947 982 1143
5771 1143 1348 1305 711 672 1018 860 1166 913 655 792 900 853 776 645 527 434 543 237 434 534 679
5792 679 506 364 744 1 188 377 14 132 288 36 -111 367 -140 42 -26 63 -82 -248 -116 -421 -143
5813 -143 -595 -343 -377 -556 -689 -387 -591 -569 -640 -324 -608 -506 -509 -660 -571 -729 -777 -718 -790 -717 -617 -687 -675 -577
5837 -577 -726 -807 -796 -700 -803 -692 -555 -530 -625 -651 -555 -353 -854 -216 -408 -712 -568 -481 -580 -536 -449 -547 -447 -268
5861 -268 -343 -463 -351 -497 -534 -62 -170 -212 36 -34 -184 -252 351 -104 -331 -431 -28 -35 -358 -90 -39 -73 -388
5884 -388 173 -47 -404 -232 48 -236 -273 -210 -238 -315 -359 -435 -331 76 -70 -61 -475 -315 -356 -118 -429 -58 18
5907 18 -45 -220 -259 54 -174 -231 -280 -30 -442 -122 76 -145 -400 -233 -244 -337 -132 -368 -529 -257 -242 -439 -452
5930d52R7Q3k67O18q3n36np6O9K76k97J6L29k06J89P8j79j01R4L73m6k06r6K25
5954a03J07l01R3j09K16J3k57J27J53r6J29K71R1n01K07L8k17J4M50j99j16Q6
5976I6p1J2J87K3p7K37m9o6K01J22k10j99J2m5J24M6r5J88p9j29L67k52l9P9j40
6001B43K66k8k5N7j95L22k93J58l22L07J00j61p1K94k69m0l8l05M41k81M18l4
6023E44O0j9j15L1o0N4J22m3nm35R3KJ16pJ10k65K24j43K11k1k8K2k67L44k34
6048B91j0K8J03m7k33J60J13k78K07k24K40J78m20J74L11j43k04k06j04L26o9
6069A93l1K06j05J12j69J40j5l32L14O6p3Q9K64k24K73m38J49K50j46Q2P3l16
6091C62P4J45j8J32j42j27pK60L7k00n1J34Qp6K50j1Om2L5K8K25j97j71L16p7
$$ plain form
5930 -452 -355 -272 -539 79 -4 -540 -545 -621 -552 -276 -573 -557 -228 -434 -245 -167 -346 -447 -353 20 -26 -232 -328 -103
5954 -103 4 -297 -204 -313 -97 -84 -341 -214 -61 -157 -28 243 334 -167 40 78 -139 -125 325 126 10 96
5976 96 25 37 224 247 170 407 358 292 493 615 405 206 218 173 297 343 248 436 357 228 595 343 304 383 243
6001 243 509 481 456 513 318 640 347 505 183 490 590 429 358 652 383 343 305 0 441 160 578 544
6023 544 604 585 470 501 441 495 617 574 569 134 227 229 345 338 448 183 407 264 475 454 426 448 181 525 291
6048 291 281 309 412 365 132 292 405 127 334 110 350 528 108 282 593 450 246 40 -64 262 193
6069 193 162 368 263 375 206 346 331 -1 313 379 306 395 659 435 708 270 419 669 523 605 678 362
6091 362 436 581 563 695 553 426 419 679 716 516 465 599 607 531 781 770 776 734 769 797 1022 825 654 970 893
6116H93j92K33JK1k3m61K05M03l30R9J07o2L22l72J16J73l86L46J45l98R4J1J5
6139I60l16K58R9Nm14M08l44L82j21j96M21l61Q4j0l17J88J13N7Q9k22nK16m03
6162E71K35l00K6K09k62K33l85J21j82q8J81q8M82p30k6p2L56r1k46q8k58J26
6184b76P0j47k19LJ20oK9J08k40On9p6J87l25M0l1o8R1J25l65Q9l5Q9k35J15k4
6210a034j52n7j53J95M5j6k35M31k07k65K2K46k14J6N1m9K57p1l03K57k03N59
6232h80k36k76J9J56O3J60k3K64l20m2K56j53J34j22K13N0J31l64K91K61k39J30
6254e27l2N18n04L59j66J96k86L47j1n1K03l08K40RK01R7L2K74l15K8J04p8l12
6277A8N75m2M5q6L0L0J45j91R6J31J56m32J86j9J32K90l18O9k04J94j89q1K65
$$ plain form
6116 893 701 934 935 956 933 472 677 1080 750 849 956 894 1216 844 960 1133 747 1093 1238 840 934 945 960
6139 960 644 902 1001 1006 592 1000 656 1038 917 721 1142 781 865 855 538 726 839 896 985 763 758 974 571
6162 571 806 506 532 741 479 712 327 448 266 178 359 271 753 23 -3 -75 281 190 -56 -144 -402 -276
6184 -276 -206 -353 -572 -569 -449 -455 -426 -318 -558 -552 -611 -687 -500 -825 -785 -816 -884 -793 -668 -1033 -944 -979 -890 -1125 -1010 -1034
6210 -1034 -1186 -1243 -1396 -1201 -1156 -1172 -1407 -976 -1183 -1448 -1426 -1180 -1394 -1378 -1327 -1376 -1119 -1190 -1493 -1236 -1439 -880
6232 -880 -1116 -1392 -1373 -1217 -1154 -994 -1017 -753 -1073 -1115 -859 -1012 -878 -1000 -787 -737 -606 -970 -679 -418 -657 -527
6254 -527 -559 -41 -545 -186 -352 -156 -442 -95 -106 -157 46 -262 -22 -13 188 285 317 591 276 304 408 330 18
6277 18 593 551 596 510 540 570 715 524 620 751 907 475 661 642 774 1064 746 815 611 805 616 535 800
6300H00M2m8j66J51j00N2k04J69j80o5Q8m05L34K08l65l2j62L13j31k14m2O7j15
6323eJ05j28jK19l47l17J66l7M3j28Q5q1o7k71L13j85k70K90J54m80J10m41K42
6346a031k0n4R0l6l7K26k90K8j34J41l56J60J27L6l3K2Lm7p9J84R2l1J2p9Mo1
6372a163K39l24J44K31k09Q3J75k61M28k12J58k70Q6m1J36l8K7j57L35pL96k25
6394d69L0L57l95l15K92L28j02k7J44J6k32O39n56L95j23j25M39j38K71k08J22
6415C43p7k85K10N7J17R2K28n64K16J62j04l49M52j96O4p4M0%R0j95Q9L24j07
6438E33o4k41K07l8j00j94L26K1k42o4l08K86J90J07k28k78k09N29j69p5j29M37
6460B97k67k65K15K6l2k41K75l55Q0N9P4m4j66nj08J40K90k41q1O9j83K30k08
$$ plain form
6300 800 842 794 628 779 679 731 527 696 516 451 539 134 468 676 311 279 117 430 299 85 43 110 -5
6323 -5 100 -28 -29 190 -157 -474 -308 -345 -302 -430 -345 -426 -493 -764 -451 -636 -906 -616 -462 -942 -832 -1273 -1031
6346 -1031 -1051 -1105 -1015 -1051 -1088 -862 -1152 -1124 -1258 -1117 -1473 -1313 -1186 -1150 -1183 -1161 -1158 -1205 -1284 -1100 -1008 -1039 -1027 -1106 -1102 -1163
6372 -1163 -924 -1248 -1104 -873 -1082 -999 -824 -1085 -657 -869 -711 -981 -895 -936 -800 -838 -811 -968 -633 -640 -244 -469
6394 -469 -439 -82 -477 -792 -500 -172 -274 -301 -157 -141 -373 266 -290 105 -18 -143 296 158 429 221 343
6415 343 266 -19 191 248 365 457 685 121 337 499 395 46 498 302 366 292 332 332 422 227 316 640 533
6438 533 469 228 435 397 297 103 429 450 208 144 -164 122 312 419 191 -87 -296 233 64 -11 -140 297
6460 297 30 -235 -20 6 -26 -267 8 -347 -267 -208 -134 -178 -344 -349 -457 -317 -27 -268 -349 -280 -463 -233 -441
6483d41J90j28j35P2J53n0n9j21l36N20P8L13k89Q5j55L47l46L4J21q9J38m4J66
6506B4m78L75m5L00j98j05L93j37j6j27K25K23m03J47OJ89j31p0K45j81K38n4
6528D20j06K58j99q4L24m16J0L69j32kJ68ml03J23r4Mj71J55P7j38k59J80J91
6551C71l56K75J31k2k41m9j9O9j32L63o11L59k5k52L31j82l08J91K53k80J75%
6573D1j74k04r6J58K1qj3O3l99K71K3j79J89J73m24J02OJ59k89P0J21l3r5m9R2
6598d74o2J95j65m4j0M8J40k22j94J98k3K0LJ95Q2j13M48j83p0J88k88R8J68j80
6622b45n2O00j42k30L0O5n0n2J22rO2k03M84j29q8L7o0L52k75Q0R5Kj1J15m1K29
6648F86j97n5q1M09j91L19N1j33J48o72P05l95L15j72n3M9J44n1K0K55n02J07
$$ plain form
6483 -441 -251 -379 -514 -442 -289 -339 -398 -519 -855 -335 -257 56 -233 -148 -303 44 -302 -268 -147 -236 -98 -142 24
6506 24 -454 -79 -124 176 -22 -127 266 129 113 -14 211 434 31 178 184 373 242 172 417 236 474 420
6528 420 314 572 373 289 613 197 207 576 444 442 610 606 303 426 332 336 165 320 397 259 0 180 371
6551 371 15 290 421 399 158 109 90 159 27 390 -221 138 113 -139 192 10 -298 -107 146 -134 41 41
6573 41 -133 -337 -433 -275 -254 -262 -275 -212 -611 -340 -317 -496 -307 -134 -558 -456 -450 -291 -580 -510 -389 -422 -517 -566 -474
6598 -474 -536 -341 -506 -550 -560 -512 -372 -594 -788 -590 -613 -593 -590 -395 -313 -426 22 -161 -231 -43 -331 -233 -65 -245
6622 -245 -297 303 161 -69 -39 26 -24 -76 46 37 99 -104 380 251 163 200 140 492 217 297 392 394 383 498 457 686
6648 686 489 434 353 762 571 890 941 808 956 284 989 594 909 737 684 733 877 826 846 1101 599 706
6670G06J51K96j53j05l90L35N5p1P4j0J30r5l53O36m17J14Jp4J69j59L36n39j45
6693D92K56Mk41L17J12k01j20J00m62L25M23j8j83k28J63m3j6J9l83L35l4L8j63
6716D92J2K56n6j59M4j97j11K63j19l2L57m11J42o3M9l0l65M35j11Qj31J51l52
6739G2j22L03Mj09O9Q4O3j01j95m2J4L07j83J72O7n7q2j83JL78j30j17J08l76
6763e5L7j49J33M88o54M20j35j19J73K24l35J71L0j92P1k3J75Pj48K60O4l21J39
6786B61n5j80J57p6L26K8l45m9M10k75m5L19m02qJ22j32K09l04n0qN13k92OL77
6810E07m92K49n3j24K45J19j18o33P19n0m0J3J12k69k95K09J06m8j99N34o21J25
6832doJ07n1K05j37k47o3L5j78K82J87k11J07J97q2j07k41K54j78R8m6P5m2j67
$$ plain form
6670 706 857 1153 1000 895 505 840 895 824 898 888 1018 923 570 1206 789 903 904 830 999 840 1176 637 492
6693 492 748 752 511 828 940 739 619 719 257 582 1005 987 804 576 739 696 680 699 316 651 617 655 492
6716 492 504 760 704 545 589 392 281 544 425 393 750 339 481 418 467 437 72 507 396 404 273 424 72
6739 72 -50 253 257 148 217 301 364 263 68 26 40 347 164 336 403 346 264 81 82 460 330 213 321 -55
6763 -55 -18 -167 -34 454 -200 220 85 -34 139 363 28 199 229 37 108 85 260 267 119 379 443 122 261
6786 261 206 26 183 107 433 461 116 67 477 202 157 476 74 66 188 56 265 -39 -89 -97 416 124 130 507
6810 507 15 264 211 87 332 451 333 -300 419 369 329 342 454 185 -110 99 205 157 -42 492 -129 -4
6832 -4 -10 97 46 251 114 -133 -196 -161 -339 -57 130 -81 26 223 141 34 -207 47 -131 -33 -79 -4 -46 -213
6856b13K53m13K45J1P4m4O4k06j81J63j68L4M65p07L17p2O7k2K8m67K50m7M10
6879a59l64O2k21J03j53K27j69L25l73J74L1l46M21k87q5N0K27k81J24j28j60
6900i82K46J0l00K49JN2r9m7o0j10M00l34J24j71L06j93K4L36l20K10k80P4j15
6923i79R3Q4k35P0K26j10J34o3k6j87K79p4k24M17l12K26N9j99J71J50m42L56
6945e86k06k2M46j44l41L93m14K72M4J79K6J41l19j01M47k78K12pj08l91N18j57
6967c96K1M8K33l0k39K76N7l8k65K63j67L30j71J48Q8r7J22j66j00K47O9m3M5
6990B35l93J43J29j83K5L62j9J22k12MJ38q1m0J5J87j09K23l04j69J32J17l09
7012A3K12l4mj0L99o79L16j3K05j09j53O0l3J00Pj48K41j50k24P4J73n5J86R1
$$ plain form
6856 -213 40 -373 -128 -117 -43 -87 -23 -229 -410 -247 -415 -381 84 -623 -306 -378 -311 -333 -305 -772 -522 -569 -159
6879 -159 -523 -461 -682 -579 -732 -505 -674 -349 -722 -548 -517 -863 -442 -729 -814 -764 -537 -818 -694 -822 -982
6900 -982 -736 -726 -1026 -777 -776 -724 -823 -870 -930 -1040 -640 -974 -850 -1021 -715 -908 -884 -548 -868 -658 -938 -864 -979
6923 -979 -886 -802 -1037 -967 -741 -851 -717 -780 -806 -993 -714 -788 -1012 -595 -907 -681 -622 -821 -650 -500 -942 -586
6945 -586 -792 -814 -368 -512 -853 -460 -874 -602 -558 -379 -353 -212 -531 -632 -185 -463 -251 -258 -366 -757 -239 -396
6967 -396 -375 -327 -94 -124 -363 -87 -30 -68 -333 -70 -237 93 -78 70 158 61 183 17 -83 164 233 190 235
6990 235 -158 -15 114 -69 -44 318 299 421 209 213 351 270 230 245 432 323 546 242 73 205 322 13
7012 13 225 191 187 177 576 -103 213 200 405 296 143 203 170 270 277 129 370 220 -4 70 243 188 374 465
7036D65Pk1k19k79K74N5q9k34o8L26m69M03K72o93M40K27m47J21O1j2r9J25k06
7059f0J92j67J71J6K41o0m16K93l6j2J00l41O7K98rl55L7L7l9j23M13m31L30j29
7083A7k11K64k37L63j95n1J21M2k04J83j51M4m2R2l93j2K02r2R7j42J92n7P4O9
7107b7j10Kk69J35P4K5Q2K3k22j63J05L09k09j87j66K9J69J73m8M1j46j51L08
7130b23o8J17l0k59rK29J47%j65j84L58L5k11O8K14K0kk30j06n2Q6m2J58k5K15
7155D1j52l36M64j51K50k89J63q6Q8Q8j75M9J32K3J00k15J00L3k17J84L90Q3n03
7178F4O6k1J6R6J19K04k81j26J67j79M07m00J13pN8j04J38M6j96J39k0r4K73l72
7202A06J67q7J11j38J40k16k04K99J13m2l05Q8l13K54N2P9j8p9K53l49J05pr8
$$ plain form
7036 465 472 451 232 -47 227 282 193 -41 -109 217 -252 151 423 -270 170 397 -50 71 132 120 21 146 -60
7059 -60 132 -35 136 152 393 333 -83 210 174 162 262 -79 -12 286 277 -78 -41 -4 -43 -166 247 -184 146 17
7083 17 -194 70 -167 196 1 -50 71 113 -91 92 -59 -15 -57 35 -358 -370 -168 -260 -163 -305 -113 -170 -96 -27
7107 -27 -137 -135 -404 -269 -195 -170 -88 -65 -287 -450 -345 -36 -245 -432 -598 -569 -400 -227 -275 -234 -380 -531 -223
7130 -223 -291 -174 -204 -463 -472 -243 -96 -96 -261 -445 -87 -52 -263 -195 19 39 37 -193 -299 -351 -265 -307 -149 -174 41
7155 41 -111 -447 17 -134 116 -173 -10 -96 -8 80 -95 -46 86 109 209 -6 94 127 -90 94 484 567 64
7178 64 130 109 125 221 340 544 263 137 304 125 532 132 245 238 296 192 330 376 180 319 299 205 478 106
7202 106 273 186 297 159 299 83 -121 178 291 249 -56 32 -281 -27 25 104 86 7 260 -89 16 9 -89
7225h9K38m6k67J48l17l3L15L6m1j11L37k47j48o9J79L9j05P1J5J02q1J07K78
7248C11l30j07mP8o3M0l3j08OR6J61p9k15K19K75k48q7l8N9R4lNj07L36l98J58
7274A8K43l8j75k35J37L35r3m0L0J61j27L10k92j60J94J43J76n59N38l30M7j34
7296A49K62l6j08n81P28q1j91K34r8j08p5O3R2K91k72r1n7L13m89J36o8Q3J71
7319B67n6l8K4k63J21J62JJ8l79M00k89p9r3M69m64J69p5j88K76K9j16p7J79p4
7343g6J17l32L0M17J51m74J93M06n56J42j67m0K44M3k63K09p3K05q5O8k5j88m7
7366a01J14L8J68k17QJ9Q0J42j75o4J70p3J08L4R2j28j25K31r0j5K05n0J8p3k24
7391I2L34K80mj48P4J1m29J47j8J77k01M10Jq0m13J45R8K9J86l13M15k59J29j81
$$ plain form
7225 -89 149 103 -164 -16 -333 -366 -51 -15 -56 -167 170 -77 -225 -294 -115 -76 -181 -110 -95 7 -74 33 311
7248 311 -19 -126 -130 -52 -115 -75 -108 -216 -210 -114 47 -32 -247 -28 247 -1 -88 -126 -67 27 24 29 -78 258 -140 18
7274 18 261 223 48 -187 -50 285 192 152 182 343 216 526 234 74 268 411 587 28 566 236 283 149
7296 149 411 375 267 -314 414 333 142 376 278 170 95 158 250 541 269 178 121 434 -55 81 13 96 267
7319 267 211 173 197 -66 55 217 218 236 -143 257 -32 -111 -204 265 -199 -30 -105 -293 -17 12 -104 -181 -2 -76
7343 -76 41 -291 -261 156 307 -167 26 432 -124 18 -149 -189 55 98 -165 44 -29 176 91 159 134 -54 -101
7366 -101 13 51 219 2 10 29 109 251 76 12 182 109 217 251 343 215 90 321 231 216 421 371 389 316 92
7391 92 426 706 702 554 628 639 210 357 339 516 315 725 726 646 233 378 476 505 691 378 793 534 663 482
7415D82K4K58k87j35K16J21L2q3j82L33k20M6m0J9j56R4k17l2N1Q5O7J79k11k1
7439D23k46J53r4j00J37J22J02k39J28j72k58M01Pj1j58q6K6Q4k09K74n22K19
7461a9J71o4l43P8J49l51L41l3j81K49j0n0J04q7O1j26P1j33k29K97m21N18j79
7484a87k06J88Kp0Q9j43nj35J15L5j46L96k49q2J69K67j47j39j8J55k03j6O4k6
7508b92N8J96J5n59O41m39K98K3j2l03J05J57k46K44M20j22O3k42J46j77J16J60
7530B50k97j26K4L16R7k06R5m18L43M1k03rL35o3O8m2j4m5L9j45j4Q7k06J76J3
7555I6J28pmK4j46M4K21m4k65M24k13j59K33k14oR0r7l49L71j48j03M82k64J75
7579B69j07j36j82K50n9l64M21J38Q2j34k67j42L73Pj12R0k77Q2l3k7P6J97k35
$$ plain form
7415 482 506 764 477 342 558 679 711 628 446 779 559 605 565 584 428 522 305 273 324 409 476 655 444 423
7439 423 177 330 236 136 273 395 497 258 386 214 -44 357 364 353 195 109 135 219 10 284 -238 -19
7461 -19 152 88 -255 -177 -28 -379 -38 -71 -252 -3 -13 -63 41 -46 15 -111 -40 -173 -402 -105 -526 -8 -187
7484 -187 -393 -205 -203 -273 -184 -327 -332 -467 -352 -317 -463 -67 -316 -398 -229 38 -109 -248 -266 -111 -314 -330 -266 -292
7508 -292 -234 -38 -23 -582 59 -380 -82 -59 -71 -374 -269 -112 -358 -114 306 184 247 5 151 -26 90 250
7530 250 -47 -173 -149 167 264 58 153 -265 78 119 -84 -93 242 179 247 205 191 146 185 40 26 113 -93 83 96
7555 96 224 217 213 237 91 135 356 312 47 471 258 99 332 118 112 202 105 -244 127 -21 -124 358 94 269
7579 269 162 26 -156 94 35 -329 92 230 312 178 -89 -231 142 149 37 127 -150 -68 -101 -128 -52 145 -90
7602i0j85j28N86m20J69k62j55L24pn3L8j8n9P9j94J31j26K20r9j56R0l1K6j86
7626e06L50j96L0k8J40l49K20l7l45N84l61R8J63k02M36n88J67p7L38J6l15j64
7648f26K45J03L2j60J93J6p9r3J71j21J63j86J27nR1j99R0pK3K52M7j80k01J47
7672a57k6K49jj71j54J09k6J05k03J78r5K21j02L34l39M65m70J9P0j3k50M02l20
7695a75M6LK2L32n6l28l9J63j06K60j40k3P0j83J39J74j98J45j40k48K99j5J16
7718A18k5K94p33L22J73j80j27J29J53j52J28j98k4k1J52r7J03k47K89k49J10
7739h2O7Q2l9Nm8m3L14k97K00l34L9k20K51R5l5M82o59J13M33m16J47o8J58n0
7763I5m7q3N4j06j51L97l12N32l89P1k41M6J60l46J77K63n77L32P8k4q0J78j91
$$ plain form
7602 -90 -275 -403 183 -237 -68 -330 -485 -161 -168 -221 -183 -201 -260 -181 -375 -244 -370 -150 -249 -405 -315 -346 -320 -506
7626 -506 -156 -352 -322 -350 -210 -559 -339 -376 -721 -137 -498 -400 -237 -439 -3 -591 -424 -501 -163 -147 -462 -626
7648 -626 -381 -278 -246 -406 -213 -197 -276 -369 -198 -319 -156 -342 -215 -220 -129 -328 -238 -245 -222 30 77 -103 -304 -157
7672 -157 -183 66 65 -106 -260 -151 -177 -72 -275 -97 -192 29 -73 261 -78 387 -83 -64 6 -7 -257 145 -175
7695 -175 -129 -126 -104 228 172 -156 -195 -32 -138 122 -18 -41 29 -154 -15 159 -39 106 -34 -282 17 2 118
7718 118 93 387 -346 -24 149 -31 -158 -29 124 -28 100 -98 -122 -143 9 -88 15 -232 57 -192 -82
7739 -82 -15 67 28 33 -15 -58 256 -41 159 -175 -136 -356 -105 -10 -45 437 -222 -109 324 -92 55 -13 145 95
7763 95 48 -35 19 -87 -238 159 -153 379 -10 61 -180 -134 26 -320 -143 120 -457 -125 -47 -71 -151 27 -164
7786a64J8K39k20lQ6O6k05P6n8J93j20K12n9k91J79j36K17k12n2k2L28j64j1L69
7810B66o82J78M05j41n4J08pl06K31m4k91R1L78p41N77j30J32J37k80o9J0L08
7832G6k02N0j39K09l65L48j8K13k75l49M59k10j02JJ87K6j49J64l6J33n2k27L44
7855H6l3N4n18m0M09m41M91l26J55k0k29J44j01L19k47M12p1k76o8K39N1k02O4
7878a48j19j7M00k15l6J96M2pj24j16K56k77P4l54L16j44J13J27l23K20R9L6k77
7901b78J32m5J77J39k65k3L19l25L04k79K79l58Q8M11l58J48j63J65R8J32k14
7922H4k83N39j86M8P7k45O1k3K85L3k12%P7K9K28n24K15L7r3K42J72l77j95J76
7946A65j80J36N05m81K74k26N1M7k55J54j05K8K81j78J87k78K24qj17O5J76k91
$$ plain form
7786 -164 -146 93 -127 -130 -44 22 -183 -107 -165 28 -92 120 61 -230 -51 -187 30 -182 -234 -256 72 -92 -103 266
7810 266 -416 -238 167 26 -28 80 73 -233 -2 -46 -337 -246 132 -609 -32 -162 -30 107 -173 -242 -232 76
7832 76 -126 -76 -215 -6 -371 -23 -41 172 -103 -452 7 -203 -305 -304 -117 -91 -240 -76 -112 21 -31 -258 86
7855 86 53 107 -411 -451 -42 -483 8 -318 -163 -183 -412 -268 -369 -50 -297 115 44 -232 -300 -61 -10 -212 -148
7878 -148 -267 -284 116 -99 -135 61 103 96 -28 -144 112 -165 -91 -445 -129 -273 -160 -33 -356 -136 -37 -1 -278
7901 -278 -146 -191 -14 125 -140 -163 156 -169 135 -144 135 -223 -135 276 -82 66 -97 68 166 298 84
7922 84 -199 340 154 202 279 34 95 72 357 390 178 178 255 284 512 -12 203 240 147 389 561 184 -11 165
7946 165 -15 121 626 145 419 193 244 291 36 190 85 113 394 216 403 125 349 341 224 289 465 174
7968A74o8J03l6J31K56k67K2j74j1J71l1jj00p0q5L4J16l73L61O5k41P0J41Jk36
7993d8M67n71L12l99J93k6P3j29K92k21p9K94k06j32J85j22Qk73M44l23L39k59
8015a81J75k37J63J92k27Ko2j41K88o3J96m6m7L9p6N9k66L17j61j7o3J2%J67J40
8040A63J6k49J24K2j73L40n18N50k11J43k45N3R6l7K15j91l0l8O9N0k01K90k3
8063B15j99p6K87j9l9L79m14K48m53L19K10k01J96n51M66p5Q4k40K03r5L13m15
8085A43J34j19n0Q5M8kO9o4M3K3j15O0l16K39n6J80Jr6m0J45l61K54K76l33m5
8110A03P7k71o0L88k20R0n9QK25j45K01j75j93J81n1P7J45k70J41N1j30m9j2L9
8134I1J8k63L28N6l54J7M62k49l9m9K78n29K31O8j85J59j6k29L20k80K73Q2K67
$$ plain form
7968 174 106 209 173 304 560 293 315 141 130 301 270 269 169 99 14 48 164 -209 152 217 -24 46 187 188 -48
7993 -48 419 -152 160 -239 -46 -72 1 -128 164 -57 -136 158 -48 -180 5 -117 -109 -382 62 -261 78 -181
8015 -181 -6 -243 -80 112 -115 -113 -175 -316 -28 -91 105 59 12 51 -25 34 -232 85 -76 -93 -156 -144 -144 23 163
8040 163 179 -70 54 76 -97 243 -275 275 64 207 -38 15 111 74 289 98 68 30 99 149 -52 238 215
8063 215 16 -60 227 208 169 548 134 382 -71 248 458 257 453 -98 368 293 377 137 340 245 558 143
8085 143 277 158 108 193 241 239 308 244 287 310 195 255 -61 178 122 302 303 207 167 312 -49 205 481 148 103
8110 103 180 -91 -151 237 17 107 48 56 281 136 337 162 -31 150 99 176 321 51 192 243 113 64 52 91
8134 91 109 -154 174 230 -124 -107 355 106 67 18 296 -233 -2 66 -119 40 24 -205 115 -165 108 190 457
8157D57j48k73r2K34j80P5j64J97r6K0K54l98J20r2J01q9L85k19J23j8J08j47
8179A58O9Q0k01J21l6n1K54l37k7K16r1l
$$ plain form
8157 457 309 36 -56 178 -2 73 -91 106 10 30 284 -114 6 -86 15 -74 311 92 215 197 305 158
8179 158 227 307 106 227 191 140 394 57 30 246 155 152
8191A52
$$ Imaginary data points
##PAGE= N=2
##DATA TABLE= (X++(I..I)), XYDATA
0@%%%%%%%%%%kRj5J6j6J6k0K8l2L4m2N0n9O8p7R1j05J18j32J49j70J92k14K40
34A27k69L00l35L73m13M57n07N61o21O88p62Q45r39J045j164J303j468J663j900
53a016K199k580L092l828M977p037J1923m6515n1153K0161j830n53j1710L588
67h0282L63j604p607K606K005j272p025P65K983J488m438l88K585J590m414J27
83i2518M291L266l017j783L599N175m19j826K756M917O56j135L297O311K308j255
99f5377J199O295M141K52J403M851M767J230J354N567N788J536K51M400O624L429
115a2290L91K935N955M080J377K679N769M731N15Q78N216O101J830j29L870N707
131C9615J951l56L069N783J920j131J369N348L773j133m75L869L366o98k48L095
$$ plain form
0 0 0 0 0 0 0 0 0 0 0 0 -2 7 -8 8 -8 8 -12 16 -16 18 -24 26 -33 35 -42 49 -56 62 -70 79 -91 101 -113 127
34 127 -142 158 -177 196 -217 240 -267 294 -327 361 -401 444 -495 550 -614 689 -779 884 -1016
53 -1016 1183 -1397 1695 -2133 2844 -4193 7730 -38785 -89938 -69777 -71607 -72160 -83870 -80282
67 -80282 -79919 -81523 -89130 -86524 -84519 -85791 -92816 -92051 -89068 -87580 -92018 -92406 -89821 -88231 -92645 -92518
83 -92518 -88227 -84961 -87978 -89761 -86162 -80987 -81406 -83232 -80476 -75559 -74903 -76038 -72741 -66430 -64122 -65377
99 -65377 -64178 -57883 -53742 -53490 -52087 -47236 -42469 -41239 -39885 -34318 -28530 -26994 -26743 -22343 -15719 -12290
115 -12290 -11899 -8964 -3009 1071 2448 5127 10896 15627 16142 17020 22236 28337 30167 30038 33908 39615
131 39615 41566 41210 44279 50062 51982 50851 52220 57568 61341 60208 59733 63602 66968 66270 66022 69117
147F9117L174p58j545J592L873L4k208K62K763M63k613p9L011L87k750k225J647
164G4145J727j665k925M06J124j724k792J20J438j731l475j375J546o13l486j490
180E9230K82o61l162j932Q45l27l149l550J35R95k275l024j367L92j615l004j011
197C6802N90n65l478k052L91N41k246k716P3o4j456k111K0P36j220k865n36J220
215B1064O2k194j400P78M25j482j254J224M49j502k167Q44J704j89k070l11J084
232A5065N32j786j41J896L88k366q44J976J424j324j378N27J625n96j068R34J714
249A6578j101j595L20K080J43j482l93J286L47j190k08J692N94j983j054J798
265A5832J189o67j825Q32P75m33r50L82J090l71j872l52J916L73j494r32Q90K33
$$ plain form
147 69117 72291 71533 69988 71580 75453 75487 73279 73541 76304 76767 74154 74075 77086 77473 74723 72498 74145
164 74145 75872 74207 71282 71688 72812 71088 68296 68416 69854 68123 64648 63273 64819 64206 60720 59230
180 59230 59512 58851 55689 53757 54602 54275 51126 47576 47711 48706 46431 43407 42040 42432 40817 37813 36802
197 36802 37392 36827 33349 31297 31688 32229 29983 27267 27340 27276 25820 23709 23729 24465 23245 20380 19844 21064
215 21064 21126 18932 17532 18310 18735 17253 15999 17223 17672 16170 14003 14847 16551 16362 14292 13981 15065
232 15065 15597 13811 13670 15566 15954 13588 12744 14720 16144 14820 13442 13969 15594 14998 13930 14864 16578
249 16578 15477 13882 14202 16282 16425 14943 14550 15836 16183 14993 14785 16477 17071 15088 14034 15832
265 15832 17021 16354 14529 15361 16136 15703 14753 15135 16225 15854 13982 13630 15546 15919 14425 13493 14383 14616
283A4616j049q83R46N99j229j421N4J210r2j818m56O12P9j265o97Q22l84j003
301H641j126N31N89r16j620j54P52m79r74m09N44m73j990m45J115R8j376j181
319A127K8N00o00r77K34M65j217j269J44O56J52j393n84L76K32j236p5M74N90
338b373j605q78J075R17q31j363M51R30m46j038Q93O84n02o97L9J442J01j017
356d218k10O68N67m92M28O90P84j011m10J205J098r5p04M36N84Q45j72J5J098
375A106Q3m67L36J207O30j31l75N09J170m29K95O92R32m45k27M51J353L63o31
394F422j85P65J49L37J6Q46M19o17l08O49Q59K2o72j4L98J98m55N60K48M9j234
415H452j64J038M70o83q50J18K44r7o07L11J17q29p82N9O51J98j632o99J86K49
$$ plain form
283 14616 13567 12684 13630 14229 13000 11579 11633 12843 12751 10933 10477 11089 11168 9903 9206 10028 9644 8641
301 8641 7515 8046 8635 7719 6099 5945 6697 6218 5244 4835 5379 4906 2916 2471 3586 3684 2308 1127
319 1127 1155 1655 1055 78 312 777 -440 -1709 -1565 -909 -757 -2150 -2734 -2358 -2126 -3362 -3437 -2963 -2373
338 -2373 -3978 -4856 -3781 -2864 -3695 -5058 -4607 -3677 -4123 -5161 -4268 -3584 -4086 -4783 -4744 -3302 -3201 -4218
356 -4218 -4428 -3760 -3193 -3685 -3257 -2567 -1783 -2794 -3204 -1999 -901 -996 -1700 -1264 -680 165 -7 8 1106
375 1106 1189 722 1058 2265 2895 2764 2389 2898 4068 3639 3934 4626 5558 5113 4886 5337 6690 7053 6422
394 6422 6237 7002 7151 7488 7504 8350 8769 8152 7844 8493 9352 9374 8702 8688 9086 9284 8829 9389 9637 9686 8452
415 8452 8288 9326 9796 9113 8263 8381 8625 8528 7921 8232 8349 7520 6738 6797 7448 7646 6014 5315 5501 5750
435E750p29l43J96k08j091o23K64M95q15j138k69J05o79k68O2l32n54j280J70
454a287M43n8j134n26l10M06m10o00L41m05o36q54L22R47n25q54o44M92K21l19
474e390J74J32n83j20j92N17M94n91m49p4R93l31%J66J20q3m29J70J316M42l49
495d067n50M94N69L08k71N97K90m40O63J16J270J44o09J28N76L44K70M93O05L10
515A240k66J81O75Q18k10o74Q35Q97j6l3O33M86j25m77L69J131M31n11l46L47
535E385O59J80l91J63M11n74k52O48M34l06n79M7K59k41k21L53m94l81q07R8L57
556D748m82m14p75m14J45l62p77o9o25p64q32k31J0p17r84q69k03n31p05q23l39
577f013j280o82q58l66m01q56j546n94m94m82q59r45n62j398r58m34n40n14j064
$$ plain form
435 5750 5021 4678 4874 4666 3575 2952 3216 3711 2896 1758 1489 1594 915 647 709 377 -177 -1457 -1287
454 -1287 -844 -902 -2036 -2562 -2872 -2466 -2876 -3476 -3135 -3540 -4176 -5030 -4708 -3761 -4286 -5140 -5784 -5292 -5071 -5390
474 -5390 -5216 -5084 -5667 -5787 -5979 -5462 -4968 -5559 -6008 -6082 -5089 -5420 -5420 -5254 -5134 -5217 -5646 -5476 -4160 -3718 -4067
495 -4067 -4617 -4123 -3554 -3246 -3517 -2920 -2630 -3070 -2407 -2291 -1021 -877 -1486 -1358 -782 -438 -168 325 930 1240
515 1240 974 1155 1830 2648 2438 1764 2599 3496 3480 3447 4080 4566 4441 3964 4333 5464 5895 5384 5038 5385
535 5385 6044 6224 5833 5996 6407 5833 5581 6229 6663 6357 5778 5825 6084 5843 5622 5975 5481 5100 4293 4391 4748
556 4748 4266 3852 3077 2663 2808 2446 1669 1600 975 211 -621 -852 -842 -1559 -2543 -3412 -3615 -4146 -4851 -5674 -6013
577 -6013 -7293 -7975 -8833 -9199 -9600 -10456 -12002 -12596 -13090 -13572 -14431 -15376 -15938 -17336 -18294 -18728 -19268 -19782 -20846
596b0846q91q10p39j31j206m10q12q13j047k3j18q58j236q40m36J69n80l67p37
615c2731P3p21l55K83P8l06p03l19J75J45j6o4M78k64n16N60R49L85k86L46J57
636c2652P60N77r9P71K68K60N14J238R57J68N75L16J086R75O36N19R81M30O09
655b1111J169J314P14M83L99Q55J133Q89R40J071M62O64Q44J067J172P07N86M60
673f182Q76J142P82O94Q55M01N28P52P04J006O99j9M05P44N61N39J79M03M15L25
693E809k3Q28M30Ln95R56L69J60j62Oo9k55J09K46L85j04o97j48L74m8k14m90
715F870J34j86m67o8k36J54o03o72K4K99n95m12j66l10k15n37K77k73L30j264
735B084m29K79k70k4j1o26k80l55K31Q9j24l67l96J8J52l02K23J24m48l75J76
$$ plain form
596 -20846 -21737 -22547 -23286 -23417 -24623 -25033 -25845 -26658 -27705 -27728 -27846 -28704 -29940 -30780 -31216 -31047 -31627 -31994 -32731
615 -32731 -32658 -33379 -33734 -33451 -33373 -33679 -34382 -34701 -34526 -34381 -34397 -34461 -33983 -34247 -34763 -34203 -33254 -32869 -33155 -32809 -32652
636 -32652 -31892 -31315 -31414 -30643 -30375 -30115 -29601 -28363 -27406 -27238 -26663 -26347 -25261 -24286 -23650 -23131 -22150 -21720 -21111
655 -21111 -19942 -18628 -17914 -17431 -17032 -16177 -15044 -14155 -13215 -12144 -11682 -11018 -10174 -9107 -7935 -7228 -6642 -6182
673 -6182 -5306 -4164 -3382 -2688 -1833 -1432 -904 -152 552 1558 2257 2238 2643 3387 3948 4487 4666 5069 5484 5809
693 5809 5786 6614 7044 7047 6452 7408 7777 7937 7775 7781 7712 7457 7566 7812 8197 8093 7396 7248 7622 7574 7360 6870
715 6870 7004 6818 6351 6283 6047 6201 5598 4926 4950 5249 4654 4242 4076 3766 3551 3014 3291 3018 3348 2084
735 2084 1655 1934 1664 1640 1629 1003 723 368 599 688 564 197 -199 -181 -29 -331 -108 16 -432 -807 -631
756f31J98K95J30m59n2K9K41J02L32k28l96M89J2K42M44k0m29J92k02N70N30o4
778A325J62k12q3j28M94N13k20j72N9NL33L8o8L3J73k2KO76j06j05n62P3R80k87
802B901p9j66J58Q8k08R1N45K71r10M2L33K21j94J09M8p18K76L35J68K06m84k05
824B828M9L65J49q1oj24j93K48J87M72J0j42j77J29Q56k42L98n0k5M37l80Q83
846E591nM01k84L92P3Q37L85k55J54K23K53M85K89L84j28P4K54O95K39L57N9K34
868A0707P4L40M32N99J75R2K57J23L70J09OL46j01K83L89R8K84k42O3K06J72L63
890A5145k16K03j92l06N48K61n71Ok72R8q4m4J43l71j83l07j79n57K97j39j94
911A3086p80k92R0j8p24k33o76l27m61o4l13j3q11o98k88r2n38l83n62o52k21
$$ plain form
756 -631 -433 -138 -8 -467 -519 -490 -249 -147 185 -43 -439 50 62 304 748 728 299 491 289 859 1389 1325
778 1325 1487 1275 1192 1064 1558 2071 1851 1679 1738 1743 2076 2114 2046 2079 2252 2230 2232 2908 2802 2697 2135 2208 3188 2901
802 2901 2822 2656 2814 2902 2694 2785 3330 3601 2691 2733 3066 3287 3093 3202 3250 2532 2808 3143 3311 3517 3033 2828
824 2828 2877 3242 3391 3310 3304 3180 2987 3235 3422 3894 3904 3762 3585 3714 4570 4328 4726 4676 4651 5088 4708 5591
846 5591 5586 5987 5703 6095 6168 7005 7390 7135 7289 7512 7765 8250 8539 8923 8795 8869 9123 9818 10057 10414 10473 10707
868 10707 10781 11121 11553 12152 12327 12419 12676 12799 13169 13278 13284 13630 13529 13812 14201 14299 14583 14341 14404 14610 14782 15145
890 15145 14929 15132 14940 14634 15182 15443 14872 14878 14606 14704 14620 14576 14719 14348 14165 13858 13679 13122 13419 13280 13086
911 13086 12306 12014 12104 12086 11362 11129 10453 10126 9665 9601 9288 9275 8464 7766 7478 7386 6848 6465 5903 5251 5030
932E030m77k11n29l42n74p49j85n26K30p36m76l26l88j58n86j67j8j004p4k78
952b544k94j65l59l89k08l57K32k93k92j27k32l08j06K10j14j11J39r0j96L27
972e277K1j88J28k05j43O74J46j10j13O3K96n8N19K91J5N6l42M90M55K91N25l58
994b824L27j34P42M22J35j46K87K28L44M17J64j94J99M18J53M70M45j92J09J33
1014A503K19L36N72O0k38j75N34n1N22J11L8l3j27P02k49K71j69j73j06M30M96
1035D473j18m57p9R9j08NK39K90l71m45l9J10K75k72l0j95j05q1M14k00l14k01
1057B890m34mJ31m1q4m27n23M20k59p2J32o06o6k7K58m44j23l1j83j05J36m0k7
1080D71p4k68l04J24L7k36J40k88k84Q8L17J03m28J08q6r1j7N9L11k42r1m8J91
$$ plain form
932 5030 4553 4342 3813 3471 2897 2148 1963 1437 1667 931 455 129 -259 -417 -1003 -1170 -1188 -2192 -2266 -2544
952 -2544 -2838 -3003 -3362 -3751 -3959 -4316 -4084 -4377 -4669 -4796 -5028 -5336 -5442 -5232 -5346 -5457 -5318 -5408 -5604 -5277
972 -5277 -5256 -5444 -5316 -5521 -5664 -4990 -4844 -4954 -5067 -5004 -4708 -4766 -4247 -3956 -3941 -3885 -4227 -3737 -3282 -2991 -2466 -2824
994 -2824 -2497 -2631 -1889 -1467 -1332 -1478 -1191 -963 -619 -202 -38 -232 -33 385 538 1008 1453 1261 1370 1503
1014 1503 1722 2058 2630 2690 2452 2277 2811 2760 3282 3393 3431 3398 3271 3973 3724 3995 3826 3653 3547 3977 4473
1035 4473 4355 3898 3819 3918 3810 3815 4054 4344 3973 3528 3489 3599 3874 3602 3572 3377 3272 3191 3605 3405 3091 2890
1057 2890 2456 2452 2583 2542 2458 2031 1508 1928 1669 1597 1729 1123 1057 1030 1288 844 721 690 507 402 538 498 471
1080 471 397 129 -175 -51 -14 -250 -110 -398 -682 -594 -277 -174 -602 -494 -580 -671 -688 -629 -318 -560 -651 -699 -508
1103e08M7K29o0j00k33L57L7K06M2k95J14o5K99J06K44q5j00j48L1J67L14l36
1125B63K53Ok58N41M9K5r2l93K36j57K69J56j40j90R9k41Q3J19Q4l36k92L01L68
1148G53j35k7l03l23k48K76K37k31k79j18m72J67j3J24k26j12p57j09K55K08k12
1169a545m17j37l98lJ14q3l20m47j52J90L6m80Q1l37l7k3K08l31q9j65q2l70J00
1192d687J58m6m38K71p8j27J42j53k08k05J28K0M67k05J75l15q7L9k4J55J38N
1214d875k19J85J06J17J87R5j96K8K65L53l7K83j3k39K80J37L72j93R8L78n6J75
1236b769K26j64M68L4j48K68M12k7l5K20J69J08l3K44Q9J81l36K05L52K42q6J92
1258a88k98j9N23J44N1j71J8k7J73J71J86j73mk86K62K94j62M3k15k5J1K7K04
$$ plain form
1103 -508 -461 -232 -292 -392 -625 -268 -231 -25 17 -278 -164 -229 70 176 420 335 235 87 118 285 599 263
1125 263 516 522 264 805 854 879 787 394 630 473 742 898 758 568 667 426 509 628 712 376 84 385 753
1148 753 618 591 288 -35 -283 -7 230 -1 -280 -398 -870 -703 -716 -592 -818 -930 -1687 -1796 -1541 -1333 -1545
1169 -1545 -1962 -2099 -2497 -2500 -2386 -2469 -2789 -3236 -3388 -3198 -3162 -3642 -3561 -3898 -3935 -3958 -3750 -4081 -4170 -4335 -4417 -4787 -4687
1192 -4687 -4529 -4575 -5013 -4742 -4820 -4947 -4805 -4958 -5166 -5371 -5243 -5223 -4756 -4961 -4786 -5101 -5188 -5149 -5173 -5018 -4880 -4875
1214 -4875 -5094 -4909 -4803 -4686 -4499 -4404 -4600 -4572 -4307 -3954 -3991 -3708 -3721 -3960 -3680 -3543 -3171 -3364 -3266 -2888 -2944 -2769
1236 -2769 -2543 -2707 -2239 -2205 -2353 -2085 -1673 -1700 -1735 -1515 -1346 -1238 -1271 -1027 -938 -757 -1093 -888 -536 -294 -380 -188
1258 -188 -486 -505 18 162 213 42 60 33 206 377 563 390 386 100 362 656 494 537 322 297 308 335 539
1281E39K54l13n6j04J87k48K03r1k87Q8j61J4j45K16m22L9j8r3p2P5k71q9k48
1304a003j30L20k76j27o0j75j95J28N8k76O3l82j38N8j47j06r4k95n62J61J29
1325c049l46M21o46j17m96K85J7k01j19k74k1r9K60p05l57L20p04M56l07P1l09
1346e920o21K91j81M59j43n31J60n90K23j22K18j38l35l05J76N2q8Q5P8l89l35
1367g956J16P19L0j34m0m86K92M01l76L21K01J44m10L50N33Kq5K19J35K45L64
1388e415J43K75N5R1K62N49K79M0K6K75J84N17N30L04qO4O06J77K44P97l49L97
1410D3L68J26P02N98k99Q96l02L76O29K24L10J6L48P1J39K84L41L35p1L09j60
1431E283O31J86j48O4N6J21M84k7J65o2k76ML9K00J36o05J23k7l2rj39lj85m14
$$ plain form
1281 539 793 480 424 320 507 259 462 371 84 172 11 25 -120 96 -326 -287 -305 -398 -470 -395 -666 -755 -1003
1304 -1003 -1133 -813 -1089 -1216 -1276 -1451 -1646 -1518 -1460 -1736 -1673 -2055 -2193 -2135 -2282 -2388 -2482 -2777 -3339 -3178 -3049
1325 -3049 -3395 -2974 -3620 -3737 -4233 -3948 -3931 -4132 -4251 -4525 -4546 -4645 -4385 -5090 -5447 -5127 -5831 -5375 -5682 -5611 -5920
1346 -5920 -6541 -6250 -6431 -5972 -6115 -6646 -6486 -7076 -6853 -6975 -6757 -6895 -7230 -7535 -7359 -7307 -7395 -7310 -7232 -7621 -7956
1367 -7956 -7840 -7121 -7091 -7225 -7265 -7751 -7459 -7058 -7434 -7113 -6912 -6768 -7178 -6828 -6295 -6293 -6378 -6159 -6024 -5779 -5415
1388 -5415 -5272 -4997 -4942 -4851 -4589 -4040 -3761 -3721 -3695 -3420 -3236 -2719 -2189 -1885 -1893 -1829 -1223 -1046 -802 -5 -354 43
1410 43 411 537 1239 1837 1538 2434 2132 2508 3137 3361 3671 3687 4035 4106 4245 4529 4870 5205 5134 5443 5283
1431 5283 5914 6100 5952 6016 6072 6193 6677 6650 6815 6753 6477 6481 6520 6720 6856 6251 6374 6347 6315 6306 6167 6164 5979 5565
1455E565j48j99L5m00P5n24j29j79l18k33o18O5q89L34j74n36k48m45m67L1m01
1476A97m97k47m02j59o04l0j83k51j74o77k76Jk63n0l26m05n80L86l7l40l35j60
1498e412l00j36J66r1L15k04m65j81K62Q7Q1l7j46j49J05K42L31J35l7k38K76
1519e396M27J96J33n0K26J66J97L31O22k30R2K89N11L16K05J84O6N82J71J99N64
1540a99N9L32K02M96J88M40L92m5j2K01N19O78j02J52M03j57L27L19L60J50J33
1561D836m81M06L41K08o0j21j37K37l2O5L56j23J41l45L0J86j4J63l77k25K77
1582E331l27L76k32j16m96R2p4L2l93J78m91J35j57j6l08r2k69O3k45j40j94k6
1604B631q0n22J93k80K50j60k16k36l55K88k88J34l30k5l80Q2K26l04K78m64K34
$$ plain form
1455 5565 5417 5218 5253 4853 4928 4404 4275 4096 3778 3545 2927 2992 2103 2437 2263 1727 1479 1034 567 598 197
1476 197 -300 -547 -949 -1108 -1712 -1742 -1925 -2176 -2350 -3027 -3303 -3302 -3565 -3615 -3941 -4346 -4926 -4540 -4577 -4917 -5252 -5412
1498 -5412 -5712 -5848 -5682 -5773 -5458 -5662 -6127 -6308 -6046 -5959 -5878 -5915 -6061 -6210 -6105 -5863 -5532 -5397 -5434 -5672 -5396
1519 -5396 -4969 -4773 -4640 -4690 -4464 -4298 -4101 -3770 -3148 -3378 -3286 -2997 -2486 -2170 -1965 -1781 -1715 -1133 -962 -763 -199
1540 -199 -140 192 394 890 1078 1518 1910 1865 1853 2054 2573 3251 3149 3301 3704 3547 3874 4193 4553 4703 4836
1561 4836 4355 4761 5102 5310 5250 5129 4992 5229 5197 5262 5618 5495 5636 5291 5321 5507 5493 5656 5279 5054 5331
1582 5331 5004 5380 5148 5032 4536 4628 4554 4586 4193 4371 3880 4015 3858 3842 3534 3442 3173 3236 2991 2851 2657 2631
1604 2631 2551 2029 2222 1942 2192 2032 1816 1580 1225 1513 1225 1359 1029 1004 624 706 932 628 906 442 676
1625F76k67o9M11j80J57l13J02r4M44j31j02K93k62J54J68P4L00r9o8j2J00N70
1647A852k58J52j63K94J71L52j40L0Q6n8K01K71Q1nk0K66j08J89k9L35P8m16J30
1670C291J51o9R6j86J05j76J54M41k64j75m44J29RL17j10k12l85P3m47M18j03
1691B613k46k18j39m66L24m36J16m04j17j46m18J54k9l25j60j0m79j35n5k51N3
1712g74l55k71O1m01Q4l03k98j89M4j16Q2n07J18o42n5RN30k34l29k40K6L0J66
1735c564M3j69j84r9K06K7L49k72k54R0K29J99n7P9j12M5M72m4K41j60L85J80
1757b370O6K57L91j86J92P4L8M01L88J60K48k72L10P2L76P08J9%K28L25M9O45
1779B119m3L18K39J01r5N31K28J91J34K24J01L51K61L77m8j16J03O85K9j67M14
$$ plain form
1625 676 409 340 751 571 728 415 517 423 867 736 634 927 665 819 987 1061 1361 1262 1194 1182 1282 1852
1647 1852 1594 1746 1583 1877 2048 2400 2260 2290 2376 2318 2519 2790 2871 2866 2846 3112 3004 3193 3164 3499 3577 3161 3291
1670 3291 3442 3373 3469 3283 3388 3212 3366 3807 3543 3368 2924 3053 3062 3379 3269 3057 2672 2745 2298 2716 2613
1691 2613 2367 2149 2010 1544 1868 1432 1548 1144 1027 881 463 617 588 263 103 93 -386 -521 -576 -827 -774
1712 -774 -1129 -1400 -1339 -1740 -1656 -1959 -2257 -2446 -2402 -2518 -2436 -2943 -2825 -3467 -3522 -3513 -2983 -3217 -3546 -3786 -3760 -3730 -3564
1735 -3564 -3521 -3690 -3874 -3973 -3767 -3740 -3391 -3663 -3917 -3827 -3598 -3399 -3456 -3377 -3489 -3444 -2972 -3016 -2775 -2935 -2550 -2370
1757 -2370 -2304 -2047 -1656 -1842 -1650 -1576 -1538 -1137 -749 -589 -341 -613 -303 -231 145 853 872 872 1100 1425 1474 2119
1779 2119 2076 2394 2633 2734 2639 3170 3398 3589 3723 3947 4048 4399 4660 5037 4989 4873 4976 5661 5690 5523 5937
1800E937R4n3L2L14J40K06j70l4l3K83J84j28q5q4K1l4K73j09l0Kq0QJ08j55j15
1825F492m78L94j29n6m00K39k26k79P3l13K09j44l08k81j14K0j9j99k71j14m83
1846C613J0O8n55j41k10k09k45J06l09L05n56m44k37l60J22k55K09k99l82k65
1866c4J00m23Q8l3m39J85l77M2j83m11O5k42j0Q5l03j56j63j62J30rm32j05j59
1889b946J47P1k83K87K0m19k0m3m5o1J95l55K04l72K89m4L35j56k06J88l6J49
1911c101K6K85M5n49j51O97R3q2r8R6K03L53J6p3K20j13M1L21N92k45J84m8m13
1934a701M11K72M10N1L05m11J75Q0K83k33O57j06j43L96l9M00K07k07K45Q4J77
1955A313P2m0J2O6M01k95K49o1J27n8J30l0J28K22p2l67J76L74J22k22ml08K90
$$ plain form
1800 5937 6031 5978 6010 6324 6464 6670 6500 6466 6433 6716 6900 6772 6687 6603 6624 6590 6863 6754 6724 6726 6646 6654 6762 6607 6492
1825 6492 6014 6408 6279 6223 5823 6062 5836 5557 5630 5317 5526 5382 5074 4793 4679 4699 4680 4481 4210 4096 3613
1846 3613 3623 3691 3136 2995 2785 2576 2331 2437 2128 2433 1877 1433 1196 836 958 703 912 613 231 -34
1866 -34 66 -357 -269 -302 -741 -556 -933 -891 -1074 -1485 -1420 -1662 -1672 -1587 -1890 -2046 -2209 -2371 -2241 -2250 -2682 -2787 -2946
1889 -2946 -2799 -2728 -3011 -2724 -2704 -3123 -3143 -3186 -3231 -3292 -3097 -3452 -3248 -3620 -3331 -3375 -3040 -3196 -3402 -3214 -3250 -3101
1911 -3101 -3075 -2790 -2745 -3294 -3445 -2748 -2655 -2737 -2835 -2739 -2536 -2183 -2167 -2240 -2020 -2133 -2092 -1771 -1179 -1424 -1240 -1288 -1701
1934 -1701 -1290 -1018 -608 -557 -252 -663 -488 -408 -125 -358 299 193 50 446 407 807 1014 807 1052 1136 1313
1955 1313 1385 1345 1357 1423 1824 1529 1778 1717 1844 1786 1916 1886 2014 2236 2164 1797 1973 2347 2469 2247 2243 1935 2225
1978B225j50j53K95k6j52j79L5o2j61k75L41o22J2j81p3N45m50Q2p10R3K07l91
2000B50k99m14L0M3n0m72K9J02m61l56p0J5j83k31m91K47n10K56p7l05m29j45
2022c521o1k99o1K5j03k48l83j8J19k50j89o0j61J32l12J2j33l47k19j11L47j30
2044e971j47n6k9j1K55m35K93K81l67j66K75K78K28l02k0j09K10J6N29Rk64N6
2066e447J72M09%M20N6j1p0N42j5L32J90k27J97N51p0K27K40K30K7J66J88M24
2088a469M25J95k55J71N35L1M51j17K35j27K98J04O76Pn1j25K15K96K8J76J84
2109A883J91k11M17k7K38O6j80K51k06L22J00j53J60K3k16K61J18J66k55l0j91
2130B727l81N84k51j8m0o0n8q3O1k88k82j04K37Q0l50k20j58k43J09K88m50L56
$$ plain form
1978 2225 2075 1922 2217 2191 2039 1860 1895 1833 1672 1397 1738 1116 1128 947 874 1419 969 1051 341 434 641 250
2000 250 -49 -463 -433 -390 -440 -912 -883 -781 -1242 -1598 -1668 -1653 -1836 -2067 -2558 -2311 -2821 -2565 -2642 -2947 -3376 -3521
2022 -3521 -3582 -3881 -3942 -3917 -4020 -4268 -4651 -4669 -4550 -4800 -4989 -5049 -5210 -5078 -5390 -5378 -5511 -5858 -6077 -6188 -5841 -5971
2044 -5971 -6118 -6174 -6203 -6214 -5959 -6394 -6101 -5820 -6187 -6353 -6078 -5800 -5572 -5874 -5894 -6003 -5793 -5777 -5248 -5239 -5503 -5447
2066 -5447 -5275 -4866 -4866 -4446 -4390 -4401 -4471 -3929 -3944 -3612 -3422 -3649 -3452 -2901 -2971 -2744 -2504 -2274 -2247 -2081 -1893 -1469
2088 -1469 -1044 -849 -1104 -933 -398 -367 84 -33 202 75 373 477 1153 1160 1109 984 1199 1495 1523 1699 1883
2109 1883 2074 1863 2280 2253 2491 2557 2377 2628 2422 2744 2844 2691 2851 2874 2658 2919 3037 3203 2948 2918 2727
2130 2727 2346 2930 2679 2661 2621 2561 2503 2420 2481 2193 1911 1807 2044 2124 1774 1554 1396 1153 1262 1550 1100 1456
2152A456m79J2p6k64J08k27m20K61j94k02P3L7j56n6j54n41O94m00M8n03J50j15
2174i48j47N42j9k69J36l76K77k39L05r1k65k65K01J98M20l3j83j4q6K71J09j05
2196e81Q5K53m22J62K65k38N83l56j00J07L79P5Q5K15l23J36M9N03k45K31k35
2217F28Q3N1J79K11j37K22k66qJ98K28k35r6O6J62K60P9K9m04O4j85J72K78k74
2240A305m6j03k22M6J7L85k26p6l66N2j4Jl8m41R7L01k97L7j76n6j35j17j22J56
2264c8j27K85o29r9j90p7j05J77k07j60K58n45k2K18j26l01J83l18J35k03O0m13
2286b244J32J09L2l70M17m04j3k48J83M95N7m3m87j08J30M45l92M36j55q2K29
2307a881K82J27L6j03k78Q78m22K49K26k50J89J64K79k87N24O7k80M26R1J31K94
$$ plain form
2152 1456 977 989 913 649 757 530 110 371 177 -25 48 85 -71 -127 -281 -822 -128 -528 -480 -983 -833 -948
2174 -948 -1095 -553 -572 -841 -705 -1081 -804 -1043 -738 -829 -1094 -1359 -1158 -960 -540 -573 -756 -770 -856 -585 -476 -581
2196 -581 -496 -243 -665 -503 -238 -476 107 -249 -349 -242 137 212 297 512 189 325 374 877 632 863 628
2217 628 711 762 941 1152 1015 1237 971 963 1161 1389 1154 1058 1124 1286 1546 1625 1654 1250 1314 1129 1301 1579 1305
2240 1305 1259 1156 934 980 997 1382 1156 1080 714 766 752 753 715 274 371 672 375 412 236 180 45 -72 -194 -38
2264 -38 -165 120 -509 -608 -798 -875 -980 -803 -1010 -1170 -912 -1457 -1479 -1261 -1387 -1688 -1505 -1823 -1688 -1891 -1831 -2244
2286 -2244 -2112 -2003 -1971 -2341 -1924 -2328 -2341 -2589 -2406 -1911 -1854 -1897 -2384 -2492 -2362 -1917 -2309 -1873 -2028 -2110 -1881
2307 -1881 -1599 -1472 -1436 -1539 -1817 -939 -1361 -1112 -886 -1136 -947 -783 -504 -791 -267 -200 -480 -54 37 168 462
2328D62kr0J39N6L08M35k29l09L77Q8L45k53N23j32k6j26M56p5J30J95p6j63J41
2351B174J84j66k37J71l89J01J50J15Q0n1n47K45j79J29J86k28M5o66M68m48L18
2372A455m26L24n96m17L67k09j97k00l16l97K00J03o10n9R8n19k15j62P7m74L07
2393a866m65k88Q6j96j07o51r6J09n05Mk43p8Kk68l23k80M83k78m67n8m76N77
2415e384l52j71Q9j83k08k0N38j94k77r1q8L9J91K14j25l35KK14j61N40m8j30
2437e940j44M03q3O63k44K25l5q3O62J24N0k6K65M6N10k6J55K58QJ44J46K89J42
2460b491M09K99J04l72O39N11J21j32M54l7J49O82N9L04n4J68J84M43K45K6J39
2481A850j4j55O89k49J96J85o4N67j01M15K48k31L50J78j36L85pl0J92j49k0K4
$$ plain form
2328 462 460 370 509 565 873 1308 1079 770 1147 1235 1580 1327 1850 1718 1692 1566 2022 1947 2077 2272 2196 2033 2174
2351 2174 2358 2192 1955 2126 1737 1838 1988 2103 2183 2132 1585 1830 1651 1780 1966 1738 1783 1117 1585 1137 1455
2372 1455 1029 1353 757 340 707 498 301 101 -215 -612 -412 -309 -919 -978 -880 -1399 -1614 -1776 -1699 -2173 -1866
2393 -1866 -2331 -2619 -2533 -2729 -2836 -3487 -3583 -3474 -3979 -3975 -4218 -4296 -4294 -4562 -4885 -5165 -4682 -4960 -5427 -5485 -5961 -5384
2415 -5384 -5736 -5907 -5818 -6001 -6209 -6229 -5691 -5885 -6162 -6253 -6341 -6302 -6111 -5897 -6022 -6357 -6355 -6141 -6302 -5762 -5810 -5940
2437 -5940 -6084 -5681 -5764 -5101 -5345 -5120 -5155 -5238 -4576 -4452 -4402 -4428 -4163 -4117 -3607 -3633 -3478 -3220 -3212 -3068 -2922 -2633 -2491
2460 -2491 -2082 -1783 -1679 -2051 -1412 -901 -780 -912 -458 -495 -346 336 395 699 645 813 997 1440 1685 1711 1850
2481 1850 1836 1681 2370 2121 2317 2502 2438 3005 2904 3319 3567 3336 3686 3864 3728 4113 4106 4076 4268 4119 4099 4123
2503D123J24j06K69j77J4K44L0P4p9m3nr9M06j17J00q2o3j43J46M09m72j73j51
2526D229m2O4J78j44q7P6k18J22p7o8j7k53O4k66N44m20L62o43j48M94j61L0O2
2549C681J96p34k9L03Q8j56L97m16K83k66j09K87J33m09n1l6k0J88J72k62o9N3
2571C224q5o3K66p3k33P9R6J8R7r4j72J00k88L53J8r4m33L32o0Qk2J58q1l80J14
2596B785j52J12n4J16l68K11k23J04J61n2l06l01J00o4N9k72M8k8k76M2J38k35
2618A545J26k79k72J91J65k02j03j91J35l58j75J98k78m3k20q9K7K53k64j38n8
2639c0j84K4o8J73j18k12l57J34K33N7k44q7k4j30R8k54N13k65l47q7p7M19J21
2662g12l07k6j95J38J03o6K21o17K60K64j41j68L50j16K5j23j11L97K3K1j42L5
$$ plain form
2503 4123 4247 4141 4410 4233 4247 4491 4521 4595 4516 4473 4468 4369 4775 4658 4758 4676 4613 4470 4616 5025 4553 4380 4229
2526 4229 4187 4251 4429 4285 4198 4274 4056 4178 4101 4033 4016 3763 3827 3561 4105 3685 4047 3404 3256 3750 3589 3619 3681
2549 3681 3877 3143 3114 3417 3505 3349 3746 3330 3613 3347 3238 3525 3658 3249 3198 3162 3142 3330 3502 3240 3171 3224
2571 3224 3139 3076 3342 3269 3036 3115 3211 3229 3326 3232 3060 3160 2872 3225 3243 3149 2716 3048 2988 2996 2974 3132 3051 2671 2785
2596 2785 2633 2745 2691 2807 2439 2650 2427 2531 2692 2640 2334 2033 2133 2069 2128 1856 1904 1876 1600 1642 1780 1545
2618 1545 1671 1392 1120 1311 1476 1274 1171 980 1115 757 582 780 502 459 239 150 177 430 166 28 -30
2639 -30 -214 -190 -258 -85 -203 -415 -772 -638 -405 -348 -592 -679 -703 -833 -735 -989 -476 -741 -1088 -1175 -1252 -833 -712
2662 -712 -1019 -1045 -1240 -1102 -999 -1065 -844 -1461 -1201 -937 -1078 -1246 -896 -1012 -987 -1110 -1221 -824 -801 -780 -922 -887
2684h87rJ3K39o6l40r4K47J17L46q0O4k94J26k5K3J50J78m0Mn8j08J72J62K17
2708E7n83K69K56o4pj48N6k3M48r8J94n0m13L8L21J29k57Q4j19J90n04O8K78K8
2732A50N0j40M4q4l7L40k83o6N7m6o2j78K26j40r4J01q8l8r6J62l70L03K03j26
$$ plain form
2684 -887 -896 -883 -644 -710 -1050 -1144 -897 -780 -434 -514 -450 -744 -618 -643 -620 -470 -292 -332 -328 -386 -494 -322 -160 57
2708 57 -526 -257 -1 -65 -72 -220 -164 -187 261 163 357 307 -106 -68 253 382 125 209 90 280 -224 -156 122 150
2732 150 200 60 104 20 -17 323 40 -26 31 -15 -77 -255 -29 -169 -263 -162 -250 -288 -384 -222 -592 -289 -86 -212
$$ [...]
8191H1
##END NTUPLES=NMR FID
##END=
