##TITLE=1H_SL62-SL63(Ag-flast)
 CDcl3, 8 sc, 
 26.10.2020
##JCAMPDX= 6.0         $$ Bruker NMR JCAMP-DX V2.0
##DATA TYPE= NMR FID
##DATA CLASS= NTUPLES
##ORIGIN= UXNMR, Bruker Analytische Messtechnik GmbH
##OWNER= root
$$ XWIN-NMR		Version 3.5
$$ Mon Oct 26 10:59:55 2020 Russian Standard Time (UT+4h)  she@DPX200
##.OBSERVE FREQUENCY= 200.1315066352
##.OBSERVE NUCLEUS= ^1H
##.DELAY= (6, 6)
##.ACQUISITION MODE= SIMULTANEOUS
##.ACQUISITION SCHEME= undefined
##.AVERAGES= 8
##.DIGITISER RES= 18
##SPECTROMETER/DATA SYSTEM= spect
##.PULSE SEQUENCE= zg30
##.SOLVENT NAME= CDCl3
##.SHIFT REFERENCE= (INTERNAL, CDCl3, 0, 15.7039)
##AUDIT TRAIL= $$ (NUMBER, WHEN, WHO, WHERE, WHAT)
$$ ##TITLE= Audit trail, XWIN-NMR		Version 3.5
$$ ##JCAMPDX= 5.01
$$ ##ORIGIN= Bruker BioSpin GmbH
$$ ##OWNER= she
$$ F:/spectra/data/she/nmr/H-F/1/audita.txt
$$ ##AUDIT TRAIL=  $$ (NUMBER, WHEN, WHO, WHERE, WHAT)
(   1,<2020-10-26 10:58:38.28 +0400>,<she>,<DPX200>,
      <created by zg, POWCHK disabled, PULCHK disabled
       configuration hash MD5:
       00 E9 B6 7A A2 85 ED C7 34 08 36 98 17 FE 4E 26
       data hash MD5: 16K
       87 9B AE E2 43 BD 6B 90 CA ED 1B 21 41 FE C1 7F>)
$$ ##END=
$$ 
$$ hash MD5
$$ 1C BB E6 8E D9 0B 58 5A 73 8E 7B A9 FF BE 6A A7
##$RELAX= 
##$RELAX= 
##$RELAX= 
##$RELAX= 
##$RELAX= 
##$RELAX= 
$$ Bruker specific parameters
$$ --------------------------
##$DU= <F:/spectra>
##$EXPNO= 1
##$NAME= <H-F>
##$PROCNO= 1
##$TYPE= <nmr>
##$USER= <she>
##$AMP= (0..31)
100 100 100 100 100 100 100 100 100 100 100 100 100 100 100 100 100 100 
100 100 100 100 100 100 100 100 100 100 100 100 100 100 
##$AQSEQ= 0
##$AQ_mod= 1
##$AUNM= <au_zg>
##$AUTOPOS= <>
##$BF1= 200.13
##$BF2= 200.13
##$BF3= 200.13
##$BF4= 200.13
##$BF5= 200.13
##$BF6= 200.13
##$BF7= 200.13
##$BF8= 200.13
##$BYTORDA= 1
##$CFDGTYP= 0
##$CFRGTYP= 5
##$CHEMSTR= <none>
##$CNST= (0..31)
1 1 145 1 1 1 1 1 1 1 1 1 1 1 1 1 1 1 1 1 1 1 1 1 1 1 1 1 1 1 1 1 
##$CPDPRG= <>
##$CPDPRG1= <>
##$CPDPRG2= <>
##$CPDPRG3= <>
##$CPDPRG4= <mlev>
##$CPDPRG5= <mlev>
##$CPDPRG6= <mlev>
##$CPDPRG7= <mlev>
##$CPDPRG8= <mlev>
##$CPDPRGB= <>
##$CPDPRGT= <>
##$D= (0..31)
0 1.2 0 0 0 0 0 0 0 0.06 0 0.03 0 0 0 0 0.0002 0 0 0 0 0 0 0 0 0 0 0 0 
0 0 0 
##$DATE= 1603695517
##$DBL= (0..7)
120 120 120 120 120 120 120 120 
##$DBP= (0..7)
150 150 150 150 150 150 150 150 
##$DBP07= 0
##$DBPNAM0= <>
##$DBPNAM1= <>
##$DBPNAM2= <>
##$DBPNAM3= <>
##$DBPNAM4= <>
##$DBPNAM5= <>
##$DBPNAM6= <>
##$DBPNAM7= <>
##$DBPOAL= (0..7)
0.5 0.5 0.5 0.5 0.5 0.5 0.5 0.5 
##$DBPOFFS= (0..7)
0 0 0 0 0 0 0 0 
##$DE= 6
##$DECBNUC= <off>
##$DECIM= 32
##$DECNUC= <off>
##$DECSTAT= 4
##$DIGMOD= 1
##$DIGTYP= 9
##$DL= (0..7)
0 120 120 120 120 120 120 120 
##$DP= (0..7)
150 150 150 150 150 150 150 150 
##$DP07= 0
##$DPNAME0= <>
##$DPNAME1= <>
##$DPNAME2= <>
##$DPNAME3= <>
##$DPNAME4= <>
##$DPNAME5= <>
##$DPNAME6= <>
##$DPNAME7= <>
##$DPOAL= (0..7)
0.5 0.5 0.5 0.5 0.5 0.5 0.5 0.5 
##$DPOFFS= (0..7)
0 0 0 0 0 0 0 0 
##$DQDMODE= 0
##$DR= 18
##$DS= 0
$$ [...]
##$SUBNAM2= <"">
##$SUBNAM3= <"">
##$SUBNAM4= <"">
##$SUBNAM5= <"">
##$SUBNAM6= <"">
##$SUBNAM7= <"">
##$SUBNAM8= <"">
##$SUBNAM9= <"">
##$SW= 16.880792210976
##$SWIBOX= (0..15)
0 0 2 0 0 0 0 0 0 0 0 0 0 0 0 0 
##$SW_h= 3378.37837837838
##$TD= 16384
##$TD0= 1
##$TE= 0
##$TE2= 300
##$TE3= 300
##$TEG= 300
##$TL= (0..7)
0 120 120 120 120 120 120 120 
##$TP= (0..7)
150 150 150 150 150 150 150 150 
##$TP07= 0
##$TPNAME0= <>
##$TPNAME1= <>
##$TPNAME2= <>
##$TPNAME3= <>
##$TPNAME4= <>
##$TPNAME5= <>
##$TPNAME6= <>
##$TPNAME7= <>
##$TPOAL= (0..7)
0.5 0.5 0.5 0.5 0.5 0.5 0.5 0.5 
##$TPOFFS= (0..7)
0 0 0 0 0 0 0 0 
##$TUNHIN= 0
##$TUNHOUT= 0
##$TUNXOUT= 0
##$USERA1= <user>
##$USERA2= <user>
##$USERA3= <user>
##$USERA4= <user>
##$USERA5= <user>
##$V9= 5
##$VALIST= <valist>
##$VCLIST= <CCCCCCCCCCCCCCC>
##$VD= 0
##$VDLIST= <DDDDDDDDDDDDDDD>
##$VPLIST= <PPPPPPPPPPPPPPP>
##$VTLIST= <TTTTTTTTTTTTTTT>
##$WBST= 1024
##$WBSW= 4
##$XGAIN= (0..3)
0 0 0 0 
##$XL= 0
##$YL= 0
##$YMAX_a= 228151
##$YMIN_a= -190867
##$ZGOPTNS= <>
##$ZL1= 120
##$ZL2= 120
##$ZL3= 120
##$ZL4= 120
##$ABSF1= 10
##$ABSF2= 0
##$ABSG= 5
##$ABSL= 3
##$ALPHA= 0
##$AQORDER= 0
##$ASSFAC= 0
##$ASSFACI= 0
##$ASSFACX= 0
##$ASSWID= 0
##$AUNMP= <proc_1d>
##$AZFE= 0.1
##$AZFW= 0.1
##$BCFW= 1
##$BC_mod= 2
##$BYTORDP= 1
##$COROFFS= 0
##$CY= 11.3945322036743
##$DATMOD= 1
##$DC= 2
##$DFILT= <>
##$DTYPP= 0
##$F1P= 16.9975609425685
##$F2P= -3.02152046262296
##$FCOR= 0.5
##$FTSIZE= 0
##$FT_mod= 4
##$GAMMA= 1
##$GB= 0.15
##$INTBC= 1
##$INTSCL= 1
##$ISEN= 128
##$LB= 0.24
##$LEV0= 0
##$LPBIN= 0
##$MAXI= 10000
##$MC2= 0
##$MEAN= 0
##$ME_mod= 0
##$MI= 1.114404
##$NCOEF= 0
##$NC_proc= 0
##$NLEV= 6
##$NOISF1= 3.799351
##$NOISF2= 2.8
##$NSP= 1
##$NTH_PI= 0
##$NZP= 0
##$OFFSET= 15.70392
##$PC= 1
##$PHC0= -10693.61
##$PHC1= 16.40088
##$PH_mod= 1
##$PKNL= yes
##$PPARMOD= 0
##$PSCAL= 0
##$PSIGN= 0
##$REVERSE= no
##$SF= 200.130013532006
##$SI= 16384
##$SIGF1= 3
##$SIGF2= 2
##$SINO= 400
##$SIOLD= 16384
##$SREGLST= <1H.CDCl3>
##$SSB= 0
##$STSI= 0
##$STSR= 0
##$SW_p= 3612.71676300578
##$SYMM= 0
##$S_DEV= 0
##$TDeff= 0
##$TDoff= 0
##$TI= <>
##$TILT= no
##$TM1= 0
##$TM2= 0
##$TOPLEV= 0
##$USERP1= <user>
##$USERP2= <user>
##$USERP3= <user>
##$USERP4= <user>
##$USERP5= <user>
##$WDW= 1
##$XDIM= 8192
##$YMAX_p= 0
##$YMIN_p= 0
$$ End of Bruker specific parameters
$$ ---------------------------------
##NTUPLES= NMR FID
##VAR_NAME=  TIME,          FID/REAL,        FID/IMAG
##SYMBOL=    X,             R,               I
##VAR_TYPE=  INDEPENDENT,   DEPENDENT,       DEPENDENT
##VAR_FORM=  AFFN,          ASDF,            ASDF
##VAR_DIM=   8192,          8192,            8192
##UNITS=     SECONDS,       ARBITRARY UNITS, ARBITRARY UNITS
##FACTOR=    0.000296,      1,               1
##FIRST=     0,             0,               0
##LAST=      2.424536,      0,               0
##MIN=       0,             -190867,         0
##MAX=       2.424536,      228151,          0
$$ Real data points
##PAGE= N=1
##DATA TABLE= (X++(R..R)), XYDATA
$$ [...]
2261E70K256j927P9J632k861J974L39k677K878j014j940K631j781M8J496k320
$$ 570 2826 899 978 2610 -251 1723 2062 -615 2263 1249 -691 1940 159 207 1703 -617
2277f17J420m84j110K267k193N07J380l123J967K95k434K888j713p96J943k367
$$ -617 803 319 -791 1476 -717 -210 1170 -1953 14 309 -2125 763 -950 -1746 197 -2170
2293b170J218Q61k636K161o86j458K355j757P9J120j914R63N54j815K060r11o57
$$ -2170 -952 -91 -2727 -566 -1252 -2710 -355 -2112 -2033 -913 -2827 -1864 -1310 -3125 -1065 -1976 -2633
2310b633J898k286J290O44k197K358o96j555K735j875o9K142k420J246N78j529
$$ -2633 -735 -3021 -1731 -1087 -3284 -926 -1622 -3177 -442 -2317 -2386 -244 -2664 -1418 -840 -2369
2326b369J774r85p0J407k159J894K57j817K780j450j221L232k160L0K356k752
$$ -2369 -595 -1580 -1650 -243 -2402 -508 -251 -2068 712 -738 -1959 1273 -887 -857 1499 -1253
2342a253J565P29k081K386j010j84J317j860J748m45j409L396k507o29L011l122
$$ -1253 312 1041 -1040 1346 336 152 1469 -391 1357 912 -497 2899 392 -237 2774 -348
2358c48J266J994k760J287M64j372J380o55k7Q18j479J395m18j273K571j656k15
$$ -348 918 2912 152 1439 1903 531 1911 1256 1229 2047 568 1963 1545 272 2843 1187 972
2375I72J839k610R53J741k824J878K7j638J700p31n56J185j452J010K92j832K233
$$ 972 2811 201 1154 2895 71 1949 1976 338 2038 1307 751 1936 484 1494 1786 -46 2187
2392B187j637J83J866k821P41J287k589K495o22j800K352j638j69J449j949J404
$$ 2187 550 733 2599 -222 519 1806 -783 1712 1090 -710 1642 4 -165 1284 -665 739
2408G39R6j495K049k093L37J732k463J148L41k074K584j304r29K316k543O64J362
$$ 739 835 -660 1389 -704 -367 1365 -1098 50 391 -1683 901 -403 -1332 984 -1559 -895 467
2425D67k539J825l01j456K237j816j2J639k035J193k40j533K077r65n58J644k168
$$ 467 -2072 -247 -548 -2004 233 -1583 -1595 44 -1991 -798 -1038 -2571 -494 -1459 -2017 -373 -2541
2442b541O64J230j959J818m05j385K051j149m75J376j736J318p5j130J643j143
$$ -2541 -1877 -647 -2606 -788 -1193 -2578 -527 -1676 -2151 -775 -2511 -1193 -1268 -2398 -755 -1898
2458a898K04J408k350J488P03j890K320j133j165K810j674k21K257k260P81P67
$$ -1898 -1694 -286 -2636 -1148 -445 -2335 -15 -1148 -2313 497 -1177 -1398 859 -1401 -620 147
2474A47j266J388o26J09J057j627J655K26k106K829j195j023K756k132K45J696
$$ 147 -1119 269 -357 -248 809 -818 837 1063 -1043 1786 591 -432 2324 192 437 2133
2490B133k282J669K25j154J603j335M48P34j560K034q50j461K751j715n27K297
$$ 2133 -149 1520 1745 591 2194 859 1307 2041 481 2515 1665 204 2955 1240 713 3010
2506C010k507J130J038j977J038K96j160J561j414K89N11j025J068n14r92J851
$$ 3010 503 1633 2671 694 1732 2028 868 2429 1015 1304 1815 790 1858 1344 352 2203
2522B203j315k14J584k622J317P79k051J748m41j180J753j284nO67j909J735l51
$$ 2203 888 674 2258 -364 953 1732 -319 1429 988 -192 1561 277 272 939 -970 765 414
2539D14j347K027j689j55J809k287J133O22k023J818r90r73K075j751N50Q69j941
$$ 414 -933 1094 -595 -750 1059 -1228 -95 527 -1496 322 -668 -1641 434 -1317 -767 102 -1839
2556a839J084O3q24J665j647K96Q36j794J694l57j041J725j357k31J555j910J166
$$ -1839 -755 -692 -1516 149 -1498 -1202 -366 -2160 -466 -823 -1864 -139 -1496 -1727 -172 -2082 -916
2573i16N59k143J877k94j143J694r95k41J134j577J233l4r11J438j591N51J069
$$ -916 -357 -2500 -623 -917 -2060 -366 -1361 -1602 -468 -2045 -812 -846 -1757 -319 -1910 -1359 -290
2590b90k034J510P47k102K176q16j153K110j064l23J451j424J158l27n20J217
$$ -290 -2324 -814 -67 -2169 7 -809 -1962 148 -916 -1239 212 -1212 -54 -381 -901 316
2606C16j419O62J140j905J661J39j757K284q85j258K590j430q3J413j752J125
$$ 316 -1103 -441 699 -1206 455 594 -1163 1121 236 -1022 1568 138 55 1468 -284 841
2622H41j4n95J201j171Q97P78j704J597m35j206K271j225m54J744j739M37P51
$$ 841 827 232 1433 262 1159 1937 233 1830 1395 189 2460 1235 781 2525 786 1223 1974
2639A974j126Q95j77j85Q08j071M31L12j307J587l79j132J821j373m33J777k064
$$ 1974 848 1743 1566 1381 2189 1118 1549 1861 554 2141 1762 630 2451 1078 645 2422 358
2656C58Q20R76k144J500m64p96J486j094o1M90j123R72l85q16J474j622Q4J361
$$ 358 1178 2154 10 1510 1046 250 1736 642 581 1071 -52 920 535 -281 1193 -429 -345 1016
2674A016j874J034J84j636J815j257n10J416j424N58N24j759J617n13r30J504
$$ 1016 -858 176 360 -1276 539 -718 -1228 188 -1236 -678 -154 -1913 -296 -809 -1739 -235
2690b35j623N61J028j949J843m77j705K343j383j55J755j960Q43O67j781J441
$$ -235 -1858 -1297 -269 -2218 -375 -852 -2557 -214 -1597 -1752 3 -1957 -1114 -447 -2228 -787
2706g87j23p38J030r79L19N79j190J373p32l90J263j327K96J307j790J451K08
$$ -787 -910 -1648 -618 -1597 -1278 -699 -1889 -516 -1248 -1638 -375 -1702 -1406 -99 -1889 -438 -230
2723b30j934K209m66q82J359q65K32M90r47J233n06p30J676j638P49R71j916J570
$$ -230 -2164 45 -421 -1303 56 -809 -577 -87 -1034 199 -307 -1037 639 -999 -250 721 -1195 375
2741C75M64j903J611l49o98J646r69j54J017j270J218l89p19J428j621J099O69
$$ 375 839 -1064 547 198 -500 1146 177 23 1040 -230 988 599 -120 1308 -313 786 1455
2758A455j808J686Pj826J874p86m70J875j566N13N66r72R85l19n88J297j086M69
$$ 1455 -353 1333 1340 -486 1388 602 132 2007 441 954 1520 548 1533 1214 626 1923 837 1306
2776A306M16j259J393n51p36J462j268q4J435j734J129j09j194J131j98o67J230
$$ 1306 1722 463 1856 1305 569 2031 763 679 2114 380 1509 1400 206 1337 1139 472 1702
2793A702j276M59O37j365J196p23p76J585j361L43O87j745R79M53j486J480m71
$$ 1702 426 885 1522 157 1353 630 -146 1439 78 421 1108 -637 342 795 -691 789 318
2810C18p72J163j425K02P31j350Q72l04l81O25q87L49M02j196Q99m4j288J706
$$ 318 -454 709 -716 -514 217 -1133 -261 -565 -946 -321 -1208 -859 -457 -1653 -754 -798 -2086 -380
2828c80j082n49J745j399K58N82j493J255k22n55J056j213N74Q02j289J121m87
$$ -380 -1462 -2011 -266 -1665 -1407 -825 -2318 -1063 -1285 -1840 -784 -1997 -1423 -621 -1910 -789 -1276
2845a276q43J841j497k2J837j985Q19J147j921J353j87p30J230p51J1Q67p55O47
$$ -1276 -2119 -278 -1775 -1797 40 -1945 -1126 21 -1900 -547 -734 -1464 -234 -985 -974 -107 -862 -215
2863b15l12k00J365j179N4J261j981J477N36j242J149j70q05J200q24KM94n12
$$ -215 -527 -727 638 -541 -487 774 -1207 270 806 -436 713 543 -262 938 114 116 610 98
2881I8P89m58l06J195j048L23J038j713J139M21j563J912o92r95J390p74L1Q78
$$ 98 887 429 123 1318 270 593 1631 -82 1057 1478 -85 1827 1135 140 1530 756 787 1665
2899A665j161Q61k07m32Q85j275N29J007j429Q77l04j159K110j037m80J221j315
$$ 1665 504 1365 1158 726 1611 336 865 1872 443 1320 1016 -143 1967 930 450 1671 356
2916C56O19O74j316P77k11l57R20j149J13P44q86O72k06r21J067l28j28R19j417
$$ 356 975 1649 333 1110 899 542 1462 313 426 1170 284 956 750 -171 896 568 440 1359 -58
2935e8M56M59j042O85l36o83J323j045J38P37j367J010m54p49J225q43j53Q06
$$ -58 398 857 -185 500 164 -519 804 -241 -103 634 -733 277 -177 -926 299 -544 -697 109
2953A09j463Q62K23j126J556q15q49J182j007K65L68r61O90Q0n97P45q70N11L08
$$ 109 -1354 -492 -269 -1395 161 -654 -1503 -321 -1328 -1063 -695 -1656 -966 -886 -1483 -738 -1608 -1097 -789
2972g89j189J352o32p32J589r96m35J478j360K31Q88j126P80l54q5O50o65O25
$$ -789 -1978 -626 -1258 -1990 -401 -1397 -1832 -354 -1714 -1483 -595 -1721 -941 -1295 -1380 -730 -1395 -770
2990g70J29n35Q27k90p14J657j231K36J062j199N13O37j078R58J11q77J173o24
$$ -770 -641 -1176 -349 -639 -1353 304 -927 -691 371 -828 -315 322 -756 202 313 -564 609 -15
3008a5J70K61n05R25m68m39J305q21J54Q57j402J244R2j251J449n99n37J325r72
$$ -15 155 416 -89 836 368 -71 1234 413 567 1424 22 1266 1358 107 1556 957 420 1745 773
3027G73L01M93j181J082l70j72P81j199N13R77j573J084k8j197J539q83o8P69
$$ 773 1074 1567 386 1468 1098 926 1707 508 1021 1998 425 1509 1481 284 1823 940 872 1641
3045A641j117K78M24q85O76n30n1P69j301Q48P5q67J221q27n09J469j105K24M43
$$ 1641 524 802 1226 341 1017 487 436 1205 -96 752 827 -40 1181 354 -155 1314 209 433 876
3064H76r71L61K00j031J063p28l69J024r58N24K18j064Q79k49n11J033j304O80
$$ 876 -95 266 466 -565 498 -230 -599 425 -533 -9 209 -855 24 -225 -736 297 -1007 -327
3082c27L95j274Q33J31r66J293r16k81R14o68M75k16n65O11l93l26J029r89L41
$$ -327 68 -1206 -373 -242 -1208 85 -831 -1112 -198 -866 -391 -607 -1172 -561 -954 -1280 -251 -1240 -899
3101h99N92j454J350k78j113J494o89k21J196j408L12N62r47Q17j56m3N67q74
$$ -899 -307 -1761 -411 -689 -1802 -308 -997 -1218 -22 -1430 -1118 -556 -1503 -686 -842 -885 -318 -1192
3119a192N01j00m57R82p49l07J392j130K5J145r60M36K20o68O11q2J20K12m03
$$ -1192 -691 -791 -1248 -266 -1015 -1322 70 -1060 -1035 110 -850 -414 -194 -862 -251 -333 -213 -1 -404
3138d04M77J51o77R33n40k86J104q55L36R75j729J225N4o26O39k76j44P40l83
$$ -404 73 224 -453 480 -60 -346 758 -97 239 1214 -515 710 764 138 777 501 357 1097 714
3157G14N14K4o79J016o84j09O97j068N55N72j130R88q2q76J250o65m11J142j049
$$ 714 1228 1252 573 1589 905 796 1493 425 980 1552 422 1410 1328 452 1702 1037 626 1768 719
3176G19N29L8n52P53p22j53Q51j190Q87j89p75O89j11m97R67j129K44N93j082
$$ 719 1248 1286 734 1487 765 612 1463 273 1160 971 196 885 774 277 1244 115 359 952 -130
3195a30N07J56p36O69k85j84K62m42K19k17n48P98o63K76N06j119L36N72j221
$$ -130 377 533 -203 466 181 -3 259 -183 36 -181 -729 69 -594 -318 188 -931 -595 -23 -1244
3214a244Q30J06r19Q47l37m04O93p36J04N40q38P86m59j18P37p28L04N89j349
$$ -1244 -414 -308 -1227 -380 -717 -1121 -428 -1164 -1060 -520 -1358 -572 -1031 -1149 -412 -1140 -836 -247 -1596
3233a596J279l67q54J264p28j14O00m60J93J82m55O74n08k9Q97j188P74j45q10
$$ -1596 -317 -684 -1538 -274 -1002 -1116 -516 -976 -783 -601 -1056 -382 -890 -919 -22 -1210 -436 -581 -1391
3252a391J298n30l54J068q20k97J207j057M32M24n88N67l70J21N73o05M27R3n11
$$ -1391 -93 -623 -977 91 -729 -1026 181 -876 -444 -20 -608 -41 -411 -290 283 -322 105 198 -313
3271c13O05k19m91J056o17k07Q11p10L70M44o56M80k27r4M40m01K57K34n47P08
$$ -313 292 73 -418 638 21 -186 625 -85 285 729 73 553 326 232 672 271 528 762 215 923
3291I23k17m67R76p64J11N11m40L42K36n84L26N8l23P62m92k0K58m87M64k55k67
$$ 923 706 239 1215 451 562 1073 633 975 1211 627 953 1011 688 1450 958 938 1196 709 1173 918 651
3312F51P03q38L18K45p56Q54k45o21R19n11k86P26q47J32M50r06M86Ml72N48q76
$$ 651 1354 516 834 1079 323 1177 932 311 1230 719 433 1159 312 444 894 -12 474 478 106 654 -222
3333b22L87M63j241J004o14l20R08o56j20L99p60L07L29j139Q28K2m15M50n83
$$ -222 165 628 -613 391 -223 -543 365 -291 -411 -12 -772 -465 -136 -1275 -447 -425 -840 -390 -973
3352i73K79o9l86N23l51k53O11o73O9P32r79M32L42q62P60n4m05N17m38K17Q4
$$ -973 -694 -763 -1149 -626 -977 -1230 -619 -1292 -1223 -491 -1470 -1038 -696 -1558 -798 -852 -1257 -740 -1178 -961 -877
3373h77l41O69k26k91Q28j104M85N09j054R75O4q60J069m89j38O70o82K01N71
$$ -877 -1218 -549 -775 -1066 -238 -1342 -857 -348 -1402 -427 -363 -1223 -154 -643 -781 -111 -793 -592 -21
3392b1m19L46j38l05Q03o37K19M68o98R38l23m09Q05m86n7O54o99j2P64p32M67
$$ -21 -440 -94 -232 -537 266 -371 -152 316 -382 556 233 -176 629 143 86 740 41 29 793 61 528
3413E28k53J10N34o09L71L3m58Q91l46n10P16o11J5P86j041O12P4o96Q23l11m2
$$ 528 275 385 919 310 681 714 256 1147 801 291 1007 396 411 1197 156 768 842 146 969 658 616
3434F16N31n23K01q3j98P19m59k48N33r05L61M07o88O86j57m84P31j64m57M98
$$ 616 1147 624 825 742 544 1263 804 556 1089 184 545 952 264 950 793 309 1040 876 419 917
3454I17n08L84Pp25N72l12k02O74p36J69M56q56O95l99l49O20m51j20O68q51L47
$$ 917 409 793 800 75 647 335 133 807 71 240 696 -160 535 136 -213 407 -44 -164 504 -347 0
3475@K74o93N16o13K67J18n49M98l05o03R23j06n68L56l46k2M85q43L87J40o76
$$ 0 274 -419 97 -516 -249 -131 -680 -182 -487 -1090 -167 -273 -841 -485 -831 -853 -368 -1211 -824 -684 -1360
3496a360O25k7k45J68k02k5O2l39P42m46MK77n47N39J38o47Q37k2p17P36m29J15
$$ -1360 -735 -762 -1007 -839 -1041 -1066 -1004 -1343 -601 -1047 -1043 -766 -1313 -774 -636 -1283 -446 -468 -1185 -449 -878 -763
3518g63L07l18N22k31j56L96n55L41M90r41O25J62o62J178l82m43R04o04R3O98
$$ -763 -456 -774 -252 -483 -639 -243 -798 -457 33 -908 -283 -121 -783 395 13 -430 474 -130 -37 661
3538F61q40R7L69L0J07J82K70j87n00O49j09l95Q79p45L1Q34p92K04L77n31K72
$$ 661 -179 -82 287 317 424 606 876 689 189 838 729 334 1213 468 499 1333 541 745 1122 591 863
3559H63o2j43N63n73K97J55q57P20L9l34N27o02K35M67r04P19k7r37N86K5o52
$$ 863 801 658 1221 648 945 1100 243 963 1002 668 1195 593 828 1295 391 1110 1083 146 732 757 105
3580A05N89j40k79M37n56L00j8J72J26o74K92J50n92O68l64o52R58l86k66O82
$$ 105 694 554 275 712 156 456 438 610 736 62 354 504 -88 580 216 -436 522 136 -130 552
3600E52p16K18K04o32N71j16m44N15o38J84K58o07O54k24o49O60n06J91K46n09
$$ 552 -164 54 258 -374 197 81 -363 152 -486 -302 -44 -651 3 -221 -870 -210 -716 -525 -279 -788
3620g88J79M56n71J78J70l00J53m45M65j93n6L21k14l44M36l85m7P66r85N88J49
$$ -788 -609 -153 -724 -546 -376 -676 -523 -968 -503 -696 -752 -431 -645 -989 -553 -938 -985 -219 -1204 -616 -467
3641d67p55L98J76m78L63p9n8K95k15O72m42j44M01o97L01N88n96K62K36n63P64
$$ -467 -1222 -824 -648 -1126 -763 -842 -900 -605 -820 -148 -590 -734 -333 -1030 -729 -141 -737 -475 -239 -802 -38
3662c8K8p40P35l84K36K56k60K45m8KM06m98M46m8j80M47o2l78M82Ml16O54k74
$$ -38 -10 -750 -15 -399 -163 93 -167 78 30 32 438 -60 386 338 158 605 543 165 647 651 335 989 715
3685G15l11N22l44L49j72k40P10m77J08J92k78K62Q8m06P20o24j68P41q32L23
$$ 715 404 926 582 931 759 519 1229 752 860 1052 774 1036 1124 718 1438 814 646 1387 555 878
3705H78K31n96L04L51k95J02l06k77L67m47M07J16o12N01m17j72N71p22M64M5
$$ 878 1109 513 817 1168 873 975 669 392 759 312 719 835 223 724 307 135 706 -16 448 493
3725D93o00L85j75m29M56l75O4m1k62L48j04k22K98k33J49J12p06L96J16l51L22
$$ 493 -107 278 103 -326 130 -245 -181 -222 -484 -136 -240 -462 -164 -397 -248 -136 -842 -446 -330 -681 -359
3746c59k64l94Q51o10j5L26j91K64j76m44L54j34N3O0l39N58k46o4Q2l05M1O65
$$ -359 -623 -1017 -166 -776 -791 -465 -656 -392 -568 -1012 -658 -792 -739 -679 -1018 -460 -706 -770 -688 -993 -952 -287
3768b87l91m8M35m03J40L4o7K1J13m3o3l4L75l44k11M71l04J95L55o19K26N38
$$ -287 -678 -726 -291 -694 -554 -520 -587 -566 -453 -496 -559 -593 -218 -562 -773 -302 -606 -411 -56 -675 -449 89
3790H9o61N05P0m62N46l41K2O6l70L52K70m05M75p2j41L33m06M02K39m14N26k03
$$ 89 -572 -67 3 -459 87 -254 -232 -166 -536 -184 86 -319 156 84 -57 276 -130 272 511 97 623 420
3812D20k16K70j47k6K57l72M18o3j19M14k20J49L92r30M75j10j28O03k92l95O52
$$ 420 204 474 327 301 558 186 604 541 422 836 616 765 1157 227 702 592 464 1067 775 380 1032
3833A032p05L32N43o77K00L0k55P8k6NL24l22L33n19J29K39j40l06M11m38k0M60
$$ 1032 327 659 1202 525 725 755 500 578 552 557 881 559 892 373 502 741 601 295 706 268 248 708
3855G08n07J59J55k05J81l77j33J18j59K35k37J9L64o07J56K12m78O0J15l25K51
$$ 708 201 360 515 310 491 114 -19 99 -60 175 -62 -43 321 -286 -130 82 -396 -336 -221 -546 -295
3876b95pm78N10m57j95M78k81j8K32l52K63j70l0J48l37M79rm33L00k55k78O81
$$ -295 -302 -780 -270 -727 -922 -444 -725 -743 -511 -863 -600 -770 -800 -652 -989 -510 -519 -952 -652 -907 -1185 -504
3898e04k44j0K33m31K69J97o8J36k02j32M70n76N93k73j70L46l09k7N35l02J17
$$ -504 -748 -758 -525 -956 -687 -490 -558 -422 -624 -756 -286 -862 -269 -542 -712 -366 -675 -702 -167 -469 -352
3919c52L14l19K42K01k59L06m17J26L88l21L04l69J73J71m01K03M71n60J37L52
$$ -352 -38 -357 -115 86 -173 133 -284 -158 230 -91 213 -156 17 188 -213 -10 461 -99 38 390
3939C90l72L58r5m4nM6k20N95p26L49L87l0K16m73j6O11r86P28J24p10O02o1p9
$$ 390 18 376 281 237 232 278 58 653 -73 276 663 633 849 376 360 971 -15 713 837 127 729 668 589
3962E89K13l69N4L44m85K33l5R4k80J00R7K40m86M41k37j87M40k67K9M56o68J54
$$ 589 802 433 487 831 346 579 544 638 358 458 555 795 309 750 513 326 766 499 528 984 316 470
3984D70O3l40L88J29n99K13K04r0j79l13L11k57K44L05n32p2L96o15K70P9l71
$$ 470 533 193 581 710 111 324 528 438 259 -54 257 0 244 549 17 -55 341 -274 -4 75 -296
4005b96K51j19m8l1j96l8K42k61m6J74K0j11j78J87j11k97L84J92o44L02m1m93
$$ -296 -45 -164 -212 -243 -439 -477 -235 -496 -542 -368 -348 -459 -637 -450 -561 -858 -474 -282 -926 -624 -665 -1158
4027a158M96k73M1K76k93k7L15J5j01k62N11P8m09LL40o67M04L31k77M98m64J37
$$ -1158 -662 -935 -894 -618 -911 -938 -623 -608 -709 -971 -460 -382 -791 -788 -448 -1115 -711 -380 -657 -159 -623 -486
4049d86K83l70K92r9J17K08m91M26Q2k59M16J51l11L21l87L0L72k34P6K15n21
$$ -486 -203 -573 -281 -380 -263 -55 -546 -120 -38 -297 119 270 -41 280 -107 -77 295 61 137 352 -169
4070a69O90j97J85J12k89J03m2m5L18q3j26K50k45K34M4l99L80k98Q1J36q5l4
$$ -169 521 324 509 621 332 435 393 348 666 583 457 707 462 696 740 341 721 423 504 640 555 521
4092E21L23n60L26L94o16L55j41j52K42k34K47j7l58P3k5l9R4l57K00M39n23K81
$$ 521 844 284 610 1004 388 743 602 450 692 458 705 688 330 403 378 339 433 76 276 715 192 473
4114D73J41k40j47K21k10r9J98k1q3j34J41k64j43M32k04m0K69o58L43L6m48M56
$$ 473 614 374 227 448 238 139 337 316 233 99 240 -24 -167 265 61 21 290 -368 -25 11 -437 19
4136A9J10p16O16j86n0K64n92M58l75pM53o33L19n1m22K17K30m99M50j28j64J09
$$ 19 129 -587 29 -157 -207 57 -535 -77 -452 -459 -6 -639 -320 -371 -793 -576 -346 -845 -395 -523 -687 -578
4158e78j06oJ71p4K48m39J13L80q16M39L66p00O35j17m61P35m84J9J39j8P8o0
$$ -578 -684 -690 -519 -593 -345 -784 -671 -291 -1107 -668 -302 -1002 -367 -484 -945 -210 -694 -675 -536 -554 -476 -536
4180e36J54O3l2p9Q9j19J30K1k21N49j03j12J33o1k78M37k57L52L9l58L23J26
$$ -536 -382 -319 -351 -430 -341 -460 -330 -309 -530 19 -84 -196 -63 -124 -402 35 -222 130 169 -189 134 260
4202B60l2K42k96L38J7l37K60o6M3L67m26R1L15l02K69j13j02L99l36M0J02n1
$$ 260 228 470 174 512 529 192 452 386 429 796 370 461 776 474 743 630 528 927 591 631 733 682
4224F82J37j55k5N4j6j99R8J91Lj7k37R3l03J97Q1k25Q1J86l43O9L28m71M19m31
$$ 682 819 664 639 693 677 478 576 767 770 753 516 609 306 503 584 359 440 626 283 352 680 209 628 197
4248A97R3m0j12J34k75j02L93j94j30L21m87L1J92n35M24P5k79l30P19m62j47
$$ 197 290 250 138 272 -3 -105 288 94 -36 285 -202 -171 21 -514 -90 -15 -294 -624 95 -367 -514
4269e14K76J74k58j30K67j39j98L22O1l93L63k97nK95m90L97k96l49O64l19J88
$$ -514 -238 -64 -322 -452 -185 -324 -522 -200 -139 -532 -169 -466 -471 -176 -666 -269 -565 -914 -250 -569 -381
4290c81J42l40J92p5k36J50Q4k60M99m19J3K46o3j57MK11Q1j04k09J44J45p9j59
$$ -381 -239 -579 -387 -462 -698 -548 -464 -724 -225 -644 -631 -385 -448 -605 -601 -390 -309 -413 -622 -478 -333 -412 -571
4313e71J56K50j29J04n6k25K43r5j24M84k91P3M7J9J28J43m39K82J18m2j0j6l2
$$ -571 -415 -165 -294 -190 -246 -471 -228 -323 -447 37 -254 -181 -134 -115 13 156 -283 -1 117 75 65 49 17
4336A7L6r6J59J25J06J02k1n6k26J49q0M10l01J28J02k30K01j32K84Q2Q1m98K58
$$ 17 53 -43 116 241 347 449 428 372 146 295 215 625 324 452 554 324 525 393 677 759 840 342 600
4359F00M1ko5O8J61n58L87N0l27K20O7l28M70k01n19M65J07j39oN9r8o1O9P3l19
$$ 600 641 639 574 642 803 245 632 682 355 575 642 314 784 583 64 529 636 497 491 550 452 391 460 533 214
4384B14L00l32l00N79l70n0R6j90LJ20mJ94k90q8N6q8j31J91k87J77J4l12L31
$$ 214 514 182 -118 461 91 41 137 -53 -50 70 66 260 -30 -118 -62 -150 -281 -90 -377 -200 -186 -498 -167
4407a67k41j69L45m90K42J8J7l57L29J85j53j78L4l5m3J87j66J49K31m49O1K17
$$ -167 -408 -577 -232 -722 -480 -462 -445 -802 -473 -288 -441 -619 -585 -620 -663 -476 -642 -493 -262 -711 -650 -433
4429d33m02J88O68p47K35Q7j54M6JL52k96j2M64k25k71L24l00M08k7j67J15j71
$$ -433 -835 -647 21 -726 -491 -404 -558 -512 -511 -159 -455 -467 -3 -228 -499 -175 -475 -67 -94 -261 -146 -317
4451c17J64J45O0l62J51K02n9K3o5M55m03r1L23k96J80k3k70N75k70k16N08l91
$$ -317 -153 -8 52 -310 -159 43 -16 7 -58 397 -6 -97 226 -70 110 87 -183 392 122 -94 414 23
4473B3M5N50m45K05J35l83M25k25n2K24k41K42j21N4J90k90K2K53j11M2O7j10
$$ 23 68 618 173 378 513 130 555 330 278 502 261 503 382 436 626 336 358 611 500 542 609 499
4495D99n1J65k64L10k04K0P7J36j35Q7k24K17m27J00K74n02L58K66o02M33j20
$$ 499 448 613 349 659 455 475 552 688 553 640 416 633 206 306 580 78 436 702 100 533 413
4516D13k76M47l37k5n2k03L29q7j93j06N2K66l43n1L51l46J6J48p8k3k43j83j4
$$ 413 137 584 247 222 170 -33 296 209 16 -90 -38 228 -115 -166 185 -161 -145 3 -75 -98 -341 -524 -538
4539e38L56l46K53Q2k70J7p6J2L01k79O9j50j31K48o5m16P83n48M9m2L3j63M59
$$ -538 -182 -528 -275 -193 -463 -446 -522 -510 -209 -488 -419 -569 -700 -452 -517 -933 -150 -698 -649 -691 -658 -821 -362
4562c62l40q0K21j55J36p7J23j48J39P2K7M6J48k73J97P6j15L46r5j63K37j10
$$ -362 -702 -782 -561 -716 -580 -657 -534 -682 -543 -471 -444 -398 -250 -523 -326 -250 -365 -19 -114 -277 -40 -150
4584a50J9j66J53L65j47l36N02k96J77m7P2O5J6j2J78k9k92J25L6J2J04n2J81
$$ -150 -131 -297 -144 221 74 -262 240 -56 121 74 146 211 227 215 393 364 72 197 233 245 349 297 478
4607D78m6l63M76j80k22M58j01J95l94M6K23k81Q1M6l11L17k1k58L92j04J01L13
$$ 478 432 69 545 365 143 601 500 695 301 347 570 289 370 416 105 422 401 143 535 431 532 845
4629H45m44j62N1L96m94J12J98j75o9R0J65m00J55J92o64O53l54j7N88n12q5L57
$$ 845 401 239 290 686 192 304 502 327 258 348 513 113 268 460 -204 449 95 78 666 154 69 426
4651D26n77K96K7k13L69k25j18l8J63J68l64l2K44k62k32L09r4p7J12j09L0o0
$$ 426 -151 145 172 -41 328 103 -15 -53 110 278 -86 -118 126 -136 -368 -59 -153 -230 -118 -227 -197 -257
4673b57K33r6l38P4J09l61N06k60j85K64q7j09k5O5o4Q7j98K54j73Jj33O0j31
$$ -257 -24 -120 -458 -384 -275 -636 -130 -390 -575 -311 -398 -507 -532 -467 -531 -444 -642 -388 -561 -560 -693 -633 -764
4696g64L19k9K08m14j9J10N8j32K10J05j9L99k52j77p5O3L4J80j61J17j75O8M5
$$ -764 -445 -474 -266 -680 -699 -589 -531 -663 -453 -348 -367 32 -220 -397 -472 -409 -375 -195 -356 -239 -414 -346 -301
4719c01L54j00j16J82n0j05L89k06J10LJ01O6l3j33K31p0l7j5R7j21J96Rj12M5
$$ -301 53 -47 -163 19 -31 -136 253 47 157 160 261 327 294 161 392 322 285 270 367 246 442 451 339 384
4743C84p5R8j37J82J6j4r4K62k97J26k4J53J37j99N8l11J56p6J44N6k9l94M94
$$ 384 309 407 270 452 468 454 360 622 325 451 427 580 717 518 576 265 421 345 489 545 516 122 616
4766F16r1m51M66J24l79J60Mq4P9k10j05K25J15k98jK28m57L23o4K2m46L68P0
$$ 616 525 74 540 664 285 445 449 365 444 234 129 354 469 171 170 398 -59 264 200 222 -224 144 214
4789B14k86k9J21m91L03L6l25M60N3m00L3L00n4k83K76l89J95J73k30j76J37J18
$$ 214 -72 -101 20 -471 -168 -132 -457 3 56 -344 -311 -11 -65 -348 -72 -461 -266 -93 -323 -499 -362 -244
4811b44k76K93k0k74Q6O0j88N9J80j86K43p6k31M4L91m80L64k09L0J19j5Q2j59
$$ -244 -520 -227 -247 -521 -435 -375 -563 -504 -324 -510 -267 -343 -574 -530 -139 -619 -255 -464 -434 -315 -330 -248 -407
4834d07r2R1R6P7j00j47O8J40k20R4J87R1k83K47P6j43k35J37J02oJ75L3J35r5
$$ -407 -499 -408 -312 -235 -335 -482 -414 -274 -494 -400 -213 -122 -405 -158 -82 -225 -460 -323 -221 -227 -52 -19 116 21
4858B1J56qm13J73J77j00R5M2Q3j67J4J95J62l17J59j24M63k99J03k8j0j26K79
$$ 21 177 169 -244 -71 106 6 101 143 226 59 73 268 430 113 272 148 611 312 415 387 377 251 530
4881E30l8l7K19j58K8q4pL8NJ32J23j17q4K4k77J20j56L59p7k08o9K83l57P0J69
$$ 530 492 455 674 516 544 460 453 491 496 628 751 634 550 574 297 417 261 620 543 335 266 549 192 262 431
4906D31j22j30K28N5k64j47L22j56l14M32m59J65K26k29N3K11m08o4k42J91M9
$$ 431 309 179 407 462 198 51 373 217 -97 335 -124 41 267 38 91 302 -106 -170 -412 -221 -172
4927a72l2J12j48Qj34L8j9J60k19J72M64o40J30J17k70R6O9m44M07M0l8j88J52
$$ -172 -204 -92 -240 -232 -366 -328 -347 -187 -406 -234 230 -410 -280 -163 -433 -337 -268 -712 -305 -265 -303 -491 -339
4950c39J16j90J05q9R8j36J99k82K26J9r2j00L54l57O1o3K96J98m85L33k44n7
$$ -339 -223 -413 -308 -397 -299 -435 -236 -518 -292 -273 -365 -465 -111 -468 -407 -470 -174 24 -461 -128 -372 -429
4972d29M78j80j94L43k92M0N3J05M1n5K6J5j58K24Nl21N20k65P6J41k98K47J28
$$ -429 49 -131 -325 18 -274 -234 -181 -76 -35 -90 -64 -49 -207 17 22 -299 221 -44 32 173 -125 122 250
4995B50j83K8N1l1K27k54L73k00j07j36K02MJ72m76L46L33m17K66K69l61q8J24
$$ 250 67 95 146 115 342 88 461 261 154 18 220 224 396 -80 266 599 182 448 717 356 268 392
5017C92O7k39J2K55k01K64K97l36j43L39k77j04L7Q8j17J30k90K13lR0j91q9L30
$$ 392 459 220 232 487 286 550 847 511 368 707 430 326 363 451 334 464 174 387 384 474 283 194 524
5040E24q1k83M42j61l70M20k97l45M50j90J99j16k30q2J52M1L9K50m29np8O4l40
$$ 524 443 160 602 441 71 491 194 -151 299 109 308 192 -38 -120 32 73 112 362 -67 -72 -150 -86 -426
5063d26L35j9l40M10Nm69l1K72l36L99j32R2l21jL82k98K70l7j19j20o8k76M33
$$ -426 -91 -110 -450 -40 -35 -504 -535 -263 -599 -200 -332 -240 -561 -562 -180 -478 -208 -245 -364 -484 -552 -828 -395
5086c95O7p1j1j39P0J71k43N51n15O8L6q6m5J72r6J76o3K3R9L27j81j15j48J42
$$ -395 -328 -399 -410 -549 -479 -308 -551 0 -515 -447 -411 -497 -542 -370 -466 -290 -353 -330 -231 96 -85 -200 -348 -206
5110b06P5k5k8m6q1K98p1o3K29r2k5J32k92K27L1j21K33J3r4N3Jo6J15j30L38
$$ -206 -131 -156 -184 -230 -311 -13 -84 -147 82 -10 -35 97 -195 32 63 -58 175 188 94 147 148 82 197 67 405
5135D05j79r5J27J80l62J28pq9J38MK74k10J20n6J6j07L21k50K42m03m1L71l41
$$ 405 226 131 258 438 76 204 197 108 246 250 524 314 434 378 394 287 608 358 600 197 156 527 186
5158A86oJ69K71j45n5M4k43K12J51k06j27J41j39m6L96j96J18Q8k42l57L15M7
$$ 186 180 349 620 475 420 464 221 433 584 378 251 392 253 207 603 407 525 613 371 14 329 376
5180C76k97rP4L0q2N0j61qQ1q7P6O7l40n2K98l32J27J34j64n3k0J10m9L2J65l87
$$ 376 79 70 144 174 92 142 -19 -27 54 -33 43 110 -230 -282 16 -316 -189 -55 -219 -272 -292 -182 -231 -199 -34 -421
5206d21j46M10r2l9k04r2N0L09j18Lm9M2k97K15Q1j18m9J60k22J47K52k42p9K94
$$ -421 -567 -157 -249 -288 -492 -584 -534 -225 -343 -340 -389 -347 -644 -429 -348 -466 -515 -355 -577 -430 -178 -420 -499 -205
5230b05q4k08RK09k74J66K42J6j54K40k37N5M2J27P2j21K60m40K23k52J31K43
$$ -205 -289 -497 -488 -279 -553 -387 -145 -129 -283 -43 -280 -225 -183 -56 16 -105 155 -285 -62 -314 -183 60
5252F0j19o1J06m4J41k0J94j08j47J59N2R7j64J48j84K30N2n8j32J56k36J86J97
$$ 60 -59 -120 -14 -58 83 63 257 149 2 161 213 310 146 294 110 340 392 334 202 358 122 308 505
5275E05l00J43K55l79L08k2p0O3kk70P7o1J15L2j61K25l65M42k5m30K67P0m5j3
$$ 505 205 348 603 224 532 510 440 503 501 231 308 247 362 394 233 458 93 535 510 80 347 417 372 359
5299C59p7L7j95K2K99m40L28p3L4k09j0j00K85J54l37j73J51k42K00L9N9j04k64
$$ 359 282 319 124 146 445 5 333 260 294 85 75 -25 260 414 77 -96 55 -187 13 52 111 7 -257
5322b57L73m3l6R6k88K6lk9j53J49Oj44L08l58L04k51K3j57K42j3l4j11oL09l54
$$ -257 116 73 37 133 -155 -129 -132 -161 -314 -165 -159 -303 5 -353 -49 -300 -277 -434 -192 -205 -239 -350 -356 -47 -401
5347d01K18k65R9J37j06J6j95Q8j84J27J6J44O0n8l8O4K41k87R6k9j32L7J41n8
$$ -401 -183 -448 -349 -212 -318 -302 -497 -409 -593 -466 -450 -306 -246 -304 -342 -278 -37 -324 -228 -257 -389 -352 -211 -269
5371b69K8j1l8P7M9q9L9j02L03k33P5Q9j35j06M16R6j95R8j89J19rK18k60K96
$$ -269 -241 -252 -290 -213 -164 -253 -214 -316 -13 -246 -171 -82 -217 -323 93 189 -6 92 -97 22 13 231 -29 267
5395B67m1j46K77j77J7P8J88l20J33R8J18k87L01m6k76R0K56r9J27j14k53L11
$$ 267 226 80 357 180 197 275 463 143 276 374 492 205 506 460 184 274 530 431 558 444 191 502
5417E02j83N0J26L9N5M7r0o5k9l22K11k39J44Q6j66K56j67j74L61N5k19jk84K33
$$ 502 319 369 495 534 589 636 546 481 452 130 341 102 246 332 166 422 255 81 442 497 278 277 -7 226
5441B26L4J35l8m02Q5j08%J0o6M3o0J35o6j68J13j96OK36j99j8L5n3o2J39M4m3
$$ 226 260 395 357 -45 40 -68 -68 -58 -124 -81 -141 -6 -72 -240 -127 -323 -317 -81 -280 -298 -263 -316 -378 -239 -195 -238
5467b38oj46lL22k41L4J93k47j80K80P9j12j06j52J02MPJ97l64L00J38l9l47K41
$$ -238 -244 -390 -393 -71 -312 -278 -85 -332 -512 -232 -153 -265 -371 -523 -421 -417 -410 -213 -577 -277 -139 -178 -525 -284
5491b84m50N87j08p0l42K89K28k03k01K15M2j9K72l7n0K5j87J4K38n8n1K55j36
$$ -284 -734 -147 -255 -325 -667 -378 -150 -353 -554 -339 -297 -316 -44 -81 -131 -106 -293 -279 -41 -99 -150 105 -31
5514c1l8j36J95o0K34r2k50J96R0l57N13J91l58l4J77k22K28j60J28k22J81k3
$$ -31 -69 -205 -10 -70 164 72 -178 18 108 -249 264 455 97 63 240 18 246 86 214 -8 173 150
5536A50j86J8L78l94K31k6j79L67j69N2l5L06l13L11j37l3J34k65K19o1j04N53
$$ 150 -36 -18 360 -34 197 171 -8 359 190 242 207 513 200 511 374 341 475 210 429 368 264 817
5558H17n11j49M01n17p9N28j37l30K49J91k77k11L15j94K5p8p2J65m1j12M46j36
$$ 817 306 157 558 41 -38 490 353 23 272 463 186 -25 290 96 121 43 -29 136 95 -17 429 293
5580B93k66pJ10L8k72L30l08k2k0J69j11J33m17O5J99k20J07j18L04l99Q5j77
$$ 293 27 20 130 168 -104 226 -82 -104 -124 45 -66 67 -350 -285 -86 -306 -199 -317 -13 -412 -327 -504
5602e04J01K22m0k89J66N2j47O0O0J26k29L14j17k46L6m6J30N4m6j67K44P0M5
$$ -504 -403 -181 -221 -510 -344 -292 -439 -379 -319 -193 -422 -108 -225 -471 -435 -481 -351 -297 -343 -510 -266 -196 -151
5625a51k02l4k2NK64K48n31L00j02j8J8L99m76M2K50J53j46j53K10l77J77l6L89
$$ -151 -353 -387 -409 -404 -140 108 -423 -123 -225 -243 -225 174 -302 -260 -10 143 -3 -156 54 -323 -146 -182 207
5648B07l16K14K0L9L2l92J84K51Nj2j32jK7r4M13l68J66P2k55M5M53k81J27n1
$$ 207 -109 105 125 164 196 -196 -12 239 244 232 100 99 126 32 445 77 243 315 60 105 558 277 404 353
5672C53k48K64p8po5J16k55p3K06j60J9K32L53m57r4K11J1l68K96L7k93J58J31
$$ 353 105 369 291 284 219 335 80 7 213 53 72 304 657 200 106 317 328 -40 256 293 0 158 289
5695B89j05J93L6j44J62p2n1j64M03m90M6J69J2o9j43RL09m29o9J80Q5j18P8j6
$$ 289 184 377 413 269 431 359 308 144 547 57 103 272 284 215 72 81 390 -39 -108 72 157 39 117 101
5719A01k09J50j9o2Q7k65OK06J0O2m73J92p0j6K37j32l5r3M5N5p4J89k17m8J25
$$ 101 -108 42 23 -39 48 -217 -211 -5 5 67 -406 -214 -284 -300 -63 -195 -230 -323 -278 -223 -297 -108 -325 -373 -248
5744b48j11j63J0K02K5l06K88Q6k51N6K83l86P0J68j26K03J0k43M19k04J43j32
$$ -248 -359 -522 -512 -310 -285 -591 -303 -217 -468 -412 -129 -515 -445 -277 -403 -200 -190 -433 -14 -218 -75 -207
5766b07M4K0qk09K58q6l38O82j44k14M91l79j34K42J85j09J50R6p9oj21j96l1
$$ -207 -163 -143 -151 -360 -102 -188 -526 156 12 -202 289 -90 -224 18 203 94 244 340 261 255 134 -62 -93
5789i3L81k50J68K55m87J49J35j07o7L4J38k50M39k92j2J60l7n8l3L06l96K27
$$ -93 288 38 206 461 -26 123 258 151 84 118 256 6 445 153 141 301 264 206 173 479 83 310
5811C10K6l21L05j18K5j0K50l61J4J38q9J44k2M4m05K96J11l94L84O6j83j1J42
$$ 310 336 15 320 202 227 217 467 106 120 258 169 313 291 335 -70 226 337 -57 327 393 210 199 341
5834C41j13k7r2J40k53J31j24j74L00l7M3k40L15l30J68l7J43k48K06k50r2M44
$$ 341 228 201 109 249 -4 127 3 -171 129 92 135 -105 210 -120 48 11 154 -94 112 -138 -230 214
5856B14k45p2J83j68j93M21k91Rk60K38Q7j89P6j27P1p1J33k1pJ08q0J40k48k68
$$ 214 -31 -103 80 -88 -281 140 -151 -142 -402 -164 -77 -266 -190 -317 -246 -317 -184 -205 -212 -104 -184 -44 -292 -560
5880e60K02L0r9K04oj4k59K80j80N3K36O0k31k4K64l36K14K24j23l58J06r6M7
$$ -560 -358 -328 -427 -223 -229 -243 -502 -222 -402 -349 -113 -53 -284 -308 -44 -380 -166 58 -65 -423 -317 -413 -366
5903c66L27j53j07J47j67J90l5K20J6n3K0j68J98n2J09J0L9k36J14r6M19j14k45
$$ -366 -39 -192 -299 -152 -319 -129 -164 56 72 19 39 -129 69 17 126 136 175 -61 53 -43 376 262 17
5926A7J31r5J98j78J10J28L5j27K99j11k93M7K03k90K28j67L4m4J96j81K81J58
$$ 17 148 53 251 73 183 311 346 219 518 407 114 161 364 74 302 135 169 125 321 140 421 579
5948E79j83j88K32j66k7o6J32p2J07j29m5rM27l06j54K92m17N2K18Q8k40L4k66
$$ 579 396 208 440 274 247 181 313 241 348 219 174 165 592 286 132 424 7 59 277 365 125 159 -107
5971a07J71J0j78J45J49l0p1j09j95J71j18K99k30j86J44r1K22q5J33j74J05k21
$$ -107 64 74 -104 41 190 160 89 -20 -215 -44 -162 137 -93 -279 -135 -226 -4 -89 44 -130 -25 -246
5993b46K18l22J87J04j47J5j1l9P8j50J53J1K4n9r0Jk24J79pp8K02n3J63k58P6
$$ -246 -28 -350 -163 -59 -206 -191 -202 -241 -163 -313 -160 -149 -125 -184 -274 -273 -497 -318 -325 -403 -201 -254 -91 -349 -273
6018b73L43k46J21P6k63n2K43k61P4J21o7j93J70P0j27J79J17k48K53O0k46J5
$$ -273 70 -176 -55 21 -242 -294 -51 -312 -238 -117 -184 -377 -207 -137 -264 -85 32 -216 37 97 -149 -134
6040a34J81r1q7M25j31l32J55R0k44L96k15j09J01R5k76J92J93m30L06O8j31J98
$$ -134 47 -44 -131 294 163 -169 -14 76 -168 228 13 -96 5 100 -176 16 209 -221 85 153 22 220
6062B20j46l5K72k30M37m41K11p0m2P2K38m19P5N3k01J33J4R9j92J92M0j67L34
$$ 220 74 39 311 81 518 77 288 218 176 248 486 67 142 195 -6 127 141 240 48 240 280 113 447
6085D47j48j39J68J4j29J26j15K8J05r7j08J97k27J26l7j40J77j70K96n4l81K14
$$ 447 299 160 328 342 213 339 224 252 357 260 152 349 122 248 211 71 248 78 374 320 -61 153
6107A53j01k66J85j08K54n2jN3l67J28L7J15n5j07jj91J72o5J12N7k36M8j28k00
$$ 153 52 -214 -29 -137 117 65 64 117 -250 -122 -85 30 -25 -132 -133 -324 -152 -217 -105 -48 -284 -236 -364 -564
6131e64L08J18j22m5NJ91m59L08l0j87K15R3k15K33k21M05j94j9J9m7j52o1pN43
$$ -564 -256 -138 -260 -305 -300 -109 -568 -260 -290 -477 -262 -169 -384 -151 -372 33 -161 -180 -161 -208 -360 -421 -428 115
6155A15n37K96L7J10l05P2J10j19nJ09N5Q4k53L63k68J28p4p0n2K78j57K02M6
$$ 115 -422 -126 -89 21 -284 -212 -102 -221 -226 -117 -62 22 -231 132 -136 -8 -82 -152 -204 74 -83 119 165
6178A65k66J21J33k28P2J15j9j6R1m0p3j9RM4n5jp8L54Q9m06J42J60p6m7J41j0
$$ 165 -101 20 153 -75 -3 112 93 77 168 128 55 36 45 89 34 33 -45 309 398 -8 134 294 218 171 312 302
6204C02j36j41P1J88j46L61n62M83j02j36K79p0l50O7K01j81j33J79j76J77L94
$$ 302 166 25 96 284 138 499 -63 420 318 182 461 391 41 108 309 128 -5 174 -2 175 569
6225E69m14j38K93k12m00N01L9k33qP1K7j25J39k67L64j42p7J00j1j37p1K95k04
$$ 569 155 17 310 98 -302 199 238 5 -3 68 95 -30 109 -158 206 64 -13 87 76 -61 -132 163 -41
6248d1j17J29M4k58K65l03J18Q4m4j55L5R3J14k53J45k44k7J89j28j37K54M4l5
$$ -41 -158 -29 15 -243 22 -281 -163 -79 -123 -278 -243 -150 -36 -289 -144 -388 -415 -226 -354 -491 -237 -193 -228
6271b28j86L78k61J48k15L9n3P5j6l9J59J91k89J84J4k13N5P6M5k35K23m6r3K94
$$ -228 -414 -36 -297 -149 -364 -325 -378 -303 -319 -358 -199 -8 -297 -113 -99 -312 -257 -181 -136 -371 -148 -194 -287 7
6295GP5k39J25k53j37M43jk86K49j22J3R5l0n0K66J84j97k07K91m2q0K50m77K49
$$ 7 82 -157 -32 -285 -422 21 20 -266 -17 -139 -126 -31 -61 -111 155 339 142 -65 226 184 104 354 -123 126
6319A26J54J16l58K07L8lk5O4n1j85P7J82k53K55n13M1M35l33J37K23L4l17P7
$$ 126 280 396 38 245 283 280 255 319 268 83 160 342 89 344 -169 -128 307 -26 111 334 368 51 128
6342A28o7J72j06K81k43J73j23k4J26j73K95j54q4j41J00K02j50J18j53P6k01
$$ 128 61 233 127 408 165 338 215 191 317 144 439 285 201 60 160 362 212 330 177 253 52
6363E2q1r7K19k6J91P6k54J10j53j90j7K31k87K24j09OP3K18n17K24K22j79rP3
$$ 52 -29 -126 93 67 258 334 80 190 37 -153 -170 61 -226 -2 -111 -105 -32 186 -331 -107 115 -64 -73 0
6387@K6j52PJ2j07J14K06m83L7J0Q1o3K0l2K86o6pJ88m24j4K32k11J88O8j01J37
$$ 0 26 -126 -119 -107 -214 -100 106 -377 -340 -330 -249 -312 -292 -324 -38 -104 -111 77 -347 -361 -129 -340 -152 -84 -185 -48
6413d8l33J4J63nl07L87q2J05Rko4j48j58J64J23J49j00j63J16n4M0K97l06J85
$$ -48 -381 -367 -204 -209 -516 -129 -211 -106 -97 -99 -163 -311 -469 -305 -182 -33 -133 -296 -180 -234 -194 103 -203 -18
6437a8J64l13J08J00r4k5M0j07J63J5m7J25K06J15k62m9J3j10J69k0J07j37K07
$$ -18 146 -167 -59 41 -53 -78 -38 -145 18 33 -14 111 317 432 170 121 134 24 193 173 280 143 350
6460C50n0M5k07J17n7O3nK6j99o9J0%L86j73j75L67l22J1q8J74L7O0n5P6j93l7
$$ 350 300 345 138 255 198 261 256 282 83 14 24 24 410 237 62 429 107 118 30 204 241 301 246 322 129 92
6486I2J34J2R9q0lk14M0N5j1k18J19J00J08l38L3K44k46k16M91k50Q9r3m49M31
$$ 92 226 238 337 257 254 40 80 135 124 -94 25 125 233 -105 -72 172 -74 -290 201 -49 40 -53 -502 -71
6510g1M3J9j05K29Rj92j79J29o5J68J42m54J37K67n75L76J9j25J65K47k78p0J1
$$ -71 -28 -9 -114 115 124 -68 -247 -118 -183 -15 127 -327 -190 77 -498 -122 -103 -228 -63 184 -94 -164 -153
6533a53l08J75L28k48l5Q4J88k32j22K63l59K46N6J62l03k2J15j59N4N0j82M81
$$ -153 -461 -286 42 -206 -241 -157 31 -201 -323 -60 -419 -173 -117 45 -258 -280 -165 -324 -270 -220 -402 79
6555G9l37j91J98J34k51K87j09qJ12K58l68J60j05P4j10j73L68j3j87J18P0j31
$$ 79 -258 -449 -251 -117 -368 -81 -190 -198 -86 172 -196 -36 -141 -67 -177 -350 18 5 -182 -64 6 -125
6577a25L24m27K7L29j53Q7O2j13J38j04J57j93L90k9j65K43m3kj05Q1m36N5L85
$$ -125 199 -228 -201 128 -25 62 124 11 149 45 202 9 399 370 205 448 405 403 298 379 -57 -2 383
6600C83k12J86r6J2K3k2j55j04K19O1k90K94K04L9n01N30k26k40K86l50K38Q3
$$ 383 171 357 261 273 296 274 119 15 234 295 5 299 503 542 41 571 345 105 391 41 279 362
6622C62R8l54P0K02k56J08M4k02Rk08O7J84J0j59o6N6p9Q6n3J25J16j80j37j43
$$ 362 460 106 176 378 122 230 274 72 81 -127 -60 124 134 -25 -91 -35 -114 -28 -81 44 160 -20 -157 -300
6646c00p9K54Q8p2L58n36P2J43l97K42J76j85j49J97J09j39j32L36l1k17K23k76
$$ -300 -379 -125 -37 -109 249 -287 -215 -72 -469 -227 -51 -236 -385 -188 -79 -218 -350 -14 -45 -262 -39 -315
6668c15l5K77k18m8K81j11q9K79k95j61L53j49R3j27K08j28k8NQ1j46K92n8k11
$$ -315 -350 -73 -291 -339 -58 -169 -258 21 -274 -435 -82 -231 -138 -265 -57 -185 -213 -208 -127 -273 19 -39 -250
6691b50L74l63K12k36J2Q0K5r6K23K2j02J76k49O3Q6K42j03k10J72K37j94m39
$$ -250 124 -239 -27 -263 -251 -171 -146 -242 -19 3 -99 77 -172 -109 -23 219 116 -94 78 315 121 -318
6713c18K96J06r3P7N1m7M9p6M8J05j5J25j44k9k5Q6J20j82o2K00j03o0r2J56l3
$$ -318 -22 84 -9 68 119 72 121 45 93 198 183 308 164 135 110 196 316 134 72 272 169 109 17 173 140
6738A40n8J6J9N8O9p7o5K23q3m3L3J73j31j59m0M3R1O4M8k63J04K7Kj25M0p5K3
$$ 140 82 98 117 175 244 167 102 325 242 199 232 405 274 115 75 118 209 273 321 58 162 189 191 66 106 31 54
6765E4j03jK47k71j96L04M8n1O5Nk07j15K09j42K41J06l24k3J02l7l54L69k54
$$ 54 -49 -50 197 -74 -270 34 82 31 96 101 -106 -221 -12 -154 87 193 -131 -154 -52 -89 -443 -74 -328
6788c28N6M63k24l7j83K17k99O4J72k2r0l57L76k43J77J34j72J48N5q0k28J06
$$ -328 -272 191 -33 -70 -253 -36 -335 -271 -99 -121 -211 -568 -192 -435 -258 -124 -296 -148 -93 -173 -401 -295
6810b95k64M86n75K74j30K99j73J32j19K53N4l84M35l06M40k87q2J49o4L3j3J33
$$ -295 -559 -73 -648 -374 -504 -205 -378 -246 -365 -112 -58 -442 -7 -313 127 -160 -242 -93 -157 -124 -137 -4
6832dj15J30J8L9j87J97L39m13P6k84R4J13P0p7K09M3l50K94k12O7L01k03K35
$$ -4 -119 11 29 68 -119 78 417 4 80 -204 -110 3 73 -4 205 248 -102 192 -20 47 348 145 380
6855C80l22l8J91j40K76p9j1k61L09j50j83K40K80m16J77l5j41K12j86j40L34
$$ 380 58 20 211 71 347 268 257 -4 305 155 -28 212 492 76 253 218 77 289 103 -37 297
6876B97j59K46l34J30J01j25j20K26k41J05q2J70r4J72j6j42p7r5M2K36l67J14
$$ 297 138 384 50 180 281 156 36 262 21 126 44 214 120 292 276 134 57 -38 4 240 -127 -13
6898a3K10r0j29J47J27k51j21J88j69j9N8K5P9L5j51K31j81k16J39q4j27j07M28
$$ -13 197 107 -22 125 252 1 -120 68 -101 -120 -62 -37 42 77 -74 157 -24 -240 -101 -185 -312 -419 9
6921IQ2l15M0L67l56K75m61J52k8K28k76K79k04k35K07K07k36N9K12m7l05O0J26
$$ 9 91 -224 -184 183 -173 102 -359 -207 -235 -7 -283 -4 -208 -443 -236 -29 -265 -206 6 -41 -346 -286 -160
6944a60p2Rl4j25K84J8l54M3L79j76q9J25k37L45l8K34k90J92p3nJ81o8l16K01
$$ -160 -232 -223 -257 -382 -98 -80 -434 -391 -12 -188 -277 -152 -389 -44 -82 152 -138 54 -19 -24 157 89 -227 -26
6968b6K0k6l4K92j64j17K23m09K88O4m3K65l29K50J6k03K40r9j95M02k22K09n8
$$ -26 -6 -32 -66 226 62 -55 168 -241 47 111 68 333 4 254 270 67 307 208 13 415 193 402 344
6991C44n2K24l23j03R1r1j8lJ48N1j06Nj2j58J82J51j23j72K40j23j0L39j81j44
$$ 344 292 516 193 90 181 90 72 69 217 268 162 167 155 -3 179 330 207 35 275 152 142 481 300 156
7015A56j2N8O4l03L16l81J4K17j08J9K06l2l16J3K34O6l79J9J92J0j41Q2k84L71
$$ 156 144 202 266 -37 279 -102 -88 129 21 40 246 214 -102 -89 145 211 -168 -149 43 53 -88 -6 -290 81
7039H1J2k41K76k04l39M28j26k9J94j28j4J06j22r5K1oPJ78Q0m12L47j8k04R0
$$ 81 93 -148 128 -76 -415 13 -113 -142 52 -76 -90 16 -106 -201 -180 -186 -179 -1 79 -333 14 -4 -208 -118
7063a18jjP4l14J99Oq1J65k18L31l37p2J72k16K51J98l67J47K86n0m7k92M0J97
$$ -118 -119 -120 -46 -360 -161 -155 -236 -71 -289 42 -295 -367 -195 -411 -160 38 -329 -182 104 54 7 -285 -245 -48
7087d8o7L9O8l80J87K06j65J44J49k31J10M6m00L47J0o8j72Q4J98rO3r1K97k47
$$ -48 -115 -76 -8 -388 -201 5 -160 -16 133 -98 12 58 -342 5 15 -53 -225 -141 57 48 111 20 317 70
7111G0J89k59k48O93m36O8M8J47k49j3O2j32L73j93j2J88j92L1j93N50J06l19
$$ 70 259 0 -248 445 9 77 125 272 23 10 72 -60 313 120 108 296 104 135 -58 492 598 279
7133B79j7K9q2lM0j70k0J76J85m53L77j00j01M6j06k67M80O9l64m6J91j29J47
$$ 279 262 291 209 206 246 76 56 232 417 -36 341 241 140 186 80 -187 293 362 -2 -48 143 14 161
7156A61R0k84M7K03m53K51Q5N8n6j52j0J84j73J76p5ok80p0L91j74K08k78R6J03
$$ 161 251 -33 14 217 -236 15 100 158 102 -50 -60 124 -49 127 52 46 -234 -304 87 -87 121 -157 -61 42
7180D2k07N7j15J34L46n99K69k54K58J10k18K6J5j92L14k84l8L3J62j70J04j34
$$ 42 -165 -108 -223 -89 257 -342 -73 -327 -69 41 -177 -151 -136 -328 -14 -298 -336 -303 -141 -311 -207 -341
7202c41m4J50oN5m9J07p2L7p3J3Q7J20m12J81L13k44M19k70k34L81j06k02K50
$$ -341 -385 -235 -241 -186 -235 -128 -200 -163 -236 -223 -136 -16 -428 -247 66 -178 241 -29 -263 118 12 -190 60
7225F0j80M4J5K9k49M64k48J98m82L08K83k85J33jk5j71L3P5J05j10M5J92k42
$$ 60 -120 -76 -61 -32 -281 183 -65 133 -349 -41 242 -43 90 89 64 -107 -74 1 106 -4 41 233 -9
7248iR2j3J4K5J10j27L11k50J38R8j43p4J13l47J09J03J93l79J47R7Nj44J57N7
$$ -9 83 70 84 109 219 92 403 153 291 389 246 172 285 -62 47 150 343 -36 111 208 213 69 226 283
7272B83j48L94m55j35J75nR9l9L4j11J00j4jk56M69k75K03j93o0o2J03k65l1K31
$$ 283 135 529 74 -61 114 109 208 169 203 92 192 178 177 -79 390 115 318 125 65 3 106 -159 -190 41
7296D1N7k28K18Pl10K0P7PJ7J61k63K1P0k7j46L76j48K8o3j72J47rl3K9k38M27
$$ 41 98 -130 88 95 -215 -195 -118 -111 -94 67 -196 -175 -105 -132 -278 98 -50 -22 -85 -257 -110 -119 -152 -123 -361 66
7322F6n20K23k7p3k73N07l42J00K28k00%p3L06j63K61J31k25j03o0K95j02J69
$$ 66 -454 -231 -258 -331 -604 -97 -439 -339 -111 -311 -311 -384 -78 -241 20 151 -74 -177 -237 58 -44 125
7344A25k39P4q7j14j13J54L2O0O3j5J86k96Q9N9q8J93j46M0K08l60J32J67J39
$$ 125 -114 -40 -127 -241 -354 -200 -168 -108 -45 -60 126 -170 -81 -22 -110 83 -63 -23 185 -175 -43 124 263
7367B63o45M79O2k94M33k55Q1N1R9l64K28J53m15L80k29N6j75L56j21k76O05l88
$$ 263 -382 97 159 -135 298 43 124 175 274 -90 138 291 -124 256 27 83 -92 264 143 -133 472 84
7389H4q6J44o8K01l3O6j22k13J24%M1Q0l40L15j36K09j01P1J02l03J31k10J74
$$ 84 -2 142 74 275 242 308 186 -27 97 97 138 218 -122 193 57 266 165 236 338 35 166 -44 130
7412A30j34K57k66J48Q1j41J17Qj47r7J67O0k33Q9Pj4lr4K32n7o6l22N32k28k31
$$ 130 -4 253 -13 135 216 75 192 200 53 -44 123 183 -50 39 46 32 29 -65 167 110 44 -278 254 26 -205
7437b05J40J70j03k17j77O43k39P2j28r3j11J25p8j65K55k63K98j33k63K92Q7
$$ -205 -65 105 2 -215 -392 251 12 84 -44 -137 -248 -123 -201 -366 -111 -374 -76 -209 -472 -180 -93
7458i3O2j96P2j13j87M09k72K13k24P4l9N9j78M05j06N3k9j08l0K30q6l7Q8o7
$$ -93 -31 -227 -155 -268 -455 -46 -318 -105 -329 -255 -294 -235 -413 -8 -114 -61 -90 -198 -228 2 -84 -121 -33 -100
7482a00RM29n73J41M1k06L15m6jj92M49l81r9K46L1l3R9j85RJ41n8k7K00q9k09
$$ -100 -91 338 -235 -94 -53 -259 56 10 9 -183 266 -115 -214 32 63 30 129 -56 -47 94 36 9 209 120 -89
7507h9J28K82l4k02J10j4p9q0m0P2q4K40o1N9Q4J12r3m7k33K7P2j32K06Jj71R6
$$ -89 39 321 287 85 195 181 102 22 -18 54 -30 210 149 208 292 404 311 264 31 58 130 -2 204 205 34 130
7533A30M8j12J85n9l00P9J17P1P4r5nm5N9rR5l82J01K59j97ON3l55J09L10j20
$$ 130 178 66 251 192 -108 -29 88 159 233 138 133 88 147 138 233 -149 -48 211 14 20 73 -282 -173 137 17
7558A7r6o6J88p1K1l6k60K83J86l83R7P6k28K51oj02J83o1j40P4j47k40K65O7
$$ 17 -79 -145 43 -28 -7 -43 -303 -20 166 -217 -120 -44 -272 -21 -27 -129 54 -7 -147 -73 -220 -460 -195 -128
7582a28n4k5R1r8R9l4j31J17o8J4K8J39j54P0l8j7p0J99j02M4Rj17M1MQ3J8j88
$$ -128 -182 -207 -116 -214 -115 -149 -280 -163 -231 -217 -189 -50 -204 -134 -172 -189 -259 -60 -162 -118 -109 -226 -185 -181 -98 -80 -268
7609b68K7K42j14M8j1Q8n2q8J23j64m7K79j67M2J1n7K3R3j46K15M4j23PK20j06
$$ -268 -241 1 -113 -65 -76 12 -40 -128 -5 -169 -216 63 -104 -62 -51 -108 -85 8 -138 77 121 -2 5 225 119
7634A19L6k21K33l29P2L76J5R1k48l30K56L0j42M84j31l10jK08j60J72j74mJ35
$$ 119 155 -66 167 -162 -90 286 301 392 144 -186 70 100 -42 442 311 1 0 208 48 220 46 42 177
7657A77L0K63j99k49K77R7m52L14k71K33r3J51j40MR0j09j67J73r7J67k40J71
$$ 177 207 470 271 22 299 396 -56 258 -13 220 127 278 138 142 232 123 -44 129 32 199 -41 130
7679A30r3j57J54R0j67m6K3k0J31k15J60n2K06Qj36o1l5r1j19Q8K70j34j8K37
$$ 130 37 -120 34 124 -43 -89 -66 -86 45 -170 -10 -62 144 152 16 -45 -80 -171 -290 -202 68 -66 -84 153
7703A53m11J93j65NL47j79L1j68j0j01K20r7K2r4J47kq8J6P2K9M4Lk47J88k9K10
$$ 153 -258 -65 -230 -225 122 -57 -26 -194 -204 -305 -85 -182 -160 -254 -107 -109 -197 -181 -109 -80 -36 -33 -280 -92 -121 89
7729H9k08j76k1J08J01P5k60K32j47K46m01J69P0j25J0N0J60o3j22K19j71K5j1
$$ 89 -119 -295 -316 -208 -107 -32 -292 -60 -207 39 -362 -193 -123 -248 -238 -188 -28 -91 -213 6 -165 -140 -151
7752a51K09j31K7j56L19o0j53J08j02K44k41K27Q6N9P4p4m94N91k82k39J3K25
$$ -151 58 -73 -46 -202 117 57 -96 12 -90 154 -87 140 226 285 359 285 -209 382 100 -139 -126 99
7774I9J5N2j89N0K5R4M0j86J88k31L04j33K7k5j56J16p8J84n6K11k66m8O3K81
$$ 99 114 166 -23 27 52 146 186 0 188 -43 261 128 155 130 -26 90 12 196 140 351 85 37 100 381
7798C81k20J14j2j75K04k6n12K77J68J15m5q9K2n2J00O6k13J5l2N7N9k17N1r0
$$ 381 161 275 263 88 292 266 -246 31 199 314 269 180 202 150 250 316 103 118 86 143 202 -15 36 -54
7822e4L02m22M10o2l27j09K72Kp3J01R0j55k4J91l27M4o4K31j54j20J87l88J88
$$ -54 248 -174 236 174 -153 -262 10 12 -61 40 130 -25 -49 142 -185 -141 -205 26 -128 -248 -61 -449 -261
7845b61R0j5K13j35k01K4J83k66L27j5r3p3P7j2J52j57J71k26j7n4j48L7L84j23
$$ -261 -171 -186 27 -108 -309 -285 -102 -368 -41 -56 -149 -222 -145 -157 -5 -162 9 -217 -234 -288 -436 -399 -15 -138
7869a38n8J37Kj9j36J15N2o6l0J53P9j43J9r0M4Q2k51J11J08NJ73j99o4J60j38
$$ -138 -196 -59 -57 -76 -212 -97 -45 -111 -141 12 91 -52 -33 -123 -79 3 -248 -137 -29 -24 149 -50 -114 46 -92
7894i2P9M0J28j38j20J48n8O4o3KJ65J8L44m30m0j9Q8l3K17m19J72m8K73j17k0
$$ -92 -13 27 155 17 -103 45 -13 51 -12 -10 155 173 517 87 47 28 116 83 300 -119 53 5 278 161 141
7919A41m3M6l6M7J25m01L55k64L05p7l43K6L48kk18K27j57J36P1l0l9K6k06K22
$$ 141 98 144 108 155 280 -121 234 -30 275 198 -145 -119 229 227 9 236 79 215 286 256 217 243 37 259
7943B59k62J18P7m0k71M35k92j6p9J7J74j47K28j17j34J99J9j76moj5j50N0L26
$$ 259 -3 115 192 152 -119 316 24 8 -71 -54 120 -27 201 84 -50 149 168 -8 -12 -18 -33 -183 -133 193
7967A93j23J10l99J31k67M89m18L36j31J07l5K5j13L2K09k88J7m7J27k63K92m08
$$ 193 70 180 -219 -88 -355 134 -284 52 -79 28 -7 18 -95 -63 146 -142 -125 -172 -45 -308 -16 -424
7989d24N36l83J95j29p2K29l51J95pj21J3L24J07k05O0j67jp1J92j98M4L25k2
$$ -424 112 -271 -76 -205 -277 -48 -399 -204 -211 -332 -319 5 112 -93 -33 -200 -201 -272 -80 -278 -234 91 69
8012F9k30Q3J75p0n0m0k82M67j15J5k75J07L21k64KK21j19j97N3J04J57K6j78
$$ 69 -161 -78 97 27 -23 -63 -345 122 7 22 -253 -146 175 -89 -87 134 15 -182 -129 -25 132 158 -20
8035b0j46N05k85p1J03J25J51j81l37L83j93J57l25L86j76M1j55R6j4J03q5J74
$$ -20 -166 339 54 -17 86 211 362 181 -156 227 34 191 -134 252 76 117 -38 58 44 147 62 236
8057B36j5k49J25j41L31j99l7J54m0m3j64K49K0k4p4On5J5k8Q0r3K0j28Q8L56
$$ 236 221 -28 97 -44 287 88 51 205 165 122 -42 207 227 203 129 135 80 95 67 147 54 74 -54 34 390
8082C90k13j03nj62o5J39n9l1J61K8q5L4qN1K1J7j13m8M6j33K62l21K37k75J33
$$ 390 177 74 69 -93 -158 -19 -78 -109 52 80 -5 29 21 72 93 110 -3 -51 -5 -138 124 -197 40 -235 -102
8107a02L2J81j85j69P9K18k20J64j17j89J8Q9O1r7J72l86M4L87j96J27M8j84J9
$$ -102 -70 111 -74 -243 -164 54 -166 -2 -119 -308 -290 -201 -140 -237 -65 -451 -407 -20 -216 -89 -41 -225 -206
8130b06P3p0K10m53K71J02p0O7J92l96J09K8R3j40O0K7k0L1J26j23R5k04J27J02
$$ -206 -133 -203 7 -446 -175 -73 -143 -76 116 -280 -171 -143 -50 -190 -130 -103 -123 -92 34 -89 6 -198 -71 31
8154C1J17l22p3J08N2k6k11L79j01L4K0K52j82Q5kj08J11j36J21K98l04j69L44
$$ 31 148 -174 -247 -139 -87 -113 -324 55 -46 -12 8 260 78 163 161 53 164 28 149 447 143 -26 318
8177C18j87L6R4k81K27n0R7j98J67%k02K62l0J8
$$ 318 131 167 261 -20 207 157 254 56 223 223 21 283 253 271
8191B71
$$ Imaginary data points
##PAGE= N=2
##DATA TABLE= (X++(I..I)), XYDATA
0@%%%%%%%%%%qJ6j6J6k4L2m0M8n6P2q8J04j20J44j71J96k28K67l07L50m01M58
$$ 0 0 0 0 0 0 0 0 0 0 0 -8 8 -8 8 -16 16 -24 24 -32 40 -48 56 -64 80 -91 105 -123 144 -163 187 -214 244
32B44n21N91o69P53q44R46j058J179j311J458j619J793j982K190k417K664k936
$$ 244 -277 314 -355 398 -446 500 -558 621 -690 768 -851 942 -1040 1150 -1267 1397 -1539
49a539L234l562L924m323M768n267N829o467P196q044R041j0228J1676j3490J5831
$$ -1539 1695 -1867 2057 -2266 2502 -2765 3064 -3403 3793 -4251 4790 -5438 6238 -7252 8579
64H579j8979K3453l0333M2337o8942K24022n0764l20240L76804k19052k8120J97412
$$ 8579 -10400 13053 -17280 25057 -43885 180137 129373 -190867 185937 -33115 -61235 136177
76A36177j38597L5894J7387p4961J05311r8458L4024O9932j00640N2448k824p1823
$$ 136177 -2420 33474 50861 -24100 81211 -17247 16777 86709 -13931 38517 35693 -36130
88c6130R9015l8115k6340O0434p4618O329O8898o1402J9172N136l5186M0349k9546
$$ -36130 62885 24770 -1570 58864 -15754 -9425 59473 -1929 17243 22379 -12807 27542 -2004
101b004J1505K4130p3918P5185j1920q6530J08818m8702l5272J07296j01490Q460
$$ -2004 9501 33631 -40287 34898 22978 -63552 45266 -3436 -38708 68588 -32902 -24442
113b4442N7397q4554P7220j6294o3838R1927o1391j405O4892q4922L8994J8177
$$ -24442 32955 -51599 25621 9327 -54511 37416 -23975 -25380 39512 -45410 -6416 11761
125A1761n0678O1973m3678q271N8476p0365K9742K5146n9316N6818j5146k9007
$$ 11761 -38917 23056 -20622 -28893 29583 -40782 -11040 14106 -45210 11608 -3538 -32545
137c2545M0761n1931M0051K7687p9107O4273j1114n8095Q6487l8307l1363N4369
$$ -32545 8216 -43715 -3664 24023 -55084 9189 -1925 -60020 26467 -11840 -43203 11166
149A1166m3138K6688N777m4008N6553l6305q131N9884o9727K0576L8472o0151
$$ 11166 -31972 -5284 493 -43515 13038 -23267 -31398 28486 -41241 -20665 17807 -42344
161d2344M4550m143l8214N3508k5854j0929L2331l0466J1874P438j0379J5374
$$ -42344 2206 -1937 -40151 13357 -12497 -23426 8905 -21561 -9687 -2249 -12628 2746
173B746k7976K5298K0520o0347M3879J6140o7008O4321J0284o8988N1451J877
$$ 2746 -25230 68 20588 -39759 4120 20260 -46748 17573 27857 -41131 10320 12197
185A2197l1927L2743j4978M128L203j4244L6487l4721q836M8547m4041J9587K1948
$$ 12197 -19730 13013 -1965 2163 5366 -8878 27609 -7112 -15948 32599 -11442 8145 30093
198C0093n1380M0014o397k3784M6907l3832p84K6398l0627J9900o739K01K4997
$$ 30093 -21287 18727 12330 -11454 35453 1621 837 27235 -3392 16508 9769 9970 34967
211C4967m7020L1402J2931n8307O6123m387o0431N9676j9868k4687M8106k8370
$$ 34967 -12053 19349 32280 -26027 40096 35709 -24722 34954 15086 -9601 38505 10135
223A0135r15J1822k3952K8309j1873j3398L1209k8487L005J8224l1965K2723L352
$$ 10135 9220 21042 -2910 25399 13526 128 31337 2850 5855 24079 -7886 14837 18189
236A8189k2913L0298k1215j5983L4096k0609k973J7301j7764M629n755J830J3025
$$ 18189 -4724 25574 4359 -11624 22472 1863 -1110 16191 -1573 3056 -2699 -869 12156
249A2156l0407K4129J2948n1372L6100Q312m2205M0672q763k6755K5297j6335
$$ 12156 -18251 5878 18826 -32546 3554 11866 -30339 10333 1570 -25185 112 -16223
261a6223J2509L728k6423L1771k0254j3222M2264l5680J587K5679l3387K2235
$$ -16223 -3714 14 -26409 5362 -14892 -28114 14150 -21530 -19943 5736 -27651 -5416
273e416p01k2021L1370j8387k930J7994k5261J7395j512r806K7251l3599J0519
$$ -5416 -6117 -28138 3232 -15155 -18085 -91 -25352 -7957 -9469 -19275 7976 -25623 -15104
286a5104K9341n1942K9595K1594m8839L6263L841l1042K6387r939M243O818k3113
$$ -15104 14237 -37705 -8110 13484 -35355 908 4749 -26293 94 -9845 -5602 1216 -21897
299b1897K8787j2893j5203M2462l1057r148L4447l0116J0743J7052k9195J9467
$$ -21897 6890 -6003 -21206 21256 -9801 -18949 15498 -14618 -3875 13177 -16018 3449
311C449K73j6146K3467j0748o436J3185j0110N690n731J612K1105l0443J1421
$$ 3449 3722 -12424 11043 295 -6141 7044 -3066 2624 -3107 -1495 19610 -10833 588
324E88K4725m8505K8695K4993n1795L0874Q971l2234K9186r080m239J2094k0020
$$ 588 25313 -23192 5503 30496 -21299 9575 18546 -13688 15498 6418 2179 14273 -5747
337e747K3910j0582j8080L7251k5851P12K6014l9768K0870J1420k9123L3946j3217
$$ -5747 18163 7581 -10499 26752 901 1613 27627 -12141 8729 20149 -8974 24972 11755
350A1755k0561K8507j4360K434O635j0472J5909k2870P266K5218m1913K5402J9631
$$ 11755 -8806 19701 5341 7775 14410 3938 19847 -3023 4243 29461 -12452 12950 32581
363C2581n0434K9624R405l0719K9459r122j1071J3711j9458J9960R4k6411L1049
$$ 32581 -17853 11771 21176 -9543 19916 10794 -277 13434 -6024 13936 14030 -12381 18668
376A8668j4125j6588L3918k4524k894K2287k6208J4083K684k4039K7515r399j2253
$$ 18668 4543 -12045 21873 -2651 -5545 16742 -9466 4617 7301 -16738 10777 1378 -10875
389a0875K1311k0571M743Q574j5990K0255j6781p130L1918l4276M641K7483l7212
$$ -10875 10436 -10135 -5392 3182 -12808 7447 -9334 -16464 15454 -18822 -14181 13302 -23910
402b3910J6426J2187k6303J7908p702M05J3806k7330K1060J953k8036L4989j4655
$$ -23910 -7484 4703 -21600 -3692 -11394 -10989 2817 -24513 -3453 -1500 -29536 5453 -9202
415i202j8525L3630k2615M555J5543k9600K2048O73j7571K4384j7074j214J3827
$$ -9202 -27727 5903 -16712 -12157 3386 -26214 -4166 -3493 -21064 3320 -13754 -14968 -1141
428a141j4032J8754j4555p016L2515l5144O032L3207m2524J7601K2934l6717J6740
$$ -1141 -15173 3581 -10974 -17990 14525 -20619 -14587 18620 -23904 -6303 16631 -20086 -3346
441c346P633j1484J2289j1915P442K066j5651K7776r317k0392L1316j6620p531
$$ -3346 4287 -7197 5092 -6823 619 2685 -12966 14810 5493 -14899 16417 -203 -7734
454g734K7550k6047N058J9657k4671J4121M268j8522J8062l072l838K779r630
$$ -7734 19816 -6231 -1173 18484 -6187 7934 12202 -6320 11742 8670 4832 7611 -2019
467b019J9573j1427r560L1215l2017o94L7526l9134P383K3511k9664J7110l15
$$ -2019 17554 6127 -3433 27782 -4235 -4929 32597 -6537 846 24357 -5307 11803 11488
480A1488j2182J7371j9403J3307P134l1464K9054k993j9924K9106k1991l789K2574
$$ 11488 -694 16677 -2726 10581 17715 -13749 15305 12312 -7612 21494 -497 -4286 18288
493A8288k2610J4366J573k2774K3246o073p614J2663j3360Q475j190r378J8521
$$ 18288 -4322 10044 11617 -11157 12089 6016 -1598 11065 -2295 6180 4990 -4388 14133
506A4133j8383O98K4752k9136M341J8138k3679J4096M569j7061J3198q596K129
$$ 14133 -4250 -3552 21200 -7936 -3595 14543 -9136 4960 9529 -7532 5666 -2930 -801
519h01J2854k3789J3781P052k3817K3063o155j7219K5188j4750k783J4586k3022
$$ -801 12053 -11736 2045 9097 -14720 8343 2188 -15031 10157 -4593 -7376 7210 -15812
532a5812J3621Q707j9884J4853o877o440J3583j2558R323l603j4387K7590j7604
$$ -15812 -2191 6516 -13368 1485 -5392 -11832 1751 -10807 -1484 -5087 -19474 8116 -9488
545i488j2642L2414k4339k667K4086k3866M916O610o168J0594j8024J0150J0705
$$ -9488 -22130 10284 -14055 -16722 7364 -16502 -11586 -4976 -11144 -550 -18574 -8424 2281
558B281k7925K7186j406k9002L4530j0821j4106K5584k1151M202J5403j8306J1296
$$ 2281 -25644 1542 136 -28866 5664 -5157 -19263 6321 -14830 -10628 4775 -13531 -2235
571b235j615o532J2316q777O782j589j1607K3380j1575j1746K7841j8504o381
$$ -2235 -3850 -10382 1934 -6843 -61 -1650 -13257 10123 -1452 -13198 14643 -3861 -10242
584a0242K6144j9557k544J6357r601L261j59k907Q588j1439Q668P433k1710J7427
$$ -10242 15902 -3655 -6199 10158 557 3818 3659 752 9340 -2099 6569 14002 -7708 9719
598I719L032j8600K0970r805p656K2289j9593L803J2848k1757J5265L505j3736
$$ 9719 12751 -5849 15121 5316 -2340 19949 356 4159 17007 -4750 10515 14020 284
611B84J1338q312N620K129j4537K1339j2026j1902K9719k2367m492K4033k2221
$$ 284 11622 3310 8930 11059 -3478 17861 5835 -6067 23652 1285 -3207 20826 -1395
624a395N769P677j4430J3355q297j89J2515k1403J1595P799k1142J8790m873j3555
$$ -1395 4374 12051 -2379 10976 2679 2490 15005 -6398 5197 12996 -8146 10644 5771 -7784
638g784K0118j2882k183J3243j6879Q555M959j3307R736m906q72O346j1117J1403
$$ -7784 12334 -548 -2731 10512 -6367 2188 7147 -6160 3576 -1330 -2202 4144 -6973 4430
652D430k939j4043K0953r678j1970K0362j1070m772J2447q786K418k010j207R783
$$ 4430 1491 -12552 8401 -1277 -13247 7115 -3955 -8727 3720 -5066 -2648 -4658 -5865 3918
666C918j5985N679J3498k3197J2481R003k2998J7243J460j5346J6226r845k421
$$ 3918 -12067 -6388 7110 -16087 -3606 5397 -17601 -358 1102 -14244 1982 -7863 -10284
679a0284J2945j3730P655J446r853J1899r264L360P145j7910J8185j163j9689
$$ -10284 2661 -11069 -3414 -1968 -11821 78 -9186 -5826 1319 -16591 1594 431 -19258
692a9258K5285r764j2913K2539j3270k097Q831p559R009q187P96J1592j9604J2288
$$ -19258 6027 -3737 -16650 5889 -7381 -9478 -647 -8206 803 -7384 -6588 5004 -14600 -2312
706b312Q531k1929J8333m58j5879J9345q994n310J6771j3181J304Q265r909N755
$$ -2312 6219 -15710 2623 2165 -13714 5631 -3363 -8673 8098 -5083 -3779 4486 -5423 332
720C32J515j393K519p786R888q38j2662J9276n568j4646K2504q259j0646J7349
$$ 332 1847 454 2973 -4813 5075 4237 -8425 10851 5283 -9363 13141 4882 -5764 11585
734A1585p815k255O323n817O918o449J160J1769j7408O988J0511j8939J4397J550
$$ 11585 3770 1515 7838 2021 8939 2490 3650 15419 -1989 4999 15510 -3429 10968 12518
748A2518j5295J7468q473n706J5353j4625M524P609j2392Q588m237j161Q357j3568
$$ 12518 -2777 14691 6218 512 15865 1240 5764 13373 981 9569 5332 4171 12528 -1040
762a040J0294J238j6901J8936m779j2507J6331q996k305P069q572P715n805l510
$$ -1040 9254 10492 -6409 12527 7748 -4759 11572 2576 271 7340 -1232 6483 678 -2832
776b832J4107j5989J799J3595j8323P661O149j5319J1069j425o600J0010r790
$$ -2832 11275 -4714 -2915 10680 -7643 18 6167 -9152 1917 492 -6108 3902 -5888
789e888J431O944j0999O957j09o359Q680p701J679O777j3861J0160M223j6817
$$ -5888 -4457 2487 -8512 -1555 -1664 -8023 657 -7044 -5365 1412 -12449 -2289 1934 -14883
803a4883J3677K13j2415J1901j771m083L241l426O232o372j872J3261j5019K932
$$ -14883 -1206 -993 -13408 -1507 -3278 -7361 -4120 -7546 -1314 -7686 -9558 3703 -11316 -8384
817h384J4278j9760Q813Q292j7144J3780j924r456J3679p611o69O462p945O693
$$ -8384 5894 -13866 -5053 3239 -13905 -125 -2049 -11505 2174 -5437 -6106 356 -7589 -896
831h96l931J20Q185j4795J0447O367k0008J7294J623j7357J7185k304j0282R808
$$ -896 -4827 -4707 3478 -11317 -870 5497 -14511 2783 4406 -12951 4234 1930 -8352 1456
845A456k502J318j296j837Q763j0865K458J2069j6483O564Q746j5149J0168K129
$$ 1456 -1046 272 -1024 -2861 5902 -4963 -2505 9564 -6919 -355 8391 -6758 3410 5539
859E539j0953J2115l984m972R839p729J217N423n562M176l786O70O901j0651P252
$$ 5539 -5414 6701 2717 -2255 7584 -145 1072 6495 933 5109 1323 1993 8894 -1757 5495
874E495M712j5037J2935J569j3609J3205k855n395P876p318M809J94o979J2904
$$ 5495 10207 -4830 8105 9674 -3935 9270 6415 1020 8896 1578 6387 6581 -398 12506
888A2506q971m523J4238j2757K698Q783j3794R440n3r163J2620q961j505J0533
$$ 12506 3535 -988 13250 493 3191 11974 -1820 7620 7567 -1596 11024 2063 558 11091
902A1091j1506M578K187p805R593p226n68Q818j4502Q441N755j5101J0191J4q254
$$ 11091 -415 4163 6350 -1455 8138 912 344 9162 -5340 3101 8856 -6245 3946 3960 -4294
917d294P553m131J114j7n382J0229q670m787J5122j2835n01J2166j4942M042P499
$$ -4294 3259 -872 242 225 -5157 5072 -3598 -8385 6737 -6098 -6599 5567 -9375 -5333 2166
932B166j1468O797l94o361P943m938j64L512o370O642k681m865J0726j0877J375
$$ 2166 -9302 -2505 -2899 -9260 -1317 -6255 -6419 -2907 -9277 -2635 -5316 -10181 545 -10332 -8957
947h957J3260j7696N103J1371j6310Q505M537j0479O347q15J707mo684J2042o627
$$ -8957 4303 -13393 -8290 3081 -13229 -4724 -187 -10666 -4319 -5134 -3427 -3431 -10115 1927 -4700
962d700n919J6438j4138K5J4999j5358O186N475j2295J1914k099o786R670p251
$$ -4700 -10619 5819 -8319 -8294 6705 -8653 -2467 3008 -9287 2627 528 -6258 3412 -3839
976c839K919L712o734Q138o201k28J0948j4523N307R604j5520R712M415j3308
$$ -3839 -920 2792 -3942 4196 -2005 -2233 8715 -5808 -501 9103 -6417 3295 7710 -5598
990e598R405O17m166M371n289M589J73n553J0044o923l069J1647j0386J388P223
$$ -5598 3807 4424 258 4629 -660 3929 4102 -1451 8593 1670 -1399 10248 -138 1250 8473
1005H473j0933P947J769r904J0331m143l710R256p836J541K675n535Q389n992
$$ 8473 -2460 5487 7256 -2648 7683 3540 -170 9086 1250 2791 5466 -69 8320 2328
1019B328k377J0980j2372L676R120j5044P632M239r344P753m594P1N747r859R146
$$ 2328 -49 10931 -1441 2235 11355 -3689 3943 8182 -1162 6591 1997 2068 7815 -2044 7102
1034G102k407j0471J5775p156o501J3604j1197J339P640j0943O764j076n107R075
$$ 7102 4695 -5776 9999 2843 -3658 9946 -1251 88 7728 -3215 3549 2473 -2634 6441
1048F441q445J156N325r244Q986l285p511J2380r059j996J2086j3001K230Q087
$$ 6441 -2004 -848 4477 -4767 4219 934 -6577 5803 -3256 -5252 6834 -6167 -3937 4150
1062D150r869L334R41k549K667m373N089j405q400J2625m566q629J3166q002l669
$$ 4150 -5719 -2385 -1444 -3993 -1326 -5699 -610 -2015 -10415 2210 -2356 -10985 2181 -5821 -9490
1077i490J1876r929Q15O758q695N967m84m937O351m918K139J975o918R273m625
$$ -9490 2386 -7543 -6728 30 -8665 -2698 -3182 -8119 -1768 -6686 -4547 -2572 -9490 -217 -4842
1092d842n182J3976j2603j85J4065j4698M344Q413j1412N799J026l160M213n762
$$ -4842 -10024 3952 -8651 -8836 5229 -9469 -5125 3288 -8124 -2325 -1299 -4459 -246 -6008
1106f008O481k2q477J2645o175n156J3880j0806K92R905j1316O507L064q990Q188
$$ -6008 473 451 -8026 4619 -1556 -6712 7168 -3638 -3346 6559 -4757 1750 4814 -4176 4012
1121D012j954k823N810n156M108n45m390R172p262j392J0643j0348J427Q256j0124
$$ 4012 2058 -765 5045 -111 3997 3452 -938 8234 972 -420 10223 -125 1302 9558 -566
1136e66L984L662n331M199l077J212K791o816O416J42p796R323l667n058Q900
$$ -566 3418 7080 1749 5948 2871 4083 6874 58 6474 6616 -1180 8143 4476 -582 8318
1151H318o133Q85M167p402N732p92n048P540n744r27O285q160N098P10p505R779
$$ 8318 2185 3070 7237 -165 5567 4775 -273 7267 1523 596 6881 -1279 3819 4529 -2976 6803
1167F803n184m719J0690q642Q0O623p754L980j099j757N424q121M801L087j1301
$$ 6803 1619 -3100 7590 -1052 -972 5651 -2103 1877 778 -979 4445 -3676 1125 4212 -7089
1182g089J0729j388r200J1664n740l713Q007p138K371K437n501N505l381o38M497
$$ -7089 3640 2252 -6948 4716 -1024 -4737 3270 -3868 -1497 940 -4561 944 -2437 -3075 1422
1197A422o547M549N14p023R035m090n911J1636p429l969J0693p188j353N647l763
$$ 1422 -5125 -576 -62 -7085 1950 -2140 -8051 3585 -3844 -7813 2880 -4308 -5661 -14 -3777
1212c777K93k43J173Q73n700O299L53q619R441j991p610J0984m985l931Q540o780
$$ -3777 -3484 -3727 -2554 -1681 -7381 -1082 -729 -9348 93 -1898 -9508 1476 -3509 -7440 1100 -5680
1228e680J184M038n423M167j313j349M012n689N207K27p372J0698m948n326J2525
$$ -5680 -4496 -458 -5881 -1714 -3027 -4376 -364 -6053 -846 -619 -7991 2707 -2241 -7567 4958
1243D958q486j827R609q324K209L609m546M660l471J453M096p983O978R16p914
$$ 4958 -3528 -5355 4254 -4070 -1861 1748 -2798 1862 -1609 -156 3940 -4043 2935 3851 -4063
1258d063R196l138m120Q245o216J595M395o760N302J24m673O119l287j09L629
$$ -4063 5133 1995 -2125 6120 -96 1499 5894 -866 4436 4560 -113 6006 2719 2610 6239
1273F239m979M357k90m943P339l909l369P982n514p29M890m857K297Q9k591M672
$$ 6239 1260 5617 5327 384 7723 3814 445 8427 2913 2184 7074 2217 4514 4603 2012 6684
1289F684n208J351N150q653M577K737q492P019r57n204O275m449J83L261n658
$$ 6684 1476 2827 7977 -676 3901 6638 -1854 5165 4208 -996 5279 830 1013 4274 -1384
1304a384M717j661l442O355o669K001M817r858P299M27r124J0077l546n197Q170
$$ -1384 3333 1672 -1770 4585 -2084 -83 4734 -5124 2175 2602 -6522 3555 9 -5188 2982
1319B982m999m76K490l407L777m376J127N326r722N670L869j0901Q312O25q739
$$ 2982 -2017 -2493 -3 -3410 367 -4009 -2882 2444 -7278 -1608 2261 -8640 -328 297 -8442
1334h442Q696k282l604N461m354J260J740l351L788k862J38M070o694M234K551
$$ -8442 254 -2028 -5632 -171 -4525 -3265 -1525 -4876 -1088 -3950 -3812 258 -6436 -2202 349
1349C49q270Q154o27q521J0032k993n363Q408m320p15L482l289L105k708j10N259
$$ 349 -7921 233 -394 -8915 1117 -1876 -7239 1169 -3151 -3866 -384 -3673 -568 -3276 -3386 1873
1365A873p587M096L993r428Q116j71p038Q510m498j734P055o850K662K465n038
$$ 1873 -5714 -1618 2375 -7053 1063 892 -6146 2364 -2134 -3868 3187 -3663 -1001 1464 -3574
1380c574N581l178r01M677o640N528R29p698R638k808n339R487o354p54N990n740
$$ -3574 2007 -1171 -2072 2605 -4035 1493 2422 -5276 4362 1554 -3785 5702 -652 -1406 4584 -1156
1396a156L653n27k919O410n086L52N728q449M615L390p497O555j506l112N946
$$ -1156 2497 1970 -949 5461 375 727 6455 -1994 2621 6011 -1486 5069 3563 451 6397
1411F397m691J37L795n367N157m78m680O250m222k00N571p951L642L629p968O506
$$ 6397 1706 1843 5638 271 5428 4950 270 6520 2298 2098 7669 -282 3360 6989 -979 5527
1427E527p32n589O720k920j144K689m845N227k194l925P952p715K41Q351j0446
$$ 5527 4795 -794 5926 3006 1862 4551 -294 4933 2739 -1186 6766 -949 -708 7643 -2803
1442b803L356M562q830O206r48m207N223m275J848J322n819N810l227j592O499
$$ -2803 553 5115 -3715 2491 1543 -2664 2559 -1716 132 1454 -4365 1445 -1782 -3374 3125
1457C125q428K461N258r281O550R15q385P476j039m279M799l252J373N87l025
$$ 3125 -5303 -2842 2416 -6865 -315 600 -7785 -309 -1348 -5627 -828 -4080 -2707 -2120 -5145
1472e145M791m989q5P286q695K617N165q766O053J702p416O515j617k942N663
$$ -5145 -354 -5343 -5428 1858 -6837 -4220 945 -7821 -1768 -66 -7482 -967 -2584 -5526 137
1487A37m448P51K466l232M050l088q18N780o669L728L544r243P106J466p258P291
$$ 137 -4311 -3560 -1094 -4326 -276 -3364 -4182 1598 -5071 -1343 2201 -7042 64 1530 -5728 1563
1503A563k357k779N561m111J785P55l266O199m555j441O918p133K885M109p787
$$ 1563 -794 -3573 1988 -2123 -338 417 -2849 3350 -1205 -2646 4272 -2861 24 4133 -3654
1518c654N664M33m967O765m405o83N214n665L847k0m180O004l352p61M927o531
$$ -3654 2010 2443 -2524 4241 -164 -847 4367 -1298 2549 2529 -1651 4353 1001 240 5167 -1364
1534a364L582K615o367N500j100l327N286l571P27J805m274N289j973l748O765
$$ -1364 2218 4833 -1534 3966 2866 -461 4825 1254 1981 3786 -488 4801 2828 -920 5845
1549E845m677o94O049o323J269L212m376L582j295k345M285l367J208J831n095
$$ 5845 1168 474 6523 200 1469 4681 305 3887 2592 247 4532 1165 2373 4204 -891
1564h91M725q19l968O074m816k09N979p176K413L026o098M205J27l768L371k743
$$ -891 3834 3015 -953 5121 305 96 6075 -1101 1312 4338 -1760 2445 2572 -1196 2175 -568
1580e68K138J11m531O657m305l153Q287p230l57P107p963K824K508o012M578j260
$$ -568 1570 1681 -2850 3807 -498 -3651 4636 -2594 -2951 4156 -3807 -983 1525 -4487 91 -1169
1596a169j877K615l287K426M2l433N127m216p79N729o842J837M720p505L950K344
$$ -1169 -3046 -431 -3718 -1292 -1250 -4683 444 -3772 -4551 1178 -5664 -3827 893 -6612 -2662 -318
1612c18n935L899j0j894J964k305K458p11k477N488l998j469O128n555Q17M577
$$ -318 -6253 -2354 -2364 -4258 -2294 -4599 -2141 -2852 -5329 159 -3839 -5308 820 -4735 -3918 659
1628F59n802L336J084m034M568j512j472L510l439K037Q54k742M510k817r58M915
$$ 659 -5143 -1807 -723 -4757 -189 -1701 -3173 337 -3102 -1065 -211 -2953 1557 -1260 -2218 2697
1644B697n488K421L689o456M708M95m054N189k793j73L173m608L941r7m164O304
$$ 2697 -2791 -370 3319 -3137 1571 2066 -1988 3201 408 235 3408 -1200 2741 2644 -1520 4784
1660D784l426j421N538n440J738K771m805M321j510k143M676m290J328K619m901
$$ 4784 1358 -63 5475 35 1773 4544 -261 4060 2550 407 5083 793 2121 4740 -161
1675a61M008q55k993M978l709l73M248m914J877J645l314K873j423n32K243l575
$$ -161 3847 2992 -1 4977 1268 895 5143 229 2106 3751 437 3310 1887 1355 3598 23
1691B3K797J72m402N241j797l861O472l383k313N050m243N53K324l201K272r29
$$ 23 2820 2992 -1410 3831 2034 -1827 4645 1262 -1051 3999 -244 309 2633 -568 1704 775
1707G75j038K657l925K663R22m970N497k123l639P124n395r67N660n833J647K352
$$ 775 -263 2394 -1531 1132 2054 -2916 2581 458 -3181 3943 -1452 -2419 3241 -2592 -945 1407
1723A407m102K716j132m05K143l882L839q30m550O444l415l064O952n417n3M439
$$ 1407 -2695 21 -1111 -1516 627 -3255 584 -246 -4796 1648 -1767 -4831 2121 -3296 -3349 1090
1739A090n303K498R58l351L244j838n84K260l009K758o85k902M889l547r98M925
$$ 1090 -4213 -1715 -757 -4108 -864 -2702 -3286 -1026 -4035 -1277 -1962 -4864 25 -3522 -4520 405
1755D05n086J340L712n144K649J346l283K992j646J55J956l333L132M3l393M990
$$ 405 -4681 -3341 371 -4773 -2124 -778 -4061 -1069 -2715 -2560 -604 -3937 -805 -762 -4155 835
1771H35k610j521M923m140N92L449m561L513m7k874M393k653m8L047l906K837
$$ 835 -1775 -3296 1627 -2513 -1921 1528 -3033 480 433 -2441 1952 -701 -749 2298 -1608 1229
1787A229O33l476M855k398j163M546m490J538K265l877L874j109j743L949m388
$$ 1229 1862 -1614 3241 843 -320 4226 -264 1274 3539 -338 3536 2427 684 4633 245
1802B45K278K490n410M754m71m134N364k747j076L482l176J283P03k557L222k085
$$ 245 2523 5013 -397 4357 3886 -248 5116 2369 1293 4775 1599 2882 3585 1028 4250 2165
1818B165o57L285m348K078J565m330L701m50l668M412k129j804L792l006r6J536
$$ 2165 1508 4793 445 2523 4088 -242 3459 3009 -659 3753 1624 -180 3612 606 510 2046
1834B046j737J518j502k69K340m227K692J310n182M613k89m696N322k140k571
$$ 2046 309 1827 325 56 2396 -1831 861 2171 -3011 1602 1313 -3383 1939 -201 -2772
1849b772M743l882P23J862l041K460j391m12K367l969K671P20m361N176k133l071
$$ -2772 1971 -1911 -1188 674 -2367 93 -1298 -1710 657 -3312 -641 79 -4282 894 -1239 -4310
1865d310N854m138r02M325l996J157J136k207K578k090Q56J441l939L654J2m150
$$ -4310 1544 -2594 -3496 829 -3167 -2010 -874 -3081 -503 -2593 -1737 -296 -4235 -581 -569 -4719
1881d719M999j944k537N073l655l48L552l683J905N21k659L090j348p19K423l460
$$ -4719 280 -1664 -4201 872 -2783 -3131 421 -3262 -1357 -836 -3495 -405 -1753 -2472 -49 -3509
1897c509K242J140l422M002j830k000M623l016l17L058l556K517J84k623L399
$$ -3509 -1267 -127 -3549 453 -1377 -3377 1246 -1770 -2087 971 -2585 -68 116 -2507 892
1912H92k391K52L363m524K374J975l994L783j123k370M179k587P62J955l981L773
$$ 892 -1499 -1247 2116 -2408 -34 1941 -2053 1730 607 -1763 2416 -171 591 2546 -1435 2338
1928B338j99k556M218l596P2L790m257K330J212l779M072r12k143L475k717Q90
$$ 2338 2139 -417 3801 205 277 4067 -190 2140 3352 -427 3645 2733 590 4065 1348 2238
1944B238J307k751K975j844m61L535m391J416K804m843L336O69m068L557r46j628
$$ 2238 3545 794 3769 1925 1464 4999 608 2024 4828 -15 3321 3990 -78 3479 2533 905
1960I05K328k006O13P40k206K535k103o93L579l986J120K148m942L434P47m384
$$ 905 3233 1227 1840 2580 374 2909 806 113 3692 -294 826 2974 -1968 1466 2213 -2171
1976b171L924j332k391L639k583J39J235k027J958k025n35L418m334J701K430
$$ -2171 1753 421 -1970 1669 -914 -775 460 -1567 391 -1634 -2169 1249 -3085 -1384 1046
1991A046n369L922O5m025M762k374j299L193l217J388O24k037K719k157k1K425
$$ 1046 -4323 -401 -336 -4361 401 -1973 -3272 -79 -3296 -1908 -1284 -3321 -602 -2759 -2780 -355
2007c55l787K725R74m113L967q98k590M366k775q94K912k585J688L62j804K469
$$ -355 -4142 -1417 -443 -4556 -589 -1487 -4077 289 -2486 -3380 -468 -3053 -1365 -1003 -2807 -338
2023c38j843N4K490l352K104R93l262L327j356j292L575k819N37K139l347K591
$$ -338 -2181 -2127 363 -2989 -885 108 -3154 173 -1183 -2475 1100 -1719 -1182 957 -2390 201
2039B01m9k062L399k376m36K915l223J838J046k819L042j103j302K873k372Q87
$$ 201 152 -1910 1489 -887 -1323 1592 -1631 207 1253 -1566 1476 373 -929 1944 -428 459
2055D59J647l244L147j168j292L687l097O8L209l904J860J299l114L076j132j113
$$ 459 2106 -1138 2009 841 -451 3236 139 207 3416 -488 1372 2671 -443 2633 1501 388
2071C88K071k235J934L41k602L727k109j348M099m012J148K706m251K447P37k857
$$ 388 2459 224 2158 2499 -103 3624 1515 167 4266 254 1402 4108 -143 2304 3041 184
2087A84K812p96p93J391k046J526l50j459L173l169n6L356m431J817K262m223
$$ 184 2996 2200 1407 2798 752 2278 1928 469 3642 473 417 3773 -658 1159 3421 -802
2103h02K262N66k756K452q05o39J387k234J368l42j511L075k832j79K688l710
$$ -802 1460 2026 -730 1722 917 278 1665 -569 799 457 -1054 2021 -811 -990 1698 -2012
2119b012J567J685m248L119m12k940L562j532q66J742k211J110k26j425L002k864
$$ -2012 -445 1240 -3008 111 -301 -3241 321 -1211 -2077 -335 -2546 -1436 -1662 -3087 -85 -2949
2135b949L55K242l809K494J045l571L352q95k201L299k189K61J574k596K329n05
$$ -2949 -2594 -352 -4161 -1667 -622 -4193 -841 -1736 -3937 -638 -2827 -2566 -992 -3588 -1259 -1764
2151a764j546K713k140O27J418k943K167P81k413K903j326j030K639k107R89J213
$$ -1764 -3310 -597 -2737 -2110 -692 -3635 -1468 -687 -3100 -197 -1523 -2553 86 -2021 -1032 181
2167A81j981K112q38j345L013j858Q5J754k420J562N24j384K098j289k82J989
$$ 181 -1800 312 -526 -1871 1142 -716 -631 1123 -1297 265 789 -595 1503 214 -68 1921
2183A921k765J888R81k574K699q60j860L438j999j89K256k364J019M09j744K330
$$ 1921 -844 1044 2025 -549 2150 1290 -570 2868 869 680 2936 572 1591 2000 256 2586
2199B586j275k56J547k443K106n7k167L222k028j480L777k940q7K851l105J249
$$ 2586 1311 1055 2602 159 2265 2208 41 3263 1235 -245 3532 592 505 3356 251 1500
2215A500P32j761J672j318L55J094k211K277p44j601L231k852j05K650l200J101
$$ 1500 2232 471 2143 825 1180 2274 63 2340 1596 -5 3226 374 269 2919 -281 820
2231H20J767l158K054K08k136J501p05K61N05j389J650j323j099K990k597j40
$$ 820 2587 -571 1483 1691 -445 1056 351 612 1117 -272 1378 55 -1044 1946 -651 -791
2247g91K885l097M24J893k981J640N72j909J723j102k15J017j568J730p87j496
$$ -791 2094 -1003 -579 1314 -1667 -27 545 -1364 359 -743 -958 59 -1509 221 -566 -2062
2263b062K260j975m28K960l311J181J233l307K519o5j986K510j795j63J349j789
$$ -2062 198 -1777 -2205 755 -2556 -1375 -142 -3449 -930 -995 -2981 -471 -2266 -2429 -1080 -2869
2279b869J856r64j288L058k368Q4K072k753J520O63k083K475j006r72K304j904
$$ -2869 -1013 -1977 -3265 -207 -2575 -2491 -419 -3172 -1652 -989 -3072 -597 -1603 -2575 -271 -2175
2295b175P15J215k255K000J32j671K197j551J20J670j973J407L61j513J971j093
$$ -2175 -1460 -245 -2500 -500 -368 -2039 158 -1393 -1273 397 -1576 -169 192 -1321 650 -443
2311d43j86J918k192J336N62k077K564K2k014K713j361o60K123j824R53N21j343
$$ -443 -629 1289 -903 433 995 -1082 1482 1504 -510 2203 842 182 2305 481 1434 1955 612
2328F12J715j258J11J872k514J606N76k778K994o14k079L266k278n72K562k553
$$ 612 2327 1069 1180 3052 538 2144 2720 -58 2936 2322 243 3509 1231 659 3221 668
2344F68J080O86j475J660j812P35J022k142K101n57k583L096j284j481L204k619
$$ 668 1748 2434 959 2619 807 1542 2564 422 2523 1966 -617 2479 1195 -286 2918 299
2360B99j98K353k872J198M82j060J011j220L51P13j886K048o64j902K525j848
$$ 299 101 2454 -418 780 1262 202 1213 -7 344 1057 -829 1219 555 -1347 1178 -670
2376f70n69L085k800J59J931k764J494L40j642J498r50j76R05j710J559Q9j822
$$ -670 -1239 1846 -954 -795 1136 -1628 -134 206 -1436 62 -888 -1064 -159 -1869 -310 -221 -2043
2393b043K309j744p19K858k353K35J482k546J853J30j780K164j605J71J431k111
$$ -2043 266 -1478 -2197 661 -1692 -1457 25 -2521 -668 -538 -2318 -154 -1759 -1588 -157 -2268
2409b268J527m43j167K316j743l32J863k361J776L86k429K490r28p48K068k042
$$ -2268 -741 -1184 -2351 -35 -1778 -2110 -247 -2608 -832 -446 -2875 -385 -1313 -2061 7 -2035
2425b035P59J048j964J674n20j271K441j455k13J235j581J318P82j937J851q83
$$ -2035 -1276 -228 -2192 -518 -1038 -2309 132 -1323 -1536 -301 -1882 -564 218 -1719 132 -751
2441g51l22J904j932M58J448k129J917J64j760K040o67n70J639j430O94N92j180
$$ -751 -1073 831 -1101 -643 805 -1324 593 757 -1003 1037 370 -200 1439 9 703 1295 115
2458A15J698j192k79K104k233J220R42k748K744j28j992K434j146k74J278j447
$$ 115 1813 621 342 2446 213 1433 2375 -373 2371 2243 251 2685 1539 1265 2543 1096
2474A096P43K18j011J773j472N1J476k404J778L04k563K278n11j505K444j920
$$ 1096 1839 2057 1046 2819 1347 1398 2874 470 2248 2552 -11 2267 1756 251 2695 775
2490G75k4J628j697Q11j19r49J380j562P43M48k166J937m23j791K345j453p61
$$ 775 751 2379 682 1493 1374 425 1805 243 986 1434 -732 1205 782 -1009 1336 -117 -878
2507h78K311k254K40J203j644Q93k10q11R29r65N26N53j737J318j81j601K339
$$ -878 1433 -821 -581 622 -1022 -129 -339 -1150 -221 -1186 -660 -107 -1844 -526 -707 -2308 31
2524C1j435l24J503j530J61J011j795J331J39j175J329j272O98J064k057J635
$$ 31 -1404 -1728 -225 -1755 -1594 -583 -2378 -1047 -908 -2083 -754 -2026 -1328 -264 -2321 -686
2540f86l88j351K381j565l20J801k118J059P96j883K030o37q73J733j498N27R15
$$ -686 -1074 -2425 -44 -1609 -1929 -128 -2246 -1187 -391 -2274 -244 -881 -1754 -21 -1519 -992 -77
2557g7j512J212k95r92J702j206L43J236k003J486k88j084K072j237j72J756k341
$$ -77 -1589 -377 -672 -1664 38 -1168 -825 411 -1592 -106 -394 -1478 594 -643 -815 941 -1400
2574a400J084J072j816J651N6j543J616r24M23Q81j231J129n58o26J867j404j4
$$ -1400 -316 756 -1060 591 647 -896 720 -204 219 1100 -131 998 440 -186 1681 277 263
2591B63J649j899Q34J158k108J549P2j530J861q63J42N60j178J082m21l94J596
$$ 263 1912 13 847 2005 -103 1446 1518 -12 1849 986 1128 1688 510 1592 1171 777 2373
2608B373j598M77J559k431J406M54k135K067n48j128J800j237o1J008j500J091
$$ 2373 775 1252 2811 380 1786 2240 105 2172 1624 496 2296 1059 998 2006 506 1597
2624A597m24m39J233j320N08R03k219J188O21k117K274j070q54J669j783J77Q16
$$ 1597 1173 734 1967 647 1155 2058 -161 1027 1648 -469 1805 735 -119 1550 -233 -56 760
2641G60j147J009p06n00J331j659R13P09k221J615n12j329J819j235o27J604j469
$$ 760 -387 622 -84 -584 747 -912 1 710 -1511 104 -408 -1737 82 -1153 -1780 -176 -1645
2658a645L90R34j597J363m70r66J029p45M78N61j475R20l65r66J911j190L2R46
$$ -1645 -1255 -321 -1918 -555 -1025 -1991 -962 -1707 -1229 -668 -2143 -1223 -1588 -2554 -643 -1833 -1801 -855
2676h55j580J345J42j507K118j044m70J334j467P67P76j532J552k70j099J859
$$ -855 -2435 -1090 -948 -2455 -337 -1381 -1851 -517 -1984 -1217 -441 -1973 -421 -691 -1790 69
2692F9j272M24R68j846J624j68j417K142j170k75J978j759O57Q80j221R76k62
$$ 69 -1203 -779 189 -1657 -33 -201 -1618 524 -646 -921 1057 -702 -45 835 -386 590 328
2709C28m09J043r30P88M21j107R65l76q03J867j445k87J790k024J118O50j599
$$ 328 -81 962 32 820 1241 134 1099 723 -80 1787 342 55 1845 -179 939 1589 -10
2726a0J418m42o09J213p89L12J21j000J142l52p10J931j700J71J446j957Q40Q47
$$ -10 1408 966 357 1570 781 1093 1214 214 1356 1004 294 2225 525 696 2142 185 1025 1872
2744A872j576J500o85j003J563r97K13K50p16R88m55m86J581j769O50J016k408
$$ 1872 296 1796 1111 108 1671 674 887 1137 421 1409 954 468 2049 280 930 1946 -462
2761d62J435L33j803K045r49r48J521j357M81N94j395J489r78k17J017j485O63
$$ -462 973 1306 -497 1548 599 -349 1172 -185 296 890 -505 984 6 -211 806 -679 -16
2778a6N50j403J266j43j516J679r02l24J153j498M46O42j192J041q98m30J077
$$ -16 534 -869 397 254 -1262 417 -485 -809 344 -1154 -708 -66 -1258 -217 -1115 -1545 -468
2795d68j095O73M25j394R05J71j032J536j398m8J139j589R18O20j710J503k30
$$ -468 -1563 -890 -465 -1859 -954 -783 -1815 -279 -1677 -1725 -586 -2175 -1257 -637 -2347 -844 -1074
2812a074j109J622j252M43P21j228R29k22m47J177j292O22Q86j397R91N9j243
$$ -1074 -2183 -561 -1813 -1370 -649 -1877 -948 -1170 -1617 -440 -1732 -1110 -224 -1621 -630 -571 -1814
2829a814J736m47r02J689j228M39R20j367J096l84k20J270r56M38M27j259J441
$$ -1814 -78 -525 -1427 262 -966 -527 393 -974 122 -262 -482 788 -168 270 697 -562 879
2846H79j81r67J679p61m58J534j211J31R01j075P73m24k54J022m50M0N09j038
$$ 879 698 -269 1410 649 191 1725 514 645 1546 471 1244 820 566 1588 1138 1178 1687 649
2864F49J159m06p27J449j364K39J208j432K09R25j636R31J63q63R83n79K26L21
$$ 649 1808 1402 675 2124 760 999 2207 775 984 1909 273 1204 1367 504 1487 908 1134 1455
2882A455j117Q16j74p35J465j413j44J271j541P45O71j856J276n1q98R95p83K53
$$ 1455 338 1154 980 245 1710 297 153 1424 -117 628 1299 -557 719 668 -230 765 -18 235
2900B35O44j179O87l81k00P94j130L01P19j428J175L33j800J516p53n00J576j548
$$ 235 879 -300 387 6 -194 600 -530 -229 490 -938 237 570 -1230 286 -467 -967 609 -939
2918i39K09M96r73R04l72m19J207j215J66P90j479J095j71o44Q32p65k21J175
$$ -939 -730 -234 -1207 -303 -675 -1094 113 -1102 -936 -146 -1625 -530 -701 -1345 -513 -1278 -1499 -324
2936c24q92k7J060j503Q36J58q12P79r06K12P95j207Q39J54o46J281j047k6R95
$$ -324 -1216 -1243 -183 -1686 -850 -692 -1504 -725 -1631 -1419 -624 -1831 -992 -838 -1484 -203 -1250 -1276 -281
2955b81j281Q72M41j638J417p4p41J178q98P8Q85j045Q72ll79J096j066K93P02
$$ -281 -1562 -690 -249 -1887 -470 -544 -1285 -107 -1005 -927 -42 -1087 -215 -218 -597 499 -567 -274 428
2974D28j330J591k19j131J583o99k98J215j108O03O10r76R44m67k39Q51o64L84
$$ 428 -902 689 470 -661 922 223 -75 1140 32 635 1245 269 1213 746 507 1358 694 1078
2992A078J67j212J599j09p42J246j081j57J354j359J93P23j190P24K04k21L16
$$ 1078 1245 33 1632 1523 781 2027 946 789 2143 784 977 1700 510 1234 1438 1217 1533
3009A533m23J51K57q28J105q81l47J122j049Q8Q85j398O34N27j230Q93l03o31
$$ 1533 1110 1261 1518 690 1795 914 567 1689 640 728 1613 215 849 1376 146 1039 736 105
3027A05Q25r06N10q2p93J036m73n51J107j100O2Q46j523P53L18j130R53l86l45
$$ 105 930 24 534 452 -341 695 222 -329 778 -322 -260 586 -937 -184 134 -996 -43 -429 -774
3046g74P84j006K89K58q80Q90l92j82O06j337J169K29j452J529o22n12J169j006
$$ -774 10 -996 -707 -449 -1329 -439 -831 -1013 -407 -1744 -575 -346 -1798 -269 -891 -1403 -234 -1240
3064a240n0J053j143N14L59r28R99l38n81R59j022N56K62p32J030n49k75J038
$$ -1240 -1290 -237 -1380 -866 -507 -1435 -436 -774 -1355 -396 -1418 -862 -600 -1332 -302 -851 -1126 -88
3082h8r81R2R11j495J136K45j071J106m85l70Q87r19O12M78j065J148n81m96J589
$$ -88 -1069 -977 -66 -1561 -425 -180 -1251 -145 -630 -1000 -113 -1032 -420 58 -1007 141 -440 -936 653
3101F53j399N74N57j438J174N1r99J301n57j53R82r84N12L19r71J192k95R1M15
$$ 653 -746 -172 385 -1053 121 172 -827 474 -83 -236 746 -238 274 593 -378 814 519 610 1025
3120A025q74O69K40j289J429m31m89J129p15n9Q84o73J98R5n94P98l16q9L31o45
$$ 1025 151 820 1060 -229 1200 769 280 1409 694 635 1519 846 1044 1139 545 1343 1027 938 1269 624
3140F24Q04j10r07J210o96l45J116r48K1R83j316O47j8l09M88k39l49L76q04M53
$$ 624 1428 1318 411 1621 925 580 1696 748 769 1752 436 1083 1065 756 1244 1005 656 1032 228 681
3160F81Rq79J386q59j82R90j120O1O12j041K66J44p59J003m90k37O07j105O08
$$ 681 690 -189 1197 338 156 1146 26 87 699 -342 -76 68 -691 312 -178 -415 192 -913 -305
3179c05P9o78P18k67n95O55q27L72M87j091P02j41p03J068n12k45N35n92L22n
$$ -305 -226 -904 -186 -453 -1048 -393 -1220 -848 -361 -1452 -750 -891 -1594 -526 -1038 -1283 -748 -1340 -1018 -1023
3199a023n36Q00n72L34K91r41P77j59m96R17l22l09J091o50j92O89q47N96J19
$$ -1023 -1559 -759 -1331 -997 -706 -1647 -870 -1029 -1525 -608 -930 -1239 -148 -798 -990 -301 -1148 -552 -433
3218d33o00N61j15n5P32q02N29J2n33Q47l96l22J087p55R0P44j139P94K31r56
$$ -433 -1033 -472 -587 -642 90 -712 -183 -171 -704 143 -253 -575 512 -243 -153 591 -548 246 477 -479
3238d79J079m80l75J061o38K16P9l73O89o32J81O40j017N71K97q11R17n9q80J005
$$ -479 600 120 -255 806 168 384 463 90 779 147 328 968 -49 522 819 8 925 866 -14 991
3258I91m60j41P19o69K42L96p53O17j30j83O31p83N95j38n20P41j60p63J238o94
$$ 991 531 390 1109 440 682 1078 325 942 812 629 1260 477 1072 934 414 1155 995 232 1470 776
3278G76k62P93j189P26J67p21Q43n19k53P97o82M09o4o80O11mo85Q70n99k92P99
$$ 776 514 1307 118 844 1011 290 1133 614 361 1158 476 885 821 141 752 748 63 933 334 42 841
3299H41j138M88K73r57J133p61%M56p71O69j51o92N64k06l01N05q05M3O90q18
$$ 841 -297 191 464 -493 640 -121 -121 335 -436 233 82 -610 -46 -252 -553 -48 -853 -810 -120 -938
3319i38N57o4p34Q95l61n10P46o86J06K48n86O40l33j35O99j016L63N6o67R05
$$ -938 -381 -445 -1179 -284 -645 -1155 -409 -1095 -989 -741 -1327 -687 -1020 -1155 -456 -1472 -1109 -1053 -1720 -815
3339h15P7q66R12n15j55R50p65J44K80k76K04Q8m10N98l77K86K10o11Q32j79k67
$$ -815 -738 -1604 -692 -1207 -1362 -412 -1177 -1033 -753 -1029 -825 -737 -1147 -549 -926 -640 -430 -1041 -209 -388 -655
3360f55R39q75o2J038j116O80J61n18Q81j07n02O06l87L93o8o48R46m31r8J004
$$ -655 284 -591 -653 385 -731 -51 110 -408 473 366 -136 470 83 476 408 -240 706 275 177 1181
3380A181r35L08P95r78N00K20p70O85l34k47O49l07n2L65m91O02k96k60P04q86
$$ 1181 246 554 1349 371 871 1091 321 1006 672 425 1074 767 715 1080 589 1191 895 635 1339 453
3400D53L67L56q37P52j78q44J119l68n84J138r54J25O7j76L70l37k2L08o98K74
$$ 453 820 1176 339 1091 913 69 1188 820 236 1374 420 545 612 436 806 469 447 755 57 331
3420C31L95r35P73l03l22Q98o83j86P37p14J8N12p03M38k39j05J64k72J83J59
$$ 331 726 -209 564 261 -61 837 154 -32 705 -9 9 521 -182 256 17 -88 76 -196 -13 146
3440A46p39Q17m11k51Q20j101L50J43m46L48J71p63M33O6j67K20k33J40j60j71
$$ 146 -593 224 -187 -438 382 -719 -369 -226 -672 -324 -153 -916 -483 -417 -584 -364 -597 -457 -617 -788
3460g88N42p57J33M54o23K22K22o63O26k96l75P98l58j58M38n73J91J21k82M45
$$ -788 -246 -1003 -870 -416 -1039 -817 -595 -1258 -632 -928 -1303 -505 -863 -1021 -583 -1156 -965 -844 -1126 -681
3480f81j53k3K46o92O86Mn28P73k81l24P94m44N0K89l57R5M06m81O44j84k67N45
$$ -681 -834 -857 -611 -1303 -617 -613 -1141 -368 -649 -973 -179 -623 -573 -284 -641 -546 -140 -621 23 -161 -428 117
3502A17l95P30k20n03N79k83M1P88q91L49K18k61M71L5m86O99l85J57K56o29M73
$$ 117 -278 452 232 -271 308 25 66 854 -37 312 530 269 740 775 289 988 603 760 1016 387 860
3523H60j29j82P61n54J06L40l61J03K17o27P19k70n80P84m25k19N03k14j65J26
$$ 860 731 549 1310 756 862 1202 841 944 1161 534 1253 983 403 1187 762 543 1046 832 667 793
3543G93m00O69o79J85O17r18O23o41o4O97m61o8L42l72k53K58k85L25j87o9J87
$$ 793 393 1062 383 568 1185 267 890 249 185 882 421 353 695 323 70 328 43 368 181 112 299
3564B99l88j36L51o22N18j23m69N00k74j78N23o42L29J81q05N84q8m49Q46p01
$$ 299 -89 -225 126 -496 22 -101 -570 -70 -344 -522 1 -641 -312 -131 -936 -352 -440 -889 -43 -744
3584g44K61j37k34L34O0q13J244q45j47N32o61M74J42o14P32m03j61P89o37j5
$$ -744 -483 -620 -854 -520 -460 -1273 -29 -874 -1021 -489 -1150 -676 -534 -1148 -416 -819 -980 -191 -828 -843
3604h43M20n81J73M29o72Q76p13K2N23p02O51j26r9N58k52l47M98k38p3N76q66
$$ -843 -423 -1004 -831 -402 -1074 -198 -911 -889 -366 -1068 -417 -543 -642 -84 -336 -683 -185 -423 -496 80 -786
3625g86M44nj73L53l56L12L75l17K19nl92Q50r76N16L67n99L02K15n51M89J84
$$ -786 -342 -347 -520 -167 -523 -211 164 -153 66 61 -331 519 -457 59 426 -173 129 344 -207 282 466
3646D66l91M43l85L83J28l13L35ll45P12n46P0M50m80R0M97q92P69J1m46O11l59
$$ 466 75 518 133 516 644 331 666 663 318 1030 484 554 1004 524 614 1111 219 988 999 553 1164 805
3668H05J7J58j59K39j07o01P64m10K71K48o62K67M31r71M54ok11J48J10l64K77
$$ 805 822 980 821 1060 953 352 1116 706 977 1225 563 830 1261 290 744 738 527 675 785 421 698
3689F98m69p4L30k35J73l01J76Q7o53N30k83m20P13q88Q7M54m30K75j23n92N80
$$ 698 229 155 485 250 423 122 298 385 -268 262 -21 -441 272 -616 -529 -75 -505 -230 -353 -945 -365
3710c65j81l4J95j96k13K96m28N75n49j30O54n44j4M76p60L66K78l53L58l01j86
$$ -365 -546 -580 -385 -581 -794 -498 -926 -351 -900 -1030 -376 -920 -934 -458 -1218 -852 -574 -927 -569 -870 -1056
3731a056O23l18k85L20j05K38j32k62O61n81K90N07o37J30K91n62M42J12k31J12
$$ -1056 -433 -751 -1036 -716 -821 -583 -715 -977 -316 -897 -607 -100 -737 -607 -316 -878 -436 -324 -555 -443
3751d43J53j23M36p24M40L2j94K40j15QK08j52L65K01o48M85p4m4M98m37k5L53
$$ -443 -290 -413 23 -701 -261 -229 -423 -183 -298 -290 -82 -234 131 332 -316 169 95 51 549 112 87 440
3773D40m39L59k19N3K50r9j0K13l66N59j58l04O87m38l06O71m91L48R3n69O06
$$ 440 1 360 141 194 444 345 335 548 182 741 583 279 966 528 222 893 402 750 843 274 880
3794H80j04j99L43k13n6J07k41K07j2k86L89k03o3M48m59K88J55p27K99J22l99
$$ 880 776 577 920 707 651 758 517 724 712 426 815 612 549 997 538 826 981 254 553 675 276
3815B76L88j39O8n3j5j43K35m49M34k62j74K98n36L42K19o27M64j69j92K41m03
$$ 276 664 525 593 540 525 382 617 168 602 340 166 464 -72 270 489 -138 326 157 -35 206 -197
3836a97pL87m99K72m2l37L31m03q8L92l49k9n6k52M35j15j93L26l49L3M33n71
$$ -197 -204 183 -316 -44 -86 -423 -92 -495 -583 -191 -540 -569 -625 -877 -442 -557 -750 -424 -773 -740 -307 -878
3858h78J06J25m6J79l02k2J10m6j57K48l35M23l78lN71o51M59J51l50L41P5m12
$$ -878 -772 -647 -693 -514 -816 -838 -728 -774 -931 -683 -1018 -595 -973 -976 -405 -1056 -597 -446 -796 -455 -380 -792
3880g92M34R2j63R1l14L09q3J51O8l47M48J83m43K25O19o63K38J71l23L76l32
$$ -792 -358 -266 -429 -338 -652 -343 -426 -275 -207 -554 -106 77 -366 -141 478 -185 53 224 -99 277 -55
3901e5J31M6O2N3j24K50K03k81K04N9q0R3Q9m75M63r2j17N81m82n7K43j27pK18
$$ -55 76 122 184 237 113 363 566 285 489 548 468 561 650 175 638 546 429 1010 528 471 714 587 580 798
3925G98m43L02m0q8K56k63M13l49l2L97o17M5L58l02J21Q4k82K42j37k67Q2J61
$$ 798 355 657 617 529 785 522 935 586 554 951 334 379 737 435 556 640 358 600 463 196 278 439
3947D39l2J44j30N0L5m14M58n68M7N36p36K19L56k61K80l4m66L66m46jK19j99
$$ 439 407 551 421 471 506 92 550 -18 29 565 -171 48 404 143 423 389 -77 289 -157 -158 61 -138
3969a38p0k3R7K09m83P2K72l92N22m73JM25p17J42M47m85L0l0J93M3Ll78M71m42
$$ -138 -208 -231 -134 75 -408 -336 -64 -456 66 -407 -406 19 -698 -556 -109 -594 -564 -594 -401 -358 -355 -733 -262 -704
3993g04K20j94k45K11k72R6K48j51J11J65m29J56J19J57j02m4j42N51l77J90L
$$ -704 -484 -678 -923 -712 -984 -888 -640 -791 -680 -515 -944 -788 -669 -512 -614 -658 -800 -249 -626 -436 -433
4014d33l26M17n08M2O49n54K53J27l49N07L08p84P73k99j98K77j12J03K04p0J89
$$ -433 -759 -342 -850 -808 -159 -713 -460 -333 -682 -175 133 -651 122 -177 -375 -98 -210 -107 97 27 216
4035B16J49k53K21k20L85J94q77P70o0nM07k53j27K03l83K42K54m39K27PJ9K49
$$ 216 365 112 333 113 498 692 -185 585 525 520 927 674 547 750 367 609 863 424 651 658 677 926
4057I26l59K65j59k83K62N3k32N84m95l2N13o37J21J8k9J06L9m06L20l13K27R8
$$ 926 567 832 673 390 652 705 473 1057 562 530 1043 406 527 545 516 622 661 255 575 262 489 587
4079E87n03M87l54j28K76l14n9M97m04L54k97m04N04m39Q9K65l31R6J98m86M43
$$ 587 84 571 217 89 365 51 -8 489 85 439 142 -262 242 -197 -108 157 -174 -78 120 -366 77
4100G7j87k18K02m47M33P3m41L36j7n12O24n86j15Q17q20L79m7j32K04O3k24q5
$$ 77 -110 -328 -126 -573 -140 -67 -508 -172 -189 -701 -77 -663 -778 39 -781 -402 -449 -581 -377 -314 -538 -623
4122f23MJ68K9j95L36j91l84N68n77M31L19o69L34K12l18J25n7k68K34P0n3L2
$$ -623 -619 -451 -422 -617 -281 -472 -856 -288 -865 -434 -115 -784 -450 -238 -556 -431 -488 -756 -522 -452 -505 -473
4144d73n7J38n2j67L75j42k92M59j98J88K06k89J41k4M7j0k11K69N9j69L60j96
$$ -473 -530 -392 -444 -611 -236 -378 -670 -211 -409 -221 -15 -304 -163 -187 -140 -150 -361 -92 -33 -202 158 -38
4166c8p4L60m28M13K26k78K66l26o2K54r7lM12q7j2l8j1J11j24j5K08k0j43J16
$$ -38 -112 248 -180 233 459 181 447 121 59 313 216 213 625 538 526 488 477 588 464 449 657 637 494 610
4190F10k08K58K68l55M61j89j63P2J31l5M6l31L42k73n8K51k79l9J28j6K32l56
$$ 610 402 660 928 573 1034 845 682 754 885 850 896 565 907 634 576 827 548 509 637 621 853 497
4212D97k51M40l72j05L08l86J40L26o18K57j70J1J87k95N1L5O1k22m9Q3r6k30
$$ 497 246 686 314 209 517 131 271 597 -21 236 66 77 264 -31 20 55 116 -106 -155 -72 -168 -398
4234c98J02m2k09M67m39J97J30m28J12K52l43j22P8j58M64k16J89j0l87K81l5
$$ -398 -296 -338 -547 -80 -519 -322 -192 -620 -508 -256 -599 -721 -643 -801 -337 -553 -364 -374 -761 -480 -515
4255e15o6J71N3k51J7m0j29N06m44mK86k20L9J59M5j17K7M8j42K27K41k62k2K77
$$ -515 -581 -410 -357 -608 -591 -631 -760 -254 -698 -702 -416 -636 -597 -438 -393 -510 -483 -435 -577 -350 -109 -371 -393 -116
4279a16j38m2L50n11M70J95o90J85Q1j10L3L76r9j51L20J6m17L00QJ1o7K31l30
$$ -116 -254 -296 54 -457 13 208 -482 -297 -216 -326 -293 83 -16 -167 153 169 -248 52 60 71 4 235 -95
4302i5O6L55l71R4K30j45L23j24J3q6J13K33k03K15j5k14J86J3l86K83K14o08
$$ -95 -29 326 -45 49 279 134 457 333 346 260 373 606 403 618 603 389 575 588 202 485 699 91
4324I1N50j99J63J74k8l11O8r5K93q9k05P7M21l00J67m22J27m9J21R1j83l4m1
$$ 91 641 442 605 779 751 440 508 413 706 617 412 489 910 610 777 355 482 433 554 645 462 428 387
4347C87K83l39q1q9L24j10l38J25N7j28J13l9M0m7P6M7l43Q2L55p45K75j86j0
$$ 387 670 331 250 161 485 375 37 162 219 91 204 165 205 158 234 281 -62 20 375 -370 -95 -281 -291
4370b91l6J63j70R1k92r0L88o2k54l4j26J16P4j69M8j82L65j15l16K23n7O8L9
$$ -291 -327 -164 -334 -243 -535 -625 -237 -299 -553 -587 -713 -597 -523 -692 -644 -826 -461 -576 -892 -669 -726 -658 -619
4393f19J89n23M79q2k31M25l72J50J6N9j30j95M67j99K9L38j38k99L86k93L47
$$ -619 -430 -953 -474 -556 -787 -362 -734 -584 -568 -509 -639 -834 -367 -566 -537 -199 -337 -636 -250 -543 -196
4414a96j25k27P9J19K67J03k00K95K8l9P4j99J2K5j78K91J59l17J81J83m7J69
$$ -196 -321 -548 -469 -350 -83 20 -180 115 143 104 178 -21 -9 16 -162 129 288 -29 152 335 288 457
4436D57m5n06P56o81M42o3j16L19l39L13j57m3J92J20k50K28r3m8j97J57K96l11
$$ 457 412 -94 662 -19 423 360 244 563 224 537 380 337 529 649 399 627 534 486 289 446 742 431
4458D31j23J82O2j38J67k45j89J45m2J27J06j87J55p8j70K25j26N3M58n19L9K30
$$ 431 308 490 552 414 581 336 147 292 250 377 483 296 451 373 203 428 302 355 813 294 333 563
4480E63n73L44j01K06l50p3J5K31p0q5q3K06r5l79K78l4j21J56k10J74M9n23K52
$$ 563 -10 334 233 439 89 16 31 262 192 107 24 230 135 -244 34 0 -121 35 -175 -1 48 -475 -223
4503b23J84k96rl32J96K56l39K09o7o5J69k03j88L42J2k58J70O2l12J61l36K35
$$ -223 -39 -335 -344 -676 -480 -224 -563 -354 -421 -486 -317 -520 -708 -366 -354 -612 -442 -380 -692 -531 -867 -632
4525f32j10N1m0M25l83L2O9J7K26l01K07p6k81M11j8l50M66l11k8P3J06j7L1k0
$$ -632 -742 -691 -731 -306 -689 -657 -588 -571 -345 -646 -439 -515 -796 -385 -403 -753 -287 -598 -626 -553 -447 -464 -433 -453
4549d53J32K7J30P5j78M46k38o7K06j95m4K94L7kq6K35j67M4J99k30L37jk17k2
$$ -453 -321 -294 -164 -89 -267 179 -59 -126 80 -115 -159 135 172 170 84 319 152 196 395 165 502 501 284 262
4573B62K02J78q4j17p8J66J15j69o2J41j20N8J15K8k2k39K62j24N0J49k49p2J05
$$ 262 464 642 558 441 363 529 644 475 413 554 434 492 607 635 613 374 636 512 562 711 462 390 495
4596D95q1j12J70l41L37o3r1J54k83J60l3q6L47O4l86n9j26O7R1l63J05J13l41
$$ 495 414 302 472 131 468 405 314 468 185 345 312 226 573 637 251 192 66 133 224 -139 -34 79 -262
4619b62K73R4k64K29m26L15J41j52O5O0n45K40J67j47r0K19k45L27r8J84k23k72
$$ -262 11 105 -159 70 -356 -41 100 -52 13 73 -472 -232 -65 -212 -302 -83 -328 -1 -99 85 -138 -410
4641d10L85l30Q8K6j40r6J55j24K01j9k86J12j25K03o2k53L86l01L06j43Q8n9
$$ -410 -25 -355 -267 -241 -381 -477 -322 -446 -245 -264 -550 -438 -563 -360 -422 -675 -289 -590 -284 -427 -339 -398
4663c98P3j05O6J23m85R9M32k68N8J95l01L44l30K4J01K02k76K43k25J59O6J37
$$ -398 -325 -430 -364 -241 -726 -627 -195 -463 -405 -210 -511 -167 -497 -473 -372 -170 -446 -203 -428 -269 -203 -66
4685f6j59k75N33n7J60j13j10R8P2j8J59k39m4M8J58J05O5j26K84j53k86L71o2
$$ -66 -225 -500 33 -24 136 23 -87 11 83 65 224 -15 -59 -11 147 252 317 191 475 322 36 407 345
4708C45K59r1j11j72K28lR6j33R6n7J22R1l58L02J02r3J2J82o25M37Nl52K18j3
$$ 345 604 513 402 230 458 455 551 418 514 457 579 670 312 614 716 623 635 817 192 629 634 282 500 487
4732D87o0J19l41N5L00k55O0j4K20l60JJ32j79J23j51J08k69K43n4j42J27j06
$$ 487 427 546 205 260 560 305 365 351 571 211 212 344 165 288 137 245 -24 219 165 23 150 44
4754D4Q8j98M4q5L30n29J51n9r1K26R7j73l50K97J29p5k89O1K65j92N9l30K26
$$ 44 132 -66 -22 -107 223 -306 -155 -214 -305 -79 18 -155 -505 -208 -79 -154 -443 -382 -117 -309 -250 -580 -354
4777c54J03Rl02M0j86J92P9J39j53n0J15m1l62M53k21J41j69m4K01J08l93LM19
$$ -354 -251 -242 -544 -504 -690 -498 -419 -280 -433 -483 -368 -409 -771 -318 -539 -398 -567 -611 -410 -302 -695 -692 -273
4800b73j01J54j82J86j83L94m57J98j53K22k52L13k46N4J16O7j4J41j09j7J7R4
$$ -273 -374 -220 -402 -216 -399 -5 -462 -264 -417 -195 -447 -134 -380 -326 -210 -143 -157 -16 -125 -142 -125 -31
4822c1p4j03M0l8J19J02J3JL06q9J47l04rR2J84k02J65j48k77N45k36p4K30q3
$$ -31 -105 -208 -168 -206 -87 15 28 29 335 246 393 89 80 172 356 154 319 171 -106 439 203 129 359 276
4846B76j57M09l08L01j47J09J08j13Q7o2M8p3k67K04Q9q4K2R9RQ6l82J31K3m0
$$ 276 119 528 220 521 374 483 591 478 565 503 551 478 211 415 504 420 442 541 550 636 254 385 408 368
4870C68j1R6j17K37k11j82J52j36J34k75K31j76K97j95k00N01m03j52p4K31j81
$$ 368 357 453 336 573 362 180 332 196 330 55 286 110 407 212 12 513 110 -42 -116 115 -66
4891f6L5P0k95K56j72m3k68L43k19J28J72k45q5Q4j1m4M0p2p1j7Q2k28O3J60j65
$$ -66 -31 39 -256 0 -172 -215 -483 -140 -359 -231 -59 -304 -389 -305 -316 -360 -320 -392 -463 -480 -398 -626 -563 -403 -568
$$ [...]
8191D6
##END NTUPLES=NMR FID
##END=
