##TITLE=1H_SL62-J2-f10
 CDCl3, 8 sc, 
 7.07.2021
##JCAMPDX= 6.0         $$ Bruker NMR JCAMP-DX V2.0
##DATA TYPE= NMR FID
##DATA CLASS= NTUPLES
##ORIGIN= UXNMR, Bruker Analytische Messtechnik GmbH
##OWNER= root
$$ XWIN-NMR		Version 3.5
$$ Wed Jul  7 09:38:12 2021 Russian Standard Time (UT+4h)  she@DPX200
##.OBSERVE FREQUENCY= 200.131506
##.OBSERVE NUCLEUS= ^1H
##.DELAY= (6, 6)
##.ACQUISITION MODE= SIMULTANEOUS
##.ACQUISITION SCHEME= undefined
##.AVERAGES= 8
##.DIGITISER RES= 18
##SPECTROMETER/DATA SYSTEM= spect
##.PULSE SEQUENCE= zg30
##.SOLVENT NAME= CDCl3
##.SHIFT REFERENCE= (INTERNAL, CDCl3, 0, 15.7039)
##AUDIT TRAIL= $$ (NUMBER, WHEN, WHO, WHERE, WHAT)
$$ ##TITLE= Audit trail, XWIN-NMR		Version 3.5
$$ ##JCAMPDX= 5.01
$$ ##ORIGIN= Bruker BioSpin GmbH
$$ ##OWNER= she
$$ F:/spectra/data/she/nmr/H-F/1/audita.txt
$$ ##AUDIT TRAIL=  $$ (NUMBER, WHEN, WHO, WHERE, WHAT)
(   1,<2021-07-07 09:36:40.00 +0400>,<she>,<DPX200>,
      <created by zg, POWCHK disabled, PULCHK disabled
       configuration hash MD5:
       00 E9 B6 7A A2 85 ED C7 34 08 36 98 17 FE 4E 26
       data hash MD5: 16K
       A9 77 FB FA 37 65 C9 03 70 3D ED B1 89 AB E0 64>)
$$ ##END=
$$ 
$$ hash MD5
$$ E2 FF C1 AA F1 D3 5E 0E 3F F5 08 3F 0D E6 03 B5
##$RELAX= 
##$RELAX= 
##$RELAX= 
##$RELAX= 
##$RELAX= 
##$RELAX= 
$$ Bruker specific parameters
$$ --------------------------
##$DU= <F:/spectra>
##$EXPNO= 1
##$NAME= <H-F>
##$PROCNO= 1
##$TYPE= <nmr>
##$USER= <she>
##$AMP= (0..31)
100 100 100 100 100 100 100 100 100 100 100 100 100 100 100 100 100 100 
100 100 100 100 100 100 100 100 100 100 100 100 100 100 
##$AQSEQ= 0
##$AQ_mod= 1
##$AUNM= <au_zg>
##$AUTOPOS= <>
##$BF1= 200.13
##$BF2= 200.13
##$BF3= 200.13
##$BF4= 200.13
##$BF5= 200.13
##$BF6= 200.13
##$BF7= 200.13
##$BF8= 200.13
##$BYTORDA= 1
##$CFDGTYP= 0
##$CFRGTYP= 5
##$CHEMSTR= <none>
##$CNST= (0..31)
1 1 145 1 1 1 1 1 1 1 1 1 1 1 1 1 1 1 1 1 1 1 1 1 1 1 1 1 1 1 1 1 
##$CPDPRG= <>
##$CPDPRG1= <>
##$CPDPRG2= <>
##$CPDPRG3= <>
##$CPDPRG4= <mlev>
##$CPDPRG5= <mlev>
##$CPDPRG6= <mlev>
##$CPDPRG7= <mlev>
##$CPDPRG8= <mlev>
##$CPDPRGB= <>
##$CPDPRGT= <>
##$D= (0..31)
0 1.2 0 0 0 0 0 0 0 0.06 0 0.03 0 0 0 0 0.0002 0 0 0 0 0 0 0 0 0 0 0 0 
0 0 0 
##$DATE= 1625636199
##$DBL= (0..7)
120 120 120 120 120 120 120 120 
##$DBP= (0..7)
150 150 150 150 150 150 150 150 
##$DBP07= 0
##$DBPNAM0= <>
##$DBPNAM1= <>
##$DBPNAM2= <>
##$DBPNAM3= <>
##$DBPNAM4= <>
##$DBPNAM5= <>
##$DBPNAM6= <>
##$DBPNAM7= <>
##$DBPOAL= (0..7)
0.5 0.5 0.5 0.5 0.5 0.5 0.5 0.5 
##$DBPOFFS= (0..7)
0 0 0 0 0 0 0 0 
##$DE= 6
##$DECBNUC= <off>
##$DECIM= 32
##$DECNUC= <off>
##$DECSTAT= 4
##$DIGMOD= 1
##$DIGTYP= 9
##$DL= (0..7)
0 120 120 120 120 120 120 120 
##$DP= (0..7)
150 150 150 150 150 150 150 150 
##$DP07= 0
##$DPNAME0= <>
##$DPNAME1= <>
##$DPNAME2= <>
##$DPNAME3= <>
##$DPNAME4= <>
##$DPNAME5= <>
##$DPNAME6= <>
##$DPNAME7= <>
##$DPOAL= (0..7)
0.5 0.5 0.5 0.5 0.5 0.5 0.5 0.5 
##$DPOFFS= (0..7)
0 0 0 0 0 0 0 0 
##$DQDMODE= 0
##$DR= 18
##$DS= 0
##$DSLIST= <SSSSSSSSSSSSSSS>
$$ [...]
##$SUBNAM2= <"">
##$SUBNAM3= <"">
##$SUBNAM4= <"">
##$SUBNAM5= <"">
##$SUBNAM6= <"">
##$SUBNAM7= <"">
##$SUBNAM8= <"">
##$SUBNAM9= <"">
##$SW= 20.0188882624521
##$SWIBOX= (0..15)
0 0 2 0 0 0 0 0 0 0 0 0 0 0 0 0 
##$SW_h= 4006.41025641026
##$TD= 16384
##$TD0= 1
##$TE= 0
##$TE2= 300
##$TE3= 300
##$TEG= 300
##$TL= (0..7)
0 120 120 120 120 120 120 120 
##$TP= (0..7)
150 150 150 150 150 150 150 150 
##$TP07= 0
##$TPNAME0= <>
##$TPNAME1= <>
##$TPNAME2= <>
##$TPNAME3= <>
##$TPNAME4= <>
##$TPNAME5= <>
##$TPNAME6= <>
##$TPNAME7= <>
##$TPOAL= (0..7)
0.5 0.5 0.5 0.5 0.5 0.5 0.5 0.5 
##$TPOFFS= (0..7)
0 0 0 0 0 0 0 0 
##$TUNHIN= 0
##$TUNHOUT= 0
##$TUNXOUT= 0
##$USERA1= <user>
##$USERA2= <user>
##$USERA3= <user>
##$USERA4= <user>
##$USERA5= <user>
##$V9= 5
##$VALIST= <valist>
##$VCLIST= <CCCCCCCCCCCCCCC>
##$VD= 0
##$VDLIST= <DDDDDDDDDDDDDDD>
##$VPLIST= <PPPPPPPPPPPPPPP>
##$VTLIST= <TTTTTTTTTTTTTTT>
##$WBST= 1024
##$WBSW= 4
##$XGAIN= (0..3)
0 0 0 0 
##$XL= 0
##$YL= 0
##$YMAX_a= 121118
##$YMIN_a= -198702
##$ZGOPTNS= <>
##$ZL1= 120
##$ZL2= 120
##$ZL3= 120
##$ZL4= 120
##$ABSF1= 10
##$ABSF2= 0
##$ABSG= 5
##$ABSL= 3
##$ALPHA= 0
##$AQORDER= 0
##$ASSFAC= 0
##$ASSFACI= 0
##$ASSFACX= 0
##$ASSWID= 0
##$AUNMP= <proc_1d>
##$AZFE= 0.1
##$AZFW= 0.1
##$BCFW= 1
##$BC_mod= 2
##$BYTORDP= 1
##$COROFFS= 0
##$CY= 11.3945322036743
##$DATMOD= 1
##$DC= 2
##$DFILT= <>
##$DTYPP= 0
##$F1P= 15.9154993809931
##$F2P= -4.1035820241983
##$FCOR= 0.5
##$FTSIZE= 0
##$FT_mod= 4
##$GAMMA= 1
##$GB= 0.15
##$INTBC= 1
##$INTSCL= 1
##$ISEN= 128
##$LB= 0.24
##$LEV0= 0
##$LPBIN= 0
##$MAXI= 10000
##$MC2= 0
##$MEAN= 0
##$ME_mod= 0
##$MI= 1.114404
##$NCOEF= 0
##$NC_proc= 0
##$NLEV= 6
##$NOISF1= 3.799351
##$NOISF2= 2.8
##$NSP= 1
##$NTH_PI= 0
##$NZP= 0
##$OFFSET= 15.70392
##$PC= 1
##$PHC0= -11911.49
##$PHC1= 8.80099
##$PH_mod= 1
##$PKNL= yes
##$PPARMOD= 0
##$PSCAL= 0
##$PSIGN= 0
##$REVERSE= no
##$SF= 200.130013532006
##$SI= 16384
##$SIGF1= 3
##$SIGF2= 2
##$SINO= 400
##$SIOLD= 16384
##$SREGLST= <1H.CDCl3>
##$SSB= 0
##$STSI= 0
##$STSR= 0
##$SW_p= 3612.71676300578
##$SYMM= 0
##$S_DEV= 0
##$TDeff= 0
##$TDoff= 0
##$TI= <>
##$TILT= no
##$TM1= 0
##$TM2= 0
##$TOPLEV= 0
##$USERP1= <user>
##$USERP2= <user>
##$USERP3= <user>
##$USERP4= <user>
##$USERP5= <user>
##$WDW= 1
##$XDIM= 8192
##$YMAX_p= 0
##$YMIN_p= 0
$$ End of Bruker specific parameters
$$ ---------------------------------
##NTUPLES= NMR FID
##VAR_NAME=  TIME,          FID/REAL,        FID/IMAG
##SYMBOL=    X,             R,               I
##VAR_TYPE=  INDEPENDENT,   DEPENDENT,       DEPENDENT
##VAR_FORM=  AFFN,          ASDF,            ASDF
##VAR_DIM=   8192,          8192,            8192
##UNITS=     SECONDS,       ARBITRARY UNITS, ARBITRARY UNITS
##FACTOR=    0.0002496,     1,               1
##FIRST=     0,             0,               0
##LAST=      2.0444736,     0,               0
##MIN=       0,             -198702,         0
##MAX=       2.0444736,     121118,          0
$$ Real data points
##PAGE= N=1
##DATA TABLE= (X++(R..R)), XYDATA
$$ [...]
1958e20M32J04n57O2M78J50p65M1N51j16k94L58K57p46J03M28J88l02k80L73k0
1979g5o04K64N82k90n33M97M94p78k86P76j0m31mJ64K32l22j45N76j04o22M72
2000a47J43k7l50K57L38o87L7P68m7p30J35O64m22m03N46j02K05m52L03L60l34
2021E5O1K37K88l63m49O97J11o52N49J33j19l12J84M62l29k23K85q5j29j50O25
2042H76P5o99k2O47l37l54K81J40l8k42L29N0j61l81N75l6q28K81M01q2m23M68
2064E20L88n41n26P65L9o30j63N05j8j24n82N89L58j119L58N41j83n97L62N65
2084E07l97n50M03J81m73l44L83L08n23j06N42l7o14O2P84l28n47M61K64m78m
2105e06M77j33m22K75L14o6l24k10L66k0o60M74M09j72k42N64J30m49l48R21l87
$$ y = [-520, -88, 16, -541, -479, -1, 149, -616, -575, -24, -140, -434, -76, 181, -565, -462, -34, 154, -148, -428, -55, -75, -679, -415, 167, -123, -656, -159, 335, -443, -729, 47, 37, -394, -398, -234, -2, -324, -469, 107, 3, -619, -147, -4, -31, -381, -124, 214, -473, -436, 332, 285, -445, -310, 354, -68, -471, 75, -27, 178, -274, 29, 389, 55, 116, 353, 641, 278, -171, 526, 637, -15, 534, 667, 548, 236, 420, 882, 553, 330, 615, 530, 401, 251, 876, 951, 252, 230, 877, 540, 186, 467, 607, 569, 327, 656, 706, 545, 164, 739, 703, -125, 156, 557, 475, 52, 520, 908, 367, -159, 606, 645, 15, -148, 357, 339, 215, -367, 222, 580, -539, -181, 360, 177, -420, -58, 507, 110, -440, -37, 144, -329, -673, -290, 18, -505, -611, -69, -106, -720, -658, 126, -202, -749, -288, -24, -502, -506, -29, -162, -584, -309, 5, -61, -385, -595, -229, -249, -909, -435, -26, -198, -440, 124, 254, -195, -543, 378, -9]
2126io46J44K67L55o25M3P82l73n26N68J35m49j8M15J74n47n3P49k36l77l20P60
2148B13k4p49O03K17p28K78L09J82n61j96N95J16m69m0M20k10m40K62N74m08l73
2169d29M92J62m57M0L77k9l79rM73j83m27K68L83j54k12QL51m29j17N77J51n96
2191a39j50Q00n3p79M72L44m48l13P11J5l03o8K97L29l38k08M52K17q35j37R67
2212H33l61k22K10O64o69k56L01M1K4k7p3J72l25j22L18R9l58k04N99k51p64N54
2234A83L65m70k37L14L15m47m6O89j63m01j87L94j57k25N2L98j99l12L76J62m80
2255g6n56P49j26n63J95L21J2l72J73J97j15m00K72R5j40m80M71K96n59j72N54
2276b24j29n72N29M19l95m83M50L96n60j82M01J48n2n39N49M00p91PO16k29l61
$$ y = [-9, -655, -511, -244, 111, -514, -471, 311, -62, -588, -20, 115, -334, -352, 63, 237, -310, -363, 386, 150, -227, -547, 213, 189, -560, 43, 260, -468, -190, 119, 301, -260, -456, 139, 255, -214, -254, 166, -44, -484, -222, 352, -56, -429, 63, 225, -232, -192, 185, 156, -223, -232, 241, 58, -369, -101, 282, 128, -84, -76, 275, -154, -271, 306, 457, -139, -289, 511, 458, -321, 151, 495, 47, -266, 445, 460, 157, 89, 386, 715, 377, 169, 621, 838, 3, -134, 833, 472, 250, 460, 1124, 455, 199, 500, 541, 565, 538, 465, 637, 312, 190, 508, 607, 249, 45, 644, 393, -371, 183, 548, 78, -159, 155, 470, 23, -23, 666, 503, 102, -85, 309, 152, -73, -21, 377, 178, -134, 242, 404, -76, -632, 117, -9, -572, -377, -56, -44, -416, -243, -46, -161, -561, -289, -194, -334, -814, -343, -47, -606, -778, -224, -353, -925, -396, 23, -372, -855, -405, -9, -569, -751, -350, -202, -254, -793, -244, 156, -635, -628, -12, -241, -602]
2297f02J55O92k24o99M38M44o81K0J85K21J56o35M77j44k0j25M36j54m0L6L17
2318B53k84k28O04Mn47j09O23j43n82K65M96j17n86O14k65K6k10M82J35m75k45
2339b89L51L73q34L82J57J73n38L67K08j80l30M84J54m75j24L24K64l53k48L54
2359B20l5l44j06O95k36k55m7O23n58P7K80J8m94L1L31j16o6m21R38k70m26J05
2381e6O17k65l27J72L95k72k87M65k7n04K06L47j45m46J59O51m56k60J26K83J21
2402D97o41N75K59l43j78N39k82n72J72J23K42m23J46N48l72n80K99K49n5l87
2422a84L40Q5l10k02M43J12p07L19L18k23n10M83J97n8q49M06L48m62K6M22k13
2443b19n09K62N82n79l10N60J07j63n26N19Q1l05k08L67K82n12q1M73J26n24J85
$$ y = [-602, -447, 245, 21, -678, -240, 204, -477, -457, -272, -51, 105, -530, -53, -197, -217, -342, 94, -60, -100, -64, 253, -31, -259, 345, 349, -198, -307, 316, 173, -409, -144, 352, 235, -351, 263, -2, 24, -186, 296, 431, -44, -289, 62, 435, -399, -17, 140, 313, -225, 142, 350, 170, -160, 324, 478, 3, -121, 203, 467, 114, -134, 220, 185, -159, -265, 430, 194, -61, -108, 515, -43, 34, 314, 332, -162, -131, 200, 84, 18, -403, 535, 265, -161, -56, 561, 296, -31, 141, 536, 264, -23, 442, 415, -89, 117, 464, 319, -127, 32, 683, 227, -33, 93, 376, 497, -144, 431, 690, 347, 169, 708, 426, -146, 26, 149, 391, -32, 114, 662, 290, -290, 9, 258, 203, -184, 156, 241, -69, -271, 172, 284, -423, -104, 214, -9, -519, -36, 161, 103, -746, -340, 8, -454, -428, -6, -219, -728, -466, 116, -463, -773, -213, -106, -269, -795, -276, -195, -500, -708, -341, -59, -571, -652, -179, -53, -577, -392]
2464c92J67j79m02J50L67k02m04P11o6k42l5N33j56p0r1k82L51l66K94L97j91
2485a08k20O36L0n66j25M05M3m47L29J68N4l48p7O66p9m52J72L66j90l24N69j49
2507C53n31L41M40j80m61J89K27j81m26N37j70j02j8L53L1l27K2L66N7o18J97
2528I9K58j71j58n1N66k49k12J9N00m20k40P7N39n13k12N07k31k14m0O12m93m4
2550g1L56r2j51j10N0K09k35p0M23L4m53m9O25l38l92N66J13j24m68L10M5r5k97
2573b14M94J86m43j86M33p6k94L08J75j15n64M70K31m60R0K88J2k40j79M48O6
2594D30o52L41K24k45l81K96M39m51n4K21%j59l06M20L15p26k8L80l85q4j36P32
2616A91m48k39L53L52m89j24L84r9l18j09N14l23J14k0L7j45qn3L98m26J48r7
$$ y = [-392, -225, -404, -806, -656, -289, -491, -895, -184, -250, -492, -527, 6, -150, -220, -311, -593, -242, -608, -314, 83, -108, -328, 308, 338, -228, -353, 52, 95, -352, -23, 145, 199, -149, -226, 440, 361, -91, 81, 447, 257, -67, 502, 353, -178, 163, 603, 423, -38, 151, 378, 197, -229, 308, 138, 36, 18, 371, 402, 75, 97, 463, 520, -98, 99, 357, 186, 28, -23, 543, 294, 82, 101, 601, 181, -59, 18, 557, 44, -168, 339, 108, -106, -146, 466, -27, -71, 285, 193, 42, -68, -18, 191, -44, -114, 309, 343, -110, -159, 466, 128, -264, 302, 415, 291, -177, 133, 178, 83, -214, 280, 466, 23, -163, 270, 194, -100, 208, 383, 268, -296, 174, 405, -55, 35, 323, 335, 95, -84, 364, 430, -222, 119, 343, 98, -283, 13, 452, 1, -53, 168, 168, 9, -297, 123, 438, -288, -316, 64, -321, -405, -541, 191, -257, -496, -143, 209, -280, -404, -20, -119, -437, -546, -32, -355, -241, -261, -224, -369, -377, -430, -32, -458, -310, -407]
2638d07K19n10K61M13m8m22k20O27p0n52K72O67n97rk3K71j81j40M18n4k79K08
2660a56J34n7l16M15R3r9j60J53K50k91k5J86K99l39j35M59k39J4N8m3K6l21K36
2683A42N1j45J71J46l4j21j11K33J26l29r8K20K31m26L13K59k68l05M53J21m89
2704A40j22L23J75l89k84N21J09l78l5K66n0j43L06Q9l31o53Q13J24m57k2M19
2725D21p5m18o8K20K98o05K52M23n73J31RJ21j56k97M14K61k83m80N40k05k02
2746b72Q6L53j81k09K45M49n70m8J85K56j70m51O00k68l46L70K50k25j34K89K19
2767D28m27m37N44M55p38q0N26k71k98M34J75j99o57M74J86J2k33kN82q75J56
2788b45K05O9l86J80L69m09j84L10K16n39K4L44k08j31k73N31O4m60k9K56J51
$$ y = [-407, -188, -698, -437, -24, -72, -494, -714, -87, -157, -709, -437, 230, -367, -376, -399, -128, -309, -449, -31, -85, -364, -156, -22, -79, -395, 20, 113, 14, -146, 7, 257, -34, -59, 127, 426, 87, -48, 411, 172, 186, 244, 201, 227, -94, 142, 193, 48, 219, 365, 331, 210, 99, 332, 458, 129, 31, 251, 482, 56, 369, 628, 360, 55, 508, 629, 140, 18, 341, 516, 127, -157, 364, 473, 95, 60, 326, 276, 133, 439, 528, 197, -456, 357, 481, 24, 2, 421, 346, -72, -140, 80, 378, -227, 25, 448, -125, 6, 15, 136, -20, -317, 97, 358, 75, -405, 135, -70, -272, -186, 167, -14, -223, 22, 471, -99, -147, 38, 294, 124, -327, 273, 5, -341, 29, 279, 54, -80, 209, 428, 1, -436, 108, 563, -175, -255, 271, 0, -298, 136, 311, 112, -545, -71, 115, 127, -106, -108, 474, -401, -245, -40, 29, -357, -177, 192, -217, -401, -91, 125, -414, -390, -46, -254, -385, -658, -127, -63, -523, -552, -296, -145]
2809a45j68K0J35k6j44p3K31q8l22K86K73j45j48O9P8j27r8K51K06m64J88R1l4
2832a54j25j91O51l32m9L94j83k58J03M04j75o7k16L31J0j91r0N24l79j17M20
2853C10L1j57Kn1K10m53KO86j48m86M03k30R0%M57j65j05j52K87K18o20j3K3M82
2877F21o38J74L45j34n29J49K78l36M65M5O6l53J61j18mk17K73n3J56l78J27L19
2899D19k97o18O54R3k48r3K64jm10K17J01J68l86L07M3l71k07J28M69l07J24K5
2921G4J5k74r8N64j01m45J5N17j21n55M95K2j83j22K09k15j43K01j18N18p05J20
2943c30N74k19n06N1L12R1k87K77n9J26l47R6M43m27l08N35r9q0J19L41k10m90
2965c97L53J75k03k00M18k85J10l89L17K28k24j74N26l44j85N2M55n57rJ32J21
$$ y = [-145, -313, -293, -158, -184, -328, -401, -170, -258, -580, -294, -21, -166, -314, -245, -167, -294, -392, -141, 65, -399, -211, -120, -154, -279, -470, 181, -151, -200, 194, 11, -247, -144, 260, 85, 18, -198, 133, 143, -48, -138, 386, 7, -110, 310, 341, 184, 186, 135, 345, -108, -106, 580, 432, -54, 349, 119, 209, 209, 666, 501, 396, 244, 531, 749, 129, 116, 139, 621, -17, 157, 502, 368, -161, -12, 266, -70, 395, 440, 506, 153, 314, 196, 192, -25, 248, 195, 351, -27, 100, 419, 122, -496, 158, 251, 3, -90, 174, 173, -237, -20, 81, 249, -137, 170, 213, -158, -365, -237, 232, -75, 49, 74, 89, -185, -283, 281, 180, -265, -250, 267, 146, -409, 86, 108, -75, -197, 12, -203, -346, -145, -263, 255, -450, -330, 244, 25, -481, -430, -118, -27, -314, -37, -96, 30, -317, -221, 222, -205, -513, 22, -77, -157, -38, 303, 93, -397, -44, 131, -72, -272, 146, -139, -29, -418, -101, 127, -97, -271, 255, -89, -274, -222, 233, -324, -333, -201, -80]
2986h0k49k08O49q5k41qJ80k05k10q4O36l63r3L03L0k06k00L30N20n54R8J46j49
3009d3k71J49K58R8n54L87jn9r7n8L92j33j43J96r4j49K02j24K69k01J20M06n05
3032D5l34O69kj45k27K84J64l67J78J80J38p75J76L76J12n53L06K93k36p8P8M36
3054G18l20j67M06m15l47K16M91l56j09J08L46n71r8K74K77m19j26L59J94m81
3074b0K42J91j28k43l37M65rk84N6K70j57k94L02J73m08o4M35j96l68J74L58l66
3096b08k24J85L50m25k36O41j91k54N3J73M1m64P7K89k05K09R2K47k83l28J81
3117b80K80n56J29J54J68j02j5L29j64q8n9J22J89k50P5M05o63L8J71m1N8j68
3139b68J87K66m50o4N21km87K19L33k36k40L18O6k95l17N42J29m63n2K85o6j45
$$ y = [-80, -329, -537, 112, 27, -214, -222, -42, -247, -457, -541, 95, -268, -361, -58, -28, -234, -434, -104, 416, -138, -40, 106, -43, -314, -165, 93, 191, -363, 24, 23, -36, -133, -191, 201, 68, -75, 121, 27, -122, 80, -44, 225, 24, 144, 550, 45, -289, 380, 378, 233, 6, 290, 454, 87, 265, 445, 583, -192, -16, 360, 472, -81, 225, 518, 282, 204, 282, 718, 398, 231, 637, 222, -125, 91, 582, 226, 117, 225, 571, 0, -98, 176, 453, 34, -92, 267, 461, -20, 222, 413, 285, 42, -295, 170, 161, -123, -67, 203, 46, -248, 54, 227, -181, -245, 190, -6, -374, -200, 158, -208, -432, -247, 103, -322, -558, 83, -108, -362, -309, -136, -95, -559, -482, -193, -398, -189, -97, 150, -133, -461, -280, 0, -556, -427, -273, -105, -207, -222, 107, -57, -145, -204, -82, 107, -143, -68, 337, -326, -288, -117, -158, -100, -268, -81, 185, -265, -329, 192, 190, -297, -78, 255, 19, -221, 97, 163, -132, -449, 93, 222, -241, -293, -8, -74, -219]
3161b19L10l8l53J04K09K17m98n5O10k96k78N9L73m26J55p6M12j07n05L78J88
3182A64j96k02J13N27n55j05L29ok05Q9J48J42n63K75M43n87Q9K30o8j99LM18
3204B84J01l43l6L93J6k66P0P7J47o50N12L54l46j52J18R7J6jm1o8l65K80J52
3227C49k32Jj2L21k57k63O03k77m90J93M75p2j25p2O7K09m39K08j30k46J09L90
3249C10P3m27k55L48K74k67j80J82j18m68L87J01j21o4J87J04l30j14J56Q6k79
3270d15l6L23j42k21J36L01j68l11L12K41l24l11N00j30j55j34K01K36l42P5K53
3291a11j8l79K92K42k33j23p5K65l58M9L59O3l17o9N21R0n66J68J78P3l55K62
3313d2K22n97J45L30L71q79N62l3j46J04lK70j23m18J78M05l22Q3R1J66k89l52
$$ y = [-219, 91, 53, -300, -196, 13, 230, -268, -323, 287, -9, -287, -228, 145, -281, -126, -202, 210, 103, -402, -24, 164, -32, -234, -121, 406, -149, -254, 75, 69, -136, -47, 101, 243, -320, -45, 398, -189, -100, 130, 62, -137, -134, 284, 385, 42, 6, 399, 415, 149, 219, 296, 443, -207, 305, 659, 313, 161, 279, 376, 392, 391, 350, 282, -83, 197, 349, 117, 118, 106, 427, 170, -93, 510, 233, -257, -64, 411, 339, 214, 142, 209, 418, -21, 187, 57, -189, -80, 310, 383, -44, -299, 49, 323, 56, -124, 58, -60, -528, -141, -40, -161, -225, -38, 66, -264, -378, -222, -136, -415, -451, -128, -270, -491, -355, -54, -222, -533, -221, 20, -304, -615, -115, -245, -400, -534, -333, -97, -439, -364, -111, -129, -508, -216, 26, -207, -330, -405, -140, -498, -449, -90, -27, -344, -413, 108, 198, -368, -200, -22, 51, -304, -42, 180, -417, -272, 58, 429, -450, 112, 79, -67, 37, 34, 304, 181, -237, -59, 346, 24, 107, 198, 364, 75, -277]
3335b77M65K2l58J02K59j99r9q9L92ol52J65L64m13K6N6L46n82M5K29J05m48K66
3358A9J87k14j51JM02L5l38J09K66l19J0J77J41n25J38M52l58j30K2O47l03k33
3380C5M34p7k15l49M46m8k75r4O06j19k85J52K28j76j48j9K89k84l51O39o7p7
3402B45j7J70j92j34j77N39k87k09L12K06m65j18L59K70m13m18K32J59Q9l87K67
3423C1Rk30K76J16m7l39q2N87l06j48j72L28r0j99K01j2k26l3N64m04j82L80p1
3446d9j31k97J35L03o86K75R7J61l26lL64q3p9J2K47l59P7k42K87k4nmL08m75
3470d97L0M96j89k52j13N28k93L5m1M07k16k55L31kJ14k2O6j07k05q5L67P9k70
3493i4J05L37j43n03M02L35n43K33K77j62j31m0O2m8k98L75K99o00j22M34R5k28
$$ y = [-277, 188, 210, -148, -46, 213, 14, -85, -174, 218, 212, -140, 25, 389, -24, 2, 58, 404, -178, -133, 96, 201, -247, 19, 206, -8, -159, -158, 244, 279, -59, 50, 316, -3, 7, 184, 325, -200, -62, 390, 32, -98, -76, 571, 268, 35, 469, 392, 177, -172, 274, 226, -49, -143, 463, 344, 59, 211, 439, 263, 115, 96, 385, 101, -250, 389, 322, 245, 228, 398, 206, 72, -105, 434, 147, -62, 250, 456, -9, -127, 232, 502, 89, -329, -97, 62, 151, -236, 31, 40, -190, 86, 202, 155, -184, -266, 321, 15, -133, -305, 23, -67, -266, -65, -77, -303, -336, 228, -176, -358, 22, -49, -180, -477, -342, -39, -725, -450, -353, -192, -518, -521, -157, -240, -319, -307, -60, -419, -342, -584, -297, -321, -326, -330, -22, -497, -467, 29, -160, -412, -525, 3, -290, -255, -296, 111, -105, -360, -29, -31, 83, 61, 127, 20, -185, -270, 97, 176, -94, 11, 348, 205, -298, 104, 439, -104, 129, 406, 244, 113, 73, 135, 87, -211, 164, 463, -137, -259, 175, 270, 42]
3515D2n7K05K02n58l4P32l74k3j45K86l89L07l90M57j28k83P7O14o81K35L18j33
3537B80k78lL30k65k17L65O1j22j71K57j20n7k66L60j9j67N2K76p8r4m0J77j02
3560A59k19K3K21K0l91M21k11r6R5N36m66ok54L24J37m90N21P5j37j76J70J86
3582D42n81k8L97j21m6m5q0r9o0N2J19J56l48L40M03p10k0J05M9k7q3N25l87M2
3606eq4j20M19m93K25K92l20k86K43J17k25k80J46M95l96J14J78k44k62M57J60
3627A31o06l1L19L01l79k97N55j02j18o7K84j32k19J3L38k52k73L22L3j42rL31
3649@j80j7j05J92j41K82l45L74n6k52K15Q5k19l1K68K64m77J40M1J41j79q5L94
3672C09k06j9N4L65l79L9j53K73Rm39M71j3j81l70N74J20n18L31P5n0l42K06N06
$$ y = [42, -15, 190, 392, -166, -200, 532, 158, 135, -10, 276, -113, 194, -196, 261, 133, -150, -73, 541, -140, 95, 413, 280, 2, -1, 329, 64, -153, 212, 273, 151, -20, 237, 117, 60, -206, 154, 135, -32, 20, 296, 218, 124, 84, 261, 159, -60, -37, 184, 204, -187, 234, 23, -73, 22, 558, 92, 86, -168, 156, 293, -197, 324, 399, 262, 86, 256, 442, -139, -167, 230, 109, 63, 18, -62, -161, -221, -169, -50, 106, -242, 98, 501, -209, -229, -124, -75, -102, -185, 340, -47, -5, -89, -209, 210, -283, -58, 234, -86, -372, -129, -12, -237, -517, -371, 124, -272, -158, 20, -224, -486, -29, 131, -475, -506, -187, 114, -265, -562, -7, -109, -227, -294, -10, -142, -361, -348, -10, -262, -535, -213, -180, -322, -331, 0, -180, -197, -302, -110, -251, 31, -314, 60, 4, -248, -33, 52, -167, -198, 70, 334, -143, -3, 38, 179, 0, -85, 309, 103, 84, 138, 503, 124, 163, 10, 283, 292, -147, 324, 311, 130, -240, 334, 454, -64, 267, 342, 292, -50, 156, 662]
3695F62n93j27J06L50m45J62jL39k80J14L75m87K6k74M76p4l72j6L38l15J57m7
3717G4j5k44J88K62j78m32M41L4o7j63J54J5j8j45J07J10j14N5N7j86l32N58j51
3740A0J51k87J22O2p4k29K59K48l42k5R7O2l9j23L00K4p00N64L05l84j62J50L81
3763C70m15n8K20qq9l38J03J39p9J3K55r5l4mK81m65j73N12r6k33j12P8K35k16
3787b09m8L79j82n20J44M84k47k81M25p1k33n5M27rl63qL25O5p38J91L23K04n25
3810e22N07m5k75k77K52M08m60J90J41K39k93k60N87j84k26M7J29l02M5L81Nm77
3832c90K68K28p4R7k30J17J14l60L25M0J37k74J00M4m54L32K44K14k98J12j68
3853A24p2Q6J16k51J58l29M31K19m9n28P22m63j12L1K33J46m22L84L5l59m7J77
$$ y = [662, 69, -58, 48, 398, -47, 115, 114, 453, 173, 287, 662, 175, 201, -73, 403, 329, -43, -59, 279, -36, 121, 74, 59, -185, 3, 265, 87, -345, 96, 130, 63, -100, 54, 69, 51, -94, 13, 123, 9, 64, 121, -65, -397, 161, 10, 161, -126, -4, 58, -16, -245, 14, 262, -80, -105, -8, 54, 15, -108, 192, 216, -484, 80, 385, 1, -161, -11, 370, -45, -103, 117, 109, 20, -318, -215, -76, -155, -142, 113, 18, -16, -20, 261, -204, -377, 135, 39, -194, -306, -228, 7, -209, -257, 122, -60, -580, -436, 48, -199, -480, -55, -126, -359, -414, 13, 4, -359, -367, -42, 23, -715, -524, -201, 3, -522, -15, -60, -335, -612, -360, 48, -412, -222, -81, 158, -135, -395, 192, 8, -218, -171, -42, -344, -299, 82, 87, -390, -122, 106, 32, 129, -101, 16, 130, -230, 95, 135, 272, -2, 98, 142, -312, 20, 264, 478, 180, 292, 124, 52, 138, 254, 3, 161, -168, 263, 482, 433, -95, 627, 164, 52, 83, 316, 462, 40, 424, 459, 100, 53, 230]
3875B30K52l61L7M2M57m26j40K42p1j79J88J79l04n9M0L66l57l49L35J96j85l14
3897a81K58J46l28K6J71r6l43N30k77jk23J24L94j75l08P50n09q2K38m25M62n28
3919c77Q0R0K16l43K20L45m92r1K91R7j8j92J7K40l34k0L50K10n49j8M49K16m87
3942a00J57J01k46k64K50O0l69J98L15j01q1k23N52l63J7J76M0J54k39O7k02J67
3964F6l36K46J22k40j08K44m0l06K10n0R5k10K31L75m66o5J27J12k11nK96k8l47
3987b88K78k49K56m02L28j74K57k04L27o4l34M9Q9J81j55l7J85N4l01L81m0j66
4009b9K3K60k71j4o4K98K98n53j50N30j80l01N07r6l93J29K12L02n57K18J02o6
4031B05k9J77K1j30k25Q4M62k81L0r7K28m77O8M30k95k5o5L81m07J8K58j74O1
$$ y = [230, 482, 121, 158, 200, 657, 231, 91, 333, 262, 83, 271, 450, 146, 87, 127, 493, 136, -213, 122, 318, 133, -181, 77, 223, -105, -79, 92, -4, -347, 183, -94, -95, -318, -194, 200, 25, -283, 467, -42, -124, 114, -311, 151, -377, -297, -207, 9, -334, -114, 231, -261, -352, -61, 36, 18, -174, -157, 83, -251, -271, 79, 289, -260, -278, 171, 387, -100, 57, 158, -88, -352, -102, -42, -411, -213, 102, 1, -80, -303, 249, -114, -97, 79, 119, 273, 34, 101, -101, 66, -270, -24, 98, -142, -250, -6, -46, -352, -142, -192, -97, -307, -76, 299, -167, -232, -105, 7, -204, -209, 87, 59, -288, -10, -259, -3, -405, -77, -251, 6, -198, 129, 65, -269, -220, -131, 50, -105, -142, 43, 97, -204, 177, 137, -29, -6, 254, -17, -31, -95, 203, 501, -52, -202, 328, 148, -153, 354, 258, -135, -6, 206, 508, -49, 169, 271, 205, 176, 353, 374, 244, 19, 103, 565, 284, 314, 217, 445, -32, 36, 466, 171, 146, 81, 462, 55, 73, 331, 157, 218]
4054B18j41NL60k51l8k29L23m13J90K89j74r4j42K82j04j96k5K04k06rJ26r4r1
4077b10L7J75m4j98J17K15q0k60m6J26j07J89j66J63k79RK93J18n81J27M75k41
4099a68k40L22j39J5p7Q4L40m79k2M36j88rj65K2P5j33j37O66k48j29rJ94Q6k81
4123a84N2J57r7j81K72j98j12K42L06o20J34K27o9K16k35k95O51m79k56L03J20
4144d6k50J5K98J32l56K21J62k47l21J11M29m31K32L6K21k64o2N19l05n9j27Q6
4166fj38r8K53L38l09n67M56L45m08p0L19l6J27k05R0n5L8j1K05L7n40K69K54
4189B88l86P9rK42k10k08M16k78n0K25M03l16m5J89k36M5J79K65j72m29K81L32
4211F05m14k61K17J58K34o40K14K57k67l29K53M39j58j76K29J1l81m5L04J06j85
$$ y = [218, 77, 82, 442, 191, 153, -76, 247, -166, 24, 313, 139, 45, -97, 185, 81, -115, -140, 64, -142, -151, -25, -119, -210, -173, 2, -42, -240, -123, 92, 12, -248, -294, -168, -275, -86, -252, -89, -368, -359, -66, 52, -529, -402, 73, -168, -408, -86, -225, -210, -287, -203, 137, -342, -364, 72, -116, -125, -290, -268, -193, -326, -463, 203, -45, -174, -183, 11, 97, -184, -132, 25, -72, -253, 19, -179, -291, -49, 257, -363, -229, -2, -71, 145, -90, -385, 266, -213, -469, -166, -46, -296, -281, 17, 149, -207, 14, 176, -71, -392, -281, 148, -283, -51, -15, 206, -58, -120, 399, 94, 35, -92, -6, -144, -242, 11, 349, 40, -527, -71, 274, -134, -204, 115, 79, 206, 1, 91, 36, 74, 63, 268, 305, -235, 34, 288, -98, -19, -28, 214, 4, -204, 212, -66, -116, 109, 512, 196, 151, 340, 104, 149, 328, 593, 421, -8, 273, 605, 191, -70, 147, 305, 539, -101, 113, 370, 103, -226, 27, 466, 308, 132, 361, 372, -9, -54, 250, 356, 171]
4232A71L8k20K00l12K83M4j53k57L28j22j15o9K70R6m71K02J82N4k66L6J33k49
4254a97j43K55M9l85o0N89j83l18M1K80J88o51K41P8l9k10M10o4o6j69J36K64
4276D6l61p0O2J12L2N2O0L6m60l4M13J12j26k14L00lj59L8P6k61J06M01p0l27
4300b39l8N01m12P8j8L06l05L01j64K1j07J50J51N2j80J6J78j55j48Qj35K64o2
4323F3j45M45m39Q1r6K66j27O3R0K7m27K74r3K1rQ9J62k11m1LK46l04j23M43o
4348B52m69K17R8J53n26L75Mj25L2L51j87m08M12o1j46J08m1J30j4l25L92l6o7
4371A19j74L25n5l66Q6K52N6l48L05j6K31n59L15N4J23J7m38N88m82r3J67O6p6
4394I7J37K08k81m49L68N51n21l78K43Q9K06l86M65mk96rK82l16j02K37J48j23
$$ y = [171, 209, -11, 189, -123, 160, 204, 51, -206, 122, 0, -115, -184, 86, 182, -289, -87, 95, 149, -117, -81, 52, -197, -340, -85, -36, -421, -481, 108, -75, -393, -352, -72, 116, -535, -294, -216, -255, -465, -55, -119, -185, -354, -218, 46, -315, -385, -323, -211, -179, -127, -67, -31, -491, -525, -112, 0, -126, -340, -40, -43, -202, -164, -88, -349, -243, 158, 88, -239, -277, 224, -188, -110, -128, 178, -127, 174, 10, 31, -76, 74, 225, 277, 97, 113, 291, 136, -12, -4, -139, 125, 63, -82, 363, -76, 5, -91, 175, 48, 111, 201, 228, -199, 75, -18, 3, -6, 83, 245, 34, -7, -4, 242, -62, -185, 258, 252, -217, 0, 98, 251, -275, 100, 104, -21, 11, 362, 175, -233, 179, 118, -28, 80, 39, 169, 155, -170, 222, 186, 119, -55, 270, 215, -151, -65, 187, 243, -105, 200, 184, 415, -144, 171, 225, 348, 365, -73, 515, 33, -60, 107, 173, 97, 234, 442, 161, -288, 80, 631, 110, -268, -25, 64, 270, -116, 349, 345, 49, 40, 322, 6, -96, 141, 289, 166]
4416A66k05j64J75K35p6l19M50k96m2q2L11k96l20M12k30q7l6J55O5N4k11K27
4438a14o0j72J35j2Lk92L37J52l84K19O6j57k80L06P8l2k46L61L16o13m4J56M80
4461B03k74l26L07k7j74J11J63j89J15K14l4k35j3J44j2r7M7n7K51j47k6L52k34
4484F2m25L67J25N7j76J14J77j92k47M44l80R1O8R1mp8K97l4k95k08J21J90j74
4507il5M79j67j18j20R8n6N7J45J5j08m98N19n8n5k90L62k5j4k22K29J06k12Q1
4531A04J38j68q1J04L4j31J27Q9l41Q8j27M03j77Q2J27r3kl93K45L76n51P8K37
4554A68M0L3k76Q9J68Lk33J81O5k32q0L68l51n7J64L15m34k44Q69m46j30K11k04
4577a3K00l43K20Q6j83P8k09K51k11N4p0J56j01q7K53j12J14K9L4q0j46q4K77
$$ y = [166, -39, -203, -28, 207, 131, -188, 262, -34, -76, -158, 153, -143, -463, -51, -281, -368, -404, -249, -184, -130, -341, -114, -174, -346, -211, -223, -220, -512, -175, -23, -407, -188, -122, -279, -559, -253, -175, -207, -453, -92, 224, -389, -433, -277, 203, -71, -397, -90, -117, -291, -180, -17, -206, -91, 123, 89, -146, -159, -15, -27, -124, -77, -134, 117, -30, -56, 296, 62, -363, 4, 129, 186, 10, 124, 301, 109, -138, 306, -74, 17, 85, 176, 172, 94, 391, 357, 62, -146, -25, 165, -9, -44, 435, 268, 150, 30, 128, 72, 129, 274, 289, 181, -317, 202, 144, 89, -201, 161, 136, 122, -100, 129, 235, 23, 104, 242, 74, -7, 97, 131, 0, 127, 216, -125, -37, -164, 239, 62, 144, 271, 178, 176, -217, 28, 404, -147, -69, 168, 208, 241, -35, 54, 222, 225, -8, 173, 238, 6, -74, 294, -57, -114, 50, 365, -69, -313, 556, 110, -20, 191, -13, 187, -156, 64, 150, -33, 45, -164, 87, -124, -70, -140, 16, -85, -172, 81, -31, 83, 112, 146, 66, -80, -164, 113]
4600A13k72M1J67j98j50k88N48k6j06r4K28Q1j46j77M84l50k76K37J17k70L5L70
4622F8j21j32P2k4R5k81k7M05j76k83K08N9K08n54L76K62m13Q5K38j2j79k4M61
4645C11n22L7P1K4K5O1n8n5J01JJ50p6Q9j21M52n20R8J9J67n8l54L9N44j59k60
4670FJ15K29j79P2j40M2N1k78K73N3J36r9j37J35j52J05Q7j08n22M06l3O5K79
4693D06j41o9j72j45K37j31M8K42J39j18k02mj60J71o2oL19l88J53mmj0K18r6
4717B21k14k31K0N16n29J10M40j05n34M39R0Q7n7j26n6j68PK17p5m17J35J63J63
4740I6o9j67J86K4j80K17j87%k89N09q3K78l63K13n2k56OJ81Qj98R3J89j42l20
4764c06N32l85J5j55L19J22j32K0j08J94k80j31N37k37k85J25j7J83l77L02J62
$$ y = [113, -159, -118, 49, -149, -299, -587, -39, -65, -171, -265, -37, 44, -102, -279, 205, -145, -421, -184, -67, -337, -302, 68, -53, -185, -113, -137, -42, -323, -350, 55, -121, -404, -196, -137, 71, -483, -107, 155, -258, -173, 65, 53, -126, -150, 311, -211, -174, -103, -79, -54, 7, -51, -106, -5, -4, 146, 70, 159, 38, 490, -30, 68, 87, 254, 196, -158, -119, 425, 266, 6, 121, 350, 171, 243, 103, 145, 196, -82, 191, 244, 380, 281, 144, 279, 127, 232, 319, 211, -311, 95, 62, 127, 406, 265, 196, 24, -121, 116, -15, 33, 275, 414, 296, 94, 90, -70, 101, 39, 33, 352, -36, 117, 113, 109, 99, 317, 221, 7, -224, -204, 312, -217, -107, 333, 228, -306, 133, 223, 310, 253, 127, 71, -97, -90, 127, 52, -365, -230, -67, 96, 27, -140, 46, 70, -110, 107, -80, -80, -369, 140, 57, 335, -28, 185, 133, -123, -117, 64, 72, -126, -33, 156, 14, -306, 226, -159, -144, -299, 20, 142, 10, 30, -78, 116, -164, -295, 242, 5, -280, -155, -172, 11, -366, -64, 98]
4785I8m98K19J54J41j98k58M29j62j08q2L46k68k04K35K45j32j65qK94l30Q7K03
4807C8l92J07n3M54l02p6K61m4m3p4L7K9J96n7l6K58k05%M0r1j0j32M49m08Q7
4832C3k5K04j93p9K63k70M86j58k7j08j51j02M77m96J57j92R78p92J62J07Po7
4854B14q4l4J81m32K67J30k47ro4M54j33j54J18Q8k77L3RLj43K9J82n7o7L66o5
4879C08k85J57p9L5K65o91M80l00K5L8K11l73J0R1P5r7j21J33J77P5j90J29j86
4902a13K31q8n6j62R8R7mJ49j54q8p1j04kK61K30j25k50L66l9k97l5JQJ70j03
4927h0J39j43L5K81k4k46k25J62M87m02l13L40oL9k14K65rk15k50L90j56R3K1
4950c1K53l08k97K41J29r4N7L45m70j66L70n4j27m6J66K09j60j78K89k21J21l06
$$ y = [98, -400, -181, -27, 114, -84, -342, 87, -75, -183, -265, 81, -187, -391, -156, 89, -43, -208, -216, 78, -252, -165, 38, -354, -247, -300, 154, -148, -224, 37, -7, -50, -124, -87, -58, 138, 81, 45, 303, 98, 98, 138, 47, 37, -95, 354, -54, 33, 8, 212, 19, -60, 203, -67, 419, 261, 234, 126, -25, -127, 350, -146, 11, -181, 797, 5, 167, 274, 281, 214, 130, 96, 277, -155, 112, 242, -5, -14, -78, 376, 243, 89, 207, 295, 18, 51, 60, 63, -80, -51, 131, 74, 7, 373, 308, 23, 180, 101, 136, 401, -290, 190, -110, -85, -47, 164, -209, -199, -108, -33, -130, -251, -118, 59, 134, -56, 73, -113, 118, 30, -26, -188, -90, 7, 3, 152, -2, -90, -161, -265, -267, -6, 224, 99, -151, 215, 176, -121, -156, -155, -147, 23, -80, 59, -84, -49, 232, 208, -38, -263, -101, 386, -16, -329, 11, 5, 44, -170, 95, 86, -129, -379, 11, -145, -52, -31, 222, -86, -383, -142, -13, -107, -50, 295, -175, -341, 29, -25, -152, -198, -32, 177, 17, -161, 128, -93, 28, -278]
4972b78L98l20j51L63j97q3P0j19L05O2jl10L39k25m0L33L15n53m1J30l7j43K63
4995H0K8o2l48M17J93l27k89L87R2j00j8o9R2j18L55r8j39K0L8J83j84j15K46
5018B64j46j93J95K40j13o6j75L59l25Q4j24P0J9j85K36J5K9k37N44j83k96j03
5040i1K87L05l56j61K8K08k35J88J97l52m8K06Kj74k80K26K15l46P3L29j33k82
5062a94K88j39j81L87k0Q9j75j48K85k74J44k9L5k99J05J08j27Rkk55L26p4j09
5085b50J70l5j23l6J01O8p7k12K10J53j24j92K32J59k24m9K59l64K22J08j8k12
5107b34J99j89J36j55L09K17l43N8j10J13j18M8j10L56m46J83Q3N3q1K46k19J58
5129A54j35j7Q4j68O0qJ67j73P4j74K91l86K32K04l90J97J2kJ1j00R1K24k81j37
$$ y = [-278, 120, -200, -351, 12, -185, -268, -198, -317, -12, 50, 49, -261, 78, -147, -187, 146, 461, -92, -133, -3, -40, -183, 80, 108, 46, -302, 115, 308, -19, -308, 79, 171, 71, 53, -16, 76, -42, 313, 215, 76, 96, 134, 317, 133, 18, 264, 118, -75, 120, 360, 247, 181, 6, 365, 40, 124, 0, 70, 89, -96, 140, 155, 184, -53, 491, 308, 12, -91, 196, 501, 145, -16, 12, 220, -15, 173, 370, 18, -30, 176, 178, 4, -276, -50, 165, -181, -108, 221, 88, -194, 94, -45, -226, 161, 141, 230, 55, -93, 192, -82, 62, 33, 68, -231, -126, -18, -145, -136, -138, -393, -67, -141, -250, -80, -115, -238, -274, -173, -105, -182, -394, -184, -31, -155, -347, -115, 44, -180, -229, 30, -334, -112, -4, -22, -234, -35, -224, -88, -243, 66, 283, -60, -2, -112, 1, -117, -69, -179, 177, -269, -86, -3, 50, -31, 215, -4, 154, 19, 2, 86, -82, -22, -30, 137, -36, 38, -136, 155, -231, 1, 205, -185, 12, 24, 22, 33, -67, 24, 248, -33, -170]
5153a70R4J59l08J06K16O8n59K01K65l33J66J34J27j46k99L27Lp9p9M48k89l8
5175A4k19M79j27j47j09N69m69m4J06O7k9j22J41J31j84j15K62J70j17l05K09
5196A61o8l73L09K70Q5m93M76r6j05j70R3K90l86J82m9Q0%rJ78l53jN9Q7j60K25
5221B32j36K5j43O5K28p4m59LJ88J82j64Kp5P5k36K90M04l31k27K18o1j70K84
5244A20K43o48L5K60k9n1m18Q08k41l06j34M67N1k75J49j19k33N7R0K38j99j6
5266a51J46n6k67K09L51l24k38K62L13l53N8q7K30j99J58Nj93Q7p4O7o0O4k00
5289b52L40r8M8q6J58n2j87r8N63j54l58M43j99j35K1N1p5j23L07kl50J25M8K27
5313A62K2r4k22J75q8j69L44n7k98m5M31j40J86o6j06J81j88N4j94J10N2O7K65
$$ y = [-170, -76, 83, -225, -119, 97, 165, -394, -193, 72, -261, -95, 39, 166, 20, -279, 48, 51, -28, -107, 341, 52, 14, -205, 274, 147, 0, -109, 460, -9, -53, 53, 120, 91, -31, 110, 241, 57, -58, 204, 374, 257, -48, 161, 93, -280, 29, 299, 384, -109, 367, 271, 166, -4, 89, 379, -7, 175, 126, 206, 206, 197, 375, 22, 21, 80, 167, 7, 232, 96, 121, -22, 43, 271, 197, -262, -259, -71, 111, -53, -51, -126, -51, -287, 3, 407, 76, -151, 67, 6, -164, 120, 363, -285, -250, 10, -19, -70, -488, 320, 79, -227, -361, 106, 157, -118, 31, -88, -321, -264, -174, 64, -135, -151, -5, -61, -328, -119, 232, -92, -330, -68, 245, -108, -50, -137, 93, -106, 52, 57, -136, -49, -123, -56, -116, -52, -252, 88, -10, 38, -48, 110, 58, -129, -227, 336, 182, -176, 267, 68, -67, -46, 5, -70, -193, 114, 112, -238, -113, -65, 162, 184, 90, -132, 43, -45, -214, 130, 73, -225, -270, 161, 21, 207, 141, 35, 216, 28, 82, -112, -2, 50, 117, 382]
5336C82o10M23j41L6j14n4K35k26j75N54k83N5J10n7J04k33J27j25K6J15k2K27
5358C54j55l23M00K4l30P5q2K13l03R0J95r3K8p6J51K2p4j13L45j70J07r7l3j96
5382d1o1J42J03k29K74J12l7o27K61K79l2j02J59q3j28k43K90J35m39L27k33L49
5404A76l51J62k15K24n4m1M8pJ73k96J00q0L9mj5l21L91l9k6r6JK2K6p0K60j35
5430a28N8k41K01k4q8m7N8J53j03K09j10M3r8K3J28r5j22r9M22l19p1O7K71j58
5454g0J2K06j04j44j05K07q1L4J08K11m62P6j39L57O0j65L28n26J22K47l4j20
5476A8j5P2N1j99n6Q9J06l8m6J28j20p7l3J62K48m72L07K19j76l49J56K74j8j1
5500B20l55L88j14J3j07J89l93M0K44L2n9l31L88j44k97K39L06k82L7J80K3k32
$$ y = [382, -228, 195, 54, 90, -24, -78, 157, -69, -244, 310, 27, 82, 192, 135, 239, 6, 133, 8, 34, 149, 127, 354, 199, -124, 276, 300, -30, 45, -37, 176, -127, -37, 158, 65, 93, 17, 168, 190, 116, 3, 348, 178, 285, 188, 155, -41, -102, 40, 143, -86, 188, 300, 263, -364, -103, 176, 144, 42, 201, 118, -10, -253, 37, 172, -267, 60, -173, 176, -175, -13, -228, -4, -58, -99, -51, -58, 115, -181, -81, -161, -122, -126, -141, -462, -71, -110, -136, -232, -231, -209, -183, -253, 7, -128, -70, -311, -110, -134, -222, -269, -211, -58, -161, 48, -62, -19, -117, -94, 34, -61, -183, -282, 140, -179, -250, -183, 88, -70, -58, 148, 44, -100, -205, 2, -79, -45, 63, 274, -188, -112, -251, 106, 166, 1, 329, -197, -75, 172, 138, 18, 3, 75, 126, -73, -129, -40, 66, 28, -18, 110, -10, -87, -120, 42, 290, -182, 125, 344, 168, -181, -25, 249, 231, 220, -135, 253, 139, 152, 45, 234, -159, -119, 125, 157, 98, -233, 155, 11, -286, -47, 259, -23, 14, 194, 217, -15]
5522a5J11K1k56n9J72J05l5j4J23m8j48N7Q5L4j39M2Q5k2m1n1J21k67l1J58J8
5547Fj35J8r8K48L3l02K73j24j38M42q9j89J46k4l3p2k00M00j16n9p9J37j12j61
5571b28M36k49J04k36J59n9L0L8P2J4k8o2k10K95j46NM3k6nn0J47k43J97K8j70
5596a44P1o2pOL0L5R8j93O2p0n8k3M9L67L1m37o1J30K41ml68N4L34l18J56k9m0
5623a50J10m2R4k49J3L24K04n01p9J79K79j20j76J07K99j79j73L31k31j07J53
5644H6K08k92N1M9j2j28K67k90K18l41P7M01j70j30J59o8n2j13K22J25q9k73K76
5667A81K66l33p9q2L57m13J17K3q4k90L15M1k21J90M0L3nL3K23k66p7K42K00l57
5691E4k29K55K49r0j18m4J03j98r8K74j74%l49M79j43M4k8K8pp8M23m02K51l34
$$ y = [-15, 96, 117, -139, -198, -26, 79, 44, 30, 153, 105, -43, 14, 99, 133, -6, 36, 121, 99, 58, 7, 128, -139, -170, -12, 6, -129, -111, -209, 39, 72, -230, 43, -81, -219, 223, 134, -55, 91, 67, 34, -38, -238, 162, 46, -13, -92, 45, -67, -228, 208, -41, 63, -173, -14, -73, -43, -5, 67, 81, 53, -9, -219, 76, -70, -65, -22, -48, -53, -103, 44, -199, -2, 26, -144, -73, -135, -142, -136, -106, -71, 27, -166, -104, -174, -232, -255, -206, 161, 192, -245, -306, -176, 65, 61, -307, -253, 81, -237, -81, -110, -150, -40, -82, 12, -237, -224, 100, 304, -197, -276, -97, 182, 62, -114, -7, 292, 113, -60, 271, 40, -67, 86, 294, 2, 53, 102, 90, -38, 229, -61, 157, -184, -107, 294, 124, -6, 153, 85, 33, -80, 142, 267, 178, -95, 181, 447, 114, 35, -47, 310, -103, 14, 37, -47, -337, -22, 19, -202, -12, 28, 61, 56, 89, 312, 46, -31, 211, 411, 54, -175, 80, 329, 239, 121, 77, 180, -18, -116, 158, -16, -16, -365, 114, -29, 15, -13, 15, 8, -70, 353, -49, 202, -132]
5715a32P8J3L5J29p9k6J46j14l8k63j36M28J49q6k51J83j06L92k50Oj40R0J23
5738A51K12k77l37K83K16k3l47m9L70k73K6K04J20m61Q9K56j35l87M64J07k34
5759b5m7P7K50k3l15n5J03j9j98K26L00l17J7J25p1l37M33k65J09j59L41k69K17
5782I8j38J40k01O8p0Q3P1l21K07J82q2j78K00j23k63J19K8j03P6k0L44l86J59
5805a10J08N4N6k2M3l2l03J15j06L63j50m1o1l3K55J51l41J03J8j39M23l29j11
5828h9J47J88m02R9J67j19P2R5Q2k84k9pK46j05J84k44L17m53m7K07K13j99R0
5851A29q7K9r8J37n9K6j21L45L9q0j76j49L29k48J90J03k46j8j15J41Q8j31K23
5874B51j93Q8l43L07JR1P7l35J17L9j97J13k31q7R2J65o4k89K65L6Rj93J26K37
$$ y = [-132, -54, -41, -6, 123, 44, 18, 164, 50, 12, -251, -387, 41, 190, 104, -147, 36, -70, 322, 72, 78, -62, 28, 151, 363, 86, -251, 32, 248, 225, -122, -171, 199, -74, -48, 156, 276, -185, -96, 160, 25, -362, 102, 209, -25, -72, 5, 255, 232, -83, -138, -35, -54, -252, -26, 274, -43, -26, 99, 28, -309, 124, -141, -32, -191, 150, -119, 98, -40, 100, -101, -33, -103, -20, 51, -270, -63, 119, 37, -141, 59, -64, -327, -208, -180, -283, -207, -227, 117, -269, -110, -2, 52, 108, 86, 129, 97, -206, -91, -197, 166, 16, -25, -86, -119, 136, 287, -54, 49, 67, -72, 351, 22, -89, 58, 246, -156, -57, 110, -9, 63, 158, 240, -44, -73, -80, 166, 61, 245, 1, 318, -135, -182, 25, 238, 39, 129, 42, 71, -27, 110, 51, 77, -44, 301, 340, 260, 84, -65, 264, 16, 206, 309, 63, 45, -70, 71, 159, 28, 251, 58, 146, -197, 110, 111, 202, 279, -56, 61, 100, -97, 16, -215, -302, -210, -45, -109, -398, -133, -97, -88, -281, -155, 82]
5898H2p1k96N70k55nM5l57K51jL16J53m79k32n7L46j29J15R6n9k8j28K14J75l88
5922a22J46l5N7N3j71J81j83j33j44K88l9M5K85l50p9J28L9O2k92L18p8j81L94
5945A89r9k17K47m7k20J27n7J98k6N1k0j50J47J07l99M46q7j45j80M8j49O3ll0
5969b06M92k61l3R8J30k73JR9j19k41L53p0J25j51O7j8k02K9M5R4O5K0J8J3j1
5994F4j72J61m50O15N4m87q8K94Q0q9n8M10m92L24l51L95j81N5k95L13j37J68
6016A33l11L14n6p8J12J68m96J69J6K3J63j98L63j43p3j04Q1p3j8J89J48j50Q3
6039B62j93J7K64m41j90J46P9p2J95k9j02M5k6K9K2O6n2k8M4n4M3j39o3J33j30
6064a74K97P3j74P1k34J24j5q1m4J09J36k53J05oK25k73J4O2J60M8mr4j59j40
$$ y = [82, 11, -285, 285, 30, 25, 70, -287, -36, -37, 279, 432, -47, -279, -336, 10, -119, -4, 92, 33, 5, -123, 91, 266, -122, 24, -11, 46, 99, -72, 109, -74, -207, -351, -63, -102, -57, 228, -122, -201, -73, -34, 28, -264, 54, -24, -205, 189, 90, -127, 120, 73, -147, -20, -77, 121, 95, 146, 126, -24, 123, 230, -169, 277, 190, 45, -135, -87, -236, -173, -176, -206, 286, 25, -8, 90, 220, -53, -52, 47, -72, -313, 40, -30, 95, -56, 11, -7, -209, -180, -135, -41, 24, 44, 62, 75, 64, -108, 53, -397, 218, 272, -215, -303, -9, 71, -18, -76, 334, -158, 166, -185, 210, 29, 84, -211, 102, -35, 133, -178, 136, 80, 2, 114, 282, -214, -45, -29, -6, 157, -41, 322, 179, 106, 2, 83, 10, -8, 181, 329, 179, 262, 69, 86, 350, -91, -281, -135, -56, -128, 67, 38, -64, -19, -45, -16, 6, 72, 20, -8, 36, -18, 25, -114, -177, -44, -174, 123, 196, 22, 93, -141, -17, -32, -113, -157, -48, 88, -165, -60, -66, 159, -114, -100, -38, 122, 170, 166, 72, -87, -227]
6088b27L43j51j24R4Q7nj11n2J0K01j52j47J65j5k5j27J9M09k58J92m11L83l03
6111b05K00Kj3j49P3pL8L7J13K2j73K37j21R4j89L9J22l43M1o5K19J07k9J08p
6136A51j04o5Q5j26Q2J4j41J76j60J89l54J87K5J03j3lL08k84k47J46J82J63o31
6159c17K40J69N6k53O2J46L7j23j69J88l4k3j14L30k34j86R7K10j07J33j70Q6
6181B4J05j88J05K1j83P6K92k09O7j57M01q4k09J03N8o7k57J29L16n16K21K33
6203B81N3l72M6J78J20o04K37K14k93L35j97J8Lk6O1p3o8J37L4k49m2K0R9k94
6227c82M47K1nK2J24j15j69q5J2K91j71j81O5J03k06K87l25K32J77n06L46j25
6249a43o4j6J14j49Q6j84M13j4o7J50p5k36K35k39N5N2P0N1r6Q3j23J08k72j48
$$ y = [-227, 116, -35, -159, -65, 22, 17, -94, -146, -136, 65, -87, -234, -69, -84, -109, -236, -217, 192, -66, 126, -285, 98, -205, -5, -3, -16, -165, -92, -99, -61, -24, 89, 111, -62, 175, 54, 148, -41, -2, 120, -223, -182, -247, -28, 79, 50, 158, 151, 47, -18, 67, -59, 23, 37, -104, 72, -88, 101, -253, -66, -41, 62, 49, 46, 354, 70, -177, -31, 151, 314, -317, -77, 92, 148, -105, -43, 103, 140, 17, -152, 36, 2, -21, -135, 195, -39, -225, -128, 82, -25, 108, -62, 24, 129, -59, 46, 67, -116, -40, 252, 43, 110, -47, 354, 270, 61, 164, 222, 155, -102, 27, 343, -173, 48, 281, 334, -38, 8, 186, 306, -298, -61, 153, -140, 195, -2, 16, 19, -7, 54, -19, -87, 50, 84, -165, -207, -187, -88, -382, 65, 86, 81, 103, 227, 112, -57, -142, -130, 161, -10, -191, -126, -23, -229, 58, -267, -35, 142, -364, -18, -143, -207, -223, -109, -258, -172, -356, 57, 43, -24, 126, 51, -185, 50, -189, -134, -82, -12, 39, -57, 26, -97, 11, -261, -409]
6273d09M96j1j63kJ08K15l37MQ4Q3j22J40k11K34lj91J54O2j80J64Jk10J73M4
6297A23k46j11L14P2j72j63j4K19m8R9M7P4m25K62q5K59m67K13j31K94j24J23
6319A13j31K08J52j53j30J96k5n2j07r3m5K02k2j76Q4R7l8m00K39M9N7j26J93
6342I2Q8k96K30j20r7K4J95JJ8jj53Q9l37L48k03J95O1j91J3K43k52J12K68l52
6366b5m0P9J17k0o2K21j22k74J08m2J51rJ7J26k75P2K9J34mm2j6j08K2Jj08K08
6392A38J42l85J35J88j98j11j2K21q6J6j44J13k20M66j37p4k56P0K94l12K77j33
6414hN3l10K36M8j74%J49NJ41l44j82K08J92R8Nj36k1j80J56l0j37K21N6j57J86
6439G5k79Q7qj72J02J1J99J23k58p8J23k07K52j2r7j69K2L61O7k71N44o40J94
$$ y = [-409, 87, 76, -87, -89, 19, 234, -103, -99, -15, 68, -54, 86, -125, 109, 106, -85, 69, 131, -49, 115, 116, -94, 79, 123, -123, -234, 80, 152, -20, -183, -197, 22, -26, 73, 120, 194, -231, 31, -54, 205, -262, -49, -180, 114, -10, 113, -18, 190, 342, 189, 59, 255, 230, 178, 71, -22, -67, 135, 113, -63, 21, 118, 80, -320, -81, -32, 25, -101, 92, 180, -116, 114, -6, -103, -79, 116, 117, 135, 134, -19, 70, -267, 81, -122, 73, 134, -57, -44, 199, -53, 59, 327, -25, -65, 14, 131, 111, 49, 270, 148, -126, -18, -60, 91, 82, 99, 225, -50, 22, 51, 185, 181, 139, 123, 15, 37, 38, -70, 138, 280, -105, 30, 218, 20, -91, -103, 118, 32, 48, -96, 17, -203, 263, 126, 52, -204, -134, 160, -152, 125, -8, 45, -265, -29, 19, -155, -155, -6, -1, 140, -204, -386, -178, 14, 112, 117, -19, -40, -220, -64, -94, -231, -10, 46, -111, 75, -204, -117, -125, -297, -195, -184, 15, 138, -120, -198, -75, -282, -30, -42, -139, -308, -286, 75, 142, -129, 415, -225, -31]
6462c1j89l8Q4J29J58j57J36k27p7L30j70K4j00P4J55K55l08q1J51q6Q3k14J83
6485H4j86J57j19j12J49l75K41J6K47l56J32K66J67n3j68J81k29l4q6K62j63Q3
6507A04J32Ll51J24M6p8O7k76n6M48m8J2M4l01J79J60o1j57Q2k09J68m3l8L21
6531B72m85J55K26o3k10O1K08l4o7Nj45R3nj73J37K08q8J39o8k10J70K4R5k12
6555C3Oj00K17j67J44OJ22j40o6J33j58M7o1J8J34k56J50p9K87k70J3Q2j31q5
6579a21N5N6N8o5q1J20k84K79j78J12L4J49J12l18k16J99N0j2q8N9j14J6J95r7
6603h0Nj27J22L43k21m0O4K41m23j45J08L95l98K2n0Q3j7J01J87O4l61RR4M6p
6628A5J16k68k55L60O0j08j06J01P4o8M3r9K43m3j79J27j40J9k04M19j12J59k72
$$ y = [-31, -220, -258, -174, -45, 113, -44, 92, -135, -212, 118, -52, -28, -128, -54, 101, 356, 48, -33, 118, 32, 115, -99, 84, -102, 55, -64, -176, -27, -402, -161, -145, 102, -254, -122, 144, 311, 258, 90, 271, 42, 8, -78, 184, 21, 104, 236, 239, -112, 12, 58, -20, 47, -229, -285, 163, 115, 127, 171, -130, 49, 209, 148, -9, 73, -136, 32, -11, -49, 272, -213, -58, 168, 105, -105, -44, 164, 130, 63, 68, -77, 16, 11, -162, -25, 183, 95, 234, 166, -44, 126, 150, 245, 33, 39, -61, 156, -11, 133, 139, 261, 121, 55, 188, 30, 77, 16, 34, 168, -88, 62, -17, 270, 0, 13, 95, -36, -121, -66, -10, 48, -17, -98, 22, -262, 17, -161, -49, -15, 134, 246, -72, -288, -89, -39, -51, -139, -80, -194, -178, 17, -80, -75, -202, -80, 263, 42, 2, 66, 307, -116, -261, -153, 242, -156, -134, -184, -101, -118, -17, 170, 234, -127, -118, -24, 22, 15, 131, -137, -392, -32, 28, -80, -186, -85, -11, -79, -36, -135, 108, 65, -114, 13, -127, -108, -312, 107, -5, 154, -118]
6651a18K17k14J57j3oQ9j56O5P1J18j32k30K41j6k0l14L95k62q2K06o5j47L76
6674A60r6n2qm7J62J4K1P7j47j8J9P8J32j72j9J1j40j96L50k41k2j18M33k05m2
6699f6L7L01l36K74j73l65M57r6J75k05O5j99M75m09J9L37J17n57L31j33M0P0
6721A59p4p0j50N6j79J59J49%l86M41j40k7J20m8l8j9J4n3P0M1q4J57k89L45k40
6746h6J3K61l67L94k77R8K8j51O1J54J7j05k41J38R8J76m47J75N1K51l54k33M12
6769F6j45k05J61J73j89K34n3L03l13k48M75l45M9J0J59k22k00K30p5L27n24K70
6791f2J52k41J07j5J31j76l8O1RJ5n5K23l55J98o5L85m26K84m56L52Nj14J64r1
6815hJ12j19J61k13j4j6l8J85jj22J41m47J89K13qK08j78m0J56n9rj93mk1l1K46
$$ y = [-118, 99, -115, 42, 29, 23, 112, -44, 21, 92, 210, 78, -152, 89, 73, 53, -261, 134, -128, -210, -4, -69, -216, 160, 64, 12, 4, -43, 119, 133, 154, 231, 84, 66, 85, 163, 295, 123, 104, 115, -25, -221, 129, -112, -134, -252, 181, -24, -66, -29, 272, -64, 210, 37, -328, 129, 33, 208, 3, 68, -131, 344, -65, -46, 291, 408, -149, 182, 49, 89, 159, 85, 15, -135, -79, -258, -99, 50, 50, -336, 105, -35, -62, 58, 10, -28, -47, -33, -86, -16, 25, -59, 98, -191, 154, -86, -73, 188, -179, 215, -62, 36, 64, -87, -26, 128, 145, 40, -201, -63, 35, 211, -236, -61, -10, 241, -113, -346, 66, -79, -284, -123, 50, -139, 95, 42, 345, 32, -216, 259, -86, -37, -27, 132, -90, -290, -60, -135, 192, -332, -62, 90, -151, -44, -59, 72, -104, -142, -81, -72, -57, -112, 111, -244, -46, -111, 274, -152, 132, -324, 28, 33, -81, 83, -8, 104, -15, 146, -67, -81, -97, -135, 50, 49, -73, 68, -379, -190, 23, 15, 223, 45, 5, 161, 102, 93, -100, -104, -125, -156, 90]
6841I0n2k9M3R7k76K9L27m40L60j80J63r8l6j81J74J72k83K78r3j53M07l04m2
6864b7J03o2M18m50L1kn4m9K66m2n9K40l72J50K5l1JK11l80k39M62M7k19P0M6
6889H4L54o66L60r5j18L05k13R4N3k84J35M20k49k92J79j29R4LQ0n5o5n5J24r3
6913b9n8q9J05K46l44J39J11J55l54p5L32j47J54p3L3j54J03L20m91Q7j20l8R3
6936i4q8j42Q1J44j50J31R9JM9J41l73k4J01O5l2j4k38M17j85j65L39j49J51k48
6960a83K13J7m6j82J48o7j75L9M05l13K32n7j3j89M8N0o8Q2o4m9K69q4O0N6k23
6985i4J66j99k6j12J11R3k53L75m3K70j60l32K92k07j70N12l24J27k00L3L37q4
7007A12p6J06R2j71k32M89j77pj45nP2J51k88j13L32l23K09q7N6p4p7n6J89J66
$$ y = [90, 38, 9, 52, 149, -127, -98, 229, -211, 149, -31, 132, 34, -2, -183, -9, 163, -120, 158, 65, -88, 319, 15, -27, 76, 14, 432, -18, 13, 11, -43, -92, 174, 132, 73, 313, -59, 91, 116, 85, 86, 297, -83, -322, 140, 187, -32, 38, 84, 438, -228, 132, 37, -81, 224, 11, 105, 158, -126, 9, 429, 180, -112, 67, -62, 32, 35, 115, 60, -5, -60, 64, -29, -87, -176, -71, 175, -169, -30, 81, 236, -118, -193, 139, -8, 146, 73, 106, -48, 55, 375, -116, -29, -149, -187, -94, -182, -324, -243, -99, -249, -118, -19, -18, 31, 172, -201, -225, -124, -59, -91, -105, -343, 74, -111, -276, 63, -86, 65, -183, 30, 47, 1, -181, -33, -100, -275, -236, 169, -144, 88, 31, 18, -171, -123, -73, -141, -59, -123, -172, 97, 13, 73, 129, -94, 72, -127, -153, -265, -154, -61, -314, 61, 18, 288, 128, -204, 88, -119, -289, 223, -101, 26, -174, -141, 196, 112, 36, 142, 234, 63, -169, 320, 143, 136, -9, -14, 58, 209, -79, -192, 140, -183, 26, -61, -5, -79, -156, -212, -23, 143]
7031A43j12J49j81K6J21k01L6J51l62O58m42J56k2J4Q0n7m6j55K30k11j26J42
7053ij62J16l4K6J67o7j84R3J12j26J61j36m1rO8j40L18j07K10l67K54j31J08
7076A20j47L4P8j70N8J35K7k83l63M47J9M40l50k09L36q8j58J22k2j0p8l07K96
7099g3j39K42j07R4q0j62L16j45J7m4J72j23NO4r6K03R6m42J95k8K7N9k71J61
7123e9K39j22r0N7P0j94K2N1j2k5l9L21m29L17J1o4m7N5k7R3l54J22J47L23p99
7148d33J8K84k77L80J14j2J3j78J12R7m1p8M2O3j57qj85J83k33L79mo6j75Q3K55
7173A76l33J10Q9J38q0j93K40k82j29K44o1o8K57J17m10L21p9Q9r7j80J91n1m3
7196c4J80j34K56j41J33o8j04Q5l08L02p6j66o5L32r8k3M6q9K2N8j5jO3k64K89
$$ y = [143, 31, 180, -1, 25, 146, -55, -19, 132, -230, 428, -14, 142, 120, 134, 214, 157, 111, -44, 186, -25, -151, -9, -171, -55, -89, -63, 104, 37, -147, -54, 58, -68, 93, -43, -84, -93, -25, -165, 153, 46, 256, -111, 143, 12, 120, -27, 7, 85, -85, -27, 108, 135, -148, -511, -64, -45, 395, 45, -164, 172, 84, -74, 48, 26, 16, -62, -369, -73, -212, 30, -77, 17, -63, -225, 91, -54, -37, -81, 91, -32, -27, 37, -59, 144, 240, -202, -7, -35, -8, 51, -220, -59, 180, 58, -32, 25, 95, -99, -77, -26, -38, -63, -102, 219, -210, 107, 118, 54, 7, 62, 35, 128, -226, -104, 43, 366, -433, -415, -131, -408, -28, 86, 74, 87, -91, 21, 118, 77, -1, 41, 104, -53, -61, -246, -63, -296, 83, 79, 13, -162, -79, 176, -157, -47, 42, 180, 100, -93, 147, -135, -264, -20, -81, -149, 108, 225, -185, 136, 57, 146, 49, -131, 60, 9, -34, 146, 12, 268, 127, 260, 192, 88, 173, -135, 167, 91, -75, -140, 192, 94, 71, 117, 28, 50, 108, 93, 92, 155, -109, 180]
7221A80J3j9j15J19k7o9J70p0j27J45l69K33j00k9m1l1J66P5J1L3k41J10nj61
7245a49K4L8K23m02J42l30N15k49j84K43J70j33n7m0O1J96k09K49p8j03J1J90
7267A28l94j1K62J22j9Q5j64j18J32o5ql18M68l17J75J45k2lk53L16l34K53J0
7290G0j63j83N18l63P6R7j94P3J50k1j42J51Q8P1k01j66L1L35j70j46j7J2K78
7313A84q9j92J48j09R2j23J53k07j10K56k3j4k69L43K04l55K10k75K41j95L60
7334B30k9k27K3J60j93j24K83k76J43pm5Q0N9j21J17k29J98j63l8M86k03j47j66
7357a89k9K41P9k76K85n8m6O5KK12k19j25L3J67j75O6J96j00k45nL03j08K1j52
7381e7K57k6P0j58r8K23p5j49j95J06q8K71J15M0m38j11L38L1N5n5k13K68J19
$$ y = [180, 193, 174, 59, 178, 151, 82, 252, 182, 55, 200, -169, 64, -36, -65, -106, -137, 29, 104, 115, 148, -93, 17, 12, -149, -125, -87, 136, -266, -124, -454, 61, -188, -372, -129, 41, -92, -149, -189, -128, 68, -141, 108, 30, -73, -62, 128, -266, -277, -15, 107, 88, 173, 9, -109, 23, -42, -50, -368, 100, -217, -42, 103, 81, 78, -175, 141, -193, 60, 70, -93, -276, 242, -121, -45, 52, -142, -69, 81, 60, -82, 69, 157, 228, 27, -139, -108, 227, 57, -89, -106, -94, 184, 95, -97, 51, -58, 34, -89, 64, -143, -253, 3, -20, -34, -303, 40, 244, -111, 99, -176, 65, -130, 230, 201, -26, -3, 157, -36, -160, 123, -153, -10, -17, -62, 18, 77, -44, 73, -156, 42, -121, -159, 327, 124, -23, -189, -218, 23, 102, -174, 111, 53, 7, 72, 74, 286, 67, -58, -25, 142, -33, 33, 229, 129, -116, -121, 182, 74, 95, -57, 200, 174, 244, 86, -12, 211, 136, -13, -208, -102, -190, 81, 196, 236, -202, -313, 25, 56, 111, 56, -157, 111, 230]
7404B30q9k42J09J40k35K18j5j11J65k88K00j13J56j16J43j28j04J15qjk16L29
7426A39K7l69K81k20K57k48N0N8q7j46L9K08l63N66j17nq0O2J29l35J49J41l98
7449b62M34m49K45O8K1m0k91K55j10J5J2k41K18M44j68l25R1K33o5N4P1l00P4
7472a6k26K01J32J39j79Q2m3j30J04j49o0J74rK21k60K13j10Q6j14j64J6J41p0
7495b1R4N7j1j73K2J17o3K2j47K78L0q1K12k94r5M2n3m0j60K87L4j15K2o7K12
7520A09j96K38m3L4k95J95J6J1j12p1J61j29N3M9J33K50m26m4j1L11n05K0N84
7543C32O2n84P7K19j47K27M2k33k51J73J05K10m25L31j14l07J42R6K86m35J53
7564d1o6L26k79l3K7l00K59r8K32J29l38J53K30pk27Q6j09j69P1J51j42L3Q3J54
$$ y = [230, 141, -101, 8, 148, -87, 131, 116, 5, 170, -118, 82, -31, 125, 9, 152, 24, -80, 35, 27, 26, -190, 139, 166, -203, 78, -142, 115, -133, -83, -25, -112, -258, -219, -11, -374, 192, 75, 70, -10, 52, 181, -154, -5, 136, -262, 172, -277, -32, 36, 57, 17, -274, -19, -129, -114, -102, -343, -125, 319, 151, -174, -83, 150, 85, 139, 210, -90, -16, -242, -41, 91, 230, 51, 133, 90, -40, 64, -85, -145, 29, 20, 241, -19, 194, 84, 170, 56, -108, -92, 49, -21, 73, 130, 119, -54, -32, 85, 22, 44, -103, 175, 205, 124, 336, 42, -53, -11, -64, -104, -264, 23, 57, -58, -36, -103, 109, -87, 151, 108, 142, -153, 42, 58, 69, -43, -114, 47, -82, -29, 20, 153, 403, -23, -67, -78, 233, -272, -252, 332, 394, -190, -113, 106, -41, 186, 228, -5, -256, -83, 22, 232, -193, 138, 24, -283, -141, -45, 241, -194, -41, -107, 219, -60, -93, -66, -366, -107, -205, 27, 156, -182, -29, 201, 194, -33, 53, -56, -225, -154, -3, -145, -112, -29, 125]
7588A25M0j00Jol76L55k4N5k12j50L85j24j73J67O8J66k17q8l4q4rO6L87k76J20
7613F2j49j77L20l3N6l59n3K18l9J36k39K36j5j20j10J85q1J70J36k91o5K27k5
7636a0K61m86N9K81K4l4r3J22m1k51J32P8q0j41J74R7kR7n9J53k45k4L13l29m2
7661d6J35j04J12J5Ln5J56l04J50%k06P0J42kN6j13K31R9m86qP3J84q3P8K18l73
7687e8Q3J43j7k28J28O3J12k1j95J89k97mL6J79r2k41P3J99j77J95j58O6J22j6
7711H4j06qj89j82K18M12j98K9k10L69m35O7J48j17J64p8m6J71j73J57J80l8Q5
7734C04k87j24K59j97O6j85K62J86k12o0j32K03q4k39L94l28J91j94J21J14J28
7755A86l44K78k3j01j8M33m89j51L38j0o5l90M13j38k5k11K46J05k14L86k19J88
$$ y = [125, 165, 65, 66, 60, -316, 39, 15, 70, -142, -292, 93, -31, -204, -37, 31, 197, -20, -108, -142, -226, -235, -169, 218, -58, 62, -87, -264, 56, 23, 79, -280, -333, -115, -154, -18, -257, -21, -36, -156, -266, -81, -162, 8, 144, -147, -212, 15, -10, 251, -235, -176, 105, 129, 95, 2, 124, 83, -168, -36, 42, -38, -179, -5, 92, 90, 187, 128, 281, 36, 12, 325, -4, -46, 89, -15, 97, 112, 115, 60, 216, -88, 62, 62, -144, -74, 68, 66, 122, 9, 240, 339, -147, -155, -82, 102, 19, 97, 315, -58, 25, 168, 151, -77, 51, 114, 226, 205, 10, 199, -98, -102, -66, 113, 21, -220, -147, 52, -125, 70, -88, -22, 100, 84, -22, -30, -219, -401, -183, 229, 31, 60, -150, 219, -216, -149, -1, -118, 46, -32, -78, 93, -80, 77, 257, 219, 304, 17, -107, 152, -45, 21, -164, 98, 284, 72, 12, -120, 83, -1, -240, 154, -174, 17, -177, -56, 58, 186, -158, 120, 97, -4, -22, 411, -78, -229, 109, 99, 34, -356, 57, -81, -106, -317, -71, 34, -180, 206, -13, 175]
7777A75j1l68K84m3l20J79QO3J68k15P7j04J72j36k0j10K38r2k14L22N1L0j24
7800A0j78J2J98k22K38l72L03j23K2Q9j43j24M49l55J74N5K21l31K26q4jj38J35
7823F1J7p4L16j88P7j09k07J9K90L2n9k9o4p2j02J07K21J5j89K17k28j48K49%
7847A52j22m7n1O8k7R7Lk64K17q3L51q9k5j84j86L48l10J29K5O9K31m00Q6J09
7871I7l6j58q3M45k87K97r0j57j22K51K0k78Q4l5q3Q3p4Q0J83j63k19K87k7J9
7895C4r6J08k57L80m05L17l9j70K8J91j33k39J78P3K6j81J09P5k03L6l4J94j42
7918a50J79k78j7K73k8q6Rl0K97j21j76K23o6m8N7n3R8Qmj93L87k51l51R3P0K70
7944A12j39J29j65J66j60R4k63K22j52L32j92Nk43L80r3r9J50j97m5J64k1P0k68
$$ y = [175, 164, -204, 80, 37, -283, -104, -96, -33, 135, -80, -3, -107, 65, -71, -91, -201, 37, -55, -269, 53, 104, 134, 10, -168, -156, 42, -180, 58, -314, -11, -134, -112, -23, -166, -290, 159, -196, -22, 33, 254, -77, 149, 65, 64, -74, 61, 78, 4, 320, 132, 209, 100, -107, -88, 202, 234, 175, 146, 82, 10, -92, 15, 236, 251, 62, 279, 51, -97, 152, 152, 30, -17, -68, 0, -27, 70, 73, -191, 26, -57, 294, 205, 180, -4, -190, 158, -152, -23, 2, 71, 302, -98, -12, 97, 61, -97, -180, 265, -22, 275, 185, 28, -94, 157, 177, -101, -17, -52, -135, -52, -126, -46, 137, -26, -245, 42, 15, 34, -62, 46, -211, 169, -236, 81, 42, -128, -100, 91, -42, -281, -103, -30, -4, -185, -76, -1, -204, -168, -202, -8, -150, 29, -249, -266, 7, -21, -107, -98, -128, 169, 48, -128, 95, 29, -19, 38, -15, 83, 91, 87, -106, 281, 30, -321, -228, -158, 112, -27, 102, -63, 103, -57, 37, -226, -4, -156, 176, -16, -11, -254, 126, 33, -66, 84, -113, -158, 6, -15, 55, -213]
7967b13J68J77K8k07O0k0K18j94l43J01M3P9J76m7j04Kj34K43L0j37L00o4j16
7990D6r4J19J60j37l2k20K57l96M07k09J45j21K56l87L62j51N3k0p9J55j8j21
8012b5k27M70l14j3K64J1j88k50N60l37R4P8K47j99j95J54p8o9L5M31m02j33j32
8035b18K72J65J71n89J48K07l11O9J05M4K24l50l5K45o1O3l21L36q8L5r4l10K94
8058An0l04K49O5J49k80j7K2J60J68r4j6j01j24k9P1J45J25q6pj82R1j62K68j00
8083c8M4n1L1l10L78k24o7K46O9j94j61J54J15j39M08k41r8K41l02J32O6l33J78
8106i6j01L61J34m34KO8p3L45q8J76n30J8L40L8j71j26n5M73m60J09J08j57o6
8129a85M9L22j41q7M5n0m5J52k6q2l38J01J35L8o7n1Q8L50k20j15J67j73K56j48
$$ y = [-213, -45, 132, 160, -47, 13, -7, 211, 17, -326, -225, -182, -103, 73, 26, -78, -76, -210, 33, 63, -74, 226, 162, 46, -48, 71, 231, 94, 62, -158, 99, -297, 110, -99, 46, -75, 181, -206, 156, 5, 58, 38, -41, 114, 96, -25, -252, 218, -96, -109, 155, 166, -22, -272, 288, -49, 45, 123, 370, 171, -24, 130, 52, -17, 18, 449, 47, -86, -218, 54, 219, 390, -199, -51, 156, -155, -86, 19, 63, 287, -63, -98, 147, 86, 149, -172, 164, 76, 111, 17, -293, 1, -49, -353, -104, -39, 110, -170, -187, -165, -5, 163, 69, 53, -48, -172, -201, -130, 15, 140, 54, 47, -135, -44, -206, 62, -38, 6, -45, -14, -324, 54, -170, -237, 9, 78, -116, -277, -123, -8, -147, 261, 20, -78, 163, -139, -7, 59, -274, -96, -197, 164, 298, -136, -134, -66, -139, 206, 118, 294, -236, -218, 122, 160, -11, -137, -192, 281, -179, -70, 38, -119, -185, -136, 186, 45, -42, 3, -47, -92, 60, 34, -48, -386, -285, -150, -112, -179, -230, -142, 208, -12, -127, 40, -133, 123, -25]
8153b5J55k50K37j75J63j04M1j21o8o3M42l64J58J14l2j98j42K08J07j18O9k07
8175a73N50j29j08j06J84j98m3L79n51R7J27J25n7j31Q9N4
$$ y = [-25, 130, -120, 117, -58, 105, 1, 42, -79, -147, -210, 232, -132, 26, 140, 108, -90, -232, -24, 83, -35, 34, -173, 377, 248, 140, 34, 218, 20, -23, 356, -195, -98, 29, 154, 97, -34, 55, 109]
8191A09
$$ Imaginary data points
##PAGE= N=2
##DATA TABLE= (X++(I..I)), XYDATA
0@%%%%%%%%%%%%%%Pj5J6j6J6j6K4l2L2m0M8n6O4p2Q7j00J12j26J44j64J84k07
36a10K32k58K88l22L59l99M41m88N41n98O60p27Q00q80R69j067J175j298J438
55G56j593J769j974K213k495K837l260L796m501N476o913R231j3556K4190r4279
70g8303j20399K68113r899j80864Q7107J04377j08637j9390P1604j5017l0084
81c1392J6413n037J4823J1447k7024O998K3915l6453l814M3028j1240l0257K3473
94e120J4378j9152k239J5687m639p591M167q25L116R380j6462j1393K4760K139
108F206k5776J2936K1648k5514j3835L1705l36k6411J5515J5548j5811L000J0087
121H962o079m000p054q23J9253m679k3565J4252J8932k3717q181K7658n677k2740
$$ y = [0, 0, 0, 0, 0, 0, 0, 0, 0, 0, 0, 0, 0, 0, 0, 7, -8, 8, -8, 8, -8, 16, -16, 16, -24, 24, -32, 32, -40, 47, -53, 59, -67, 77, -87, 97, -110, 122, -136, 152, -170, 189, -210, 231, -257, 284, -314, 346, -381, 419, -461, 508, -559, 616, -682, 756, -837, 932, -1042, 1171, -1324, 1513, -1747, 2049, -2452, 3024, -3889, 5342, -8214, 15976, -78303, -198702, 69411, 59512, -121352, -34245, 70132, -38505, -57895, 13709, -1308, -31392, -14979, -20016, -5193, 6254, -20770, -13772, 10143, -26310, -30124, 12904, 1664, -28593, -5120, 9258, -9894, -12133, 3554, -1085, -8676, -4509, -5334, -2218, 7162, -9300, -20693, 4067, 6206, -19570, -6634, 15014, -10500, -24335, 7370, 7034, -19377, -3862, 11686, -4125, -1125, 8962, 2883, -1117, -8171, -8994, 10259, 5580, -17985, -3733, 15199, -8518, -16699, 10959, 5282, -17458]
135a7458J7555J4193j3153%N322n889K338L071l843K624K399o572j055R133k953
150E712j0858O997N647j1785K990J0938q971o311Q563p7l554N074p87q394O632
165A816M030j0900O087Q303j5186J236J8045j0186q042J4605k979j2552J2158
178F435O484j4560J27J0350q224j959R729p056n050Q376k568l265O550k944m626
193b201N779J380m746M424J807q696L619J0115q718m183J2357m441j0524Q954
207D926M625r572j428O161j591l575K450J963j265r92j808N028M498r720k348
222b648J1608n004q405J0406L656j2094j56R337l376p074L225K967k806k29Q7
237e06J812j93q484J115R903o410p525J0893K371j2262J000J0321n374q249Q289
$$ y = [-17458, 97, 14290, 1137, 1137, 6459, 570, 2908, 5979, 2136, 4760, 7159, 587, -468, 8665, 5712, -5146, 1851, 7498, -4287, -1297, 9641, 670, -5641, 2922, 2845, -709, 4365, 3578, -4816, 1816, 5846, -5054, 1033, 9336, -5850, -4614, 13431, 3245, -4797, 9808, 6829, -5723, 6435, 12919, -1641, -1514, 8836, 612, -1347, 8382, 1326, -3724, 4652, 2084, -1181, 5369, 2425, -2201, 3578, 4958, 212, 4636, 6443, -2253, 1366, 11481, 2763, -1420, 10937, 6496, -4028, 4926, 9551, -21, -1449, 4712, 3121, -454, 1996, 3959, 2694, 1702, -106, 4922, 9420, -300, -2648, 8960, 3956, -4449, 5957, 9613, -2481, -2637, 6700, 3324, -3750, -525, 2442, -364, -593, -506, 1306, 1113, -7371, -6256, 3647, -2763, -10288, 605, 2976, -9286, -8286, 2035, -3339, -11588, -3299]
252c299N299o316r51M028n24k135k695L058M431m534m356M781J298p238j303P013
268c443j223p281M587O174n988l835L493K633j702q04M695L032m587j697M251
283a695N92m412o00O547J544n787K440M837m260l998L870M552k556m048N591K831
299E448p401j651N763K29n177J254P319j394o892L763N359n010l391O181N043
314I443n863l748O247O14p378K89N930j51m717N6O208j770q943K504Q345m155
330B911o447O106O107p962m807R032R99q655J289P599m60n927k0O615j388q411
346c419M310Q084n259p214O937O576j0772n639J2050K48j2015L215R226m656p815
361f143M915O572n611m858O989M524o441l853O084L478p742k425Q946m2q360K420
$$ y = [-3299, 2000, -4316, -5267, -1239, -1763, -3898, -6593, -3535, 896, -3638, -7994, -3213, -1915, -9153, -10456, -3443, -4666, -11947, -7360, -1186, -7174, -11009, -7516, -4883, -6585, -7389, -2694, 338, -4249, -5946, -1695, -1103, -5515, -6115, 432, 1976, -3811, -1371, 3466, -794, -4792, -922, 3630, 1074, -2974, 2617, 5448, -1953, -3604, 2159, 2388, -2789, -1535, 5784, 4390, -2502, 1261, 6620, 1610, -1781, 4400, 9443, 3580, -168, 6079, 6693, -685, -396, 5534, 5383, 666, 722, 6930, 5160, -3783, -1279, 7066, 2911, -3536, 2570, 8677, 715, -4092, 4940, 5939, -2716, -1427, 6172, 5712, -215, -235, 6380, 4992, -3419, 891, 8975, 3716, -3498, 3439, 10015, -757, -6396, 5654, 5902, -6113, -2898, 6328, 1672, -6143, -1228, 5344, -267, -5125, 1864, 6388, -53, -3906, 2178, 5656, -2086, -4511, 4435, 4393, -3967, -1547]
377a547O708l602n591L375N569l037m141L685L532l534l880L996M354o299l329
392c741P702R52p508J022N511j838m561K489M441k753l374K640K424j856l980
407b430K216L767m950m088N428N81n802J045M047j074l517J961L341k515j470
422c460K068J192q62j746l2K172k102k274J949J498k004j799K426J666l351j057
438e716L808k82k518J155K009r84k052R72J790j532j271J322J176p65j327K68
454c947K210j175j053K894N65j869P82J835j689j201J865N56k144J652J187l303
470b835J268K366k508l8L238M07j301O93K455j260j837K240J253o47j046L99K615
487E462j824m138L370K734m437j63M379p46m598Q83M279k543k865L112K390j765
$$ y = [-1547, 5161, 1559, -4032, -657, 4912, 1875, -2266, 1419, 4951, 1417, -2463, 1533, 5887, -412, -3741, 3961, 4913, -2595, -1573, 3938, 2100, -2461, 28, 4469, 1716, -1658, 982, 3406, 1550, -2430, -214, 3553, -1397, -5485, -57, 524, -5278, -4233, -186, -1260, -4777, -2816, 525, -1990, -3460, -1392, -200, -1062, -2808, -2840, -668, -2770, -5044, -3095, -1597, -3601, -5400, -2974, -1308, -4659, -5716, -1908, -2190, -4708, -3553, -1544, -2528, -4580, -3608, -1818, -3350, -4621, -3299, -2123, -2888, -4215, -3947, -1737, -2912, -3965, -1071, -506, -2375, -1593, 242, -1447, -2648, -783, -227, -2371, -719, 468, -2835, -1567, 799, -1709, -1747, 1491, 1898, 597, 1290, 3745, 2485, 648, 2888, 4141, 3494, 2448, 2847, 5462, 3638, -500, 2870, 5604, 1167, 1004, 5383, 4637, 39, 922, 5201, 2658, -207, 2905, 5295, 3530]
503C530k228J261K489k458l477L966L219n446j688N591K75o181J066O159k862
518C216m254L720K281l461k878K058L178l114m162M567L536o076l150O984O91
533C136p814J881Q338m716n699O113K594n025j207L730J743k812k166L102J658
548B856m032k773M790J692o154j1O987k585n772M093L838l741k298L846K255m381
564a390j589L531O34l388q04L102J685m136q89M973l52m854J763N331k465m689
580c537L920L647n541k083N094L38m135K25K915J96l718o61M628p17m432J463
596b398M853k106m947L890L676n571j433N316j047m177N83K167j068k216J67L063
612a248j76k855N00M194j741l980L525L635n269j685N903q15n241J715L955k109
$$ y = [3530, 1302, 2563, 5052, 2594, -883, 3083, 6302, 856, -832, 4759, 5034, -1147, -81, 6078, 3216, -1038, 2682, 4963, 1502, -1376, 682, 3860, 746, -3416, 1151, 4687, -1389, -4539, 2445, 3136, -4678, -2797, 5541, 825, -4874, 1239, 3833, -1192, -2399, 1331, 3074, 262, -1904, 1198, 2856, -1176, -3949, 841, 2533, -3621, -3632, 3355, 770, -5002, -909, 2929, -812, -3110, 736, 2991, -1390, -2979, 552, 1186, -2202, -3006, 96, 1781, -2355, -3244, 1729, 1377, -3477, -1714, 3617, 1152, -3537, 383, 4030, -1511, -3594, 1500, 1838, -2297, -2072, 843, 1039, -2679, -3340, 1288, 571, -3861, -2398, 2455, 349, -4598, -708, 2968, -2603, -4036, 1280, 233, -3944, -3361, -1194, -2262, -4478, -4311, -1248, -1424, -4279, -3779, 415, -1326, -5306, -1781, 1854, -3415, -5100, 803, -12, -5253, -3538, 417, -1692]
628a692k362K869J795k331p30J022K150l56l348K283M444m425k573N435M2n246
644c023J964M703l058l148M465M21l843J163K347n19J67l65Q89J452k345j399
660a29L392L4l978J297M093l341k655L886O63l596K032K524j480k85N06R0N15
677C568j387m21J627M83k026P5K679j919k607K851J483l206J00K260o11k062P3
694I60J305m40j532R38J251q74j655L50J295j652j236K168J85k235M11J819j269
711b11j549R57J312j236n00J199j60j632K3M63L70r47j1J373n02j183O59J311
729b64j161r86J544Q65j689k71K040j148j219J476L18n88j81J208L52j555M5J002
747b12m71o52J75P73L61j024o12K214j021j546J791P44j685o70K176p0k816J561
$$ y = [-1692, -4054, -1185, 610, -1721, -2451, -1429, 721, 365, -2983, -700, 3744, -681, -3254, 2181, 2223, -3023, -1059, 3644, 586, -2562, 1903, 2324, -1519, -356, 1991, 1472, 1639, 1274, 2163, 3615, 1270, -129, 3263, 3297, -681, 616, 4709, 1368, -1287, 2599, 3262, -334, 1698, 4222, 2742, 2457, 2963, 3053, 3568, 2181, 1760, 3387, 3870, 1844, 1919, 4598, 2679, 72, 2923, 4406, 1200, 1300, 3560, 2949, 887, 960, 2265, 1825, 293, 1231, 2482, 1608, -47, 303, 1598, -54, -1290, 878, 1063, -1172, -761, 1058, -211, -1760, -803, 509, -727, -1227, -28, -188, -1820, -1797, -1334, -964, -1911, -1922, -549, -1051, -2234, -1575, -264, -1425, -2411, -867, -2, -1691, -1962, 78, -1070, -2289, -813, -495, -1083, -1264, -56, 296, -1259, -1214, -212, -683, -1335, -1160, -387, -26, -1050, -1662, 552, -469, -2015, -224, 520, -1165, -1835, 341, 271, -2545, -984]
765i84J329j167n49R96O09m40j238L3J867q16j998J885J462k470r00L532l89l658
783b896J698K439k688j143J910J024j682j246J985J224k194j175L073P34l526
798b463q9L747n93l829K098K814k626j895K251K082k502j546K636J810l800o27
814b532L771L72l546O35M075j401l694K562L062k905k193K814K214k954j661L190
830A809J464l194n66L527K7l541L94L714q46l483K070K765k042k077K024K185
846D230k376k201L040J693l557o22L274K38l775k4M083j113l376K271K350k352
862A783j884J592J977k059k380K981J523l509o82L083r0l863J087L770k413k683
878a767K404J060k303r39J501R38j541j188K178R55k885q82K359j16k717Q58K620
$$ y = [-984, 345, -822, -1371, -375, 234, -206, -1444, -1411, 456, -360, -2358, -473, 989, -1481, -2381, 1151, 762, -2896, -1198, 1241, -1447, -2590, -680, 344, -1338, -2584, -599, 625, -1569, -2744, 329, 1063, -2463, -2552, 1195, 602, -3227, -1129, 1685, -941, -2836, -585, 1497, -1005, -2551, 85, 1895, -1905, -2532, 1239, 1611, -1935, -1300, 2775, 1374, -2320, 242, 3304, 399, -1794, 1020, 3234, 280, -1381, 1809, 3273, 79, -487, 3040, 3067, -474, -80, 3634, 2788, -695, 1375, 4140, 2098, 21, 2045, 4230, 1854, -347, 2693, 4386, 829, 207, 3481, 3719, -56, -80, 4003, 2890, -486, 1785, 4135, 1783, -101, 1491, 3468, 1409, -971, 2010, 3533, 24, -658, 2425, 2335, -1528, -441, 3329, 916, -1767, 637, 1697, -606, -1545, -44, 894, -647, -1835, 343, 1298, -1587, -2469, -110, -226, -2943, -2085, 535]
895E35j952j980K358M01j401j13Q56J096j188j210J564M81j850o75K301N44k511
912b744N96K252j555j313J987M06j242PJ144M89n78r20J138m4j589J012J352n53
930a55j484J087N78j219l33J439l2j125R55L84j05o94K14R17m04q12M11N72n54
949c60o41P53K09j397M52J740j197j14Q73M01r58JO51J67o52p06J307m01r40J20
969f92J101k1j280Q73J249j193n96J043K9p62l29J433K60j682K51J321o31r88
987f14N90P66m42j212J769J93j644K54J429P5j113K21J173p9j410N69J198j200
1005E23j082J180J033j521m40J795J53j616O63J167k0j057Q2J404m93j601R66
1022A136J357j504j024J280J416j988n01K057n76j099N09R30k17r70L9J222l88
$$ y = [535, -1417, -3397, -1039, -638, -2039, -2152, -1296, -200, -1388, -2598, -1034, -553, -2403, -3078, -777, -233, -2744, -2148, 104, -1451, -2764, -777, -371, -1613, -1606, -462, 27, -551, -1471, -333, -377, -1966, -954, 398, -155, -1639, -552, 26, -1193, -1526, -87, -119, -1244, -289, 95, -10, -704, -490, 427, 23, -789, -378, 194, -360, -1001, -248, -39, -1436, -984, 756, -441, -555, 318, 719, -239, -238, 413, 580, -72, -778, 529, 128, -812, -692, 409, 388, -892, -19, 1230, 37, -559, 484, 513, -249, -578, 855, 1115, -567, -316, 1005, 374, -614, -24, 742, 300, -912, 857, 1050, -594, -340, 1089, 1164, 51, 272, 1445, 1366, -44, 525, 1723, 523, -559, 621, 1654, 133, -307, 1488, 1641, 25, 688, 1855, 1835, 778, 860, 2264, 1771, 170, 1136, 2493, 989, -35, 1245, 2661, 673, 172, 2229, 1653, 554, 1063, 1993, 1776, 806, 845, 2067, 1679]
1039A679j706R20J561j888j364K309M91k482J70K201j206j901J371Q39r89m34
1055d29p5J333p93j297Q87Q85j366j246J813Q13k758N92K165j504j659J977O36
1072b6j815p9Q72M23j324n65J130O80j251o33J597R97k749L31K547j472j863J929
1090a271J079k029j82J253N71j248j28J571k1j161j37J561L33k096M87K385j308
1107c41j996K096J450j973o75K115P5j492L30J605m16j251J03J557m47j343M06
1124a97K182j436j348J604J041j873r76K461L71k552P07K007j296j485J019R58
1140A187n02j413P89J373j247j400J509J317j683j192J971R77k637M37K353j321
1156E18j510J379J394j649o99J192N78j539l2Q74M72p75o12J467N03k087r9K461
$$ y = [1679, -27, 893, 2454, 566, -798, 1511, 2002, -480, -310, 1891, 685, -1216, 155, 994, 5, -429, -504, 829, 36, -1261, -374, 511, -855, -2101, -288, 525, -2233, -1641, 524, -980, -2639, -662, -26, -1841, -1920, -1048, -625, -1949, -2514, -1384, -704, -1955, -2588, -991, 6, -2743, -2412, 135, -1337, -3200, -1271, -192, -2221, -2403, -1150, -579, -1827, -1955, -384, -405, -1566, -1703, -142, 191, -1905, -1418, 967, -341, -2337, -241, 1209, -764, -1439, 676, 751, -741, -411, 1194, 778, -473, -370, 1187, 740, -603, -197, 1985, 549, -799, 805, 1846, -27, -1003, 1458, 1829, -723, -16, 1991, 695, -790, 229, 1187, 685, -728, 61, 1434, 187, -1213, 296, 1613, -70, -1262, 709, 1686, -951, -514, 1839, 518, -992, 387, 1781, 132, -567, 625, 1203, -336, -368, 506, 978, 203, -409, 1058, 1561, -526, -625, 1836]
1174A836o26j658P79J529j564j041K102j10j609M56R59q9k11m52K39P07q27m40
1192b0J532m56j558J195J245j524j213K181m33j062P37O87q45K07p0L18Kq29J87
1211B81P33j08j018M78J066j243n22J326m78r19Q02N37r91j3K80o6l86K4J76K36
1231A95Om83l46Q69j001n75J293l74j276R70O68j639M06J001l94j171P51N58o43
1250a185j03R5L04N3n71KR48j119l87J343J44j187l25J489k62j178Q00J133j393
1269a399l43J051L63j180L6J147K41j285L60J105o24q84J012R67k75j289N92J171
1287G66r97p12J268N24j137m84J529J74j674N75J584p44o57L51Q94l51j205R43
1305F47J146j243o83J279M92j287l43J639k09j331J35J718j237o89P70R91r22
$$ y = [1836, 1210, -448, 331, 1860, 296, -745, 1357, 1247, -362, 94, 1053, 964, 753, 301, 540, 1247, 420, -20, 1512, 1056, -502, 693, 1938, 414, -799, 1382, 949, -113, 624, 1311, 466, 673, 603, 921, 923, 94, 281, 1014, 906, -112, 366, 1432, 189, -333, 993, 515, -404, 398, 935, -56, -69, 211, 145, -241, -217, -41, 195, 201, -282, -628, 241, -760, -1335, -42, -416, -1692, -722, -54, -1693, -1287, -286, -680, -1851, -1100, -542, -1185, -1288, -1193, -889, -836, -1407, -1405, -457, -1576, -1963, -620, -476, -1663, -1988, -499, -761, -1939, -1139, -6, -1399, -1742, -691, -328, -1508, -1472, -325, -84, -1369, -1009, 96, -528, -1412, -400, 567, 292, -997, -405, 766, -231, -943, 325, 849, -288, -772, 757, 931, -743, -168, 1416, 672, 15, 366, 1260, 909, -296, 647, 1793, 550, -133, 1146, 1638, 351, 8, 1647, 1438, 107, 242, 1960, 723, 34, 804, 1795, 873]
1322H73j026P94J123j212j057J547L23j438k51J677N3j707K32J331p09p70P38
1339E21O66q79q98J356L39j130k82Q47M59j081k10J042Nj566J027J145j225o70
1357e34J041N07j017l89J086K30j264j10J217J36j028j39J328m44j408Q27J229
1374A268j071n00M69P40j186k37J372j73r49J25R77n02j109O63J094q94r05J381
1392E63K38q87n22J118K02j155j61J261m00q49J50O52o09n10N68R42j064n96J076
1411A7j91o92q9P29L8o11l56J025m82p40M60N01k70r14Q72N46j342j27J082L00
1431b44j178K70N24n4j060M86J085q14m57M72P77o50o85Q62N05r99O6J248l00
1450a46j065O12R45n30p94O18N54o27l59J055K12p45k70J150r4r44J60J337l08
$$ y = [873, -153, 641, 1764, 552, -505, 1042, 1365, -73, -324, 1353, 1406, -301, -69, 1262, 553, -217, 521, 1187, 308, -590, 766, 1105, -25, -307, 540, 999, -82, -292, 750, 755, -811, 216, 1361, 136, -534, 507, 1014, -3, -392, 694, 924, -340, -450, 767, 903, -125, -264, 1064, 620, -788, 39, 1268, 197, -303, 166, 906, -280, -517, 855, 682, -267, -142, 835, 333, -776, -113, 981, 87, -818, 563, 801, -86, -608, 510, 712, -443, -604, 657, 257, -592, -442, 210, -399, -909, -341, 601, -463, -1059, 17, -174, -866, -955, -226, -188, -799, -1155, -130, -612, -1352, -892, -391, -661, -1575, -703, -157, -1499, -1626, -544, -244, -1422, -1152, -628, -682, -1742, -1256, -171, -985, -1442, -970, -193, -843, -1528, -666, -161, -1160, -1094, 154, -146, -1211, -599, 346, -184, -978, -360, 194, -433, -792, 263, 475, -270, -540, 610, 516, -428, -268, 1069, 761]
1469G61j024P36P39q22n09Q79M77p90j15P99J78p50j74R83j95q89K15Q85n56p78
1489E0O97N21l11q74J150n3p49L67M50k81m19k20P72j54r70P04Q86j028p43J018
1509H13N92r59l24P22j69o61M51L80m19o20K76O76m11o33O22L79q85k68Q54k30
1529A86q27L71N79j18p80O19L47m54m43O45P7o18q8P30J29j255K21J047o9j394
1549a095O48Q87m88q01P00Q70q97l73O70L49q87l0Q25j07p62K67N60j97r40M95
1569c06R71o86q04R04J55q90M3R68k38p04j56J383p36j042Q06L90n87m46O89M36
1589A50q35n92J468j61q60j09J180k18j076M97O24p09n56Q49M82j209m6N47M80
1608i4m41l68O66J93j135J41J118m03j119N23J443j058n34J270N6r96m55J042
$$ y = [761, -263, 473, 1212, 390, -119, 760, 1237, 447, 332, 1131, 1309, 559, 385, 1368, 1173, 284, 499, 1384, 828, 50, 747, 1268, 957, 83, 1233, 1180, 431, 798, 1248, 967, 548, 328, 1100, 946, -24, 680, 1566, 538, -205, 813, 1405, 446, 122, 844, 675, 14, 465, 845, 426, -194, 82, 758, 347, -286, 336, 715, -170, -438, 416, 186, -641, -270, 309, 191, -589, 30, 377, -77, -520, 125, 202, -416, -504, 226, 355, -900, -679, 368, 299, -1095, -447, 440, -48, -849, -149, 721, -176, -549, 121, 470, -417, -447, 378, 271, -491, -224, 336, 139, -801, -306, 665, -21, -825, 79, 234, -656, -613, 355, 117, -587, -743, 640, -96, -1138, -332, 58, -529, -975, -286, 150, -685, -1277, 191, 30, -830, -939, 241, 23, -1053, -556, 68, -641, -1197, -348, 134, -1075, -1121, -574, -94, -535, -903, -237, -44, -1179, -1038, 80, -323, -1442, -919, 524, -534, -1068, 202, 258, -738, -1193, -151]
1626a51L5o79O1R93k31o77J72P62J88j317M61J431q47o81R06Q31j527k0J116k6
1646H00j073R20K93k98k86N8M87j75o28L21J151j067n18J205L06j555M55R01j68
1665A129j085O55K88l28l23O51Pm11l92N46J11m16p5M90M86j270j18J368l93j493
1685e73P61N21m76k71N56P4k60m36M86L8p22K54M08R1p84J57O06n34n76P37L49
1706D06o73m53Q91k83m25o8O60l29m74K29N02n96p5M1K73j0n11R89k54m54k54
1727h68P62M7o79KP39o72k17Q54J78o41l13N35M13o06l96J025J32p40n8O94j90
1748Ap89J83R89n83o48R35j7n32j54Q08k92m22O8N46k85j75N7M93j50q75K86P21
1770A65m50o81R90M01j244j00J218l48p52L95O41l72m00L91N2k58j57Q6R95q54
$$ y = [-151, -116, -795, -734, 259, 28, -649, -477, 285, 473, -844, -383, 1048, 201, -480, 426, 1257, -270, -290, 826, 800, -273, 647, 940, 642, 356, 414, 901, 726, 98, 419, 1570, 503, -15, 1190, 1496, -59, 396, 1297, 1129, 44, 699, 987, 659, 336, 987, 994, 583, 191, 737, 848, 432, 357, 847, 1333, 63, -55, 1313, 920, -573, 188, 709, 233, -38, 518, 592, 332, -104, 382, 420, -302, -48, 360, 451, -333, -176, 430, -104, -680, 57, 406, -267, -720, 171, -112, -537, -605, 55, -274, -748, -519, -17, -613, -688, -647, -374, -384, -895, 94, -160, -614, -868, -106, -59, -738, -736, 3, -669, -886, -32, 146, -495, -808, -273, 140, -466, -862, 163, 295, -445, -503, 191, 1, -788, -605, 384, -199, -847, 88, 71, -461, -615, 193, -99, -521, -453, 93, -192, -367, -310, 183, 33, -842, -556, 165, -285, -966, 24, 425, -819, -919, 299, -49, -801, -406, 235, -137, -537, -146, -94, -352, -509, -423, 572, -282]
1790b82m68P96J28o81l13J039j06p29J90N68n07j95P84J4m47r4L32N80p13M2L03
1811B41M16j150L17Q62l20q16N86N50n35j49N71K26m84k56O33J91p15m8P31q7
1831G64o26m4Q81l17n00N86M73p90l7P07m37j33l7L41J43o37J77M29m30j90L21
1852F44K75m22l34M36K32n33r5M60J7o12p0P55n75l11J33M89m18m62N51M41o70
1873f9k86O18K44j084K5N23j94l20K3O13l45m34O9O74p27n0N60P8n65o5P69m63
1895d06l26l15J034l23o60P17k0j44m40M22M80p81j85Q23k6o30pP32m06m67N08
1916d20L72m93j42M22N64n31k70K85L89m49l08P68j59l94J6O85l75n95Q18K38
1936D21q00p1L94O68q46j03O61j50m62L41J14J44o77M18L99l69j72L0M22p34j28
$$ y = [-282, -750, 46, 174, -507, -820, 219, 113, -616, -426, 142, -365, -560, 224, 238, -209, -303, 29, 609, -104, -62, 241, 657, -493, -176, 686, 366, -450, 136, 686, 151, 2, 573, 799, 315, 59, 692, 883, 168, 120, 851, 764, 138, 94, 975, 658, 158, 744, 1217, 427, 390, 1097, 660, 527, 490, 831, 974, 337, 514, 943, 513, 323, 644, 919, 497, 163, 599, 831, 298, 203, 663, 680, 68, -2, 753, 178, -133, 0, 489, 71, -391, 160, 601, -69, -355, 263, 507, -577, -552, -29, -223, -543, -520, 93, -252, -686, -617, 57, -670, -720, -160, -82, -647, -712, 57, -406, -732, -1047, -13, -336, -996, -279, -299, -443, -883, -461, 19, -762, -947, -124, -150, -780, -787, -55, -461, -928, -420, -48, -541, -683, -261, 303, -228, -498, -213, 176, -273, -581, 187, 28, -366, -350, 335, -40, -635, 183, 421, -379, -450, -56, 612, -234, -337, 324, 174, -288, 53, 167, 311, -366, 52, 451, 82, -90, -60, 362, -372, -500]
1957e00Q13n4q30L86L70n5n13K37M34p8o40K53M33m56j68N69o5l35k97N56Q3o93
1979e50L11O62n93l00N62N86o42q6K58M25o24J14R6O0k40k17O45j22l32j11N65
2000D67k79j7J63M57n87k71O00J67m28OK90Q2k06k52L76J97p64M11K22j40j03
2021C91J53K93m42j90M72j94l63K72K67l39n69M66J55P0o91O73J87o09LM43j71
2042B77n10J77L58l67l53L36N40n62k66P3L55m58j34M24M06p76q0N36O2j024M57
2063e29L21m39j47L86N07n24m67N44J33n60j1N39j97l68K30L70r0p30P95L06o72
2084f03k43N91K48m69j02J27K46k94m6K88L0l29K63J95R7m55L24O70p56j33N48
2105A97k4m63n0L21N1j60J04J62J00l35k9P19l17m38L70L20n85l05M92J21m14
$$ y = [-500, 313, 259, -571, -185, 185, 130, -383, -146, 288, 210, -430, -177, 256, -200, -368, 201, 136, -199, -496, 60, 143, -550, -239, 423, -170, -470, 92, 678, 36, -50, 208, 633, 9, 123, 219, 279, 39, -178, 467, 345, 13, -98, 467, 188, 171, 334, 791, 204, -67, 533, 700, 272, 278, 568, 650, 444, 192, 568, 765, 1, 412, 634, 494, 391, 544, 837, 395, 205, 677, 483, 120, 392, 659, 320, -249, 217, 372, 442, -249, 424, 611, 2, 5, 448, 277, -233, -56, 302, -65, -418, -82, 458, -104, -370, -297, 58, -400, -534, -110, 296, -480, -560, -24, 38, -986, -529, -208, -647, -794, -408, 99, -425, -892, -348, -215, -775, -786, -247, -444, -812, -582, -212, -302, -1032, -237, 69, -603, -846, -255, -7, -476, -578, -451, -205, -499, -545, -257, -227, -556, -293, -98, -1, -456, -132, 538, -218, -351, 197, 173, -290, -340, -19, 32, -128, -24, 138, 238, -97, -126, 593, 276, -162, 208, 528, -57, -362, 130, 251, -163]
2126a63K51J69Q8n71K59N74m50k36J42L99o04k42O40J45l47l20N06N4m72K01N55
2147E78m33m96N79K46n52n8N22j10k21j49L52O6l80J30M35l81p7K07L6p8o73Q96
2169D39M7k97j73O72L2r38L41K26O3o76L80M79m83k04K54K05J11o12L25K47k73
2190A65j42K88L00p60L35K91j23l94K09L37k62j32m3O72o22k12M27K74o16p5N49
2211D66R0n93k65O82l17m90O67j7j57l56M10J94k56k41L68j8o62J93K98j00n65
2232f69J42Q32n86l59M46L08q33J35M23n4l54o5O90l59J18k17J02k70l38L36J56
2253d16o2p55J045N3o67K71J3M91q48M22L11j58k90M56p9j14j23p1N24n17n2M39
2275a27K60m19q4L41o4k84K98N38p98j62O01K21m00k32P67n7m68o3M32N2l84O4
$$ y = [-163, 88, 257, 345, -226, 33, 607, 157, -79, 63, 462, -142, -384, 256, 401, 54, -266, 240, 294, -178, 23, 578, 145, -351, 228, 474, -78, -136, 386, 276, 55, -94, 258, 324, -56, 74, 509, 128, 51, 258, 294, 216, -457, 439, 486, 189, 16, 688, 720, -218, 123, 349, 412, -264, 116, 595, 112, -92, 162, 367, 478, -134, 191, 438, 165, 23, 311, 611, -149, 186, 477, 354, -40, 169, 506, 244, 112, 69, 741, 119, -93, 334, 608, -8, -83, 466, 556, -37, -302, 380, 63, -427, 240, 223, 66, -290, 120, 314, 58, -183, 185, 167, -495, -302, -4, -104, -669, -527, 305, -281, -640, -194, 114, -719, -584, -161, -215, -569, -634, 56, -303, -185, -402, -300, -570, -908, -572, -416, -478, -1233, -188, -135, -802, -531, -518, -27, -875, -453, -142, -300, -590, -134, -213, -327, -450, -521, 3, -514, -566, -127, 133, -286, -370, -29, -93, -377, -79, 459, -339, -501, 100, 321, -79, -311, 456, 399, -69, -132, 300, 352, -32, 32]
2297C2L58l4k82J29M46k39n67P27j89m57L34J33K7l62L32O0N2n83K72M01k01l58
2319C1L20L98o98O4M73k74m28L16K93l16l97K86K20l13k18M82J11l39k51N70K68
2340E98p01pK41K57l30J35K25j94m12N27K3m32q4O25j24m17O7K57k92M7jM71l94
2363H5n1P8J72j6o64O19J09o31J05M26Nn41K40M24J59n67p3O32k46o38M46J06
2385A79k71j12N00q1o92N62NJ84o98J08M60K7m67K89J63j69r0p3L91k25k61L26
2407E5P9p57M36J92m8m67L36J51k71l19L95l1j8l37M22K65o27Q7L09n4m58J96
2429d64m6J31k04J38L35r5o71N45K31k34k0L5K37m37m9L64k5j25k5M50k74j55
2451c58M3O70n68k8L26J46m79k1N65l10r8O1M70l49j34M01j15k83k6J33K78k14
$$ y = [32, 390, 356, 74, 203, 649, 410, -157, 570, 381, -76, 258, 391, 418, 56, 388, 448, 500, -83, 189, 590, 389, 31, 351, 749, 51, 115, 588, 314, -114, 202, 495, 179, -218, 68, 288, -25, -243, 239, 350, 11, -240, 330, 598, -103, -110, 131, 388, 58, 193, 418, 224, -188, 339, 362, -70, -154, 471, 347, -70, -3, 254, -38, 9, 8, 479, 85, 34, 112, 284, 268, -396, 223, 332, -299, -194, 232, 237, -304, -64, 360, 519, -48, -121, 511, 265, -373, 73, 179, -92, -204, 296, 215, -477, 85, 90, 274, -424, -316, 144, 171, -296, -7, 156, -13, -103, -176, 215, -10, -271, 55, 134, -623, -187, 5, -43, -510, -174, -23, -294, -613, -218, -249, -267, -604, -182, 83, -544, -457, -148, -202, -660, -464, -510, -379, -583, -445, -110, -205, -876, -331, -100, -334, -354, -319, -82, -519, -568, -204, -229, -354, -379, 71, -203, -358, -315, 355, -213, -241, 85, 231, -248, -269, 296, -14, -112, -51, 419, 70, -64, 337, 222, -61, -87, 46, 324, 110]
2473A10k2L87n2n08K11M42k93l23J97M12j27M5k38Q6L3m28K78L33k36J14L2K66
2495G19n59J19J63p6l72L78j01r2j35O7M63m58j82N14k2m52P0L99k38k84M23J54
2517D98k79k84K61J65k52j01K87j2n14j15N67J01o94O64K8l06j35J92L09m98k43
2538c61M24R7n29J16N90q5m11k43N52P1l47P7L69l10p31P86K48n16n9N60Pm41
2560a36JK54j6l16K74R7m84j70L61K67l4m12N95n4o24n1O79r3k69j66N92l75m98
2583e78L64N60n67p8J18K9k05J3K80Rr4l7q0J95n61J76N41n08l19M71J13l38j49
2606f45N43k83K8l6J88K90n47J42M08m61k39K03L77k78M8J82J58k99j20K91j02
2627a52l07L12L69j92m75L91L10k44m37N27Ol95J52Q9L77l97M4L98l28l14O85
$$ y = [110, 88, 475, 423, -85, 126, 568, 275, -48, 149, 561, 434, 479, 241, 327, 360, -68, 210, 543, 307, 421, 453, 719, 160, 279, 442, 366, -6, 372, 271, 179, 44, 111, 574, 116, -66, 448, 426, -26, 44, 443, 205, -79, 344, 498, 219, -65, 196, 361, 109, 8, 295, 283, -231, -346, 221, 322, -372, 292, 320, 14, -121, 71, 380, -118, -361, 63, 160, -369, -253, 337, 252, -159, -402, 150, 221, -126, -49, 320, 10, -721, 65, 313, -203, -262, 298, 305, -136, -135, 119, 103, -213, 61, 158, -326, -496, -135, 132, 98, -314, 281, 227, -397, -448, 231, 138, -131, -297, 295, -80, -578, -214, 346, -221, -299, -181, -152, -357, -344, -64, -55, -149, -186, -266, -71, -632, -456, 85, -423, -742, -271, -158, -496, -645, -102, -385, -357, -393, -205, 85, -462, -320, 88, -373, -612, -409, -32, -310, -262, -80, 78, -221, -341, -50, -152, -459, -147, 222, 30, -445, -54, 256, 12, -425, 102, 108, -287, -135, -46, 331, -66, -22, 376, 48, -266, 419]
2648D19j02l1m18J29L85L5q8J40L5m30j16M12P5j45o3M47k90q5Q3M91p21K14k
2671C74L54l78l60N10j53l80Q7M61j34n51L37O27m67m37M90j3j21j88K64K41m92
2692G1k36M51N2n20P2K47nk53J36K23j79j79K75J18n60J53L05m58o4j8O26l9m55
2715b37J86J62m43j87M87K62j95l87L49K79j08m91N32J88r94J90N88l36p7j9O78
2736D27o97n0M83k99P4l54J80M27l69K50K42m80l61M63L07m51lP7M59m82l26M42
2758d1j01j1n9J88j44k99L08M15l19m65N44J01k07j87k8K59j31k26M07o33K51
2779c78J76K05l49r7J17N44m11j64J74J02m01K47L24M1n71K48R7L41o84J15N13
2800A89m3l70J03K35m85j3L03L13o17K77M76j91k10P2L00k34j67J31J59k20l7
$$ y = [419, 317, 286, -132, -3, 382, 417, 329, 469, 504, 74, -42, 370, 445, 300, 237, 684, 394, 309, 392, 883, 162, 376, 374, 728, 350, -10, 500, 347, -33, 54, 515, 381, -170, 167, 794, 327, -110, 380, 367, 246, 58, 322, 563, 71, -165, 286, 338, -182, -110, 137, 132, -121, 15, 238, 59, -120, 155, 273, -287, -134, 171, -287, -351, -369, 257, 218, -237, -51, 111, -332, -519, -32, 230, 35, -352, -3, 276, 168, -323, 209, 397, -597, -407, 181, -155, -232, -251, 427, -270, -320, 163, -136, -62, -416, -236, 191, -178, 72, 314, -166, -527, -64, 243, -208, -211, -134, 325, -157, -483, -41, -142, -153, -212, -24, -168, -467, -159, 256, -63, -528, 16, 117, -90, -277, -305, -46, -177, -403, 4, -629, -378, -202, 3, -346, -443, -326, 218, -193, -357, -183, -81, -482, -235, 89, 130, -441, -193, -96, 245, -439, -324, 189, 146, -224, -121, 114, -371, -384, -81, 232, -385, -108, 368, 177, -33, 39, 339, 105, -62, 69, 228, 8, -29]
2821b9M67K8m51J25L55j49l32L14J30J44m49K25K38l19r2L4J88l78L9K97rO7l18
2844A25K68k8j56Q6K77j67k75K5N01n06k29M58l27j08K9M51P4o18K47L48n01j15
2866a41M22Rk30k30K37J90m91J29M25j73l77J93J87k34k26pM14k38m36M97M2j72
2888b10R3J35p9j26r9p4M46p44L98K35l34k15O1Q07m16l60M41j59k39K86Q3k08
2910b78p6k28P37j68p25O86J12m40l5J90N46p22K24M14k22n02K99M22m90l69N10
2931a15K68l87k40M33J41k72q1L26j21q0K15J97M7o17L79l1l05l7K25J78Mm09
2953b82K68L15k52r6J7j3k40J15L83k28l64L87K78m23j65L00L2J20m2k2M4k56
2975a24j10O08k45l61K84J59k31l00K20K37j95l24O22j23N1j44J42O1m38K76M82
$$ y = [-29, 438, 466, 15, 140, 495, 346, 14, 328, 458, 602, 153, 378, 616, 297, 205, 239, 427, 49, 88, 385, 376, 443, 125, 393, 365, 209, 295, 572, 405, 130, 155, 656, 150, -79, 379, 52, -56, -27, 424, 498, -120, 127, 475, -26, -141, 281, 290, 60, -170, 67, 257, -234, -105, 320, 147, -230, -37, 150, -84, -310, -317, 97, -141, -577, -80, -38, -210, -117, 18, -61, -187, -286, -360, 86, -658, -260, -25, -359, -574, -513, 294, -122, -482, -41, -200, -439, -153, -70, -278, -354, -582, 155, -13, -738, -52, 60, -380, -415, -225, 321, -401, -177, 237, 15, -487, -188, 234, -256, -625, -115, 153, -234, -474, -41, 100, -172, -253, 73, -48, -128, 87, 284, 331, -286, 93, 62, -243, -280, -55, 123, 127, -282, -14, 301, 49, -47, -30, -43, -283, -168, 215, -13, -377, 10, 288, -135, -300, 0, 32, 152, 110, 88, 132, -124, -234, 374, 129, -232, 52, 211, -20, -320, -100, 137, -58, -382, 240, 117, 168, 24, 166, 227, -211, 65, 547]
2996E47k85r2r3K36k17M2K81jl89J2J70J90P2n74N13j53k32N0P50l94k91K01Q3
3019D26j50l71M72L16l02j44K23j87k23K85q0n6k15M77P3m47r2L91j42j60p9K21
3041B36M1k83k24J67J47p8J91N2k5n66L31J65n28j2M91k9j88m3K35l07k27K86
3063a68J22r7k02J83K30k06K1n3k27r7KK50o0j1p6L8o0n9J62K15m35R3K20M0K5
3088a50k06M07J89m64k9K61K6l95J11L25m98J42J44L71l71l72M14J77k73K17J5
3109D1n9l43N9P91k83m90L13mk75k29M22K25k35n5M65j96k09o5J80M2j48j03N72
3132D16m81m07M35L95k98k24M56j83k45M24j38K9k92K57J09Jl28K85r6l34L57
3153A38l44N64n31j10N04k61r7K53J77Rl85L93k8m54J49K27L38n98J04K54J62
$$ y = [547, 262, 170, 77, 313, 96, 138, 419, 418, 29, 41, 211, 401, 473, -101, 412, 259, 27, 77, 827, 433, 142, 343, 426, 276, -95, 377, 693, 391, 247, 470, 283, 60, 345, 265, 209, -6, 471, 544, 97, 5, 396, 254, 94, 15, 236, 277, -6, -230, -63, 84, 6, 197, 249, 224, -342, -11, 154, -374, -386, 105, 76, -112, -155, 80, -227, -454, -168, -46, -143, -345, -162, 68, -138, -117, -170, -397, -494, -492, -242, -302, -313, -389, -351, -411, -470, -308, -93, -528, -435, -215, -175, -150, -356, 51, 240, -224, -253, 8, 34, -361, -250, 75, -423, -281, -137, 234, -137, -509, -95, 82, -191, 26, 41, -18, -361, -302, 489, 206, -284, 29, 25, -250, -479, -57, 168, -67, -122, 343, 147, -62, -127, 53, 95, -53, -156, 416, -65, -472, -37, 358, 60, -164, 292, 109, -136, 288, 150, 179, -113, 144, 253, 254, -74, 211, 115, -219, 138, -206, 358, -173, -283, 221, -40, -137, 116, 293, 302, -83, 310, 282, -172, -23, 204, 542, -56, 48, 302, 464]
3174D64o43J56N48j99o6R8l3j10j24J74J89j52l12M40K88p47J09L53j43n11L39
3195A18J17Q3n74N60O1j88O0j82L16l55j3J54P7j77K19k71J15J85k44L03k17j44
3217CK85k77r5j57M12N0q6j04N1J67n76J32L88n10j5K71J88l50J04j05K15k49
3239b58m47P55k70k06J17Jk8k00m0M50l37j08J75M9n7j53K77P3k80J10L22J78
3261A23q09O18l6k74o7L45l3k28K31J80k95l53M77k09L86k27Q3j0K17k75K09K00
3283B53m25R0J47K64l57j22J89J39k03j73L23l3r8J96K24j73l67J07M29m49J13
3304G4J39L4k76L02J61l85j47J19J10m9j56J03L78p24J22L63j04j75j03O66l50
3325A02j34P1M13l31j96K78L57l63j66j77M86o13K14M08j11kk99L29J2n58M30
$$ y = [464, -179, -23, 525, 326, 260, 358, 325, 215, 91, 265, 454, 302, -10, 430, 718, -29, 80, 433, 290, -221, 118, 235, 318, -256, 304, 365, 177, 237, 55, 371, 16, 3, 157, 234, 57, 276, 5, 120, 305, 61, 364, 147, 3, 288, 11, -84, -241, 171, 221, 135, 31, 82, 249, -327, -195, 193, -317, -332, -61, 127, -223, -119, -224, -9, -258, -705, 50, -220, -426, -309, -308, -336, -536, -576, -126, -463, -571, -396, -347, -404, -557, -280, -207, -487, -377, -55, 123, -686, -68, -104, -378, -445, -100, -133, -361, -130, 50, -245, -598, -121, -330, 56, -171, -88, -98, 119, -156, 53, 253, -172, -82, 65, 329, -28, -150, 39, 178, -25, -198, 125, 92, -6, 190, 414, 241, -126, -19, 410, -39, 74, 213, 247, -29, 273, 434, 49, -98, 21, 131, 82, -74, 29, 407, -317, -195, 168, 64, -111, -214, 452, 102, -32, 39, 452, 121, -75, 203, 560, 197, 31, -146, 340, -273, -59, 349, 238, 236, -63, 266, 278, -280, 150]
3346A50M8l2l91N73k7l83r8M60J41k26l41M19M1m33L26K22l62l87L60K51N0m12
3368e1L26j73L5j31J34q8J53k93M16l05k51K98K94k89J69J10j87k45k06M43k64
3389a05j82K54J36L17m45K4K62l25j25J28J29m21L12P3J11l50q1M20j00l72K72
3410f8j92o1j34j8N15n05l9K43K52k89l5j48K39l03M14J56j53n01M41K08k27k10
3432d15J73L04l17J33M1J37n85R6M90j93q9j09K75Q9k56J0K12j66k21M96Q4n66
3454c77L48J79Oj90k58N48k62r8L33j75l06J92L52j96K8j33J60J99k14j9L22j60
3476B79k46J01M74m34Q4J14K72n62q7M07r1k25K62K94m56m9K04L7j04j29J47J69
3498D61l93j33M15n1j24j41L02j89j21j46N41j2l98L2L64l58j4J13Q6m16L12k4
$$ y = [150, 198, 166, -225, 348, 321, -62, -160, 300, 441, 215, -126, 293, 334, -99, 227, 449, 87, -300, 60, 311, 361, -51, 275, 102, 137, 6, 140, 52, 205, -88, 328, 23, -228, 70, 364, 75, 244, 354, 167, -78, -284, 159, -105, -287, -33, 103, 420, -25, -1, 261, -64, -189, -61, 68, -353, -41, 32, 143, -207, -288, 132, 32, -340, -68, -260, -321, -455, -473, 42, -463, -502, -259, -7, -296, -331, -479, -240, -543, -129, 27, -126, -627, -186, 22, -205, -415, -242, 62, -255, -122, -81, 56, -529, -433, 57, -136, -225, -334, -59, 30, -226, -216, -4, -170, -391, 105, 189, -377, -29, 150, 156, -34, -292, 256, -6, -104, 229, 54, -252, -60, 292, 96, 124, -9, 151, 350, 136, 117, 439, 279, 33, 134, 608, 174, 258, 372, 644, 82, -5, 402, 311, 86, 348, 642, 186, 137, 341, 378, 274, 145, 292, 461, 68, -65, 350, 299, 175, 34, 336, 147, 26, -120, 421, 409, 11, 43, 407, 49, 35, 148, 234, -182, 130, 106]
3520A06o5m7j88L74M6m57k4N90m54l53O57q9k94N5L83j2l71m7M59l45l92K73J65
3543c0Ll15M96J34l41J63j02O7l7k36J90K03l75L21J29k62l66J20M62k86r2r1
3565b45L83l63J03K58j8j45k22M79k74j31J67J82l69j69O04m69K22R4j71j12j85
3586c81j95M56n0J5o8J16j69mL05K6l73L3J84J49o10L10K80r7k70l2J10L10q9
3609d4k33K55k55j74M01j46m6k92L93J03j28L0K54j4k19o2J21k4k19M77q7j72
3631h1J54J2J65j47j53J49J84k38K17k5J51n24L3N26j30m67N20J89O2n24L60p4
3653C59M1o6J13j65l00K68J46J12k94J53L0j24k08K21J66k08j96L72k05j61K98
3674C52J86j47m77M27j86j03K15J10J63o35M38q3M8m95N8P26n56j59J08N7r3k39
$$ y = [106, 41, -6, -194, 180, 226, -231, -255, 335, -119, -472, 185, 96, -198, -143, 240, 228, -143, -190, 269, -76, -468, -195, -30, -27, -342, 154, 288, -53, 110, 8, 75, 38, -198, -8, 195, -180, 141, 270, 8, -358, -238, 224, -62, -154, -245, 138, -225, -122, 136, 118, -27, -249, 230, -44, -175, -8, 174, -195, -364, 240, -229, -7, 87, -84, -196, -381, -576, -120, -170, -155, -223, -107, -276, -280, 25, 51, -322, -289, -105, 44, -566, -256, 24, -73, -343, -375, -265, 45, -44, -277, -22, -277, -451, -50, -196, -242, -534, -141, -38, -166, -136, 118, 104, -115, -177, -56, -80, -299, 178, 91, -81, 73, 85, 250, 103, -50, 99, 283, 45, 262, 237, 388, -136, -103, 423, 293, -174, 346, 535, 597, 73, 433, 359, 400, 334, 447, 282, -18, 250, 396, 508, 214, 367, 397, 273, 65, 286, 452, 244, 48, 420, 215, 54, 352, 538, 391, -86, 341, 155, 52, 267, 377, 540, -95, 343, 260, 308, -187, -129, 597, 41, -118, -10, 47, -46, -285]
3696b85L57o3j53k00N01j27j78j03K90q0j51L7n7J39j77K11K2k56j42N82L8l82
3718a77k05N19j39k62J10J52k58j39L41M46n14l2L7Jj54J14J85qk21J66J95j62
3740ej56M65j28k88j74M17q8m30J12L69n6l82p7M31O2m83L07J88m17K31K16P6
3762A90j94m97L74L36m38j34M56k48j83Q1K55K33m71L12J27k83j19J96L09o57
3782c55j38M63P1j14q6M8Q7m06M76K2j90l25K22J41j29j7J06J56l16J57L61p4
3804A60k55J19K91k03p6k42M89j32m36M75o0M1k32K35Rm24L98r1J68k01N00P2
3826F05l65k03K67J0j6r8L42j36j37q8K10M7m11J24K95m99L92pL0k0m70L72L80
3849F24k96k13M3J17j36j98N1K9J22R3J90o18J4L85j28l79J61KL27l58j46M19
$$ y = [-285, 72, 9, -144, -344, 157, 30, -148, -251, 39, -41, -192, -155, -212, -73, -250, -39, -17, -273, -415, 167, 205, -177, -382, 137, -2, -264, -154, -2, -260, -399, -58, 388, -126, -158, -121, -120, -274, -160, 25, 17, -204, -38, 157, -5, -161, 304, 176, -112, -286, 131, 43, -387, -275, 94, 38, -344, -421, 10, 72, -411, -104, 84, -333, -102, 114, 190, -4, -501, -127, 209, -229, -363, 93, -155, -338, -257, -2, 231, -240, 72, 199, -84, -203, -7, 302, -355, -493, -30, 41, -73, -159, -111, -24, -430, 46, 68, -122, -447, -225, -84, -213, -230, -124, 32, -284, -127, 234, 160, -95, 24, 315, 112, 36, -206, 283, 151, -285, 190, 130, 171, -61, 174, 183, -241, 157, 66, 234, 33, 533, 605, 240, 37, 304, 314, 298, 200, 542, 406, 269, 181, 391, 438, 27, 151, 446, -53, 339, 332, 362, 342, -128, 244, 624, 328, 115, 158, 275, 139, -59, -8, 21, 143, 236, 426, -192, -178, 207, 79, -300, -139, -137, 190, -168, -314, 105]
3871A05j24m8K4L90l76j89LK73l19NJ40j67K43j25L80k74n6l24P52m78j88K24
3893a29K39j48j19M0lk72L5J95R6k50Q1N8J82k95pK39Q0k52L9KJ95m97M45P6q1
3918e1K54n5l42oK8J86J0l92K93O2l25J87K76k7j62j82K51K61l89J07M24n50r4
3941b36L00M2n3j90R3Q0j18J09j1n6k40OL13J30l37O2M60n16N7L11l6l06m0J10
3965f6J85m28K65K1J50l88k2K40J48j32J91k4p7j56K16J05l77O8J39N1lj65K72
3988B13l06K52J75n4k89o6L96p8l63K85N2K07k53k57J54L23k43J34K16n79P5M7
4010D1M35m50l15L98K50l20o0L58k44l1K61J5jj40P6Q9j46k46J05L57n16k5M21
4033C12j8m77L73JJ08k97J79K20l03k89K44j73J40m43L64L0j80j83M06J12m58
$$ y = [105, -19, -67, -43, 347, -29, -218, -215, 58, -261, -256, -116, -283, -40, -165, 215, -59, -115, -439, 313, -165, -353, -129, 110, -38, -157, -117, -120, -392, -357, -162, -66, -316, -235, -177, 5, -290, -297, -58, 22, -230, -191, -189, 6, -491, -46, 30, -51, 203, 148, -194, -200, -172, 14, 24, -368, -75, -13, -338, -151, 125, 98, -64, -246, 5, 266, -123, -16, 408, -142, -236, 64, 106, 53, -137, -44, 36, -82, 27, 16, -40, -280, -274, 39, 169, -168, -106, 354, -162, -105, 206, 170, -136, -176, -66, 119, -309, -44, -23, 127, -261, -283, -43, 105, -27, 164, 140, 63, -93, 123, 228, -149, -81, 58, 109, 106, -59, 213, -93, 159, 334, 280, -9, -75, 321, 243, -120, 165, 217, 424, 171, -86, 68, 391, 148, 282, 498, -81, -6, 41, 476, 26, -289, 109, 359, 39, -21, 337, 93, 62, 323, 338, 337, 197, 273, 362, 216, -30, 75, 432, -84, -109, 312, 294, -183, 190, 191, 299, 2, 181, 401, 98, -191, 53, -120, 20, -423, -59, -29, -209, -392, 14, 126, -332]
4054c32K70n9k44J21m9L57k63k38K63l4j83k3L79j50n0k48L54r3K6J75k6j37k69
4077d53K30J72j77L6J47L63o00l4K52j86j44J9M83l75L08N0j84K18m52J02Q0L0
4099a15L9k42J27J78R9J0r0m35N60r7L2k56N24l38k67M05q6M48m76J86N4j05j17
4122C8J25k7k99J15J19N5l18O3N7J71j51M7K80L4m10N7K37j52K1r7N90o45k26
4145c16M79P6m12J82N2m1L6j12N56l47j55J05O5o3j50P3L14j74j81J45J59r2l87
4168a88N02k08m17N44Lk94N7M9K59k40J0R0K9K3k09L61l69p9L97%j18j09Q0K8
4192B01j24k96J75L59m02m3L11r9r8K51K14l98R4J71m8l31k85L30K02j71m50N91
4214A54Q1m62P1K97j60l25J97L45k76l63O23q6k70n5P7P5l60J79K59m23J12J97
$$ y = [-332, -62, -121, -365, -244, -293, 64, -199, -437, -174, -208, -391, -414, -35, -185, -235, -483, -129, -222, -196, -21, -47, -184, -453, -223, -51, -228, -192, -45, 318, -282, -316, -64, -250, -394, -375, 108, -267, 41, 91, -93, 125, -327, -225, -145, -115, -76, -318, -191, -13, 86, 96, 6, -429, 131, 34, 66, -190, 334, -4, -271, 134, 48, 496, 20, 206, 260, 155, 38, 163, 136, -163, -48, 71, 126, -192, -129, -72, 99, -52, -5, 275, 309, -101, -44, 193, 41, 62, -35, 555, -90, -316, 163, 239, -173, 9, 61, 20, 56, -56, 500, 153, -2, 103, 168, 105, -45, 28, 342, 168, -13, 132, 291, 199, -188, 314, 106, -311, 233, 236, -58, -1, 48, 307, 67, 77, 167, 196, 219, 10, 371, 2, -77, 320, 320, 202, 93, 173, 201, 77, -219, -44, 315, -87, -130, 181, 82, -16, 235, 449, 51, 145, 316, 268, -63, -348, -18, 184, 13, -437, 154, 235, -227, -156, 141, -19, -344, -147, 198, -78, -441, 182, 96, -174, -229, -152, -77, -437, -258, 1, -422, -310, -113]
4236a13J08l08j04J74K02l14q2J19J67j34j21K49M4j61K7L21m20o0J38L55l12
4257b25j28J94N47o69J76N8k58M0J68K34l04p6J35L66n79J24J14L36j49n1J37
4278A90Pl35k90L30K13l39J00J59R9k3K5j39N4j81K52Q7j24j08L11k5k27K22J47
4301D05m55m3J77K7j57k73O44J0l05j5K33j04R3j7k52M76m03m4R6p1k47N33Q7
4324C95r7k79L35j13j09k25J08J17m35N03N5k65j82L21p9k33k1M62j26pk54mJ29
4347dJ2p3L51j68l16K75J20r2O4lK46n00J12K47l3m34rL81k2m14K07K65j65o3
4371a6J2J95l47j53N96j32l26R9K06j59q0L86r5k09PJ04K65l95l94M23J96k76
4393i3j29J98R2l24R7J30K5n17N12P5k13j30J83L16l24q0o5K71l14n1K45k04n9
$$ y = [-113, -5, -313, -417, -243, -41, -355, -437, -318, -151, -285, -406, -157, -113, -274, -247, 74, -346, -406, -268, 87, -225, -353, -159, 388, -281, -105, -47, -305, -265, -97, 137, -167, -243, -108, 258, -321, -197, -83, 253, 104, 53, 190, 197, -138, -428, -98, 115, -224, -124, 35, 134, 111, 136, -3, 51, -130, 122, 209, 85, -23, 288, 263, 36, 258, 405, -50, -93, 84, 111, -46, -319, 325, 335, 30, 15, 248, 144, 237, 220, -32, 444, 41, -3, 93, 22, -225, 308, 395, 298, 19, 354, 241, 132, -93, 15, 132, -303, 200, 255, -10, -192, 129, 50, -183, -204, 258, 132, 125, -129, -133, -4, 8, -65, 286, 118, -198, 77, 197, 105, 169, 166, 412, -88, 24, 271, 238, -196, -205, 176, 154, -260, -53, 212, 47, -16, -4, 191, -156, -309, 287, 155, -171, -72, 134, -25, -105, 281, 186, -23, -16, 88, 353, -42, -436, -13, 183, -93, -222, -24, 68, -256, -159, -29, -4, -521, -9, 66, -147, -277, -94, 222, -102, -182, -247, 24, -290, -341, -96, -300, -359]
4416c59J83J23j37Q4P8j12m67pN97l91M52l97K03M90m95J07j05j24o7K35r7J66
4438d0l91L89J15l27r1K24J83m28K16M48j29m45N02Q9k08k17L33Q4l73n7K23M11
4460E11l46J49j2j73o1K9J15K46j41k14L62j74j68L40p1j44j81L08j73k4k18K86
4482B46O6m37J81O2L90m37M59k64J02l22L78j79j70p4M14k31m91M61J62j9k35
4503F2j13K81j24j69L03nr3k5J22r1l90K28J90o5k15m8J32j51J34j5K80k41k86
4526b99J55QK00R0J28j63l30J7J72M18p25M01K62n30L5R7K05j71k78K60J89k62
4548a21o4K56k26K26j15J06k92J47J30m7j64o6K78K73m98%M51m82o8K64O5l1j38
4571a16K06r1k27J64J50k4k94J13p4J39k84K49L01l01%j87M43o03J11J22J41j98
$$ y = [-359, -176, -53, -190, -106, -28, -140, -607, -614, -17, -408, 44, -353, -150, 340, -155, -48, -153, -277, -344, -109, -206, -40, -431, -42, 73, -254, -345, -121, 62, -366, -150, 298, 169, -276, 226, 315, 107, -110, 223, 307, -66, -123, 100, 511, 165, 314, 302, 129, 68, 97, 212, 458, 317, 103, 465, 291, 123, 463, 392, 248, 67, 375, 202, 178, -40, 246, 312, -125, 56, 118, 508, 71, 530, 266, 368, 46, 424, 245, 75, 1, 415, 184, -307, 154, 316, 297, 62, -51, 230, 106, -63, 240, 235, 142, 117, 239, 148, -242, -14, 176, 111, -104, -152, -20, -171, -37, -52, 228, -13, -299, -144, -136, 64, 154, 282, 119, -211, -194, -22, 396, -329, 72, 334, -196, -161, -64, 141, -30, -308, -48, 141, -121, -185, 71, -155, 71, -44, 62, -230, -83, 47, 0, -164, -230, 48, 321, -177, -177, 274, -208, -276, -12, 53, 22, -116, 90, -1, -228, -64, 86, 62, -232, -119, -193, -54, -338, -89, 212, -89, -89, -276, 167, -436, -325, -203, -62, -260]
4593b60K24m6R5j98k20M30j42l18L78N6j42j72K89M53k27j87K49k81j98Q7O8k28
4615b90K2J53oJ31k25L83o8j48J0K67k10oO5K63l57j41K34K0n2J5Q1rQ5l3J01
4640B85J6k0Q9Q0j34k93O6J57o9m44L76J17pk12J40J21k54j19M04l19Lj44L42
4663A81J67n63K88Q8M0k56L50j38j68j99L06O1l87K77rJ21j84j04K64l78kK41
4685dQ3k63k4L42j0m35K36J44j8l90J70N03n08j01J00M06k69l57K23L04l46j9
4707b33J14m6l7J14R6N3l30L23j01k2p5J38l8j64J23l39L15j76L88J76j08l38
4729a67P2J17j06p3o4K99k63O7o9K84r3O2j73K27m64J96J09j04Ko6L00j55k27
4752b89K97L7l77J36L26j31j74p8K65L0n79L34J81j66K57j73K38j83k44L4L29
$$ y = [-260, -36, -82, 13, -185, -405, 25, -117, -435, -57, -1, -143, -315, -26, 427, 200, 13, 262, -19, -217, -130, -62, -290, -268, -115, -121, 10, -215, 168, 100, -48, -38, 229, 19, 13, 78, 341, -16, -157, 77, 97, 45, 60, 141, 132, 217, 184, 285, 301, 281, 370, 450, 316, 23, 89, 246, 177, -267, 109, 226, 219, 7, 147, 268, 14, -105, 299, -20, -17, -161, 181, 348, -215, 73, 161, 201, -55, 295, 157, -11, -210, 96, 157, -230, 47, 38, 159, -25, -129, 135, -243, -245, -4, 79, -184, -208, 134, 124, -311, -75, 69, 51, -339, -169, 334, -174, -275, -175, 231, -38, -395, -172, 132, -214, -233, -119, -165, -202, -88, 8, 61, -269, 54, -47, -69, -144, -6, -44, -208, -85, -424, -109, -285, 103, 279, 171, -167, -95, 22, -84, -157, -221, 78, -185, -118, -187, 97, 4, 66, -107, 120, -344, -148, -39, -143, -141, -207, 93, -62, -289, 8, 45, -332, -196, 130, -1, -175, -253, 12, 42, -537, -203, -22, -188, 69, -104, 134, -49, -293, -259, 70]
4773G0n21M49q1n5k5P6K36j94p1J3J32j97R2J19K07k40j14J75o5j73L36j82Jj50
4797a62K94o0l09o5O12j34j46k01L19M2l84J04L64k76ON9K30j56j20L05j81OL01
4820D48l46J83l82L59n7j74K13J09%j85k41K19P1r6l1L14n2k21q0J86j43l4o9
4843iJ91J48l43O6J40J01l26J55q8J4m85N10J56l61J2L45m14L8j3q6K8qK18J27
4867A16j83j00L46j63l1j98J78r3p6J41J80l15j50J89J72P3l24L30k83k22R8L74
4889E9J6l36rL50j89oq6P0o6l1L06J20l56K87j31J06l63rM85n05K73j68rP5k90
4914d07K61K01nk09K83P2M7l79Q9k0j37j11L85m7m6j33N55n22l49P32m2k15k15
4937b12M26m04J96pm3L81n24K27O9k71l7K18J94l40J06m0J01j43J66N5Nl07O5
$$ y = [70, -451, -2, -83, -138, -163, -87, 149, -45, -116, -103, 29, -168, -76, 43, 250, 10, -104, 71, 6, -167, 169, -13, -12, -162, 132, 72, -237, -302, 310, 176, 30, -171, 148, 190, -194, -90, 274, -2, 4, 63, 293, 137, 17, 322, 141, 147, 448, 102, 285, -97, 262, 205, 31, 244, 353, 353, 168, -73, 146, 217, 121, 90, 404, 352, 131, 51, 237, 94, 60, -9, 182, 330, -13, 53, 193, 294, -32, 123, 35, 49, -436, 74, 230, -131, -119, 226, -188, -150, -163, -249, -221, -229, -11, 116, -67, -167, 179, 16, -15, -213, -35, -128, -204, -63, 117, -198, -348, -159, 13, 86, -238, 92, -191, -413, -315, 59, 75, -261, -270, 80, -109, -115, -201, -131, -197, -228, 78, 198, -158, 129, -2, 104, -259, -268, 217, -288, -15, -183, -192, -117, -407, -146, 55, 50, -159, 124, 196, 243, -136, -47, -67, -204, -315, 70, 23, -23, -156, 399, -123, -472, 260, 218, 3, -212, 214, -190, 6, -1, -44, 337, -187, 40, 109, -162, -199, 19, 213, -127, -21, -61, 40, -103, 63, 118, 123, -184, -119]
4960a19K66j43k74M00R6j80p8J85M2k99n6L72k03j86L45j2m32K62J6K88J41m68
4982c7K60j90K15j97M67l48j86K84k20M73n12R2N3L3J19l61K47o4M8k56J04N7
5004H1j54Q8K56m78M10o8N2l10M93k22k59L6J88k16J43n7K85j0l64J63J14j65
5026Fk41K77L2j05j7J34o0N6m61M99q8j15q3M8oo3p3K68o4j13q5L41n05K66L8
5051a14J97l16J22J67j94j77L16o4j41PP4Q8j48l7L45j68n4k02K84o4k08j1L24
5074B6Lk92p4M89m48k3J23L09k77j23M26j24j37J25j10K02p3m90M43n8J87k9J03
5097A78k82K52k9J29l03o0L92j71O2l9l4j08j11L34l14j25K22j57K74o2M6J44
5119B38K1j34O0r4Q3j38l%J26m72L48O2j92K16j94L24l81M2L8J68k34L7R9J58
$$ y = [-119, 147, 4, -270, 130, 226, 46, -32, 153, 195, -104, -160, 212, 9, -177, 168, 156, -276, -14, 2, 290, 431, -37, 223, 33, 248, 51, 518, 170, -16, 268, 48, 521, 9, 101, 154, 187, 306, -55, 192, 128, 176, -80, 24, 81, -73, 15, 271, -207, 203, 135, 187, -123, 370, 148, -111, -75, 113, -103, 40, -17, 268, 258, -106, 57, 171, 6, -235, 42, 74, -31, -48, 86, 26, 82, -379, 120, 32, -83, -166, -118, -124, -187, -260, 8, -56, -169, -254, 87, -418, -152, -114, 83, -233, -111, 56, -138, -315, 1, -63, -204, -197, -123, -35, -183, -220, 125, -43, -97, -299, -15, -79, -287, -298, 26, 29, -263, -337, 152, -296, -319, -196, 113, -164, -287, 139, 15, -122, 3, -107, 95, 22, -468, -25, -83, 104, 75, 178, -104, 148, 119, 248, -55, -115, 277, 106, 168, 129, 95, -13, -124, 210, -104, -229, -7, -164, 110, 48, 94, 238, 259, 125, 185, 91, 174, 36, 33, 33, 159, -313, 35, 97, -95, 121, -73, 251, -130, -88, -50, 118, -116, -79, 20, 178]
5143A78j41j80L79m92K99K9J00l47M8K10K07j34l75L96n5R3k82M6Oj06L11M9j39
5166A00M8p4K55l21j1J13l50P5L07J04L06m46j09L10l03j6l80N64j95j37K22M7
5188A09k89K75lj0j08Q4KJ99k29L7J81P8m58M23p4m54L66j63J73n85M10J50j70
5211e6m28K12K16o1J5J87K96o31K0PJ99J27m36M63k72j51j6QJ05k39L33J00L1
5234B9l15K20L20k49j97K30l61O0J38l0K9J06Q2k94J51k97M00j78j23J8R4K75
5256A08l51J88L3j2q2OM05j90j34L07o0l17Q6K41rn4j28J03l5j65J13r9J96k28
5280g8J68L48k01m72K63L47l43J53r3r7o6k6L53j87k0m2J90r4m02L57M2m2J0K58
5304C26q7r1J51K6j80p0kJ90l70J45MK31l24J52ML04m09N0J83Rj86j01L33m75
$$ y = [178, 37, -143, 236, -256, 43, 72, 172, -175, -127, 83, 290, 156, -219, 177, 122, 215, -67, -21, -15, -121, 190, 239, 100, 148, 74, 329, 8, -3, 110, -240, -165, 142, 246, 552, 106, -3, 307, 4, -12, -392, 172, -23, -160, 62, 109, -180, 95, 92, 82, -26, 58, 60, 259, 30, 67, 248, 326, -132, 291, 217, -237, 129, -34, 139, -446, -36, 114, -56, -484, -272, -56, -117, -102, 85, 381, -250, -230, -223, -24, 103, -333, 130, -142, -293, -309, -301, -196, -435, -102, -2, 29, -286, -66, 254, 5, -192, 38, -323, -263, -125, -155, -126, -20, 62, -232, -81, -378, 22, -156, -279, -261, -167, 108, -243, -55, -22, -34, -116, -110, 295, 105, -29, 278, 218, -99, -13, 228, 219, 165, 37, 140, 105, -60, 53, -46, 150, -78, 90, 438, 237, -235, 28, 375, 32, 185, 92, -5, -71, -97, 256, 69, 49, 7, 197, 103, -299, 58, 100, 58, 68, 326, 239, 148, 299, 325, 145, 75, 73, 263, -107, 38, 42, 273, -51, 101, 105, 409, 0, 50, 233, 242, 56, -45, 288, -187]
5328a87K48j03K63p5k81N77p0l95J27l9k0j11J08j28K20j35J18J5L5l96M34k7
5350A78j33l7N9K42k24j64K40J41j81j19N4j03p2L28k47K9J97o9J8k59J05K76
5372B59k91J21j44J49j80K49m6j6l32O7NM07l28n1J14r9J24K8j28N3l30L86J91
5395B08l77j78K74P5p6O2p9n9m2J16l9K96m00K49l9k48j45K87J97k94Mj2L74j77
5419b3j56J74j83P6l9J32j13q4K36l50K23J20R4j48n9n6lk68K96j49K83q8J07
5442B2N1j89J97k49K22o4P6k44K00k0k39N6L72j64k7J91j28L50m42r1L78k18K7
5465F7k6K51k87L1J49j85K5Q9J17j00k52K21j69J32j07q6K70Oj87J27J51r7P9
5488B19nj6m33J42K42M5l54M05M5l65Nj61M67m7J59k94J64l13O3J57k44j59L17
$$ y = [-187, 61, -42, 221, 146, -135, 442, 372, -23, 104, 65, 45, -66, 42, -86, 134, -1, 117, 132, 167, -229, 205, 178, 45, 8, 67, 309, 85, -79, 161, 302, 121, 2, 56, -47, -119, 209, -38, -9, 188, 119, 137, -122, -17, 259, -32, 89, -55, 94, -86, 163, 117, 101, -231, -164, -159, 248, -80, -131, -17, -116, 8, 36, -92, -39, -369, 17, 208, -169, -347, -73, 2, -74, -12, -91, -150, -192, -76, -115, 181, -219, 30, -9, -257, -402, -115, 82, -212, -208, -220, 154, -23, -179, -5, -188, -112, -151, -19, -132, -216, 20, -330, -107, 13, 107, -41, -100, -156, -159, -427, -131, -280, 3, -85, 22, 73, -116, 81, -168, 54, -10, 66, -178, 22, 2, -237, -181, 191, 27, 0, 191, 63, 413, -29, -120, 258, 40, 67, 41, 292, 5, 36, 185, 0, 25, 114, 231, 131, -121, 100, -69, 63, -44, -130, 140, 146, -41, 86, 237, 140, 219, 214, 198, -235, -93, 149, 194, -160, 245, 290, -75, -70, -231, 236, 189, 348, 54, 218, -95, -32, 125, -119, -278, 39]
5511C9j59L09l41J21J59j57k64L02O1l05K89J69k53k90O98k59k45K27l77M94l49
5532a31J11P5K77m02r1K26J38j89j71L38L1p3r7J46k83p9L97l15L6k6M9n9J58
5555F6j41K73j43m08M24J69j21k61K15J19j42k34M04j88M8j58j46R1j09q9M56
5576A25l98j27M02J54j51k2J85j15k25J90p3j45J63J0p6O7k03J60L70n04o0L55
5598H2m33K03ooJ17J56j23r4K64k19J94M18p78P1MK10k4J54l69M79n39K82J11
5621A54j67J98j58M11l14j3o1J93r5k40J72K4K39k20J6J22l10K40O8j0p4R1j18
5644A48P6j41K53J9l25P2J65j20k65K41J69j37j26j08N63l21K0j9R9n17K55J50
5666A51j88M1q7M2K31k20kK56k07m80K46M04m12K29J7l3m51K78M27k24j82j16
$$ y = [39, -120, 189, -152, -31, 128, -29, -293, 9, 70, -235, 54, 223, -30, -320, 378, 119, -126, 101, -276, 218, -131, -20, 55, 332, -70, -161, 65, 203, 14, -157, 181, 212, 139, 42, 188, -95, -174, 223, -92, -56, -82, -33, -92, 66, -75, 198, 55, -353, 71, 240, 119, -142, 73, 192, 50, -184, 220, 32, 80, -78, -224, -133, -242, -331, 125, -273, -400, 2, 156, 5, -17, 168, 53, -172, 18, -55, -200, -37, -27, -103, -36, -239, -79, 291, -213, -273, 82, -351, -148, -154, -160, -43, 113, -10, -104, 160, -59, 135, 553, -225, -154, -150, 60, 36, 190, -179, 300, -239, 43, 154, -13, 185, 27, 438, 124, 111, 50, 243, 148, -92, 80, 104, 343, 123, 139, 261, -49, 191, 259, 249, 175, 266, 148, 224, 83, 336, 355, 30, 102, 267, 147, -118, 123, 292, 155, 29, -79, 484, 163, 183, 164, 263, -254, 1, 151, -37, 4, -83, -41, 190, -30, -32, 224, 17, -463, -217, 187, -225, 4, 21, -12, -463, -185, 242, 18, -164, -280]
5688b80l4K35k5Q8J53m12r7L22j10O8j64J99n0J25j03j78J7mK92j5l34O6J45K67
5712A71j27l87J67R3n1oK29j18j19K64J05l18m8J11rq1k9K20l1k08J68L8l4J48
5736A48k58j38L78o30N56j79L3J9lJ10m23K90l2K20o7j46K02k4k51P9J46mL43
5759C69l63r0j90L5P5J74j37j09K28k4n1K60l15n0J34k73K05n3P5j69P01n85K03
5782E0J10j05m2R2j11j6j82L00L0j07P1j28J46j5l82K19K50k36RJ62Q5k61J83
$$ y = [-280, -314, -79, -104, -16, 137, -275, -372, -50, -160, -92, -256, -57, -107, 18, -85, -263, -246, -250, 42, 27, -307, -241, -96, 171, 44, -343, -176, -83, -134, -140, 89, -29, -148, 116, 221, -97, -145, -34, -43, -124, -153, 67, 36, -172, -4, 34, 0, 148, -110, -248, 130, -500, 56, -123, -90, -71, -74, 36, -387, -97, -129, 91, 24, -122, 80, 56, -195, -116, 30, 26, 369, 6, -84, -274, -239, -164, 10, -127, -236, -8, -32, -83, 177, -138, -188, -54, -327, -122, -175, -100, -269, 432, -153, 50, 160, 55, 13, 105, -6, -22, -204, 96, 126, 19, 90, -38, 108, 93, -289, -70, 180, -56, -47, 115, 200, -61, 122]
$$ [...]
8191a09
##END NTUPLES=NMR FID
##END=
