##TITLE=1H_SL62-J2(f6)
 CDCl3, 8 sc, 
 4.06.2021
##JCAMPDX= 6.0         $$ Bruker NMR JCAMP-DX V2.0
##DATA TYPE= NMR FID
##DATA CLASS= NTUPLES
##ORIGIN= UXNMR, Bruker Analytische Messtechnik GmbH
##OWNER= root
$$ XWIN-NMR		Version 3.5
$$ Fri Jun  4 11:15:55 2021 Russian Standard Time (UT+4h)  she@DPX200
##.OBSERVE FREQUENCY= 200.131506
##.OBSERVE NUCLEUS= ^1H
##.DELAY= (6, 6)
##.ACQUISITION MODE= SIMULTANEOUS
##.ACQUISITION SCHEME= undefined
##.AVERAGES= 8
##.DIGITISER RES= 18
##SPECTROMETER/DATA SYSTEM= spect
##.PULSE SEQUENCE= zg30
##.SOLVENT NAME= CDCl3
##.SHIFT REFERENCE= (INTERNAL, CDCl3, 0, 15.7039)
##AUDIT TRAIL= $$ (NUMBER, WHEN, WHO, WHERE, WHAT)
$$ ##TITLE= Audit trail, XWIN-NMR		Version 3.5
$$ ##JCAMPDX= 5.01
$$ ##ORIGIN= Bruker BioSpin GmbH
$$ ##OWNER= she
$$ F:/spectra/data/she/nmr/H-F/1/audita.txt
$$ ##AUDIT TRAIL=  $$ (NUMBER, WHEN, WHO, WHERE, WHAT)
(   1,<2021-06-04 11:14:39.53 +0400>,<she>,<DPX200>,
      <created by zg, POWCHK disabled, PULCHK disabled
       configuration hash MD5:
       00 E9 B6 7A A2 85 ED C7 34 08 36 98 17 FE 4E 26
       data hash MD5: 16K
       22 28 CF A8 30 CB 3E 92 B1 AB 87 0A 6F 99 F7 29>)
$$ ##END=
$$ 
$$ hash MD5
$$ 06 E4 CB 55 26 56 2F 8B 16 B1 4B 47 05 E4 04 70
##$RELAX= 
##$RELAX= 
##$RELAX= 
##$RELAX= 
##$RELAX= 
##$RELAX= 
$$ Bruker specific parameters
$$ --------------------------
##$DU= <F:/spectra>
##$EXPNO= 1
##$NAME= <H-F>
##$PROCNO= 1
##$TYPE= <nmr>
##$USER= <she>
##$AMP= (0..31)
100 100 100 100 100 100 100 100 100 100 100 100 100 100 100 100 100 100 
100 100 100 100 100 100 100 100 100 100 100 100 100 100 
##$AQSEQ= 0
##$AQ_mod= 1
##$AUNM= <au_zg>
##$AUTOPOS= <>
##$BF1= 200.13
##$BF2= 200.13
##$BF3= 200.13
##$BF4= 200.13
##$BF5= 200.13
##$BF6= 200.13
##$BF7= 200.13
##$BF8= 200.13
##$BYTORDA= 1
##$CFDGTYP= 0
##$CFRGTYP= 5
##$CHEMSTR= <none>
##$CNST= (0..31)
1 1 145 1 1 1 1 1 1 1 1 1 1 1 1 1 1 1 1 1 1 1 1 1 1 1 1 1 1 1 1 1 
##$CPDPRG= <>
##$CPDPRG1= <>
##$CPDPRG2= <>
##$CPDPRG3= <>
##$CPDPRG4= <mlev>
##$CPDPRG5= <mlev>
##$CPDPRG6= <mlev>
##$CPDPRG7= <mlev>
##$CPDPRG8= <mlev>
##$CPDPRGB= <>
##$CPDPRGT= <>
##$D= (0..31)
0 1.2 0 0 0 0 0 0 0 0.06 0 0.03 0 0 0 0 0.0002 0 0 0 0 0 0 0 0 0 0 0 0 
0 0 0 
##$DATE= 1622790878
##$DBL= (0..7)
120 120 120 120 120 120 120 120 
##$DBP= (0..7)
150 150 150 150 150 150 150 150 
##$DBP07= 0
##$DBPNAM0= <>
##$DBPNAM1= <>
##$DBPNAM2= <>
##$DBPNAM3= <>
##$DBPNAM4= <>
##$DBPNAM5= <>
##$DBPNAM6= <>
##$DBPNAM7= <>
##$DBPOAL= (0..7)
0.5 0.5 0.5 0.5 0.5 0.5 0.5 0.5 
##$DBPOFFS= (0..7)
0 0 0 0 0 0 0 0 
##$DE= 6
##$DECBNUC= <off>
##$DECIM= 32
##$DECNUC= <off>
##$DECSTAT= 4
##$DIGMOD= 1
##$DIGTYP= 9
##$DL= (0..7)
0 120 120 120 120 120 120 120 
##$DP= (0..7)
150 150 150 150 150 150 150 150 
##$DP07= 0
##$DPNAME0= <>
##$DPNAME1= <>
##$DPNAME2= <>
##$DPNAME3= <>
##$DPNAME4= <>
##$DPNAME5= <>
##$DPNAME6= <>
##$DPNAME7= <>
##$DPOAL= (0..7)
0.5 0.5 0.5 0.5 0.5 0.5 0.5 0.5 
##$DPOFFS= (0..7)
0 0 0 0 0 0 0 0 
##$DQDMODE= 0
##$DR= 18
##$DS= 0
##$DSLIST= <SSSSSSSSSSSSSSS>
$$ [...]
##$SUBNAM2= <"">
##$SUBNAM3= <"">
##$SUBNAM4= <"">
##$SUBNAM5= <"">
##$SUBNAM6= <"">
##$SUBNAM7= <"">
##$SUBNAM8= <"">
##$SUBNAM9= <"">
##$SW= 20.0188882624521
##$SWIBOX= (0..15)
0 0 2 0 0 0 0 0 0 0 0 0 0 0 0 0 
##$SW_h= 4006.41025641026
##$TD= 16384
##$TD0= 1
##$TE= 0
##$TE2= 300
##$TE3= 300
##$TEG= 300
##$TL= (0..7)
0 120 120 120 120 120 120 120 
##$TP= (0..7)
150 150 150 150 150 150 150 150 
##$TP07= 0
##$TPNAME0= <>
##$TPNAME1= <>
##$TPNAME2= <>
##$TPNAME3= <>
##$TPNAME4= <>
##$TPNAME5= <>
##$TPNAME6= <>
##$TPNAME7= <>
##$TPOAL= (0..7)
0.5 0.5 0.5 0.5 0.5 0.5 0.5 0.5 
##$TPOFFS= (0..7)
0 0 0 0 0 0 0 0 
##$TUNHIN= 0
##$TUNHOUT= 0
##$TUNXOUT= 0
##$USERA1= <user>
##$USERA2= <user>
##$USERA3= <user>
##$USERA4= <user>
##$USERA5= <user>
##$V9= 5
##$VALIST= <valist>
##$VCLIST= <CCCCCCCCCCCCCCC>
##$VD= 0
##$VDLIST= <DDDDDDDDDDDDDDD>
##$VPLIST= <PPPPPPPPPPPPPPP>
##$VTLIST= <TTTTTTTTTTTTTTT>
##$WBST= 1024
##$WBSW= 4
##$XGAIN= (0..3)
0 0 0 0 
##$XL= 0
##$YL= 0
##$YMAX_a= 254114
##$YMIN_a= -182541
##$ZGOPTNS= <>
##$ZL1= 120
##$ZL2= 120
##$ZL3= 120
##$ZL4= 120
##$ABSF1= 10
##$ABSF2= 0
##$ABSG= 5
##$ABSL= 3
##$ALPHA= 0
##$AQORDER= 0
##$ASSFAC= 0
##$ASSFACI= 0
##$ASSFACX= 0
##$ASSWID= 0
##$AUNMP= <proc_1d>
##$AZFE= 0.1
##$AZFW= 0.1
##$BCFW= 1
##$BC_mod= 2
##$BYTORDP= 1
##$COROFFS= 0
##$CY= 11.3945322036743
##$DATMOD= 1
##$DC= 2
##$DFILT= <>
##$DTYPP= 0
##$F1P= 15.9154993809931
##$F2P= -4.1035820241983
##$FCOR= 0.5
##$FTSIZE= 0
##$FT_mod= 4
##$GAMMA= 1
##$GB= 0.15
##$INTBC= 1
##$INTSCL= 1
##$ISEN= 128
##$LB= 0.24
##$LEV0= 0
##$LPBIN= 0
##$MAXI= 10000
##$MC2= 0
##$MEAN= 0
##$ME_mod= 0
##$MI= 1.114404
##$NCOEF= 0
##$NC_proc= 0
##$NLEV= 6
##$NOISF1= 3.799351
##$NOISF2= 2.8
##$NSP= 1
##$NTH_PI= 0
##$NZP= 0
##$OFFSET= 15.70392
##$PC= 1
##$PHC0= -11127.57
##$PHC1= 22.20099
##$PH_mod= 1
##$PKNL= yes
##$PPARMOD= 0
##$PSCAL= 0
##$PSIGN= 0
##$REVERSE= no
##$SF= 200.130013532006
##$SI= 16384
##$SIGF1= 3
##$SIGF2= 2
##$SINO= 400
##$SIOLD= 16384
##$SREGLST= <1H.CDCl3>
##$SSB= 0
##$STSI= 0
##$STSR= 0
##$SW_p= 3612.71676300578
##$SYMM= 0
##$S_DEV= 0
##$TDeff= 0
##$TDoff= 0
##$TI= <>
##$TILT= no
##$TM1= 0
##$TM2= 0
##$TOPLEV= 0
##$USERP1= <user>
##$USERP2= <user>
##$USERP3= <user>
##$USERP4= <user>
##$USERP5= <user>
##$WDW= 1
##$XDIM= 8192
##$YMAX_p= 0
##$YMIN_p= 0
$$ End of Bruker specific parameters
$$ ---------------------------------
##NTUPLES= NMR FID
##VAR_NAME=  TIME,          FID/REAL,        FID/IMAG
##SYMBOL=    X,             R,               I
##VAR_TYPE=  INDEPENDENT,   DEPENDENT,       DEPENDENT
##VAR_FORM=  AFFN,          ASDF,            ASDF
##VAR_DIM=   8192,          8192,            8192
##UNITS=     SECONDS,       ARBITRARY UNITS, ARBITRARY UNITS
##FACTOR=    0.0002496,     1,               1
##FIRST=     0,             0,               0
##LAST=      2.0444736,     0,               0
##MIN=       0,             -182541,         0
##MAX=       2.0444736,     254114,          0
$$ Real data points
##PAGE= N=1
##DATA TABLE= (X++(R..R)), XYDATA
0@%%%%%%%%%%%%qJ6j6J6j6K4l2M0m8N6o4P2q8J04j20J36j60J85k09K40k72L09
34A65l49L92m43M97n54O18o88P64q47R38j039J148j267J397j539J694j867K057
52A077k266K502k764L059l397L784m234M765n400O181p165Q446j0191J2718j6719
67i604K4012m1402J55194J25914l72957L9843K26571j11101j77659J34151O7817
78F0779r1478J3492Q4553n3074m3133N0887J2900o0817J3165N8072j5142n2056
90b1852L0492M1823l2311l7476J5007o195k6159J7935L2059Q58K4433L1768m6058
103B4324o2028L2005K8757n8173j5379P1397J3972m3819Q439J8461k8880n338
115a6262K4797l498k449J3009j5542j8741K0314J9069j6809k3726l085R833J528
$$ plain form
0 0 0 0 0 0 0 0 0 0 0 0 0 0 -8 8 -8 8 -8 16 -16 24 -24 32 -32 40 -48 56 -64 72 -88 97 -112 128 -144 165
34 165 -184 208 -235 262 -292 326 -362 402 -445 493 -546 602 -665 732 -807 887 -980 1077
52 1077 -1189 1313 -1451 1608 -1789 1995 -2239 2526 -2874 3307 -3858 4588 -5603 7115 -9604
67 -9604 14408 -26994 128200 254114 -118843 -79000 147571 36470 -141189 -7038 60779
78 60779 -30699 -17207 67346 14272 -28861 22026 34926 -25891 -12726 45346 30204 -21852
90 -21852 8640 50463 18152 -19324 -4317 -10512 -36671 -18736 13323 14181 38614 70382 24324
103 24324 -37704 -5699 23058 -35115 -50494 20903 34875 -8944 -505 17956 -10924 -16262
115 -16262 8535 5037 2588 15597 55 -18686 1628 20697 3888 -19838 -22923 -13090 -11562
128a1562k965J5142K1273m361j3839O840m25l3953k0336L1883L1724j8512j8728
141a7819K5234N591l5612P254L7799k0382k7287L5036J1459m8527K76N1074m412
154A9684l6524J2078J2459k7212J37K8668j1746j3932M0871J7054n0889k2093
166c1445L0956j0j8967K1584J4087k2298J873K0910j5683k0803K3216J3508l1860
179a4932p981L4611J436l0840J2591L4808j4319l0897M697L138j0935J0754J5341
192G472m275P355R707k4864k2282J7692J4659j2058M52J7025j71q594l084j0638
206a1604m858J7476L936k1944K490K8536k769k1241J3088J7734j7563j5883M232
219h370o155j125K4110O105k1596O802K0713k4133k8327K8901K6408k4765m301
$$ plain form
128 -11562 -14527 615 21888 17527 3688 10528 10103 -23850 -44186 -12303 19421 909 -17819
141 -17819 7415 13006 -22606 -15352 22447 2065 -25222 9814 21273 -27254 -26978 24096 19684
154 19684 -16840 -4762 7697 -19515 -19378 9290 -2456 -16388 24483 41537 -9352 -31445
166 -31445 -489 -499 -19466 2118 16205 -6093 -4220 16690 1007 -19796 3420 16928 -14932
179 -14932 -22913 11698 13134 -17706 -5115 29693 15374 -15523 -10826 -7688 -18623 -7869 7472
192 7472 3197 10552 20259 -4605 -26887 -9195 5464 -6594 -6142 10883 10712 2118 -966 -11604
206 -11604 -16462 1014 4950 -16994 -14504 14032 11263 -9978 3110 20844 3281 -12602 -8370
219 -8370 -14525 -15650 8460 14565 -7031 -229 20484 -3649 -31976 -3075 23333 -1432 -5733
232e733L3157j0405l8326J0570K1059k1946l560L4030o097k9356K2396K4482k9598
245F73j4211L4958K376l8636L24K6858r321j2799J9516M134j9606P103J4160j9315
259c786n070L4010L624l4483K037K2096k1431k2019K4921J6658j8365k00J8759
272A6751j1304j7402J8572J1344j9033P40K0004j2639k7482R708J9711j2943j2326
285a6299J8898J0867j4637n833J3270K753r170M68L975j0821r326R781O346q756
299h484R20J4679j940j8256J58J6689K49r916R112J0376j4577j6029N897L434
313g688r975O111J7641l172q914J1093K545j7435K503J8038j1944j9105J5742
326d560J3635k0420m434K3036k110j6667J0473O649j7898M966K5896q153k0203
$$ plain form
232 -5733 27424 17019 -21307 -10737 10322 -11624 -15184 18846 12749 -16607 5789 30271 673
245 673 -13538 21420 23796 -14840 -14516 12342 3021 -9778 9738 13872 -5734 1369 15529 -3786
259 -3786 -8856 25154 28778 -5705 -3668 18428 -3003 -25022 -101 16557 -1808 -2008 16751
272 16751 5447 -11955 6617 17961 -1072 -332 19672 7033 -20449 -10741 8970 -3973 -16299
285 -16299 2599 13466 -1171 -7004 6266 9019 -151 317 4292 -6529 -15855 -6074 272 -8484
299 -8484 -7564 7115 5175 -13081 -12923 3766 4015 -5901 3211 13587 -990 -17019 -11122 -7688
313 -7688 -17663 -11552 6089 2917 -5997 5096 7641 -9794 -7291 10747 -1197 -20302 -4560
326 -4560 9075 -11345 -15779 7257 5147 -11520 -1047 5602 -12296 -7330 18566 10413 -9790
339i790J3780O183k4404n175K1110j453q810J6981P629j9145k026J5584p153j4997
353a1686J3233J2182j7657p577J8302k75j9111R193K0321j2681j6438J4588P064
366I458j3466O824J3130j7528r834J9471q75k4412Q689K3136r988j2027J5198
379G776K533j7507J582J2457m968l746P516o509r705J0069Q891q446l774Q359
393D528P43o348j244q96M96O109J758o399K002N711q744q202J0010R124r565l210
409d127J0815l45j2381K079J2453m441q689L743J062l095R255N994j2648p939
423h264J5274M248j8025m391J2150L174k513R320O62j4790j411R004l228n210
437d000O825J379n040M705L547r660m069R249J231o648K508N907j403j505k41
$$ plain form
339 -9790 3990 10173 -14231 -19406 1704 251 -8559 8422 16051 -3094 -5120 10464 3311 -11686
353 -11686 1547 13729 -3928 -11505 6797 6522 -12589 -3396 16925 4244 -12194 2394 9458
366 9458 -4008 2816 15946 -1582 -11416 8055 7180 -17232 -8543 14593 4605 -7422 7776
379 7776 10309 -7198 -5616 6841 1873 -1873 5643 -866 -10571 -502 8389 -57 -3831 4528
393 4528 5271 -1077 -2321 -3217 -2721 3388 5146 -1253 749 6460 -2284 -10486 -476 8648 -917 -4127
409 -4127 6688 6343 -6038 -3959 8494 4053 -4636 -893 169 -2926 6329 12323 -325 -8264
423 -8264 7010 11258 -6767 -11158 992 4166 1653 10973 11635 -3155 -4566 4438 1210 -4000
437 -4000 2825 4204 -836 3869 7416 -2244 -6313 2936 4167 -2481 27 5934 4531 3026 2785
452B785j983k063N64k725l940J744N885M733J582k777n197j995O60J48R1M46J98
469a844J48K303P44m342o070R65N451L673N99l32m052k015M503K464p258n541
485a0604L853O12Q19O746J114q107J716J0610o254j2236P888P128r745O42J1990
500F172o308j0717Q972M403j2806K942J7042m177j1998P466N839j1516j082J2487
514F719o531j3400R483J4870r092r529R921L578q098N156P191j3294n817J4922
528F079L834j1686n27P462n653l459J0224j49q215L750P482n146m464N014o04
543C942o944L000O479n834k322N452R23o106K833N789l594n055M508N89n291J941
559C10L463l454k881L432R26j995J809J54m326J453N944j966l813k02k44N28L464
$$ plain form
452 2785 802 -1261 -697 -3422 -7362 -5618 267 5000 6582 3805 -1392 -3387 -2727 -2579 -2488 -2042 -1844
469 -1844 -1696 607 1351 -2991 -9061 -8096 -2645 1028 1627 1295 -2757 -4772 -269 2195 -5063 -10604
485 -10604 -6751 -6139 -5320 1426 2540 -5567 -3851 6759 505 -11731 -3843 3285 -6460 -5818 6172
500 6172 -136 -10853 -1881 2522 -10284 -7342 9700 5523 -6475 991 6830 -4686 -5768 6719
514 6719 188 -13212 -3729 11141 2049 -7480 2441 6019 -2079 3077 10268 -3026 -8843 6079
528 6079 9913 -1773 -2300 5162 -491 -3950 6274 6125 -2090 1660 9142 3996 -468 4546 3942
543 3942 -3002 -2 6477 643 -1679 3773 4696 -1410 1423 7212 3618 -1437 3071 3660 -1631 310
559 310 3773 319 -2562 870 1796 -199 1610 1764 -2562 -1109 4835 2869 -944 -1146 -1390 -862 2602
576B602j646m756J451M075j077j149J982j86k968n6L040r40k895M51K432p43j94
593e77K425k549l016M080K215m384m78N027j286l244J740L77k128K331N30l926
609b863J110N410q78n361J935K539k497q71K442n86k889L174L066m074k666M507
625A498J20m615J212M239k356k772K867K014m436j7M050l749k222N631J376m986
641b146J029K259k525k020K002J74q55R43j07o70O67J241k992J645N49q24n27
658b157J686l40k595J692K344k873l092M665K573n007j554O046p3m591K012L078
674A814m300j421M145O63m398K549L467l813j872M606K80l682J352L470j543k450
690a133K220N81l022J732K892k347j992K332J063j802O76J997r57n07P70j185
$$ plain form
576 2602 956 -3800 -2349 1726 649 -500 1482 1296 -1672 -1728 1312 372 -2523 -2072 360 -383 -577
593 -577 1848 -701 -3717 363 2578 -1806 -2284 2743 1457 -1787 -47 330 -1798 533 1063 -2863
609 -2863 -1753 3657 2779 -2582 -647 1892 -605 -1476 966 380 -2509 665 3731 -343 -3009 1498
625 1498 1618 -2997 -1785 2454 98 -2674 193 2207 -2229 -2246 1804 -1945 -4167 1464 2840 -2146
641 -2146 -1117 1142 -1383 -3403 -1401 -1227 -2082 -1139 -1246 -1916 -1249 -8 -3000 -1355 -806 -1630 -2157
658 -2157 -471 -811 -3406 -1714 630 -2243 -5335 -670 1903 -3104 -4658 1388 1315 -3276 -1264 1814
674 1814 -2486 -3907 238 901 -3497 -948 2519 -1294 -3166 1440 1720 -1962 -610 2860 1317 -1133
690 -1133 1087 1668 -1354 378 3270 923 -1069 1263 2326 524 1200 3197 2240 1733 2503 1318
706A318p24K148Q37l110N25L474k284l325L149K888l300o93M258j538m464J931
722A090L142k395k307K655J289l426p29K304Q55j281L37Q98q81p24m33q75R72
739D91R47k370l73K513j001k642J435K633j084j095J634j304k169J576R61k158
755b006R5J802j721r40K032n47j379L052J838l337j652K344n27j393R15K44j267
772b447L57Q88n26K17R0M51J666O41k179j947J115R62P17p56j168O52R52r35l32
791a582J608J0j031K673J237m570j358M268j058k610K017J567k670M68K771k255
807e15j68K785l31k483O08m46j446K292K753l321k040K305N24j396J48L51k7J595
825A188J983j582l125j038Q30J829R25j035j442L36J703r6r35m29n4K55N44R60
$$ plain form
706 1318 594 2742 3579 469 994 4468 2184 -1141 2008 4896 1596 903 5161 3623 -841 1090
722 1090 4232 1837 -470 2185 3474 48 -681 1623 2478 1197 1534 2432 1551 827 394 -481 491
739 491 1438 -932 -1305 1208 207 -2435 -1000 1633 549 -546 1088 -216 -2385 -809 152 -2006
755 -2006 -1911 -109 -1830 -2770 -738 -1285 -2664 388 2226 -1111 -2763 -419 -946 -2339 -1424 -1180 -2447
772 -2447 -2090 -1202 -1728 -1511 -1421 -970 696 1337 -842 -2789 -1674 -712 5 -751 -1919 -1267 -315 -1250 -1582
791 -1582 26 36 -995 1678 2915 -1655 -3013 1255 197 -2413 -396 1171 -1499 -1031 1740 -515
807 -515 -683 2102 1771 -712 -104 -550 -1996 296 3049 -272 -2312 -7 517 -879 -731 -380 -407 1188
825 1188 3171 1589 -1536 -2574 -1744 85 1010 -25 -1467 -1131 572 476 -459 -888 -942 -687 -143 817
843H17j188j315R84K152k36k467n91N77M51M45J161N71l71j40j16k443k03K461
861E49J939j118l91O3l36j11O04j457j715J973L681j315j088j33q80L70L168J52
879C955m769j410L649J316p08J75r31j519R44J538l82j250M68K069J338j540k186
896G57j122l19OP69J311j22l57P76l7r73n9Q20L83j224j033n63J090J35j118o38
916a518J34K30P69J256o76j962J707K865j134k950k016q35L70K731P36j682q88
933b863J588J570n27r04m60N81O00k55p11j452r58k95J743J741p81j159J658J442
951E58j148j15J479l9j806q39M6r10j58J291P43m58J34J550J228l15n32n58L09
970D60J337j168k927j036K212J745p04K56J028q27o01J655J727j020j583J227
$$ plain form
843 817 -371 -1686 -702 1450 1214 -1253 -1844 -1267 -816 -371 790 1361 990 850 734 -1709 -1912 549
861 549 2488 1370 979 1042 706 595 1199 -258 -1973 0 3681 2366 1278 1145 265 635 3803 3955
879 3955 -814 -2224 1425 2741 2033 2208 1277 -242 702 2240 1858 608 1076 3145 4483 2943 757
896 757 -365 -684 -678 91 1402 1280 923 1699 1662 689 630 1450 1833 609 -424 -987 103 238 -880 -1518
916 -1518 -1384 -1154 -385 871 195 -1767 -60 2805 1671 -1279 -3295 -4130 -3760 -1029 -293 -1975 -2863
933 -2863 -1275 295 -232 -1136 -1596 -1015 -415 -670 -1381 -2833 -3791 -4086 -2343 -602 -1383 -2542 -884 558
951 558 -590 -705 774 735 -1071 -1910 -1864 -2774 -2932 -1641 -898 -1356 -1222 328 1556 1241 709 151 460
970 460 1797 629 -2298 -3334 -1122 623 -81 175 1203 376 -225 1430 3157 2137 554 1781
986A781K29j967j597P08n51k19K425K222j076j101J467Q93j656j230M10l68j245
1003h75l7J078j14K93P32l99m98j38J088K03L75j10L51r96j357j605KK1O5K471
1023E50J710n74j451J481K5k490m20J844R2j590K67J600j66k073m20J776O61j463
1041f41j79K593J001j567k75L37j673j544M18O94L18J306J620pj214r00j48p43
1059f04n61J206K061j44j449M41L28j770r87J863o6p23J342Q46q49j68k40l56
1077A70r79p9M22k2M2J353J054j501j604l71N24j523N37K232J214n00o74J034
1095A329j889n80j071m3R39J105q4m89p3o26q38P17K06P65k82M50R03l87p01o55
1115a304j449J72k96Q80p15K087O73k81J09K40r10l32j42R30k18o95P37j160q17
$$ plain form
986 1781 2010 43 -1554 -846 -1397 -1616 809 3031 1955 854 2321 3214 1558 328 738 370 -875
1003 -875 -912 166 52 345 1077 678 180 42 1130 1333 1708 1598 1949 953 -404 -2009 -2007 -1986 -1921 550
1023 550 2260 1686 235 1716 1741 -749 -1169 675 767 -823 -556 1044 878 -1195 -1615 161 822 -641
1041 -641 -820 1773 2774 1207 932 1269 -404 -1948 -1530 -836 -518 788 2408 2401 1187 287 139 -604
1059 -604 -1165 41 2102 1958 509 950 1278 -492 -1479 384 318 -405 937 1783 934 766 526 170
1077 170 -809 -888 -466 -488 -446 907 1961 460 -1144 -1515 -991 -2514 -1977 255 1469 969 295 1329
1095 1329 -560 -1140 -2211 -2254 -1315 -210 -294 -783 -856 -1482 -2320 -1603 -1397 -632 -914 -464 439 52 -649 -1304
1115 -1304 -2753 -2581 -2877 -1997 -2712 -625 48 -233 -124 116 -794 -1126 -1268 -338 -556 -1251 -514 -1674 -2491
1134b491J121N09O9J060R21o43O95p47q57R21j84p17j278J467J00j191J518N70
1152H43P07J139j75j560M79M69j987M52L13j610M3R13O14J98Q07l83P51J134j111
1171B036q43M29K23j115k90L39j307q53J451l46N60R58J910O0k19m4k020j668
1189g39L73k91o10J96K14N26J377k93r24P83N01l92J5j11r12L48K5q95j386m05
1209b600K04L85J484J472M36M28L10n42j760k062m27R20J155l90q7O07P88l85
1227f4j32m37L82L96J318L31p98j417p67N34n04j398R9Q78J491K031N32p24j150
1246F01k18k88j669l05M68J036J026K19n24j130l36k02Q10O45P3Q35Q46l83j978
1265d74j114J21j20J14K56j00J289J285K30r77j224q36J35O41j8k10L46P34Q25
$$ plain form
1134 -2491 -1370 -861 -792 268 1189 546 1241 494 -363 558 374 -343 -1621 -154 -54 -1245 273 843
1152 843 1550 2689 2514 954 1433 1902 -85 367 680 -930 -887 26 640 838 1645 1262 2013 3147 2036
1171 2036 1193 1622 1845 730 440 779 -528 -1381 70 -276 284 1242 3152 3212 2993 2949 929 -739
1189 -739 -366 -657 -1267 -1071 -857 -331 1046 753 -171 612 1113 721 736 625 -287 61 86 -809 -2195 -2600
1209 -2600 -2396 -2011 -527 945 1381 1809 2119 1577 -183 -2245 -2672 -1752 -597 -987 -1074 -467 321 -64
1227 -64 -196 -633 -251 145 1463 1794 996 -421 -1188 -654 -1158 -2556 -2457 -1579 -88 1943 2475 1751 601
1246 601 383 95 -1574 -1879 -1411 -375 651 870 346 -784 -1120 -1322 -512 133 206 1041 1887 1504 -474
1265 -474 -1588 -1467 -1587 -1473 -1217 -1317 -28 1257 1487 510 -714 -1550 -1415 -774 -792 -1002 -656 78 903
1284I03k46j515j955L22K094P86j77J52o03K21P3j039o08J9O28J016J016l04r88
1303b05L6L91r01k60P85r4Q4R95L20p22K85O05r68j192k64P99J481O81j706j18
1323C2N41M53m25J83K67m57J367O71j173j200o00J36O97Q43p33l51O15R29M85
1342B280m01p60%N83n69n17l27j6n01P9O68k11Q87n55k1J243n15N6j054J74n68
1363d5o27L6J78K53J5m41n43R95Q25M35q03l3M84j04j352j352j47L77j48O77J753
1384D33K92j348L24R65l56j261n52Q36L9k42k91l76l44L14K43J98j26R93J025
1403G66J48k10j08p51j747q74P13M44j87J039J698K04r84l05N51k28p26N00N24
1422D67n7j01l97j062k66q6P73J40Q20J182K66J63n18n28j049r92p03P42R19k16
$$ plain form
1284 903 657 -858 -2813 -2491 -397 389 212 364 -239 -18 55 -984 -1592 -1573 -945 71 1087 783 -205
1303 -205 -169 222 -679 -939 -154 -248 -164 831 1151 429 714 1319 351 -841 -1105 -306 1175 1856 150 32
1323 32 573 1026 601 784 1051 594 1961 2632 1459 259 -341 -205 492 1335 602 251 866 1795 2280
1342 2280 1879 1119 1119 1702 1133 616 289 273 -228 -149 519 308 1195 640 619 1862 1347 1403 349 523 -45
1363 -45 -672 -636 -458 -205 -190 -631 -1174 -179 646 1081 278 245 729 625 -727 -2079 -2226 -1849 -1997 -1320 433
1384 433 725 -623 -299 666 310 -951 -1503 -667 -628 -870 -1161 -1537 -1881 -1567 -1324 -1126 -1252 -259 766
1403 766 914 704 596 -155 -1902 -2776 -2063 -1619 -1806 -767 931 1135 151 -154 397 169 -557 -57 467
1422 467 410 309 -88 -1150 -1416 -1502 -729 -589 231 1413 1679 1842 1324 796 -253 -1245 -1948 -1206 -287 -503
1442e03P81P64O26j194p93K73qJ8P69K91j07p90o51n54Q0p30N46J543O53K02L39
1463A555m14r52k79k31o16m09O91Q73k84M27N05k80q96p15J005M59j20M48K60
1482A027k49o11l70m40n19L55O89P86N05k6N8m24p72J67m47L96k6j59Q44L51o27
1503E08P9J6l12k26K28Q34k61m59O36n4l01o41k93p8J95P35N95l3q56K65j57j85
1525B35l79N7L41K0L06J39k62m61K40l21O72o00m1m94L91n78J39P44j25m43M14
1546fk81r6k73M06j24k90n16P08o15j52N54M4l66P93k03N4k64l76P13L6n09r47
1568a710M06j8j87N77P80m18M1Q70R8j305o50R46J01o83N95N74o68k31N61L29
1588Hn65K71N94K69p6k30R0K1o85n29J61k24L06P51Q14%J53l51k0k3n59j037N20
$$ plain form
1442 -503 278 1042 1668 474 -319 -46 -54 -36 733 1024 917 127 -524 -1078 -998 -1728 -1182 361 1014 1216 1555
1463 1555 1141 189 -90 -321 -937 -1346 -655 218 -66 361 866 586 -310 -1025 -20 439 319 767 1027
1482 1027 778 167 -203 -643 -1162 -807 -118 668 1173 1147 1205 781 9 176 -271 125 99 -60 784 1135 508
1503 508 587 603 291 65 293 1127 866 407 1043 989 688 47 -246 -324 -129 606 1201 1168 312 577 420 235
1525 235 -144 -87 254 274 580 719 457 -4 236 -85 587 -13 -54 -548 -157 -735 -596 148 23 -420 -6
1546 -6 -287 -383 -656 -250 -374 -664 -1180 -472 -1087 -1239 -685 -641 -1007 -214 -417 -363 -627 -1003 -290 -254 -763 -1710
1568 -1710 -1304 -1322 -1509 -932 -152 -570 -529 341 439 -866 -1516 -570 -469 -1152 -557 17 -651 -882 -321 8
1588 8 -557 -286 308 577 501 271 361 382 -303 -832 -671 -895 -589 162 976 976 1129 778 758 735 176 -861 -341
1611c41J693l5r72k88N60n35k28M91N46j31L80P11j72j392p39O94l85lK4K48K75
1632D01Q41K89n47o95k91M63k27k83L23KJ34L63m00j343J24N41K94N07k6M30M3
1653I43j74o37p19n42k6M51J048m31m53R22L56o55n34J33J11J10RN47p0n24k60
1674c95L66Q2j100q4J198J489n88o02J45k20m25m15J53M5l89P25J346o67j238
1693e74K76R36l70m22j93M92L02j31j9m08N9k86p4M58m68K76L38K3J91l21q56
1714g71oP76m14l83L55P01m9q07R4O6p54N44J322p42q62J44O62p1n51k23J22N49
1736b98m9j35J19l92l93O01Q39n47r86L96O57l12j60M47j36k50K65L46l67k1Q0
1757b96J79Q8k14l90M02L38m7K03O5j7J4k32l57K16K76M52k78j11L40n55K32N76
$$ plain form
1611 -341 1352 1317 345 57 617 82 -146 345 891 760 1140 1851 1679 287 -452 242 -143 -146 -122 126 401
1632 401 1242 1531 984 289 -2 461 234 -49 274 276 410 773 373 -970 -846 -305 -11 496 470 900 943
1653 943 769 132 -587 -1129 -1155 -704 344 -87 -540 382 738 83 -451 -318 -207 -97 -88 459 389 -135 -395
1674 -395 -29 53 -1047 -1131 67 1556 968 366 511 291 -134 -549 -396 -351 -740 -15 1331 664 -574
1693 -574 -298 638 268 -154 -347 145 447 316 297 -111 -52 -338 -412 46 -422 -146 192 215 406 85 -771
1714 -771 -777 -1 -415 -798 -443 258 209 -598 -504 -438 -1192 -648 674 -68 -930 -786 -124 -195 -746 -969 -847 -298
1736 -298 -347 -482 -363 -755 -1148 -547 292 -255 -1241 -845 -188 -500 -660 -213 -349 -599 -334 12 -355 -376 -296
1757 -296 -117 -29 -243 -633 -231 107 60 263 328 311 325 93 -264 -48 228 680 402 291 631 76 308 884
1779H84k53j60M89j81M6r7j52k55r9O83l06k34J57L8M20mL5l09o25J54K54m1Q3
1802E27K28K90o74J74j2m81j81P58J69m96p2O48m50p71K26K77k54L22J05M7k77
1823A03j79J00m3l1m04K69L8j94J84K48k49m12M93k87l88J35M49J9j2J90j80j32
1845b83l52J78l64J25N47K08l29j46O4j87o0K98J00J27l14J07L80Qn03PJ81j09
1867c17l6R1l3L17J80m41O8O0J09n44L03K19L89m62K27J45o65r3K95M0k55K19
1889a84O14m27k37O25p8r14N76L41l58m61L44l1p0O4K38j99q1o5L78j46n6l32
1911d59N96l38o7M6j31K51K3L8L02m07p5Q4K9O5K36j28J02l85n9N88n64l4K99
1934A2K20k17L18J25j90j56M6M5K88l69j45k8J89p2M41K3k22p8R3O8O5J61k75
$$ plain form
1779 884 631 471 960 779 825 728 576 321 222 905 599 365 522 560 980 976 1011 702 77 231 485 444 527
1802 527 755 1045 371 545 533 52 -129 629 798 302 230 878 428 -343 -117 160 -94 228 333 380 103
1823 103 -76 24 -19 -50 -454 -185 -147 -341 -157 91 -158 -570 -77 -364 -752 -617 -168 -149 -161 29 -151 -283
1845 -283 -635 -457 -821 -696 -149 59 -270 -416 -352 -539 -599 -301 -201 -74 -388 -281 99 107 -396 -389 -208 -317
1867 -317 -353 -262 -295 22 202 -239 -171 -111 -2 -546 -243 -24 365 -97 130 275 -390 -483 -188 -148 -403 -184
1889 -184 430 3 -234 391 313 -601 -25 316 -42 -503 -159 -190 -260 -196 42 -157 -238 -303 75 -71 -127 -459
1911 -459 137 -201 -268 -222 -353 -102 -79 -41 261 -146 -221 -137 -108 -43 193 65 167 -218 -277 311 -253 -287 12
1934 12 232 15 333 458 268 112 158 203 491 122 -23 -51 138 66 507 530 308 230 323 391 456 617 342
1957C42k61K59k1r2O15l97n74M99O91o10k34L46j87k64P60q4l05o72P56k26q9
1978B52j52K50m2l08L20J38n02J48J70l8j12k79L15l94j45L80j02q1R2p8Jl04
2000d71K46K39j76Q6l12J22N4j1k02m61LM97r1J23j84q2L6L57L27m34Q0k11o9
2023e34K63k84n6j65L04M92m91O3K8N7P20n67P2j35Q9l49K48k91j80r9O57j83
2045c41j44J056K0n07N65n79l89O13q20J04M72l62j25P16J43o6k59J90L30n26
2065I1M90M06q62n20L74J34m55LK87K03L27K01k20j04J58k9k9k48j69n0j74N42
2087C56m48l43L82J37n4J10L79k42J00k2p63Q33j370Q03R7p79Q72q0O4M04j0k24
2109B02j91L94Q3l72j77K37m65j16J99L60m62K13M09K62l17k08O59k39l4k40n16
$$ plain form
1957 342 81 340 319 227 842 445 -129 370 1061 451 217 563 376 112 872 788 483 -189 567 341 252
1978 252 100 350 308 0 320 458 -44 104 274 236 124 -155 160 -234 -379 1 -101 -182 -90 -168 -167 -471
2000 -471 -225 14 -162 -76 -388 -266 -212 -223 -425 -886 -883 -386 -477 -354 -538 -620 -584 -227 100 -334 -254 -465 -534
2023 -534 -271 -555 -611 -776 -472 20 -471 -408 -380 -323 397 -170 -98 -233 -144 -493 -245 -536 -716 -815 -158 -341
2045 -341 -485 571 591 84 649 70 -319 294 -526 -422 50 -312 -437 279 422 356 97 287 617 91
2065 91 581 987 125 -395 -21 113 -342 -339 -52 151 478 679 459 355 513 484 455 207 38 -12 -186 356
2087 356 -92 -435 -53 84 30 140 519 277 377 355 -408 425 -945 -142 -45 -824 48 -32 32 436 426 202
2109 202 11 405 488 116 -61 176 -289 -405 -206 154 -308 -95 314 576 259 51 710 471 437 197 -319
2130c19L5K82p2n5j63O49l62M07M68n17r68J029M51r17m81Q63j01k00O8J40p6
2151A61M99k48m91M79m13K66j64K05k01n20%J6J82j64K24L16r6k32L04o3l95r0
2173d25K19J07k72o7K64L2l30M27n64l83M27K45k42K59L32m71L05j13n09k09L38
2194f30M36j73K63P2l30j08N2%p6M5K57L01P6l13K6q9j2J82n28K81R5m1L60R7
2218B43P2k27j77M12j53p5p2M64p7k08n6J08k44J0QJ81K34P6k7J16l14J53k40
2241B07j88K85k31r0M27l9l52J80J90J62n53M56k05L05j76j0k86o08j74N26J5
2262a59N54j8J32K0j4l78Lj26P6k84j29L55rn03o2N83k3m17N86K53m55K74K03
2285D62m87l21j03J66l29M22L68m94K62k6K8J36J93m73J26j63J97n2k42j22M8
$$ plain form
2130 -319 -284 -2 -74 -129 -292 357 -5 402 870 353 -615 414 865 -52 -533 330 229 29 97 237 161
2151 161 660 412 -79 400 -13 253 89 294 93 -427 -427 -411 -229 -393 -169 147 51 -181 123 60 -335 -425
2173 -425 -206 -99 -371 -438 -174 -142 -472 -45 -609 -992 -565 -320 -562 -303 29 -442 -137 -250 -759 -968 -630
2194 -630 -194 -367 -104 -32 -362 -470 -418 -418 -494 -449 -192 109 185 -128 -102 -191 -203 -21 -549 -268 -173 -214 146 243
2218 243 315 88 -89 323 170 95 23 487 410 202 146 254 10 20 28 209 443 519 492 608 294 447 207
2241 207 19 304 73 -17 410 371 19 199 389 551 -2 454 249 554 378 368 82 -526 -700 -174 -159
2262 -159 395 377 509 529 515 137 140 14 90 -194 -323 32 23 -480 -542 41 18 -399 187 440 -15 259 462
2285 462 -25 -346 -449 -283 -612 -190 178 -316 -54 -80 -52 84 277 -196 -70 -233 -36 -88 -330 -452 -404
2306d04J34k67j48R79J45q9J74n40n4L60m06n57L82L08J38m69L4K9R89m32J30
2327D36j35J13r81L73p8M09Q5q07o8k42Q96j16K37K44K95k21m83%O76p08M60j272
2349h87J75Q17r11J28J089l05m52J44N92j394O65K61m61J14q1K14m76Q59m95k39
2369f43j14M42K79l8PO35o70J92j02k60m14K13J11lL94K47J03l62J85P4n04j60
2391c88L11K71k10K04M20l50m00N65n55K10J32J83k93J61K56Rp9q8q0k62mo3M70
2414D20K4L73j09k35l1j86l67M1O97M5l48K74l80J21q73O70j72k37M42k06O89
2435F52k31n97M74q49N40N80n7j149Q65Q55j790N50j01L89K98k51J34j202J610
2454G20k34j67j000O46q0n36n09O71j40K97O21l64K72j235O63j9K9L30L26o03
$$ plain form
2306 -404 -270 -537 -685 294 439 350 524 -16 -70 290 -116 -673 -291 17 155 -314 -280 -251 738 306 436
2327 436 301 414 -567 -194 -272 137 222 -585 -653 -895 1 -115 122 366 661 440 -43 -43 633 -75 385 -887
2349 -887 -712 105 -806 -678 411 106 -346 -202 390 -1004 -339 -78 -539 -425 -506 -292 -768 91 -404 -643
2369 -643 -757 -315 -36 -74 -67 568 -102 90 -12 -272 -686 -473 -362 -365 29 276 379 17 202 276 -228 -388
2391 -388 -77 194 -16 188 608 258 -142 423 -132 78 210 393 100 261 517 526 447 359 279 17 13 -50 420
2414 420 444 817 708 473 442 256 -111 -70 627 672 324 598 218 339 -534 136 -36 -273 169 -37 652
2435 652 421 -176 298 -551 -11 569 512 -637 228 1083 -707 -157 -258 131 429 178 312 -890 720
2454 720 486 319 -681 -35 -115 -651 -1160 -489 -629 -332 289 -75 197 -1038 -375 -394 -365 -35 291 -312
2474c12l2J75L92j412L62O59n59J173l89J18m48L04K81m87k08k08Q8K30M37r4
2494G0m22Q6N41k67pK50J4j73L59k44l26l11K46k02J74O6J64L7O9J58K00l69k0
2517I3L67n66J23m09J74M4l0p9K44Q7M9M2K44K47m84J74k59o1k63J17q1J30k9
2540a26j6J86J58n8J50jl06K40j87K7m09J31k06M75J62j71J43j75M2J68j27J68
2562B68j16r4K9J98j58m89O40j31k54J17nM16k5N0j11J83j89m00j84o4N45k77
2584e1L05K56J00O6n27m6R3rk5J33J07j10k64j02PJ50K97m67L0L81L5l53J80J19
2608C05j57p9k70r5J85L34L90k34r5n72L49l19p7j30K20K65L98n83J28L71p88
2629d54K42K48k22j06N83o06J39o26J65J68j04L69J08l06N26p40O84ml49K87r74
$$ plain form
2474 -312 -344 -169 223 -1189 -827 -168 -727 446 57 175 -273 31 312 -175 -383 -591 -503 -273 164 70
2494 70 -352 -266 275 8 1 251 265 92 451 207 -119 -430 -184 -386 -212 -146 18 55 124 282 482 113 93
2517 93 460 -106 17 -392 -218 -174 -204 -283 -39 48 97 139 383 630 146 320 61 0 -263 -146 -227 -97 -126
2540 -126 -142 44 202 144 294 293 -13 227 40 67 -342 -211 -417 58 220 49 192 17 59 227 100 268
2562 268 152 58 87 285 127 -362 278 147 -107 10 5 421 396 446 335 518 329 -71 -255 -319 226 -51
2584 -51 254 510 610 676 149 103 196 187 162 295 402 292 28 -74 -67 83 380 -87 -57 324 359 6 186 305
2608 305 148 69 -201 -296 -111 223 613 379 284 -288 61 -258 -335 -465 -245 20 418 -165 -37 334 -454
2629 -454 -212 36 -186 -292 291 -315 -176 -802 -637 -469 -573 -204 -96 -402 124 -616 68 64 -285 2 -972
2650i72j73O64O14J44j032O59k62o97K35l5L74K70J051m85k37J58q21L79p5j02
2670c43O5L88K45m79K82k83J91j08o2m3k28N30l39L55K68j57l57M7j54M48N3q3
2692B36J95m74j02n2Q1K5O65p23O25m46k43O40k27N8j05n20K83N05k95k29j14
2713b17K3k3M73l23K16j6j36Q7j34J40j82J20k98O9K37l77J37K92k7J67k15K9
2735D2q0j92l9J42oj9J7K00n2P3Lj76J14J76L0j60j87p9J17L0JQ9K8k09N53j47
2761B69j48k6J99k52l75O57q4k09l03o8K72P4o1N4L36j65j3m37K53M76k79k97
2783a27k26j24Q9N55j223K52Q11J65l43Q20k46k54m63N65m58j43j89N2L12j99
2803c74P27k25j93p3j4R5l97L80j89J59K15r8j65k12J75k17L54L6k34K01J86j91
$$ plain form
2650 -972 -1145 -481 133 277 -755 -96 -358 -1055 -820 -855 -481 -211 840 355 118 276 -545 -166 -241 -343
2670 -343 -278 110 355 -124 158 -125 66 -42 -104 -147 -375 155 -184 171 439 282 -75 -28 -182 266 319 236
2692 236 431 -43 -145 -197 -116 -91 574 -149 476 30 -213 427 200 258 153 -367 -84 421 126 -103 -217
2713 -217 -194 -217 256 -67 149 133 -3 84 -50 90 -92 28 -270 -201 36 -341 -204 88 61 228 13 42
2735 42 -38 -230 -269 -127 -133 -152 -135 65 13 86 89 -87 27 203 233 73 -114 -193 -76 -46 -45 44 72 -137 416 269
2761 269 121 95 294 42 -333 324 240 31 -272 -340 -68 6 -55 -1 335 170 157 -280 -27 449 170 -127
2783 -127 -353 -477 -388 167 -1056 -804 7 172 -171 649 403 149 -314 251 -207 -350 -539 -487 -175 -374
2803 -374 353 128 -65 -138 -152 -57 -454 -74 -263 -104 111 13 -152 -364 -189 -406 -52 -16 -250 -49 137 -54
2825e4J85j88l12J93J3j97K78K94k27J05N6j5j34j0j76L62q7J48K8r1K17k34r8
2848E6o0J54K59k30j67K49o0j24m6l37M48M6j05K48j51O0K22j68j30l92K23K18
2870B13j68L31j71J45m68L77m9Qk00N4O2J86j88M10l71j71O3j20M29m32M40m55
2892g5K63j46O9k61l0pK03R8m9j54K0J21m1L2r6P3J50l21R1Oj83M0L3Rj72K69
2918e8N5k3j75K68r6P0m9P7m01K69K7K36l42k69K72l5J74P4n4j66l0L6K48k91
2942a83J30k2J27k3j51J95L4k18J26k09K46k05M50m89K96j62j77K94K29r95M11
2963b96Q91l64L12o00R7M54m56N2o19K59J086o03J52r74N47j91k27O62l35O6R2
2984EK07k44K99k04K16J9l07l29K47J44J1k01o0p8J10K2P9r5J62%mP9j99k55L20
$$ plain form
2825 -54 131 -57 -369 -176 -163 -360 -82 212 -15 90 146 131 -3 -13 -189 173 86 234 262 171 388 154 56
2848 56 -4 150 409 179 12 261 201 77 31 -306 142 188 83 331 180 240 462 294 164 -228 -5 213
2870 213 45 376 205 350 -118 259 210 218 18 72 134 320 132 542 171 0 63 -57 372 -60 380 -75
2892 -75 188 42 111 -150 -180 -187 16 114 65 -89 -69 52 11 43 -53 20 170 -151 -60 -54 -237 -197 -164 -155 -327 -58
2918 -58 -3 -26 -201 67 -29 41 -8 69 -332 -63 -36 200 -142 -411 -139 -174 0 74 20 -146 -176 -140 108 -183
2942 -183 -53 -75 52 29 -122 73 107 -111 15 -194 52 -153 297 -192 104 -58 -235 59 288 -707 -296
2963 -296 595 231 543 -57 40 494 38 90 -529 -270 816 213 365 -609 -62 -253 -480 182 -153 -87 5
2984 5 212 -32 267 63 279 298 -9 -338 -91 53 64 -137 -197 -275 -165 -143 -64 -159 3 3 -1 78 -121 -376 -56
3009e6Q4K02J4k62m6L27l58K30q7m2J04j08R1m3L9k13L3J33J92n04Q3j64M14J47
3033B10n10L60j20J32J48j25K1q8J05r6L8q4J14J9j61L59l75l3L90l4J48m02J34
3056A50j44K9k27M54l89K49k33L00j95q6m6o6O1J17j08K8J82R6k95j6q9j33K86
3079g5j09L26j06qj69K81j93l1j78k5K08k10j2K06J64j52q0J33n8q1J54l83K47
3102a51L51l17R5l57J23L51l94L60j93K23p5n7J83j32m7J15q8Q5k02P1L7K5J12
3125A18k93J56j4J01j45j03K71K27p2j82K37j92or9L80n09J44J77j35j90p7M14
3147B08j20p0K04j8l65JK36k2l51L72j25j32K13j51n6K35J54J23k79k59K44j45
3169a03N6k8K7m4J93o5L23n58M5J55J8l32L76k02n6J44J54J74j94J8K38m38Q1
$$ plain form
3009 -56 28 230 244 -18 -64 263 -95 135 48 6 110 2 93 50 89 -124 -91 42 234 -270 -187 -351 63 210
3033 210 -300 60 -60 72 220 95 116 28 133 37 75 -9 105 124 -37 322 -53 -86 304 270 418 16 150
3056 150 6 35 -192 262 -127 122 -111 189 -6 -92 -138 -204 -143 -26 -134 -106 76 172 -123 -139 -228 -361 -75
3079 -75 -184 142 36 28 -141 140 -53 -84 -262 -287 -79 -289 -301 -95 69 -83 -163 -30 -88 -169 -15 -398 -151
3102 -151 200 -117 -22 -379 -256 95 -299 61 -132 91 16 -41 142 10 -37 78 -10 75 -127 -56 -19 6 118
3125 118 -175 -19 -33 68 -77 -180 91 318 246 64 301 109 103 4 384 -125 19 196 61 -129 -206 208
3147 208 88 18 222 204 -161 -160 76 54 -297 75 -50 -182 31 -120 -176 59 213 336 57 -202 42 -103
3169 -103 -47 -75 -48 -92 101 36 359 -199 -154 1 19 -313 63 -139 -195 -51 103 277 83 101 339 -99 -18
3192a8J73r4j60L13o2k96J63mJ41J51j24L06m08n1O4l7O9J3J23m74K36j19j13
3215b08J89m6p8K82j14J57j17j53J35K25k25J22j30r7J77l63K19nJ4k3J12L4J70
3238B77k82k02K5J5J33j64P1N1j08K22k07J19J99k73O8%l8J11j68O4j10K3j15
3261b89M38j96J0k99M88k22L3Q5k35J68m4M3k51l6K52P8Nk13J00j80J86K47k54
3284h6J20j33Q7P6J1j06j68j9L75Q1j12L3j95K21o3j67K86r4n3J47k84K13j53
3307A7k2J19q7J63L6N0l1j32o6L4j27K10M3r5m5J65k24J11j58K21l56L21o3p4
3331A0j52L0K73o5J14j38K35l43O7K42l10k65N65qk41k18L85Qn34L18J25l1l83
3354c16O27K67n79J95o00N39m62r8K14K60j2M16n03l40M87R7l92k46l1Q55j067
$$ plain form
3192 -18 155 61 -99 214 152 -144 19 15 156 307 183 489 81 30 94 57 126 139 262 -212 24 -95 -208
3215 -208 -19 -65 -143 139 25 182 65 -88 47 272 47 169 39 -58 119 -244 -25 -30 -16 -39 73 107 277
3238 277 -5 -207 -182 -167 -34 -198 -127 -76 -184 38 -169 -50 149 -124 -56 -56 -94 17 -151 -87 -197 -174 -289
3261 -289 149 -47 -37 -336 152 -70 -37 48 -187 -19 -63 -20 -271 -307 -55 23 28 -185 -85 -265 -79 168 -86
3284 -86 34 -99 -12 64 75 -31 -199 -218 157 238 126 159 -36 185 122 -45 241 147 94 241 -43 170 17
3307 17 -5 114 27 190 226 276 245 113 47 81 -46 164 207 112 67 232 8 119 -39 182 -174 147 84 10
3331 10 -142 -112 161 96 210 72 307 -36 31 273 -37 -302 263 255 14 -204 181 189 -345 -27 98 67 -316
3354 -316 311 578 -1 194 -406 133 -329 -427 -213 47 35 451 -52 -392 95 192 -200 -446 -477 378 -689
3375f89O14Q54n08o84J95K9L14r24J272p53M62l56O20m8j5o27P97p46n28Q78j92
3396c5NJ28L05k19k71K72l05j42M15K00k38l32J75M5j49K10l9k37M4J67m9o9J28
3419IJ47k10Q1L09k69P6j75l8K15O8n29L01p3l2L05M7l05L62j96J28l0l18K38
3442A11j45M7MK91m07m0r9qK02k4K23k84K12J47j61J65l6m31j05M85k34J65J34
3465B12k08R3J52M5o1ll93K45J09Q5l42J31L68m55K31M6o1l6Q9l9o7j46l4J14
3489G5Mq0J55m4j56j3j06J67J60O9k47OjP3J37j90J96J38j40j34L9R7k70J49j43
3514e9J42r5L15l44M6k94J99m8K0j73K74k41J60K35j04K93o13K99L5Q9l70M40
3536B06n22K31JN9J35l21N0K11k84J47J33r2j3J61Q3k59j51J42r1k5K49k62J95
$$ plain form
3375 -689 -75 779 271 -413 -218 -189 125 -799 473 -280 182 -174 446 398 383 -244 553 -193 -721 157 -35
3396 -35 -30 98 403 184 -87 185 -120 -262 153 353 115 -217 -42 3 -146 64 25 -212 -168 -1 -50 -119 9
3419 9 156 -54 27 336 67 143 -32 -70 145 213 -316 -15 -88 -120 185 232 -73 289 93 221 191 -127 111
3442 111 -34 13 17 308 -99 -139 -238 -246 -44 -68 155 -129 83 230 69 234 198 -233 -338 147 -87 78 212
3465 212 4 97 249 294 233 230 -163 82 191 276 -66 65 433 -22 209 255 194 158 247 208 141 -5 -39 75
3489 75 79 -1 154 110 -46 -59 -165 2 162 231 -16 -10 -11 62 199 9 205 343 203 69 108 205 -65 84 -59
3514 -59 83 -12 303 -41 5 -289 -90 -138 -118 -291 -17 -258 -98 137 33 326 -287 12 47 136 -234 206
3536 206 -316 -85 -84 -25 110 -211 -161 50 -234 -87 46 -46 -59 102 185 -74 -225 -83 -174 -199 50 -212 -17
3559a7k03L13J09j98j89L16k06j37K71J3p4J10Q0k44N2j84M38l50K2K46j61j39
3581a32K65l9j14J77J1J00k62j20J90K5k46K05j01J36O8O7j74j30j07M18l21n8
3603a42Q0J67j06j56L81Q4m06R4L9k68L75J32j45j96MrM5P3j50J45n3l0J73J53
3627B84k45L16o69j3L43J33j30q9J28N9n0NJ06q0M0m6J67kk14K0J06j42L5O6k1
3652A07j07J44j66J57j14j46K29J3L0q1j42L06k85l8l0L24m9j38M3Q8k34N9j48
3675a78L07k30K9r4N3L20n2J70l68k8P5J70m49M0K09j14K5K8j28P3M6Mj84L2M7
3700a97J04Q2n3j0L78m53j09k0K34n9N7J4k80J28J80J6j03j5J03l3j67R9m0J33
3724a1k17M64r1j13k9J44K34m18J70k13L07l85M3N5m3j60L00j74L0j3K31o6l4
$$ plain form
3559 -17 -220 93 202 4 -185 131 -75 -212 59 72 -2 108 188 -56 -4 -188 250 -100 -78 168 7 -132
3581 -132 133 94 -20 157 168 268 6 -114 76 101 -145 60 -41 95 163 230 56 -74 -181 237 -84 -142
3603 -142 -62 105 -1 -157 224 308 -98 -4 35 -233 142 274 129 -67 -63 -72 -27 46 -104 41 -12 -42 131 284
3627 284 39 355 -314 -327 16 149 19 -70 58 117 67 72 178 98 138 92 259 257 43 63 169 27 62 128 107
3652 107 0 144 -22 135 21 -125 104 117 147 66 -76 230 -55 -93 -123 201 152 14 57 145 -89 -30 -178
3675 -178 129 -101 -72 -166 -113 207 155 325 -43 -71 4 174 -275 -235 -26 -140 -115 -87 -215 -142 -96 -92 -276 -244 -197
3700 -197 -93 -11 -64 -74 304 -149 -258 -278 -44 -103 -46 -32 -312 -184 -4 12 -91 -106 -3 -36 -203 -104 -144 -11
3724 -11 -228 236 145 32 3 147 381 -37 133 -80 227 -158 -115 -60 -103 -263 37 -137 -107 -120 111 45 11
3747A1K13k55M9O6j11j71K12k23M53nj77J11Q1k40%J10j33l0K75k65K31p7o7M71
3771E29m75j9p7m3L67k84j02K52j25J11j1l00J2J28j16J60m6J06Jj82P3j91K10
3794b2M7J61j72j1Q4j46j14J02n2Q8K58k89Pl4L3lKO6K17j75Q4M8m08J69N4Q7
3820H1j25K7J12k45K68l62K09K65k31K8J00l1L3l31J22Pj16K67M3l04L05k92K57
3843H7j59j31L25J15k85j15j38K59r0L06n8j8K1j31j31J41k24K34K9k7K02l54
3865a42j55J42J51Q5k95J18J90j50L40l19j43k24M95j19r7m1OK52L3j14j2j20
3887a19J04J25J81j65r5p3l9j54K01J73r9l6l12K53L22j64L36k05l27K33j53j24
3909a37L05r5J21k0l3k87K80j93K95k16L08l56J68j58K80M3j33l2j72L85k64K07
$$ plain form
3747 11 224 -31 18 84 -27 -198 14 -209 244 239 62 173 254 14 14 124 -9 -39 236 -29 202 125 58 529
3771 529 54 35 -42 -85 282 -2 -104 148 23 134 123 -177 -165 -37 -153 7 -39 67 68 -114 -41 -232 -22
3794 -22 25 186 14 3 87 -59 -173 -71 -123 -35 223 -66 -59 -93 -60 -63 -61 5 222 47 131 179 -229 -60 -6 81
3820 81 -44 -17 95 -150 118 -244 -35 230 -1 27 127 96 129 -202 -80 -73 -189 78 121 -183 122 -170 87
3843 87 -72 -203 122 237 -48 -163 -301 -42 -132 174 116 98 119 -12 -143 -2 -226 8 37 10 212 -142
3865 -142 -297 -155 -4 81 -214 -96 94 -56 284 -35 -178 -402 93 -26 -123 -164 -158 94 127 13 1 -119
3887 -119 -15 110 291 126 31 -42 -81 -235 -34 139 40 4 -308 -55 267 103 439 234 -93 140 -13 -137
3909 -137 168 73 194 174 141 -146 134 -59 236 20 328 -28 140 -18 262 305 172 140 -32 353 89 296
3931B96Q8m22J90k53m3L20j63m6J47j68L30l49K45R5j55J40r5J89k82J08J09l3
3953B48m76j4L96p4K52k23J53l77L15l31j40k03M64L82k08OJ85n97K12l11k2J32
3975b31L90n74R60o36k79M04o35N71j77K33J04Q56p95k68M29k41lj45R5M66p64
3996b40M13J28r9r9l80M26J70o43M94j61P2j29j25L83k08p2M1k21J44m2J98k20
4018a70L55Q4K54l86l89J22M1J58j00J16j94j8R4R9q9n2j43J36K1l19M02N1P1
4041A44j99J36O8j05L4k74J01O3K7J47l21K53J48k4k45j37j70J29K55J20j27L3
4063E6K31l43L41m45L8R0J41j82j77K03j67K27K65l75QJ22o9Q6j16L56k09j21
4085d0J70p0j24P3J01pj72K71k87mK14l34K52l22K64J89k78N6O2L0J58k77J46
$$ plain form
3931 296 384 -38 152 -101 -144 176 13 -33 114 -54 276 -73 172 267 112 252 157 346 64 172 281 248
3953 248 -228 -242 154 80 332 109 262 -115 200 -131 -271 -474 -10 372 164 170 355 -242 -30 -341 -363 -231
3975 -231 159 -415 545 -91 -370 34 -601 -30 -207 26 130 986 191 -77 352 111 108 -37 58 524 -240
3996 -240 173 301 202 103 -277 149 319 -324 170 9 81 -48 -173 210 2 -70 -29 -250 -106 -148 50 -170
4018 -170 185 269 523 137 -252 -130 -89 69 -31 85 -109 -127 -33 66 -23 -75 -218 -82 -61 -380 22 73 144
4041 144 -55 81 149 44 78 -196 -95 -32 -5 142 -179 74 222 198 -47 -184 -354 -225 30 150 23 56
4063 56 287 -56 285 -160 -122 -32 109 -73 -250 -47 -214 13 278 -97 -89 33 -36 50 -66 290 81 -40
4085 -40 130 60 -64 9 110 103 -69 202 -85 -89 125 -209 43 -279 -15 174 -104 -48 14 44 202 -75 71
4108G1Q3m1j66m4J77L2j90m8k1M11J5l07r1J55j47K19R7l10P7M0mO1r6Ll0p0R0
4135c4K59Pk2l71k71L24K40j40k86K41k5P6K0n3j01J92k59J68j40k09N06Lr8r4
4159f7o8J79k26L9p1N5K50m63K91l13K68K82L0j60k87L12j44Q5J41l02J66oR4
4182H5O1J2l53J92l2J3K10n6k68K86k09J79j22k3P3J52j94JN5J38p5j71L69k12
4206A11p1R5r3L65n51p4K78M2j44J87k24R7o8K50k71L8J54k28R3Kn7j3J6j55K90
4231F9Q0l22nJ80oJ02jk77L15j92J75R7j68k47P2q9K87j32j13N0j34K63p9J33
4255E8k14L28q8o4j51J89j10J50J63k72K6Ll32M33k09k0K2j0L8q5j12K71o7K48
4279A95j68j86K14J59l79K60l3J01l80M43k90J94o0K3L9k03J37j49J64N3k40J00
$$ plain form
4108 71 154 113 -53 -97 80 112 -78 -126 -147 264 279 -28 -119 36 -111 108 205 -105 -28 12 8 69 -27 -24 -54 -124 -34
4135 -34 225 232 210 -161 -432 -108 132 -8 -294 -53 -78 -2 18 -35 -136 56 -203 -35 -175 -384 122 125 27 -67
4159 -67 -135 44 -182 -143 -214 -159 91 -372 -81 -394 -126 156 186 26 -261 51 -93 -8 133 -169 -3 -9 85
4182 85 146 158 -195 -3 -35 -22 188 132 -136 150 -59 120 -2 -25 48 200 6 7 62 200 125 -46 323 111
4206 111 40 135 42 407 -144 -218 60 102 -42 145 -79 18 -50 200 -71 -33 121 -107 -14 -12 -69 -82 -66 -221 69
4231 69 149 -173 -178 2 -4 98 97 -180 135 -57 118 215 47 -200 -128 -217 70 -62 -175 -125 -259 4 -75 58
4255 58 -156 172 84 20 -131 58 -52 98 261 -11 15 18 -314 119 -90 -110 -88 -98 -60 -145 -257 14 -53 195
4279 195 27 -159 55 214 -165 95 62 163 -217 226 -64 130 70 93 132 -71 66 -83 81 134 -106 -6
4301fr7J75k78K5J43J21j70M8k63r3K20O8N7j5RQ3j8M2j44J58r3k97M21k26L9
4326i1j08K84J11j3k81L08m79K98n5J72k24R1%ok3j02L1M0J15j32Q5j62J63j76
4350a54M7J28m4rJ70N5l12J95j71K76j25K5J47l16R2lr0J90k26K10No0J0O4RQ
4376A21O8j13n2J04L4j51J2l67N45O1j82l32K05L1k25M02j99K46n5j82P1J58j39
4399F1k11M89j35l29O7k4Q3L3Mj91K78j00j26J25l24J69k9Q0L2j28J46K36k19
4422a3o0J10k33N8k1M13m35J37r4J42O2J4k44O6K09j59j17K01j66K06m01K2L64
4445F1l7qJ06j86J36k6l19mK30j17J18Q6r5K04k65J1k12N62j2j76j00J27l0j60
4469a06p0J03J48q2K6l23M34O2o1l40R2J4K73j94L13l25J62p5j49L14k04Q6l00
$$ plain form
4301 -6 -103 72 -206 -181 -38 83 -87 -39 -302 -395 -175 -107 -50 -65 -56 27 9 51 -93 65 -28 -325 96 -130 -91
4326 -91 -199 85 196 183 -98 210 -269 29 -26 146 -78 13 13 7 -16 -118 -87 -47 68 -64 21 -141 22 -154
4350 -154 -107 21 -23 -32 138 193 -119 76 -95 181 56 81 228 -88 4 1 -89 101 -125 85 90 30 40 104 113 121
4376 121 189 76 24 128 162 11 23 -344 201 262 80 -252 -47 -16 -241 161 -38 208 153 -29 42 200 61
4399 61 -150 339 204 -125 -58 -82 1 34 38 -153 125 25 -101 24 -300 -131 -160 -80 -48 -176 -30 206 -13
4422 -13 -73 37 -196 -138 -159 254 -181 -44 -138 4 66 80 -164 -98 111 -48 -165 36 -130 76 -325 -303 61
4445 61 24 16 122 -64 72 46 -273 -277 -47 -164 -46 40 -55 149 -116 -105 -317 245 233 57 -43 84 54 -106
4469 -106 -176 -73 75 -7 19 -304 130 192 131 -209 -117 -103 170 -24 289 -36 126 51 -98 216 12 98 -202
4492b02L42j1K7k03M0j01O6L73k42J80O9r7j92O5q9m3K46l51p0q6J35L59l9j83
4516gM18p12Mj08O42n55P64j87N61p44p69r4N86Q78o10l12N34k10O43p29m6J28
4538G5N0M51q48Q22o85o59Q07j99L6K74l58J97n0K39k74J81k0q0j89L99l50O17
4560D36l12j60L39l38K07P8k39J42k24L61k47k84K02J47j93L15m45R3n8K35j24
4581f9n5K54j81j9k8N3l3J46MJ26r8j68q9J22j62K82J03m23K13j16j25K6J44L99
4605C06l33O9k48N2J91J05k99K92m73K34K09Qj20q5K7L38l47Q2P2N1r7N5r7q6
4629i4J7O2r7L03j81k49K10p0K21m2q8p0P0J25O2j88J46j75J03k22Q9k07K49j12
4653a38Q8J98n0p0L0o1m7j95L93j00k89L92j90L13j23k53j59K50j27J74q0o5J25
$$ plain form
4492 -202 140 129 156 -47 -7 -108 -42 331 89 269 338 241 49 114 25 -18 228 -123 -193 -279 -144 215 176 -7
4516 -7 411 -301 -297 -405 237 -318 446 259 820 76 -693 -787 -201 677 67 -245 289 79 722 -7 -53 75
4538 75 125 576 -272 550 -135 -794 13 -186 -150 124 -234 -37 -87 152 -122 59 39 -41 -230 169 -181 436
4560 436 124 -36 303 -35 172 250 11 153 -71 290 43 -241 -39 108 -85 230 -215 -122 -180 55 -69
4581 -69 -124 130 -51 -70 -98 -45 -78 68 72 198 100 -68 -157 -35 -197 85 188 -235 -22 -138 -263 -237 -93 306
4605 306 -27 42 -206 -154 37 142 -157 135 -338 -104 105 113 -7 -92 -65 273 -74 8 80 131 34 89 -8 -94
4629 -94 -77 -15 -112 191 10 -239 -29 -99 122 80 -8 -78 -8 117 179 -9 137 -38 65 -157 -68 -275 -26 -138
4653 -138 -50 148 98 28 58 -3 -50 -245 148 48 -241 151 -39 274 151 -102 -261 -11 -138 36 -44 -109 16
4676A6K41l16K06q0l64M08k98L98J7l1l42J20R4j43J76j51J27j33K52j93j6rJ07
4699H6j25J2J02m42N91m80L61M1j30J39J54k94k25L25j6N7K4r4m6q8k42K13L49
4722B72j77k10K36k47L53k48m2M7o7K1J98k2j41O8J45j48J08m10K79J54j57j25
4744a13K87r1K3J57j37k46j04K17J62j95o1J63j57J02j08J64K6j76J16o8q1N3
4766f7J86j46N6r4K3n9J9j53n5L04l05K98J37j84K3J25l6j14j25J86k10J27r5
4789a59O3Rj6k8J52L21k59r2N9k0j11j6K5q4L75m05L67k12k3P7J8k31L04k51R1
4814d6J79K8j72k52j7J24K52k00j8K09j38J6J64k19K06k65R8J26k3J78k41M3k8
4837DR9j71p0O48n36K1K45j46j3j36K7K8L2j49K17l6j29J79j12K8P2k58j82M27
$$ plain form
4676 16 257 -59 147 67 -297 111 -187 211 228 197 -145 -25 69 -74 102 -49 78 -55 197 4 -12 -21 86
4699 86 -39 -27 75 -367 224 -256 105 146 16 155 309 15 -210 115 99 156 180 86 40 -48 -290 -77 272
4722 272 95 -115 121 -126 227 -21 -63 -16 -83 -62 136 114 -27 41 186 38 146 -264 15 169 12 -113
4744 -113 174 83 106 263 126 -120 -224 -7 155 -40 -101 62 -95 7 -101 63 89 -87 29 -39 -120 -67
4766 -67 119 -27 29 -65 -42 -101 -82 -235 -290 14 -291 7 144 -40 -17 108 72 -42 -167 19 -191 -64 -159
4789 -159 -96 -87 -103 -131 21 342 83 -9 50 30 -81 -97 -72 -156 219 -186 181 -31 -54 23 41 -190 114 -137 -46
4814 -46 133 161 -11 -263 -280 -156 96 -104 -122 87 -51 -35 129 -90 116 -149 -51 75 52 230 -11 32 4
4837 4 103 -68 -138 510 -26 -5 240 94 81 -55 -28 0 32 -117 100 64 -65 114 2 30 102 -156 -338 89
4861H9p0j2L23l81K14k24L72m01M8j22J32Kj17J0K6K85p5K6Lj42K82m03K23J0
4885I8Q0k51K57l20K37j77M9l3M4L4M17l84k00J07O0j37R9L08j73j47J13p3N9
4908F7J03k29K42k12k02L85j86R5k17L83j11k75p2K56q6j59J33J64l81L06l7o5
4930i8K30l42J70Jl59M88M4j73j71L35j71J56p9J48j65j63J92k31l4J43K02k16
4952i3R9r8L67o97K29L40n6Rm3j99r1L9J98N5L9j38m6J84Nl3P4k04L9p5J20o2
4978c8J32o8L6k38K23k48P5J72j32Q9P4j00l9P7j3J4j05L14j09Ok4J87l4l74J39
5003A6j72L33l00K28J8l3j37n9l0M44Jl04r6J65K11n49J66K95l25J43r3j27R1
5026a14M5J6N3J3J41j03j13K13j6j90j47L19p9k48J43r1K69o9M4k42J40OJ33r2
$$ plain form
4861 89 19 7 330 -51 163 -61 311 -90 -42 -164 -32 -30 -147 -137 -111 174 99 125 128 -14 268 -135 88 98
4885 98 178 -73 184 -136 101 -76 -27 -60 -16 18 435 51 -149 -42 18 -119 -20 288 115 -32 81 8 67
4908 67 170 -59 183 -29 -231 154 -32 63 -154 229 118 -157 -229 27 -59 -218 -85 79 -302 4 -33 -98
4930 -98 132 -210 -40 -39 -398 90 134 -39 -210 125 -46 110 31 179 14 -149 43 -188 -222 -79 123 -93
4952 -93 6 -92 275 -422 -193 147 91 100 57 -142 -233 -194 4 59 98 -40 -86 98 103 70 144 -60 -21 -96 24 -38
4978 -38 94 26 62 -176 47 -201 -126 46 -86 3 77 -23 -62 15 2 16 -89 225 116 122 98 285 251 -123 16
5003 16 -156 177 -123 105 123 90 -47 -106 -136 308 309 5 -91 74 285 -264 -98 197 -128 15 -78 -205 -114
5026 -114 -69 -53 0 13 154 51 -62 151 135 -55 -202 117 38 -210 -67 -158 111 42 86 -156 -16 -10 123 31
5050C1j02L16m57J22j46Q4l3J05J62r8k46K45p9L8O7M2M4l39L49J85l87J30n4
5073b1J6M9N9j07o9L35l36J15q2j04Q4N4M5p3j31K41J23k37j16M19k44q4J0r3
5097a47K71l35K49m1J50J33k03J80l53L22j61Q5k36O6L92j57m4p9l29J76Q3j74
5119a52J15o8m4K13q0j77J99j61p4K97Po6n2N2R8j54L6j57L57j1n86K95K87l48
5143a74N5K5P6j09Pl4q0K13L8j70j6K97o8k14J16k5J59k11K2N11n27M2K62j93
5167Br5J69j65K6K41Ql87K73k36K33j06N5J3J6K6nJ86j24o7O3N3k43J87N4j27
5192E0p7J51r9J46n6j22mJ65l12J94j46j25J04j9M43k66J81k78k5K24l38Q8m0
5215a61Q0k8Q3j40K44p6p0r0L4K05O1k91K39k33K21o3j27J62J7l2m6K28l49RJ35
$$ plain form
5050 31 -71 245 -212 -90 -236 -152 -185 -80 82 -16 -262 -17 -96 -58 9 51 95 -244 105 290 -97 33 -21
5073 -21 -5 44 103 -4 -73 262 -74 41 -41 -145 -61 -7 38 -35 -166 75 198 -39 -155 264 20 -64 -54 -147
5097 -147 124 -211 38 -3 147 280 77 257 -96 226 65 150 -86 -20 372 215 171 92 -237 -61 22 -152
5119 -152 -37 -105 -149 64 -16 -193 6 -155 -229 68 75 9 -43 9 107 -47 -11 -168 189 178 -408 -113 174 -174
5143 -174 -119 -94 -18 -127 -120 -154 -234 -21 17 -153 -169 128 60 -154 -38 -63 96 -115 -93 418 -109 -67 195 2
5167 2 -93 76 -89 -63 178 186 -201 72 -164 69 -37 18 31 47 73 68 254 130 63 126 179 -64 123 177 50
5192 50 -27 124 25 171 115 -7 -11 154 -158 36 -110 -235 -131 -150 293 27 208 -70 -95 129 -209 -121 -161
5215 -161 -81 -109 -26 -166 78 2 -68 -158 -124 81 142 -149 90 -143 78 15 -112 50 67 35 -11 217 -132 -123 12
5240A2J06J95l16N2j44K54l10J50j05O7l36L64p6K4K09k69O0K95k03r6J13l01
5262b55J90K86n35J13L88r9j48R5L0p8o0o8J00NK28k07o7J8K5L8K3P9L0q9J07
5287A49J6k05K7j79M12j63J07l64j2ON32l89P7l14P96o9n82k9pJ23k27J02J57
5310c6l0K43n37M73m6J41l17n01M10N46k83m36N56j29J20Rl21M99pN3K97o80K44
5333B68j82O8l26j66J37j22J44P3q8L79K92p80lO44O2l25l02L24l5K94L5j39k16
5356C6O8M03p57M45n7n69M66o4K12lR8jn5j73r6LR5Nk14M20k09M4J19m01L31k52
5382a06L70l21n5J30K1k38o5r6N57n60R13q18k65N47j08l36j31k1P92N59q68l62
5404d61j61P91k07O3J73m24L83K47O0l52K48M3k58K27m66n9o60Q54J53L29o65
$$ plain form
5240 12 118 313 -3 49 -95 159 -151 -1 -106 -39 -375 -11 -87 -63 146 -123 -63 232 29 -67 46 -255
5262 -255 -65 221 -314 -201 187 88 -60 35 65 -13 -73 -141 -41 -36 192 -15 -82 -64 -39 -1 22 101 131 42 149
5287 149 165 -40 -13 -192 220 57 164 -200 -212 -206 326 -63 14 -300 496 427 -155 -184 -191 -68 -295 -193 -36
5310 -36 -66 177 -360 113 67 208 -109 -610 -200 346 63 -373 183 54 174 183 -138 361 354 407 704 24 268
5333 268 86 154 -172 -338 -201 -323 -179 -106 -194 185 477 -303 -306 338 400 75 -227 97 62 356 391 252 36
5356 36 104 507 -250 195 138 -431 35 -29 183 180 278 277 222 49 -47 -44 51 56 -158 262 53 97 216 -185 146 -106
5382 -106 264 -57 -112 18 39 -199 -264 -360 197 -363 550 -268 -533 14 -94 -430 -561 -582 210 769 -99 -461
5404 -461 -622 169 -38 25 198 -226 157 404 464 112 360 403 145 372 -94 -153 -813 41 194 523 -142
5425a42P54j023M48k0l05R8R85l52j062J490p40N8n70M22p2J11L18m00j51R8K34
5446A79k39J28j62q9J55J46J62j92j8j37p9k9L41k01m3j47M90l20K33m3K5l83
5468b23M84p5p6j12K29m20L03l64K68l97L66k7M4N4k5NP5j34K37j42p8r5q4K61
5492G4j45J29m3j01P4rp1R6P5K88p1q36Q38k55K05M26p53J79P12p40J31n41M38
5515A00j37O5K97j16J98m05j9K2K2l65K53J54r7R5l6L95m32M5Mr9K07j06l7K27
5539B35k62K4k31L43j31m6L4j89L53k76O2k65L24J75O1l33L43k99J79J16k38l55
5561c76O29j26l80O0K52k76j15M99k23q1k55M63l31l05M29J96m37L05j20L66q0
5582I4K34l14J25l41l76O69m41K23J54J18r3j96j79M22K03o55K72n07Q40o07J19
$$ plain form
5425 -142 612 -411 37 17 -288 -190 795 443 -619 871 131 189 -381 41 -31 80 398 -2 -153 -55 179
5446 179 -60 68 -94 -183 -28 118 280 88 70 -67 -146 -175 166 -35 -78 -225 265 -55 178 135 160 -223
5468 -223 261 186 110 -2 227 -193 110 -254 14 -383 -17 -44 0 54 29 34 109 -25 212 70 -8 -103 -187 74
5492 74 -71 58 15 -86 -12 -21 -92 4 79 367 296 -540 298 43 248 674 -79 100 812 72 203 -338 100
5515 100 -37 28 325 209 407 2 -17 5 27 -338 -85 69 -28 67 31 426 -6 39 43 -56 151 45 8 235
5539 235 -27 -3 -234 109 -22 -68 -34 -223 130 -146 -84 -349 -25 150 211 -122 221 -78 101 217 -21 -376
5561 -376 253 127 -253 -193 59 -217 -332 167 -56 -137 -392 71 -260 -565 -136 60 -377 -72 -192 174 94
5582 94 328 14 139 -202 -578 91 -350 -127 27 145 52 -144 -323 99 302 -353 -81 -588 252 -355 -236
5603b36L63k65L49l39N56j62k00k23m9j53M65m05J03j03R20p10N33j81k37nL78
5624C99m52K41j98p2J19k45L09J39k1L51o13L18j99m5l16M87Q1m01L93k59L63
5645C79q94N81j51j46M08Q4j26o16N25o1J60K1k38L10o92M82K12l13K10o00N26
5666F1k34l86M30j76J35P05m94P5K70m52K75k09n19J92R5M99o01K46J3j18O9o1
5688a85J34m58M29K80j68J9O0K5j21k18N43J2j53l98J53J03n54Q60m37K88l27
5709a13Q6j38K07j6j22l34P98j28l37L94k7m77J92j00K18J09j40J01j95r0j22
5730b34L92o8kLj51j17J50n5P7j49K64j62J27K20l55R9j97K91j06k86M90K10l01
5753A40p8q5r4N94m92K8J34k72lL7J74k69K04JL2n13P77k56j22K63p7k19n6J77
$$ plain form
5603 -236 127 -138 211 -128 428 266 66 -157 -206 -359 106 -299 -196 -299 621 -89 444 263 26 21 399
5624 399 -53 188 -10 -82 37 -208 101 240 219 570 -43 275 76 31 -285 202 283 -118 275 16 379
5645 379 -515 66 -85 -231 177 261 135 -481 44 -17 143 164 -74 236 -456 26 238 -75 135 -465 61
5666 61 -173 -559 -129 -305 -170 535 41 116 386 -66 209 0 -519 -327 -232 267 -334 -88 -75 -193 -124 -185
5688 -185 -51 -509 -80 200 32 51 111 136 15 -203 340 352 199 -199 -46 57 -497 363 -74 214 -113
5709 -113 -27 -165 42 26 -96 -430 368 240 -97 297 270 -207 -15 -115 103 212 72 173 -22 -112 -234
5730 -234 158 90 88 91 -60 -177 -27 -82 -5 -154 110 -52 75 295 -60 39 -158 133 27 -259 231 441 140
5753 140 62 -23 -117 477 -15 13 147 -125 -128 -91 83 -186 18 19 51 -462 315 59 -63 200 123 -96 -152 25
5777B5J12j07J5k32K39J49j50R0j47p6K6p7L7K18j42J92k61R0J6o6M0O4J04j14
5801D5j34K3P5j7p1J01j06K51k40J32k12K92PK2k20P9p1J83j57K80l24K11j78
5824b9K8O5j27L97l43K20j98n5J16r2l3J03Pol07K02Q2K0p9K8M9l07L96j85j60
5849b08J25J17J28k34M5Q6Q3r5j50j4J79j62nJ47m1N0j38j8K52o3J02l14MK00
5873G6m0k90K29j13J04J62k83J45j7j82L14K10m49n0K45Q5l04J46j61J49J8n5
5895f1K32j86J97m8q4L3R8o1n6j12K61k33j75J32oP8kK3j6r0o1M53q0k19j02K47
5921A62l20K34k75K54n5j2k7k02K28j79M26k04o6J40p5M3j89K68j86p6K60m95
5943c46J49J95j07LJ28j3J07p5j45K03q4M6J11r4M6p3n5k58K06o8J07J09j21M
$$ plain form
5777 25 137 30 45 -187 52 201 51 141 -6 -82 -56 -133 -96 122 -20 172 -89 1 17 -49 -9 55 159 45
5801 45 -89 -66 9 -8 -79 22 -84 167 -73 59 -153 139 146 168 -52 27 -44 139 -18 262 -62 149 -29
5824 -29 -1 64 -63 334 -9 211 13 -42 74 -18 -51 52 59 53 -254 -52 30 50 -29 -1 48 -259 137 -48 -208
5849 -208 -83 34 162 -72 -27 59 142 47 -103 -117 62 -100 -105 42 1 51 -87 -105 147 84 186 -128 -124 76
5873 76 36 -254 -25 -138 -34 128 -155 -10 -27 -209 105 315 -134 -184 61 146 -158 -12 -173 -24 -6 -61
5895 -61 171 -15 182 134 50 83 181 120 64 -48 213 -20 -195 -63 -69 9 7 30 14 -76 -137 316 236 17 -85 162
5921 162 -158 76 -199 55 0 -12 -39 -241 -13 -192 234 30 -36 104 29 72 -117 151 -35 -111 149 -346
5943 -346 -197 -2 -109 -106 22 9 116 41 -104 99 15 61 172 78 124 51 -4 -262 -56 -124 -17 92 -29 -25
5967b5m0n6K36K63J1k67J83j79k27J33M29o81N83k44j2k9j9q8m4j10J1J69j36
5990a39L68k77j1j8m6ML43k17K26l53K87k14m4J23j39J52r3j74K79O5k65J87l15
6013b71N50k24l61J83M1J41K32n04K68r0j45O9M1j5P6L6%J00k43J07k09K64o7
6036b1j7q1L39m11J74L03k44K13l13P6k9j31R2J35j19N0j29k2J28J92j91m4J48
6059I8j0j60j70K93j29K39k00L65q84L67Q99p15j32M90o75K14M25l37k08K33l51
6080c48J98j59p8P5J32j56J122o16j74K39m07r7K74j99L23k22J70R3k21J58K6
6101A33j08r1K20M9j80j41N0J96o3k0j30J86n0r5m9rK5p4K23P3k01J9Q6k28J02
6126g7o8L57k12K34l42K1J45n7j36L44l40j25K91r9J49j14J76k19j8J32j03J34
$$ plain form
5967 -25 -65 -121 115 378 389 122 305 126 -101 32 461 -220 363 119 107 78 59 -29 -73 -183 -172 -3 -139
5990 -139 229 -48 -59 -77 -123 -119 224 7 233 -120 167 -47 -91 32 -107 45 -48 -222 57 122 -143 44 -271
6013 -271 279 55 -306 -123 -82 59 291 -213 55 -35 -180 -111 -70 -85 -9 27 27 127 -116 -9 -218 46 -21
6036 -21 -38 -119 220 -191 -17 286 42 255 -58 18 -11 -142 -50 85 -34 16 -113 -135 -7 185 -6 -50 98
6059 98 88 -72 -242 51 -78 161 -39 326 -558 -191 708 -7 -139 351 -324 -110 315 -22 -230 3 -348
6080 -348 -150 -309 -387 -312 -180 -336 786 170 -4 235 -172 -269 5 -194 129 -93 77 170 -51 107 133
6101 133 25 -66 154 203 23 -118 -68 128 65 45 -85 101 51 -44 -93 -102 -77 -151 72 145 -56 -37 49 -179 -77
6126 -77 -145 212 0 234 -108 -87 58 1 -135 209 -131 -256 35 -64 85 -29 147 -72 -90 42 -61 73
6148G3j43K34j1j65K8J77k75K13j3o7j54J35J29j85LK37k80o3J55k38L44l30K13
6171A7k62K28N7k88M9L54j74L7K6m0Kk4j70L16Jl9j17j9J39k12N0J47k15K41N9
6196A63k22j10J36j35K56k66M05l55L37k6n6j56q0J56Q3j25N5l40K71Jl7l8P9
6219dJ28j43j30L13k62J21R0k78K52l42L10N2O0j91n3J1j37L36j66j58J75K66
6241B50n22K21J49n8M1K6k21L6J14k06L46k12j4L2J89m8J03l38l87N94j49j88
6263b42M44j00k74L36q5M2L7k13K56q8k15NJ1J01N4K5k29K08P9L5k32r7L41r4
6287A05pl06N8L63j40p7k46L8M33j70j62j43J94J44r6n8L53k06j91L1k16K72o1
6310h8J01j26J65J9k23p7J77n6O4j66L27j00J5m6j20R7l15K06L7P0K1O0k18J06
$$ plain form
6148 73 -70 164 153 -12 16 193 -82 131 118 51 -103 32 161 -24 -21 216 -64 -127 28 -210 134 -196 17
6171 17 -245 -17 40 -248 -199 155 -19 18 44 4 6 -18 -188 128 129 90 -27 -46 93 -119 -69 78 -137 104 163
6196 163 -59 -169 -33 -168 88 -178 227 -128 209 183 127 -29 -109 47 130 5 60 -280 -9 -8 -45 -83 -4
6219 -4 124 -19 -149 164 -98 23 113 -165 87 -255 55 107 167 -24 -77 -66 -203 133 -33 -191 -16 250
6241 250 -272 -51 98 40 81 107 -114 -78 36 -170 176 -36 -50 -18 171 123 226 -112 -499 95 -54 -242
6263 -242 202 102 -172 164 79 121 158 -55 201 113 -102 -97 -86 15 69 94 -135 73 152 187 -45 -142 199 105
6287 105 98 -208 -150 213 73 -4 -250 -212 221 51 -111 -254 -60 84 -12 -70 283 77 -114 -83 -299 -27 -88
6310 -88 13 -113 52 71 -152 -229 -52 -108 -44 -210 117 17 32 -14 -134 -37 -352 -146 -109 -39 -18 42 -176 -70
6334g0L8r7lK40k14L92l73J77l0l5L2j10K13p0l51K05J24j86N7J67Mj26n9j07
6358a82K31J43j1r0j93L63k30J49J7j64k69K45j30m4Q3J94O8k37j05L83k51J04
6380G4j78L5j22M35k13j84j90M48kj81j9J57L6k03K09K06m12O0L72n02K14oJ37
6403A71n01N10k95J58J21r9j09q6J83R9Jq2l56K75p4K37m38K41J2M4R6p2l3P9
6427H2P8r4l18Q2L55j87J87r2N7o1k16K15k4m2nK28k96J84j56K08q4j67K16k83
6451a33J87K5n2N8j7N1o9k48J40J80k2mL31k33k05J3j25P0p7J70Q0j0m2j8j85
6476a35L84l34j37K85j3k3O5j3J74k17J22pq4j98J97n6j64JJ36J83m45L50m8J50
6500A73j01p5K0j35L05k51K3o9K01j39J8Q3J10k10Q3j30K84o8j74P7j57J55Nj41
$$ plain form
6334 -70 -32 -129 -132 108 -106 286 -87 90 60 25 57 -53 160 90 -261 -56 68 -118 -61 106 110 -16 -75 -182
6358 -182 49 192 181 91 -102 261 31 180 197 33 -236 9 -121 -165 -82 112 180 -57 -162 221 -30 74
6380 74 -104 -69 -191 244 31 -153 -343 105 103 -78 -97 60 96 -107 102 308 -104 -44 328 -174 40 34 171
6403 171 -330 180 -115 43 164 65 -44 -130 53 152 153 71 -285 -10 -84 153 -285 -44 -32 12 108 36 3 82
6427 82 160 66 -252 -170 185 -2 185 93 150 89 -127 88 64 22 17 245 -51 133 -23 185 101 -66 150 -133
6451 -133 54 79 27 85 68 119 50 -198 -58 122 100 96 427 194 -11 2 -123 -53 -130 40 120 110 68 50 -135
6476 -135 249 -85 -222 63 50 27 92 79 253 36 158 151 67 -131 66 10 -154 -153 -17 166 -279 71 23 173
6500 173 72 -3 17 -118 187 -64 -41 -110 91 -48 -30 53 163 -47 36 -94 190 122 -52 25 -132 23 28 -113
6524a13J22J4J89k03M5j02j3O9J4r2M02l14Q4J74m6L6l35J12j61J27Q3l3j59J23
6548B3j89Q9N0n2Q0n4j47K95k19o4L8L44k0n6j52J13k45J21j31J65K10m07M33
6571B25k15j91m8K13N3O5l02Q2N5l0j7k8K12k15lK18n8j7M6R7l17M43k15j69K79
6596A63j56J31l96J64P0K5j21k5K79k6j18p3J94p7j91n7J87M9j21K6J10j25n9
6619a47J21k5j21K22k31K08j2R0p4L14m33K27q8j46M50m15J71k9J51l11j85K12
6641e1J86j65L6Q0j42J23Q5Kj33j54k9Jn1O17k64l47o8L69K7j46N38l62p6l11
6665b35M91l31K75k55j9m6q3K52p6p3j53M02l8Ql23N6j49R0J87K30k02r1J17o1
6689b7K3K8m0J13l32L48m21n3M66k57L99J3l04N2M4k65K05j36K34j4P5j07n5O0
$$ plain form
6524 -113 9 23 212 9 54 -48 -61 8 22 -70 332 18 102 276 230 266 -69 43 -118 9 92 59 -100 23
6548 23 -166 -77 -27 -79 1 -53 -200 95 -124 -188 -150 194 174 118 -34 79 -166 -45 -176 -11 199 -208 225
6571 225 10 -181 -229 -16 37 102 -200 -118 -63 -93 -110 -138 74 -141 -144 74 16 -1 45 142 -175 268 53 -116 163
6596 163 7 138 -258 -94 -24 1 -120 -145 134 108 -10 -83 111 34 -157 -214 -27 22 -99 -73 37 -88 -147
6619 -147 -26 -51 -172 50 -181 27 15 105 31 345 -88 139 51 -95 355 -60 111 82 233 -78 -263 -51
6641 -51 135 -30 6 86 -56 67 152 154 21 -133 -162 -161 -212 405 141 -206 -274 95 122 -24 514 152 76 -235
6665 -235 256 -75 200 -55 -74 -120 -203 49 -27 -100 -253 149 111 119 -204 -148 -297 -207 -20 210 8 -83 34 -27
6689 -27 -4 24 -16 97 -235 113 -308 -361 105 -152 247 260 -44 8 52 -213 -8 -144 90 76 151 44 -11 49
6713D9k3J79M9k42J9j5k02L15J86k24j47k21M27M2j90M7R1k62N02j95j35l1j91
6736a72jK85j4l11q6Q0L36q3j47K49k2l2P0k42L8m9K30k31j6l8M22j03J2k96j8
6761a39l3K59N5q0j06j05l8O4K08m40L34n4J4O8J56k81N8Q9J29l14K40m37N77
6784B24j54K71o04L52j03j52J29l3J1R5p7N1l6M7O8j12J00q1n7J57j10k76M53
6807A63j51J34j85j72N5J39k9j42L09k66K12q4K36j94jR3j78J20P1j63n7K00O9
6830A79k04J7l10K11q6O1N2J49PJ39j43j29P1j48J07J85j00P4k22n9K67mj73J97
6854A38l43k2J03L32j76l35J14K8J7J98p2j2l6p0j4L08k45R6P4q2K20n48O03l27
6878e1P9J81r3J07m45J29L8J24JK7j04P3P8l32K20K22r7rl71L71k54Q5j34Q2O9
$$ plain form
6713 49 26 205 254 12 31 16 -186 129 315 91 -56 -277 150 192 2 49 140 -122 380 185 50 19 -172
6736 -172 -173 112 98 -213 -299 -219 117 34 -113 136 114 82 152 -90 -52 -101 129 -102 -118 -156 266 163 175 -121 -139
6761 -139 -172 87 142 62 -44 -149 -187 -123 85 -355 -21 -75 -61 7 163 -118 -60 29 158 -156 84 -353 224
6784 224 70 341 -263 89 -14 -166 -37 -70 -59 36 -41 10 -26 21 89 -23 77 -4 -61 96 -14 -290 163
6807 163 12 146 -39 -211 -156 -17 -46 -188 121 -145 67 -17 219 25 24 117 -61 59 130 -33 -90 110 179
6830 179 -25 -8 -318 -107 -193 -132 -80 69 76 215 72 -57 14 -134 -27 158 58 132 -90 -149 118 114 -59 138
6854 138 -205 -227 -124 208 32 -303 -189 -161 -144 54 -18 -30 -66 -136 -150 158 -87 9 83 1 221 -327 276 -51
6878 -51 28 209 116 223 -222 -93 -55 69 70 97 -7 66 144 -188 32 254 157 148 -223 148 -106 -21 -155 -73 -4
6903dj48J87p9R5j5L25j08p0J16l17J96n95K18L49R2m08l83N62j29k48n7P40R6
6926D15p41Q03m51l02k9N60p9L6k52j00q8J74Lqm5O4k2J66k41J38k19L03j62r7
6950a74J26J72Nk40K27m00L86j46K7m0K63j94q3J88j89l2M6r6J23Q3q4j07L46
6973B07p9o4j31lN0r1L73k32L8R4k83J72O8j10k7M5J2J81l09L3L2R8K75l22k10
6998a83K18Q7p1J88j94K10j62J1J36J65m11J0M3j64K46j78M1m7j78K54m8P1j04
7021f0n0J74N8j23J02l6J20k09L9k6J38pl2l40K00m4o5j11L43q1o8p6J24p9Q3
7046b6J27p4q0K26j69j22J89Ln6k3R5K36l53J56j63j9J33PQ1J19k44Lr5J43j04
7071a0l9p0j60L22j23J11L8j21J86n4j05J2K81l87P5Ol09K63K9J45J01k41J91
$$ plain form
6903 -4 -152 35 -44 51 36 361 253 183 299 -18 178 -417 -199 150 242 -166 -549 13 -116 -364 -421 319 415
6926 415 -326 477 26 -276 -305 255 176 212 -40 -140 -228 -54 -51 -59 -104 -40 -62 104 -137 1 -218 85 -77 -174
6950 -174 -48 124 129 -111 116 -284 102 -44 -17 -57 206 12 -71 117 -72 -104 -58 -154 -31 52 -32 -139 207
6973 207 128 64 -67 -70 -20 -111 262 30 68 162 -121 51 119 9 -18 27 39 220 -89 -56 -24 74 349 27 -183
6998 -183 35 122 51 239 45 255 93 104 240 405 -6 4 47 -117 129 -49 -8 -55 -233 21 -27 44 -60
7021 -60 -110 64 122 -1 101 65 185 -24 15 -11 127 120 88 -252 -52 -96 -161 -272 71 -10 -78 -154 -30 -109 -26
7046 -26 101 27 -53 173 4 -118 71 74 18 -5 90 326 -27 129 -34 -53 80 87 168 287 43 46 -49 94 -10
7071 -10 -49 -119 -279 43 -80 31 69 -52 134 80 -25 -13 268 -119 -44 -38 -347 -84 -55 90 191 -50 141
7094A41Q0l79K73k00j01J48J77J8j00K77k55m6R7j50R9r7J07m40N77k14p3K9K2
7117a0k7j93K33j68J33L14l52j58K48m5n3qK4J5O0J23k86L02j72J60j31n7J11
7140F3J73k68P6j5j7k97J94J03J86j99n6K61k96J80k98J57%l1L1N6k6M6ok80L24
7165F1p5Q0J6j91l6J79o5K25q0j14k7N4l0J7K37j99J94l84J14J26m5l7J1k04J83
7190A0O2k81M18j6k35j07L28k30K49j57j03pJ47kM5J68n23K46Lj61L23K8j86M5
7214F4L8p9j4J49l66M23j99j54j01J7J59K50k27%k48K83q6J19Q7j28J20k66n0
7237b09L74l96L53pJ02J8k49k6Q3j46J32o6q5L26k08J46o3p9O7m1L7R9j86r0L84
7262B70j74k34J52J15n3n6k9j89M39K1l42L4J99j94M3J05j39M9K6K5k7J86k77
$$ plain form
7094 141 221 -158 115 -85 -186 -38 139 157 57 334 79 33 130 -20 79 -18 89 -351 226 12 -61 -32 -10
7117 -10 -37 -230 3 -165 -32 282 -70 -228 20 -25 -78 -86 -62 -47 13 136 -150 152 -20 140 9 -48 63
7140 63 236 -32 44 29 12 -285 -91 12 198 -1 -57 204 -92 88 -210 -53 -53 -84 -53 3 -23 23 17 -263 61
7165 61 -14 66 82 -109 -145 34 -31 194 114 0 -27 27 -3 14 251 52 246 -138 -24 102 57 20 31 -173 10
7190 10 72 -209 209 193 -42 -149 179 -51 198 41 -62 -69 78 76 121 289 -234 12 15 -146 177 205 19 64
7214 64 102 23 9 158 -208 215 16 -138 -239 -222 -63 187 -40 -40 -288 -5 -91 28 115 -13 107 -159 -209
7237 -209 165 -231 122 115 217 235 -14 -40 43 -103 29 -37 -122 204 -4 142 79 0 67 26 63 162 -24 -114 270
7262 270 96 -138 14 129 76 20 -9 -198 241 262 -80 -46 153 -41 2 107 -32 17 43 68 41 227 -50
7285e0K77K01m70J34j1j35p1K63n9N1j4j93o1K69k75J10J72k01jj56N7J95k41
7308b09R8J76l37J10L2J63K11k54K32o0l9N4l32L42Pl86j03L31k28K13J56l80
7330b03L07K3j96L53p8j1m08K42K17l18K64k56K9o5K04k74L67l23J57J76j12Q1
7352A76k90p5Q8K21j2l26J96J8J13p4m6L2K6j4j6k1Q4J35n1j04O3k78J25j0J24
7377H4r6j52J16J31j12J90Jl61L76l06j46K2J96J74P8j54j9n5nR7LJ12l57J54
7401b9K33m15J35n6j01J21j32K87p2J7r6j01N5J4K1Q0k84L43l56K13j26L45o3
7424C3J0R4J43p7n4k7q4P7j76J30J14m3pq2k32J60k99K30K8p9rK12R0m3k63L02
7450A48k20p5P1J13R1q5k03L03J91l86J46l77J05K32QM2j04j87O5J4j01J84j37
$$ plain form
7285 -50 227 428 -42 92 81 -54 -125 138 79 130 116 -77 -138 131 -144 -34 138 -63 -64 -220 -163 32 -209
7308 -209 -111 65 -272 -162 -130 33 244 -10 222 162 123 177 -155 187 194 -192 -295 36 -192 21 177 -203
7330 -203 104 127 -69 284 206 195 -213 29 246 -72 192 -64 -35 -100 104 -170 197 -126 31 207 95 176
7352 176 -114 -189 -101 120 108 -218 -22 -4 109 35 -11 21 47 33 17 -4 80 215 164 60 123 -155 -30 -40 84
7377 84 -12 -164 -48 83 -29 161 162 -199 177 -129 -275 -253 -57 117 195 41 22 -33 -38 59 62 174 -183 -29
7401 -29 204 -211 -76 -132 -233 -112 -244 43 -29 -12 -108 -209 -154 -140 -119 -39 -323 20 -336 -123 -249 96 33
7424 33 43 137 280 203 149 122 38 115 -61 69 183 140 133 51 -181 -21 -320 -90 -62 -141 -150 62 152 109 -154 148
7450 148 -72 -147 -76 37 128 43 -160 143 334 -52 94 -283 -178 54 62 104 0 -187 -122 -108 -209 -25 -162
7473a62L30k49j33L68j64K34l03O3p7M6K01j9j62L2l03K32J3L4o2M7q6K68j32
7496A6p3j04P0J52k17J66K6k21K37J27m23K53L4J42p6M1k89L58j55l80L52J12
7518A48k10J30j47L15p5j34LJ07k5j18Q9Q3l3k19N5K31j11k71K51j61K36j13l9
7541hP2m1M9l8j39J06J56k00qK47j30j10m0J45j12j31O6k09J52J61K6J17k21J07
7565A7Pp5K52m36K48o8k24L29j56K26O2r8J3k21K25K7p6p6M6j6o5LNj48L34o9
7591F6P6j42l7L1o5j46K30pL7p2k2j4K21j81j07J73mK72m2l60O9k7J96l68M4L7
7617a42j82K81L7K4j23r2L65J5j52k79L82j37K54l04K77j10J5l04O0K15k54p9
7639b33K20J55k80K39n6j02k05J41n1P9j52N26k13q8l1Q4J18m96K25K02l1k43
$$ plain form
7473 -162 168 -81 -214 154 -10 224 -79 -16 -93 -47 154 135 -27 5 -298 -66 -53 -19 -81 -34 -120 148 16
7496 16 -57 -161 -91 61 -156 10 36 -185 52 179 -244 9 43 185 109 150 -139 219 64 -316 36 148
7518 148 -62 68 -79 236 161 27 30 137 112 -6 83 166 133 -86 -31 200 89 -182 69 -92 144 31 -8
7541 -8 64 23 72 34 -105 1 157 -43 -51 196 66 -44 -84 61 -51 -182 -116 -325 -173 -12 14 131 -90 17
7565 17 24 -51 201 -235 13 -55 -279 50 -106 120 182 84 97 -124 101 128 52 -24 22 6 -59 -56 -51 -199 135 66
7591 66 142 0 -37 -6 -71 -217 13 6 43 -29 -51 -65 156 -25 -132 41 37 309 267 -93 -24 -51 145 -223 -179 -142
7617 -142 -324 -43 -6 18 -105 -197 168 183 31 -248 134 -3 251 -53 224 114 129 -175 -115 100 -154 -233
7639 -233 -13 142 -138 101 45 -57 -262 -121 -172 -93 -245 281 68 -20 -51 33 151 -345 -120 82 51 -192
7661a92K57j39L02j76M3k60J42K04j3k01j7m2M3M7O3P4l41J54j64K01K54k14p2
7684d7jJ76j28L7J42j04p6K33j31L9j68j40j35L04j43O6J79j84L9q0J94k05K92
7707A59J8j91j78L37k3k45J91j40J67n8K1K60k0j32k8k58J56O6l04M49n22K38
7729c7J20j35j88J49K61m85N27n63J61L97l61L3J49j63k36J16L57j21l5l64M47
7750B9j18PJ21j50J2j45L24rL8j48j91K72l25K30N7J0p9q4J41j6r0J84j8L3N0
7775A35j10l9m9P1k62L99l71O2J12j02k24L80j35J82p0j00J08K43l21K61j99p9
7797a08j23K87J03m67K4K34K09k13K60l31J97k04J51j43j31M50j40j24J64L7j48
7818a6O0J37k84L41l76l0K37l47K88j31J13M2j12j92M57K5j09l62J11L90l18p1
$$ plain form
7661 -192 65 -74 228 52 95 -165 -23 181 168 -33 -50 -92 -49 -2 61 135 -206 -52 -216 -15 239 25 -47
7684 -47 -48 128 0 37 179 75 -1 232 101 140 -28 -168 -303 1 -142 -76 103 -81 -42 -122 72 -133 159
7707 159 177 -14 -192 145 122 -123 68 -72 95 37 58 318 298 166 138 -120 36 102 -202 247 -275 -37
7729 -37 83 -52 -240 -91 170 -315 212 -351 -190 207 -154 -121 28 -135 -371 -255 102 -19 -54 -418 29
7750 29 -89 -82 39 -111 -99 -244 80 71 109 -39 -230 42 -283 -53 4 14 -65 -149 -8 -24 -114 70 52 85 135
7775 135 25 -14 -63 8 -254 145 -226 -164 -52 -154 -378 2 -133 49 -21 -121 -13 230 -91 170 -29 -108
7797 -108 -231 56 159 -308 -284 -50 159 -54 206 -125 72 -132 19 -124 -255 195 55 -69 95 132 -16
7818 -16 44 181 -103 238 -138 -168 69 -278 10 -121 -8 34 -78 -270 187 212 103 -259 -148 242 -76 -147
7840a47J17j35M50l28M0O3p5n0K28k47k50M47j36J07k35L23k89J27j9p0K00k0
7862A01l06K68k76K29q2J30q0K8L95n09m4M5K65N4mm9j44m14J85K12o1k6L27k27
7886A7K64o57K27J42r1k25q3k40Q64k31O83j114l16R84o4m3r4oK6N9j13j69L48
7909A68m69J76J55L31j4k00j50J25R0k03O4m29R81r92J190m33n64R94r58l20M52
7930fj9K09p48P67P7m12J8k20L44J90k20o42P34l02j7M73K02n94k7K0L53j37K13
7953B56k88P5q6j37J60K12j32n46O14m6K02o21R43l15n70J30M0o1l11O33j56m96
7975e00O25o28N30k3k68K50J09J94J82l84M99j157J45J47N00j14j5L61p48J79
7995a16J06j2k22K4K46j49K76K2k94J02M6q9J1J41p8L0R2o8P5l63M19k28m8Q8
$$ plain form
7840 -147 -30 -165 285 -43 -3 60 -15 -65 163 -84 -334 113 -23 84 -151 172 -117 10 -9 -79 121 101
7862 101 -205 63 -213 16 -66 64 -16 12 407 -102 -146 -101 164 218 214 165 21 -393 -208 4 -57 -83 244 17
7886 17 281 -376 -149 -7 -98 -323 -406 -646 218 -13 670 -444 -760 224 160 117 23 17 43 102 -11 -180 168
7909 168 -301 -125 30 361 347 147 -3 122 212 9 73 -356 625 -367 823 390 -174 820 -138 -458 -6
7930 -6 -25 184 -564 203 280 -132 -114 -334 10 200 -20 -662 72 -230 -247 226 428 -166 -193 -173 180 43 256
7953 256 -32 43 -43 -180 -20 192 60 -486 128 82 284 -337 606 291 -279 -149 -109 -170 -481 152 -4 -500
7975 -500 125 -503 27 4 -264 -14 95 289 471 87 586 -571 -426 -279 221 107 92 453 -295 -116
7995 -116 -10 -22 -244 -220 26 -123 153 175 -119 -17 29 -60 -49 92 14 44 136 68 143 -220 199 -29 -77 11
8019A1l8L6j51L67j77l1r6O0J36r0Qm0Q4O0q6K1j76M6k63L36p1rj45K29J44q6
8045G9nl5k72R3J35n5J84k42N1j07j2M23l37j3k2L8OQ6J26m49N31j90l7J69k74
8070a29J3K30J44j53J7p57Q97m29n50O22j45J90j85K37k91L9k12L42n5L82l69
8091a62J1P5K09l07L58l37K18M0l15L4l94M22K34l05N76j24j63l59N23n0n0l17
8113a83N07J47j54Q8o95K06kK42k60J85l63K13M90n50K38l6K57l18J29K02o92
8134c49Q74q33M33j44%J88k08N3J75l87p7M05l3j51l63P39k72K52k02k92M85l9
8156B54k4l8mn5K00q6L79q66O39j28J11l56L17m96M04J57j46Q52j572K10P88k82
8178B58n51Q79O8r44J96j30j49J34Q20j171J89J433o40
$$ plain form
8019 11 -27 9 -142 225 48 17 -79 -19 117 27 35 -5 79 139 53 74 -102 -56 -319 17 -54 -63 -208 21 165 79
8045 79 74 39 -233 -140 -5 -60 124 -118 -67 -174 -186 237 -100 -113 -135 -97 -91 -5 121 -328 203 13 -24 145 -129
8070 -129 -116 114 258 105 122 -635 262 -167 -717 -95 -240 -50 -235 2 -289 -250 -462 -120 -175 207 -162
8091 -162 -151 -76 133 -174 184 -153 65 105 -210 -176 -570 -148 86 -219 357 233 70 -289 234 184 134 -183
8113 -183 324 471 317 405 -290 -84 -86 156 -104 81 -282 -69 421 -129 109 73 330 12 141 343 -349
8134 -349 525 -308 125 -19 -19 169 -39 14 189 -198 -275 130 97 -54 -417 322 50 302 100 -192 293 254
8156 254 230 192 188 133 333 247 626 -240 399 271 382 26 343 -153 251 408 262 1114 -458 -248 540 258
8178 258 -293 586 654 -290 -94 -224 -373 -239 581 -590 -401 1032 392
8191C92
$$ Imaginary data points
##PAGE= N=2
##DATA TABLE= (X++(I..I)), XYDATA
0@%%%%%%%%%%%%qJ6j6J6k2L0l2M0m8N6p2Q6j00J18j36J55j79K08k39K71l09L52
34A87l98M49n06N68o35P10p92Q81r78J085j201J326j465J616j780J962k162K382
52A249k624K893l196L533l913M347m845N427o116O946p970R271j0987J3365j6907
67i527K2818l5069J07257j94699p3321L18338r9009j87629J22961J36318j18545
78a0107j3835Q2108l5015p1592N6837K2464n2956r51O3043j7728n4781J8849M6217
91C2553l7082m1797K1806J9117j6775K1351L5623n147q853Q707m4944n5069L6254
104c4256M9045m1834j6249P0651J6972n9915m906K9548k1150j0893K9976O77j4309
117f643P673q091j7579J8711J8651k0192k2192P770J9240P398k145Q601J2598
$$ plain form
0 0 0 0 0 0 0 0 0 0 0 0 0 0 -8 8 -8 8 -14 16 -16 24 -24 32 -40 46 -54 64 -72 83 -96 112 -127 144 -165 187
34 187 -211 238 -268 300 -335 375 -417 464 -514 571 -630 696 -769 847 -933 1029 -1133 1249
52 1249 -1375 1518 -1678 1855 -2058 2289 -2556 2871 -3245 3701 -4269 5002 -5985 7380 -9527
67 -9527 13291 -21778 85479 -109220 -182541 135797 36788 -150841 -27880 108438 -10107
78 -10107 -23942 58166 23151 -48441 8396 30860 -22096 -23047 39996 22268 -32513 -13664 32553
91 32553 -4529 -46326 -24520 -5403 -22178 -827 34796 29649 20796 29503 -15441 -70510 -34256
104 -34256 14789 -27045 -43294 27357 44329 -15586 -20492 9056 -12094 -22987 6989 7666 -6643
117 -6643 1030 -7061 -24640 -5929 12722 -7470 -29662 -21892 -2652 4746 2601 11202 23800
130B3800j2157k2610P04K999k0562p137L7616L0335k3166k6494K0153J1700l0645
143a5464J171L7695j3695l3946K7843J9450m2313m687N1873k935m6376P583K4133
156A0332j9239m354L1345m011k0982K5538J2492n1167k2155M2737J3460k2633
168h637J3503J7414k3666p472K0978j0153k1468J9761J7422k7404j0175L4637
180A4740N853l2773N635L2013j6619l5857R060J7879n212P612J6244q002o358
193D215M652j9260j7504K3440K1434j3181n769J4286k049j5703k812r92k75J6048
207F530O023j8373M39K6259k027k6121O301J7977j8139j8585J1812O531N27J8268
221A7422M769k4175k198J9974j6047k4657K8760L0033k6631j6363K6823n494l8285
$$ plain form
130 23800 11643 -10967 -10263 -7264 -27826 -34963 2653 32988 9822 -16672 3481 15181 -15464
143 -15464 -14293 23402 9707 -24239 3604 23054 -19259 -23946 27927 24992 -21384 -13801 10332
156 10332 -8907 -13261 18084 14073 -6909 18629 31121 -20046 -42201 536 13996 -8637
168 -8637 4866 22280 -1386 -8858 12120 1967 -19501 260 17682 -9722 -19897 14740
180 14740 20593 -12180 -6545 25468 8849 -27008 -17948 -69 -5281 2331 18575 10573 4215
193 4215 8867 -10393 -27897 -4457 16977 3796 -1973 12313 10264 -5439 -8251 -9243 -9518 6530
207 6530 12553 -5820 -5381 20878 18851 -7270 -969 17008 -1131 -19716 -7904 -1373 -846 17422
221 17422 22191 -1984 -4182 15792 -255 -24912 3848 33881 7250 -9113 17710 12216 -26069
234b6069J0021L2189j4658j0531L0452j216l2570J3776K6430k7067k1277L1575
246A1055P342l8205j499L4295l459j9024J5461P972k0782J607J7304j2789r475
259a0197K6238K954l7378k949K7026j1776k0465K5548K1495k0928r515J8569o358
272B264j8740J5118J3741j8673p245J7924q139k4787J2109K5522r358j4490J7071
285B317J1796j7436q782J3422L835j2874k898N944o398n018J1643Q999p449k092
299d991J1810k187j6961J132J8875J241j3627L329P968j3478j4691J0695J2190
312A305n223L713J6128m393j4370N921M903j5433r97J8046o817j9421J5052J7423
326A5837j7762q849K2699J282j9654N566J2910j4268m25K2748p617k5534R382
$$ plain form
234 -26069 -16048 16141 1483 -9048 21404 20188 -12382 1394 27824 757 -20520 11055
246 11055 18397 -19808 -21307 12988 9529 -9495 5966 13938 -6844 -5237 12067 -722 -10197
259 -10197 16041 18995 -18383 -21332 5694 -6082 -26547 -999 20496 -432 -9947 8622 2264
272 2264 -16476 -1358 12383 -6290 -13535 4389 -3750 -28537 -16428 9094 -264 -14754 2317
285 2317 14113 -3323 -12105 1317 5152 -7722 -10620 -4676 -11074 -16092 -4449 4550 -2899 -4991
299 -4991 6819 4632 -12329 -11197 7678 8919 -4708 -1379 6589 -6889 -21580 -10885 1305
312 1305 -3918 -205 15923 11530 -2840 3081 7984 -7449 -8446 9600 2783 -16638 -1586 15837
326 15837 -1925 -10774 11925 13207 -6447 -881 12029 -2239 -2664 20084 12467 -13067 -3685
339c685J2769k0391l374K5114L816j3794R240P589j9275p673J7522k149j6386
352a0677J0659J3413j5337r771J7992L822j8139N246J9704j1357j8895J4198J1580
365A2438j4906J43J2832j3101j3084J8624N604k1929O677K5589j0318j8320J2610
378B859O014j7309r4J6099m175q244O725k000q656Q914J0414r719n454Q072P03
393D149q103m45L487J399L939Q81o702q19O115n675p336R844R833r823n940Q988
409C792J676j2159K237J2780m266r268J943N530j915K843N087j0860q094J3219
423B545N712j6769l852J7423M130o918K441j91j3473j342J1876p84o364N768L344
438C546o506J880L989q093m366J0127L106p971J694N822k714m254m17r06j225
$$ plain form
339 -3685 9084 -11307 -14681 10433 14249 455 9695 17284 -1991 -9664 7858 5709 -10677
352 -10677 -18 13395 -1942 -11713 6279 10101 -8038 -2792 16912 5555 -13340 858 12438
365 12438 -2468 -2325 10507 -2594 -15678 2946 8550 -13379 -6702 18887 8569 -9751 2859
378 2859 8873 -8436 -8530 7569 3394 -4850 1875 -125 -8781 133 10547 828 -4626 3446 4149
393 4149 -3954 -4399 -912 487 4426 5307 -1395 -2214 3901 -1774 -9110 734 10567 744 -5196 3792
409 3792 5468 -6691 -4454 8326 4060 -5208 -3265 2265 350 3193 8280 -2580 -10674 2545
423 2545 8257 -8512 -12364 5059 9189 2271 4712 4521 -8952 -10294 1582 798 -5566 202 3546
438 3546 -2960 -1080 2909 -5184 -9550 577 3683 -4288 -2594 3228 514 -3740 -4157 -5063 -6288
453f288J440J48j474L499O380J704k982m777m843k18L146J479K52P89N0K38O35
470h22m7l759l381L684P202K214k634k629k679j485L907K246o522l448O186M608
486B641J3L434K11q409l18R522m467j1948P425J0053p667k984J0635l506j1921
501g286Q135P927j0563J19J5692l641j5730N180Q679j0074l483J1948k129j3104
515h330R176J5533r485j2965R741O058r693O51O908r421o318J4513N250j4461
529b843j974R199k443m414P687J634r067P04P849m757o239M952J259n995K380
544b068P219m285n474N036L136n486Q47N823m875n892M926K411m545J14M223j678
560e68m276L461K895k561Q91R69m842J065N906k409n207J281J166Q40K071j287
$$ plain form
453 -6288 -4848 -4700 -6174 -2675 3705 5409 2427 -2350 -7193 -7411 -4265 -2786 -2534 -1745 -1695 -1457 -822
470 -822 -869 -4628 -8009 -4325 2877 5091 2457 -172 -2851 -4336 -429 1817 -4705 -8153 -1967 2641
486 2641 2654 6088 6299 -2110 -2428 7094 2627 -9321 -1896 8157 490 -2494 8141 4635 -7286
501 -7286 849 8776 -1787 -1668 14024 10383 -5347 -167 8512 -1562 -5045 6903 4774 -8330
515 -8330 846 16379 6894 -6071 3670 9728 35 686 7594 -1827 -8145 6368 11618 -2843
529 -2843 -4817 4382 1939 -2475 5212 6846 -2221 -1517 6332 1575 -4664 288 1547 -4448 -2068
544 -2068 5151 866 -4608 428 3564 -1922 -1075 4748 -127 -6019 -1093 1318 -3227 -3113 1110 -568
560 -568 -4844 -1383 1512 -1049 -158 811 -4031 -2966 2940 531 -4676 -3395 -2229 -1389 682 -605
576f05l460J790M529j190k758J627j2k874N51L050l30k811Q55L085j049j253J698
593H43j229k812L431K571l995j270M677n79m324J003K321k083N47K496l149J16
609a436M882j029n821O49M216k096j794K839L05l392K850K494m207l004M256J384
625A096l998O91M405j468m320L779J295m166j159N169k324k451M296K047n799
640b907P97L200k022k606K509K121j531M62k49l18J71R50k300N52K344l01j379
657e07K137j29k353J230K355k328k165L425L116m596k041N376M95m669P45L762
673C853l412j564M568l98l609J745L271l602k000M154J637l489k53K979j010k865
689EJ995R59k282L78K760j703k665K288J611k139l21K093j136j403N16O8j047
$$ plain form
576 -605 -4065 -2275 2254 1064 -1694 -67 -79 -2953 -2402 648 318 -2493 -1638 1447 398 -855 843
593 843 -386 -3198 233 2804 -1191 -2461 2216 1637 -2687 -1684 637 -1446 -899 1597 -1552 -1436
609 -1436 3446 2417 -3404 -2755 1461 -635 -2429 410 715 -2677 173 2667 -1540 -4544 -288 1096
625 1096 -2902 -2211 2194 726 -3594 185 1480 -2686 -3845 1324 -1000 -3451 845 2892 -2907
640 -2907 -2110 1090 -932 -3538 -1029 1092 -439 23 -226 -544 -373 577 -1723 -1171 1173 872 -507
657 -507 1630 1501 -852 378 2733 405 -1760 1665 4781 185 -1856 3520 4015 -654 91 3853
673 3853 441 -1123 3445 3047 -562 1183 4454 852 -1148 3006 4643 1154 901 3880 2870 5
689 5 2000 2959 677 1055 3815 2112 -553 1735 3346 1207 886 2979 1843 440 956 1024 -23
706b3J338N56k316p16L509j465l561K789L371l713j908L480p03m187J086M117
722A654k427k967K929J396l120j111L113J132k098J59O14j184p89L73m87Q28P59
739a226j344r53K572K9k530J756K497j593j597J193n76j986J681J842k027j01
755b363J699p40q23J891L95j304J611J960l971j801K882P26j629O37R29j017K5
772h93J632j82o29Q50K84N15P5k273j560J606J739Q7r05j155Q86J149o00k41J313
791A698K87j436J387O65l990j634M638k4k889J134K529k370k69K396r02j512K350
808B058o5l409N99J345j665J657J761k617k322K642J143j443J53J139j23M28R60
825B241k015l112L04K255K092j53j442r70O81J866l62j205p69R45M54K79L12p60
$$ plain form
706 -23 1315 1871 -445 -1161 2348 883 -2678 111 3482 -231 -2139 1341 638 -3549 -2463 1654
722 1654 -773 -3740 -811 585 -2535 -3646 -533 599 -1499 -1340 -726 -1910 -2699 -2326 -2813 -1985 -1226
739 -1226 -2570 -3523 -951 -922 -3452 -1696 801 -792 -2389 -1196 -1772 -3758 -2077 -235 -2262 -2363
755 -2363 -664 -1404 -2227 -336 59 -1245 366 2326 -1645 -3446 -564 162 -1467 -830 99 -918 -893
772 -893 739 557 -72 778 1062 1577 1652 -621 -2181 -575 1164 1251 346 -809 77 1226 626 385 1698
791 1698 1985 549 1936 2601 -1389 -3023 1615 1591 -1298 -164 2365 -5 -274 2122 1220 -292 2058
808 2058 1993 -1416 -817 528 -1137 520 2281 -336 -2658 -16 1127 -316 -163 976 853 1281 2241
825 2241 226 -2886 -2582 -327 1765 1612 170 -800 -119 1747 1385 180 -589 356 810 1089 1401 641
843F41j401Q30J965q67k193l35K173M96pO20K52j276o31r0j006K61K736J248j279
862B137j792J81O0m13O19o24r93J815L456k010k647K29K48k09J845L4m494o42
880c200M511J522j966j232n04n32Q33J637n00j299K55J517J05k028k730R7J131
897b383P73O26J583n38p08j48K6j016J76P48j72j093q81J96J058N17q92o44J059
916a713Q85L17J048j289j791J151K327j631l211r32J483J834J971O30j794r01
932a616K146P14p15j109n28O16R9j12r21m37j09Q87K065J585j019j455J526R60
950B577j184j209J100k67k124m34J009N11L77J438J157j057k93J213M69j121j580
967E82m76M61O59p45k294M02L107J461r86o18J048p43j173J103Q82j920j211O89
$$ plain form
843 641 -760 70 2035 1168 -1025 -1360 813 1309 1302 1922 2174 898 267 177 -829 -568 2168 3416 2137
862 2137 345 526 586 173 792 168 -825 990 4446 2436 -211 18 266 57 1902 1936 -2558 -3200
880 -3200 1311 2833 867 -365 -869 -1401 -568 1069 569 -730 -475 1042 1147 -881 -3611 -3514 -2383
897 -2383 -1610 -984 599 61 -647 -795 -769 -1785 -1609 -861 -1033 -2126 -3007 -2811 -1753 -1236 -2128 -2772 -1713
916 -1713 -828 -511 537 -752 -2543 -1392 935 -696 -3907 -4839 -3356 -1522 449 1079 -715 -1616
932 -1616 530 1244 529 -580 -1108 -492 -393 -505 -1426 -1863 -1972 -1085 980 2565 1546 91 1617 2577
950 2577 1393 184 1284 1017 -1107 -1541 -532 -21 356 1794 2951 1894 1601 2814 3283 2162 582
967 582 106 567 1226 481 -1813 -1411 1696 3157 2171 1553 2601 1858 685 1788 2670 750 -461 228
985B28N48j883j352J774J313r1K175R41k085j747J013N56j868j396R43N52q64
1002a243M10J081Q2J36n3K31o55L91M38j67m12N5r48m53j136o22J165Q07J652
1021G59J238J431k005k003N59n8j732m25K533R7j083J15J312l43j466k84J816
1038D61R43j678j54K006N82k375j240P39q35q15J441J389O23M28P33j324j661
1055g37p94N01J78j86J064J907j091j875k6Q62j304o57J614R55q64P28Q65j870
1073g30k45j45m16o31O26R17J26P1N41k62p05j932J11J735o28O11K201J72j525
1092a08r41L75p06r59M28Q07R11J85n1r75O02M20j188M59J037L34m42j86M39k85
1112A56j33q07p49L19L29J917P85n76Q89L4r10j334N61p53o2J258K03o93o0P6
$$ plain form
985 228 776 -1107 -2459 -685 628 537 2712 3653 1568 -179 834 1390 -478 -1874 -931 -379 -1243
1002 -1243 -833 248 330 466 413 644 -11 380 818 651 239 294 -654 -1107 -2243 -2865 -1700 -893 759
1021 759 1997 3428 1423 -580 -21 -79 -1811 -2236 297 394 -689 -574 738 395 -1071 -1355 461
1038 461 1404 -274 -428 1578 2160 -215 -1455 -716 -1551 -2366 -925 464 1087 1515 2248 924 -737
1055 -737 -1531 -1030 -852 -1038 26 1933 842 -1033 -1059 -197 -1501 -2158 -544 411 -453 275 1140 -730
1073 -730 -975 -1120 -1536 -2167 -1541 -624 -498 -427 114 -148 -853 -2785 -2674 -939 -1567 -956 1245 1417 -108
1092 -108 -1049 -674 -1380 -2339 -1911 -1104 -193 -8 -59 -1034 -432 -12 -1200 -741 296 630 188 2 441 156
1112 156 23 -784 -1533 -1214 -885 1032 1817 1241 2130 2164 1254 -80 481 -272 -334 924 1127 434 374 450
1132D50M59M62L92P59r2J047j397k24j021j187Q72Q0q85n71K686L9p24O93J665
1151C503r51J47n92j312r25M42j138m23J775j176M65J349R22q69K7M45n17j35
1169A037m39k982J192R68j319N08J32q42J82J610N27l35P93P51r87j130q03j883
1187c020m99J157O59lO18N65Q07N34o32r80K90N46l70o62j17l99J9N14o63j348
1207b984J148J145Q90J371O89p36o56r99q41j354r30N82K280J281n76l80P52O0
1225G42l55l72k36J87N70O30l95j139j485PQ61J50k29L80J807J394L22o34k019
1244A86j581J76J29r26M61J297J069K15l93o56r81J92N56P24N12j78k15M90j041
1263C6k180k96P75Q95O97N11J11o6J213k69k091j044K02R42O98K90m39O02K90
$$ plain form
1132 450 909 1371 1763 2522 2430 3477 2080 1856 835 -352 520 600 -285 -856 1830 1869 1145 1838 3503
1151 3503 2552 2699 2107 795 -130 312 -826 -1249 526 -650 -185 1164 2086 1217 1244 1689 1172 1037
1169 1037 598 -2384 -1192 -224 -1543 -1035 -903 -1745 -1563 47 574 239 1032 1783 796 -334 -1137 -3020
1187 -3020 -3519 -2362 -1703 -1706 -1088 -523 284 818 186 -794 -504 42 -328 -990 -1107 -1506 -1487 -973 -1636 -2984
1207 -2984 -1836 -691 199 1570 2259 1523 867 -132 -973 -2327 -3257 -2675 -395 886 310 -70 682 742
1225 742 387 15 -221 -34 536 1166 771 -368 -1853 -1846 -985 -835 -1064 -684 1123 2517 2839 2205 186
1244 186 -1395 -1219 -1090 -2016 -1555 -258 811 1026 633 -23 -1004 -812 -256 468 980 802 587 1077 36
1263 36 -2144 -2440 -1665 -770 -73 438 549 483 1696 1427 -664 -1708 -1506 -564 134 424 -15 587 877
1282H77j45n63j272q30J399K216N13j043m04Q2n64k14k59l31M89J156O13P58j240
1301A238j084J82K60n76l26J144O60n77R09m1j130k34N01p12p71P04P56J176j33
1320A946j555m14J161J65j010J78M02k72M78N62j803j252N10O90O98K56m45o19
1338c24P60O59Q0q51j163J77O52m57o99n06L54J00J252R6j92l17o54M36J118j104
1358e83j275L8M25m47l60N91P09J56L6J19k89J89J315k99j460l93N23k34j208
1377b447l50P48J441K75N56R42k17j681L05J003p86j401K54N93M30j17j89R6n0
1396e95O45K73O79q5K70M21p04m56p57n47r00J27J223J246j20P20J061n83j709
1415B09l56N42M6l94N93J25j54p25k90k14j38R95P67N81J7M81k66r53j070o95
$$ plain form
1282 877 732 169 -1103 -1933 -534 1682 2195 1152 748 830 266 52 -207 -538 -49 1107 1720 2478 1238
1301 1238 154 336 596 20 -306 838 1498 921 1830 1789 659 425 926 214 -557 147 903 2079 1946
1320 1946 391 -23 1138 1303 293 471 873 601 1079 1641 -162 -1414 -904 -214 484 740 295 -324
1338 -324 436 1095 1175 324 -839 -662 -10 -467 -1166 -1672 -1318 -1218 34 130 -62 -379 -1033 -597 521 -583
1358 -583 -1858 -1820 -1395 -1842 -2202 -1611 -902 -746 -710 -591 -880 -691 624 325 -1135 -1528 -1005 -1239 -2447
1377 -2447 -2797 -2049 -608 -333 223 1165 948 -733 -428 575 -211 -1612 -1358 -765 -335 -452 -641 -545 -595
1396 -595 50 323 1002 917 1187 1608 904 448 -309 -856 -1756 -1629 -406 840 720 1440 2501 1918 209
1415 209 -147 395 441 47 640 765 611 -114 -404 -618 -756 239 1006 1587 1604 2085 1819 866 -204 -899
1435h99l29l26k4J542J224p3j6O02k65j479p04O08N86o8J47j07l42q00o11K87
1455a047N38J03J087J273k79m51k31q91q49n35N60n8J9J098R07n59m06K48Nq00
1475b68l07R28P34m73l68L70n43m14n64J88L62L41J359M59l91n07p30k71o91J33
1495f53O32J82q6m6O73O3p41n96L54L09j16Q0J79J47o57k0k1K6m86j23L02N21
1517g7O0M03k42q56m26K39J90K7j38M36j64L63N2o60m40l03R70Nm24O4L75k65
1539h11j21M67M32o3q07k18M08P6j76J77k3m25J75P89l29L90p55M90O88p52N38
1560A50n48j35j87J050o8p83l06M52K76M70R0P82p24l15L09J81r48m45J107L91
1580G99n97L52M86o08k39N49N47n11K12L03M11p63o21N2l9l26l14M49O33R8N24
$$ plain form
1435 -899 -1228 -1554 -1578 -36 1188 1115 1099 1701 1436 -43 -747 -139 447 379 526 419 77 -723 -1334 -1047
1455 -1047 -509 -406 681 1954 1675 1224 993 102 -747 -1282 -722 -780 -761 337 1244 685 279 527 532 -268
1475 -268 -575 353 1087 614 246 616 73 -341 -905 -717 -355 -14 1345 1804 1413 906 176 -95 -786 -653
1495 -653 -21 161 75 29 702 765 24 -572 -218 91 -25 55 234 381 -276 -296 -317 -291 -777 -900 -598 -77
1517 -77 -17 386 144 -712 -1138 -899 -709 -682 -820 -384 -548 -185 -133 -793 -1233 -1536 -566 -561 -985 -921 -546 -811
1539 -811 -932 -465 -33 -96 -903 -1121 -713 -637 -813 -636 -659 -1084 -909 -120 -449 -59 -814 -324 364 -388 150
1560 150 -398 -533 -720 330 262 -521 -827 -375 -99 371 461 1243 519 204 513 694 -254 -699 408 799
1580 799 202 554 1040 432 193 742 1289 778 990 1293 1704 941 320 372 333 7 -307 142 775 873 1397
1601A397K70k71l91n65l07k00m3o50J154J063m51j190o0N28l30J30P18J36o56
1620B82L20K35q69j291O1Q70jj22L38P83P4n4k73j89j075%P37k24J20m0J31L95
1642B08j61n59p69M41Q76N00j31J4j18n09m94q32K96J1P38Q02P71n51r65O00L83
1663E51r56l38L89L1O25l34J7k5l82k56O44j4n75R8J473M12r53q33J84q8l76j78
1685h84N82J04P6N63K18n20j125O27O12j81o23Q2L82j14L6m8l76l07L51J41L83
1706b1k58k5N9J80On21l69o2O74J08k57L07M31j98p70J83L45o21M60Q58l12j486
1728a289O42R37j1p59p9O53K52K09n47O7k13j03K60Q05p08n88N80M74r1k46J50
1749C95O8k81O09m14j87k16N99K27l40j50P3M31O2l5j40J31l39Q5j04j73L48L19
$$ plain form
1601 1397 1667 1396 1005 440 133 -67 -110 -760 394 1457 1006 -184 -244 284 -46 84 802 938 282
1620 282 602 837 -32 -1323 -1262 -392 -393 -515 -177 606 680 626 353 164 -911 -911 -174 -398 -278 -318 -187 208
1642 208 47 -512 -1281 -840 36 536 405 419 301 -208 -702 -1534 -1238 -1227 -489 313 1084 533 -432 168 551
1663 551 -405 -743 -354 -323 302 -32 -15 -40 -422 -678 -34 -48 -623 -525 948 1360 407 -426 -242 -330 -706 -884
1685 -884 -302 -198 -122 441 659 139 -986 -359 253 72 -551 -469 -87 -201 -165 -213 -589 -896 -545 -404 -21
1706 -21 -279 -304 -245 -65 -59 -580 -949 -1011 -337 -229 -486 -179 252 54 -716 -533 -188 -809 -349 509 197 -1289
1728 -1289 -647 290 279 -480 -559 94 346 555 8 75 -138 -241 19 824 116 -472 108 582 491 245 395
1749 395 463 182 791 377 190 -26 573 800 460 310 383 814 876 841 701 832 493 578 474 301 649 968
1771I68l15j64L3k25j36L39N13n12k07L01K41m24j79j71k82K32L96O7o11N33j24
1792B73j16K0l70l04k14M08L40l65M8K77j40m88n8M42n39j70J041J37m97n27L42
1813d60j57o67L62N58k49K42J64n0l48K84l05J20R9l66L51M47m60J71km08L55
1834c19j96K79l84R6M02J4k11J87j92r2j92N43lJ28K43Qm48j02j8L64l87L49J71
1857B40J70m70M08k6k58l26K89j49k3K54j07M51l24K28k06J18j41j20n3j02P05
1878E58l69%k46K11n66L17N50l88M3j53P91n80n95L84L01p36M36L33j68n19J87
1899b09J14L28j70L07k18j34P6J74k28j31Q5J11m83j50N26M1j35L49K75m1K7j31
1921C83o57N06J53j19L37n53m1j63O21Ql10K99K91k61k66Q6L1j48j37M08j15k88
$$ plain form
1771 968 653 489 522 297 161 500 1013 501 294 595 836 412 233 62 -220 12 408 475 -136 397 273
1792 273 157 177 -193 -497 -711 -303 37 -328 -280 -3 -143 -631 -689 -247 -786 -956 85 222 -275 -802 -460
1813 -460 -617 -1284 -922 -364 -613 -371 -207 -257 -605 -321 -626 -506 -407 -773 -422 25 -435 -264 -266 -674 -319
1834 -319 -515 -236 -620 -524 -122 -108 -319 -132 -324 -416 -608 -65 -68 60 303 311 -137 -239 -257 107 -280 69 240
1857 240 410 -60 348 322 64 -262 27 -122 -145 109 2 453 129 357 151 269 128 8 -45 -147 558
1878 558 189 189 -57 154 -412 -95 455 67 110 -43 748 168 -427 -43 258 -478 -42 291 123 -396 -209
1899 -209 -95 233 63 370 152 18 94 268 40 -91 -6 105 -378 -528 -2 39 -96 253 528 487 514 383
1921 383 -274 232 385 266 603 50 9 -154 467 475 165 464 755 494 228 314 345 197 60 468 353 65
1943F5K61j90l3K10K39j23l3l18Q3J16K63r5l97l19M77l7l03M16j04m82L36N62
1965E94n31n25M6L72j54J76L37p35k28K87L18j06m88J5M25m65M07L29m90m97M62
1986d51K01k54j95q6K70L7l5k5J72j33J05j51p9M51q7k69J30Rl0l5K36j33j71
2009e23J60J47o5M06j44k75L45K86p7k33k74r9J37J35J23j03m1K08L88o12M50
2030C39k82N30J21k18k59m45J47Q3M09k94L54n07L07K39O8k35P0R3l76L58K8j20
2052D10n96M97M50j071k46R69N30l35p79N93K23O1m85J95r17K01J45R5J50j89
2072i9L52K96L0j10m19p6J11O7m15R0nm3M91l06k16M2J78R8L29m06K38j92L05
2095C40l37n14J89J03Q25j181Q97j10L19l15K72O0k40o04M53J18n54k54L58n2
$$ plain form
1943 65 326 136 103 313 552 429 396 78 161 277 540 445 48 -271 206 169 -134 282 178 -304 32 594
1965 594 63 -462 -416 -44 -198 -22 315 -420 -648 -361 -43 -149 -637 -622 -197 -662 -255 74 -416 -913 -451
1986 -451 -250 -504 -699 -785 -515 -478 -513 -538 -366 -499 -394 -545 -624 -173 -260 -529 -399 -390 -420 -455 -219 -352 -523
2009 -523 -363 -216 -281 125 -19 -294 51 337 260 27 -247 -346 -209 -74 49 -54 -95 113 501 -111 339
2030 339 57 587 708 490 231 -214 -67 16 425 131 485 -22 285 524 592 357 427 520 144 502 530 410
2052 410 -186 311 761 -310 -556 413 943 608 -171 422 645 706 221 416 -501 -300 -155 -60 90 -99
2072 -99 253 549 579 469 50 -26 85 152 -263 -173 -178 -221 270 -36 -252 -210 -32 66 395 -11 227 35 340
2095 340 3 -511 -322 -219 606 -575 322 212 531 216 488 548 308 -296 157 275 -279 -533 -175 -227
2115b27PJ13J36m79N17L18L11n84m94M49j13j7o54L6J4O86j22m8N8L30m32O09
2137D14j12p44j79L12M72o47k75L22o2M44n31J032p19M72m29j11K09k19M60k62
2157a53l94M9r1k17J21M28J85j06L39k84m5k64K13j06l5L25j08l71K27L66j93
2178a14j26k4O8k57L97K92k17mR1l39j52R9j30N4L87M38k02j25L37m01k1M9J4
2201A14P6K13M36k18j92jj49j46MM6k09J95M31L76m46L2L23n75k02J87K6M0J25
2224D86K13q8l96k32K38L7qK49L20j56o0k64k47k5k56j76K91J27j07OO6K68k92
2247fj8K43J30l88J4R0l22mM3l28j06J14M73K99j08J40o8k53j52l55K09j59K9
2270d83M0K57pj05o6p7M55p8m0N66J39q18j68K94j61o14J94L73k39J42Q67j05
$$ plain form
2115 -227 -220 -107 29 -450 67 385 696 112 -382 67 -46 -63 -717 -681 -667 19 -103 -151 -93 237 -195 414
2137 414 302 -442 -621 -309 163 -484 -759 -437 -499 -55 -586 446 -273 199 -230 -341 -132 -351 109 -153
2157 -153 -547 -498 -589 -806 -685 -257 -72 -178 161 -123 -168 -432 -219 -325 -360 -35 -143 -514 -287 79 -114
2178 -114 -240 -264 -196 -453 -56 236 19 15 106 -233 -385 -286 -416 -362 25 463 261 136 473 72 51 100 114
2201 114 190 403 839 621 429 428 279 133 137 183 -26 169 600 976 530 562 885 310 108 295 321 361 486
2224 486 699 611 215 -17 221 258 250 499 819 663 603 339 92 67 -189 -365 -74 53 -54 -48 18 286 -6
2247 -6 -24 219 349 -39 -25 65 -257 -261 -218 -546 -652 -538 -65 234 126 266 198 -55 -207 -562 -353 -512 -483
2270 -483 -443 -186 -193 -298 -364 -441 14 -64 -104 462 601 -217 -385 -91 -252 -866 -672 -299 -538 -396 471 366
2292C66k88LM79j79m96j21L04l41%j24M6K17k66j54L48O27K43J02J1o05p48K74
2314c02l67N91l96j3R9O83k29l66N08J17n50l21L59O7N37o44m6j39J5m51R31K18
2336C01m02M57k8J57k4r9K84j632j61M62P14k3M19l00N36m88j08K79K82m72P5
2357B29q2q93J518r60J38r4J00L8O0Q11l29n84L84L99l53j42j14L21o29M19j2
2378B25l19K91J36N9L16m5m07k15N26k61m06Q1J16q4K52K30N0m58J04n0j7%L38
2401D62P1k72o4n9jj79k48J28P0M1M70q0J09j93k61N0k55Q9K77q30O56K0K34p6
2425A59m43j50m47L15j55R34L5P4p65K82k5j40l98p8Q46k71K27pl01j84j98k47
2447i37K43K1R13j88O6L8J77l47n43J14m86R9O59P41m74q08M22L03n08N12K10
$$ plain form
2292 366 78 81 560 381 -115 -236 68 -273 -273 -397 -351 -134 -400 -554 -206 421 664 766 777 172 -576 -302
2314 -302 -669 -78 -474 -487 -388 295 66 -300 208 325 -225 -546 -187 -120 417 -227 -273 -412 -397 -848 83 301
2336 301 -101 356 328 485 461 362 646 -986 -1147 -685 29 6 425 125 661 173 65 344 626 154 229
2357 229 147 -746 772 -188 -50 -144 -44 -6 54 865 536 -48 336 735 382 240 126 447 -182 237 225
2378 225 -94 197 333 392 708 663 256 41 567 306 -100 -19 97 13 265 495 545 87 191 141 124 124 462
2401 462 533 261 197 138 137 -42 -290 -162 -92 -51 419 339 448 255 -6 44 -211 -122 155 -675 -19 1 235 159
2425 159 -284 -434 -881 -566 -721 213 248 322 -443 -161 -186 -326 -724 -802 44 -227 0 -7 -308 -492 -690 -937
2447 -937 -694 -673 240 52 118 156 333 -14 -557 -443 -929 -830 -171 570 96 -712 -290 13 -495 17 227
2468B27K04j33n52J76L11K60q13rL33r5J63M29o31P32l41J88k19m03Q4o73L96
2489c66R8J92P21l21r60R11m2j15O5K00l33L34k47k15m83j91L19N23k30L05N9
2510B24j17L38j43K7l47j9o0n7K0J24l42J065l59k76k45N37j00Kk02J68l97J63
2532Dj52p6r8k85Q51k2j65L22j28l03J77L4J04j78j64K7q5k56K60K40k9J00L67
2555E45m73K18K86k84k10N0n27M03R3J35k36m69N22L22l47L06j59l6J49l97M18
2576C09o23n1J92N5J35J08k2Q3J33j08m98mL13o6o1k0j8j73K70j07m14L07r0Q7
2600b63J25k7M4J31k68O6k21n11K98K78K49P8m3q9j64L10l20q5J95l54N74M06
2622D09n10L45l55n6m82n8K98l65J7O34J0J07R4N0j21l27M4k1L63Lm3R5k08L53
$$ plain form
2468 227 431 298 -254 -78 233 493 -320 -329 4 -91 72 501 -130 602 261 449 230 -173 -89 -762 -366
2489 -366 -268 -76 645 324 -636 275 233 118 183 383 50 384 137 -78 -561 -752 -433 90 -140 165 224
2510 224 107 445 302 329 -18 -37 -97 -154 -134 -10 -352 713 354 78 -167 370 270 272 70 238 -159 4
2532 4 -148 -224 -322 -607 244 222 57 379 251 -52 125 159 263 85 -79 -52 -137 -393 -133 107 78 178 545
2555 545 72 290 576 292 82 132 -395 8 101 236 0 -469 53 375 28 334 175 139 288 -109 309
2576 309 -314 -365 -173 -118 17 125 103 186 319 211 -287 -291 22 -44 -105 -125 -143 -316 -46 -153 -567 -260 -350 -263
2600 -263 -138 -165 -121 10 -258 -192 -413 -924 -626 -348 -99 -21 -64 -153 -317 -7 -327 -412 -217 -571 3 409
2622 409 -101 244 -111 -167 -649 -707 -409 -774 -757 -123 -113 -6 88 138 17 -310 -266 -287 76 79 36 131 -77 276
2646B76k74N0K97M84q11N1O72l84Q39j863P43K45k42O53j77L15j350K40N77p79
2666d38J01K42M30o2p2J11k03Q0l4K18q07R83o94N11n33M82n43N67k11j73k79
2687c24J91K19N13J75p31J83n51M0N85J25p4m85J53j02r6M9o1j26J4M89o7K59
2709C78m51K62k82n5K78R8m85L82k76m99J55O11p05L48l27K82L20J24o57M48J
2730e0K32j87L10l93K4j10k10L49p8O7j36L94k04J78q8l38J89L1Q8j00j25J47
2752a0n3k7J4K30j3j74M0o9L14k50n6j51M34j72l99J98j0j73M50N8m2k49j61J66
2776a05J88l60r2j9J4P14m8p24K56P92q73L60o48N25L49n21r3R83j310Q7L70m0
2798a95qJ7q07N97J098q07P3N8k22J95k82K70K72j7j81J11J01m86L43J8J83j77
$$ plain form
2646 276 2 52 349 833 22 73 745 361 1200 -663 80 325 83 736 559 874 -476 -236 341 -438
2666 -438 -337 -95 335 273 201 312 109 189 155 373 -434 549 -145 366 -167 315 -228 339 128 -45 -324
2687 -324 -133 86 599 774 43 226 -325 -285 300 425 351 -134 19 -83 -179 -130 -191 -317 -303 186 119 378
2709 378 -73 189 -93 -148 130 228 -257 125 -151 -650 -495 116 -589 -241 -568 -286 34 158 -499 -51 -50
2730 -50 182 -5 305 -88 -64 -174 -384 -35 -113 -46 -182 212 8 186 98 -240 -51 -20 68 -32 -157 -10
2752 -10 -63 -90 -76 154 141 -33 7 -62 252 2 -54 -205 229 57 -342 -144 -154 -327 123 181 139 -110 -271 -105
2776 -105 83 -277 -369 -388 -374 340 292 -432 -176 616 -257 103 -545 -20 329 -192 -285 698 -612 -525 -155 -195
2798 -195 -203 -186 -993 -396 702 -105 -32 26 -196 -1 -283 -13 259 242 61 172 273 -213 130 148 331 154
2820A54n5L40J9m37L6j73j70L22J5L35j86K18j30k04m3P3j87r9K36K27K7J89l00
2843B07o2L5M8j94j82L03L92l1j67j16r6ol14r3K75J13K14k94R7k41Q2l0p2Q9
2867d3k4j53K03J18P3l34n9n5J93j2l4j95L94k63L44l17l05J67K42Q7P8k00K13
2890A18j29m3j00N7o8m6K28j55j58M19j20k19K26j40O0o1J09J4j0j9M8L55m65
2913i9j4J4P6k5q7L87l84J56j15nP6J21j74M6j35o4K57j57r1M26j74K82k63j88
2937a34Q1l3K90k23n0J91j92J41jMJk68J39M05l54K27j57M11o5r22P02m4j73N29
2961E05j53m3k5l60O23k88Q1M1o11O06k60N11o10o93R08m82K95n47M53r9J85J50
2983A87o88M11R6K0J76l95J29L95k84m36O75o0m35L4M82l94K68mj89O2k38J92
$$ plain form
2820 154 99 439 458 21 57 -116 -286 36 51 386 200 418 288 84 41 114 -73 -172 64 291 318 507 207
2843 207 145 180 228 34 -148 155 547 516 349 233 137 131 -183 -276 -1 112 326 32 129 -112 -30 -60 -132 -43
2867 -43 -67 -220 -17 101 174 -160 -219 -274 -81 -93 -127 -322 72 -191 153 -164 -469 -302 -60 27 105 -95 118
2890 118 -11 -54 -154 -97 -165 -211 17 -138 -296 123 3 -216 10 -130 -70 -131 -22 -8 -18 -37 11 366 -99
2913 -99 -113 -99 -23 -48 -135 252 -132 24 -91 -96 -20 101 -73 -27 -162 -226 31 -126 -217 209 35 317 54 -134
2937 -134 -53 -86 204 -19 -69 122 -70 71 70 74 75 -193 -54 351 -3 224 67 478 413 -509 193 149 -24 505
2961 505 352 309 284 -76 547 259 340 381 -230 376 116 627 17 -676 232 -250 45 -502 -49 -148 37 187
2983 187 -501 -90 6 26 202 -193 -64 331 47 -389 286 226 -209 -175 307 -87 181 177 -12 50 -188 4
3005DK16r8k47J95R2k10m9J53l43L36J7l3N0K14nK6j60J1j26l49K27J99n98Q28
3029C50j39l41K14M81r54J80j88K45R0L28k62j00R1L1m9k6q9j14J64l5r0J57j16
3052a72J23j29K83j15R7l57J77Qj08J57q4k19J17K83j70J18j77K13l92J69K57
3073G9j56mJ3k63K60j5k7Ol9J58n5p8JL13j26J72k21p2k9J67k93L17mj17j0J88
3099A65J03j33j0Q6j00k23L06l6l0q2J30N3j48K3J42j10n6n7K62k78K04P0l28
3122d7J16R9K18o3p5j04q5k42K28j2j75J35K65q5j89J09J2m15L03M75l25r6k8
3145A9J4j84J16K09j90q3J97L5l02q3M67k23k14L80j43q9Mq0K72k00l30N88k84
3168a04J27j58M95l17j00o7J7J8K9N7p1k44L50k30K58J05l3l15n6J18K51k19K
$$ plain form
3005 4 220 122 -125 70 162 -48 -97 56 -287 49 66 33 83 297 292 318 158 169 43 -306 -79 120 -478 350
3029 350 211 -130 84 565 -389 -209 -397 -152 -62 266 4 -96 -5 26 -23 -49 -138 -252 -88 -123 -213 -56 -172
3052 -172 -49 -178 105 -10 87 -270 -93 -85 -193 -36 -120 -339 -222 61 -109 9 -168 45 -347 -178 79
3073 79 -77 -81 -68 -331 -71 -86 -113 -107 -146 12 -43 -121 -120 193 67 239 18 -54 -83 84 -209 108 104 -13 -23 165
3099 165 268 135 125 211 111 -112 194 158 128 46 176 229 81 104 246 136 80 23 285 7 211 281 -47
3122 -47 69 168 386 323 248 144 59 -183 45 33 -142 -7 258 173 -16 93 105 -310 -7 468 143 47 19
3145 19 33 -151 -35 174 -16 -99 98 133 -169 -252 215 -8 -222 158 15 -74 -70 -150 122 -78 -408 180 -104
3168 -104 23 -135 360 43 -57 -124 -107 -89 -60 -3 -74 -318 32 -198 60 165 132 -183 -239 -121 130 -89 -87
3191h7lK48k56k3M75k77j34K0J9J03l22M95j71q7L0L2k97K05j3J9k6J61J9l04
3215a74L14k8J22l79l6L96k21k49N4L18j44j63K86Lk26P6J77k84mm1RJ32j9J58
3239G7m01M38m62P8K11J4M0Ro2j28R4J92j51j09M1M6j74K99j35J33M4J42r6k69
3263a29J90J61l58L22j84M5k5L33p8j23J0j94J05J70O3j17R6l81M13j47J79m34
3285h3K52j45m6R2L3J05L9k38K99k63j12Q6J33J0R6J27n04J5J40J01j47J42j48
3308a6j03N46m49K0K18o3J93j81k55K62j09nl26M29q5k85L9J35L3r4J29o9m1L9
3332c8J39q2j02J21k33j06J55K05pl72J92J99N5n5l91j63N09Q7l95L11K03n94
3354c62M34O0l20m7O93j099J088l93J43l35R2r2J1L10n26N86l08l37N55M7k73
$$ plain form
3191 -87 -90 158 -98 -121 354 77 -57 -37 -18 85 -237 258 87 0 30 62 -235 -30 -43 -24 -50 111 130 -174
3215 -174 140 112 234 -145 -181 215 -6 -255 -201 117 -27 -190 96 99 -127 -51 126 -158 -162 -203 -194 -62 -81 77
3239 77 -324 114 -348 -270 -59 -45 -5 4 -58 -186 -92 100 -51 -160 -119 -73 -247 52 -83 50 94 236 140 -129
3263 -129 61 222 -136 186 2 47 22 355 277 154 164 -30 75 245 308 191 287 -94 319 172 351 -83
3285 -83 169 24 -22 70 103 208 247 9 308 45 -67 19 152 162 258 385 -119 -104 36 137 -10 132 -16
3308 -16 -119 427 -22 -2 216 153 346 165 -90 172 63 58 -268 161 76 -209 -170 -35 -2 -96 33 -36 -77 -38
3332 -38 101 19 -83 38 -195 -301 -146 59 52 -320 -128 71 126 71 -320 -483 26 113 -282 29 232 -362
3354 -362 72 132 -188 -235 458 -641 447 54 197 -138 -46 -138 -127 183 -343 243 -65 -402 153 200 -73
3375g3N8m24N02m2k50O63L6n88M65n97O44J40q76K02M78Nl85M92p75k45J10L84
$$ plain form
3375 -73 -15 -439 63 21 -229 434 470 -118 347 -250 394 534 -342 -140 338 343 -42 450 -325 -570 -460 -76
$$ [...]
8191f01
##END NTUPLES=NMR FID
##END=
