##TITLE=1H_SL62-I2-mix-f3
 CDCl3, 8 sc, 
 2.9.2021
##JCAMPDX= 6.0         $$ Bruker NMR JCAMP-DX V2.0
##DATA TYPE= NMR FID
##DATA CLASS= NTUPLES
##ORIGIN= UXNMR, Bruker Analytische Messtechnik GmbH
##OWNER= root
$$ XWIN-NMR		Version 3.5
$$ Thu Sep  2 08:53:22 2021 Russian Standard Time (UT+4h)  she@DPX200
##.OBSERVE FREQUENCY= 200.1312
##.OBSERVE NUCLEUS= ^1H
##.DELAY= (6, 6)
##.ACQUISITION MODE= SIMULTANEOUS
##.ACQUISITION SCHEME= undefined
##.AVERAGES= 8
##.DIGITISER RES= 18
##SPECTROMETER/DATA SYSTEM= spect
##.PULSE SEQUENCE= zg30
##.SOLVENT NAME= CD2Cl2
##.SHIFT REFERENCE= (INTERNAL, CD2Cl2, 0, 15.7039)
##AUDIT TRAIL= $$ (NUMBER, WHEN, WHO, WHERE, WHAT)
$$ ##TITLE= Audit trail, XWIN-NMR		Version 3.5
$$ ##JCAMPDX= 5.01
$$ ##ORIGIN= Bruker BioSpin GmbH
$$ ##OWNER= she
$$ F:/spectra/data/she/nmr/H-F/1/audita.txt
$$ ##AUDIT TRAIL=  $$ (NUMBER, WHEN, WHO, WHERE, WHAT)
(   1,<2021-09-02 08:52:03.73 +0400>,<she>,<DPX200>,
      <created by zg, POWCHK disabled, PULCHK disabled
       configuration hash MD5:
       00 E9 B6 7A A2 85 ED C7 34 08 36 98 17 FE 4E 26
       data hash MD5: 16K
       1B 23 4D 80 27 DC 13 F2 65 19 51 DB B9 40 80 08>)
$$ ##END=
$$ 
$$ hash MD5
$$ 2E 03 F1 66 AE DB 80 9D 00 8F 4B 7A 29 81 18 71
##$RELAX= 
##$RELAX= 
##$RELAX= 
##$RELAX= 
##$RELAX= 
##$RELAX= 
$$ Bruker specific parameters
$$ --------------------------
##$DU= <F:/spectra>
##$EXPNO= 1
##$NAME= <H-F>
##$PROCNO= 1
##$TYPE= <nmr>
##$USER= <she>
##$AMP= (0..31)
100 100 100 100 100 100 100 100 100 100 100 100 100 100 100 100 100 100 
100 100 100 100 100 100 100 100 100 100 100 100 100 100 
##$AQSEQ= 0
##$AQ_mod= 1
##$AUNM= <au_zg>
##$AUTOPOS= <>
##$BF1= 200.13
##$BF2= 200.13
##$BF3= 200.13
##$BF4= 200.13
##$BF5= 200.13
##$BF6= 200.13
##$BF7= 200.13
##$BF8= 200.13
##$BYTORDA= 1
##$CFDGTYP= 0
##$CFRGTYP= 5
##$CHEMSTR= <none>
##$CNST= (0..31)
1 1 145 1 1 1 1 1 1 1 1 1 1 1 1 1 1 1 1 1 1 1 1 1 1 1 1 1 1 1 1 1 
##$CPDPRG= <>
##$CPDPRG1= <>
##$CPDPRG2= <>
##$CPDPRG3= <>
##$CPDPRG4= <mlev>
##$CPDPRG5= <mlev>
##$CPDPRG6= <mlev>
##$CPDPRG7= <mlev>
##$CPDPRG8= <mlev>
##$CPDPRGB= <>
##$CPDPRGT= <>
##$D= (0..31)
0 1.2 0 0 0 0 0 0 0 0.06 0 0.03 0 0 0 0 0.0002 0 0 0 0 0 0 0 0 0 0 0 0 
0 0 0 
##$DATE= 1630558323
##$DBL= (0..7)
120 120 120 120 120 120 120 120 
##$DBP= (0..7)
150 150 150 150 150 150 150 150 
##$DBP07= 0
##$DBPNAM0= <>
##$DBPNAM1= <>
##$DBPNAM2= <>
##$DBPNAM3= <>
##$DBPNAM4= <>
##$DBPNAM5= <>
##$DBPNAM6= <>
##$DBPNAM7= <>
##$DBPOAL= (0..7)
0.5 0.5 0.5 0.5 0.5 0.5 0.5 0.5 
##$DBPOFFS= (0..7)
0 0 0 0 0 0 0 0 
##$DE= 6
##$DECBNUC= <off>
##$DECIM= 32
##$DECNUC= <off>
##$DECSTAT= 4
##$DIGMOD= 1
##$DIGTYP= 9
##$DL= (0..7)
0 120 120 120 120 120 120 120 
##$DP= (0..7)
150 150 150 150 150 150 150 150 
##$DP07= 0
##$DPNAME0= <>
##$DPNAME1= <>
##$DPNAME2= <>
##$DPNAME3= <>
##$DPNAME4= <>
##$DPNAME5= <>
##$DPNAME6= <>
##$DPNAME7= <>
##$DPOAL= (0..7)
0.5 0.5 0.5 0.5 0.5 0.5 0.5 0.5 
##$DPOFFS= (0..7)
0 0 0 0 0 0 0 0 
##$DQDMODE= 0
##$DR= 18
##$DS= 0
##$DSLIST= <SSSSSSSSSSSSSSS>
$$ [...]
##$SUBNAM2= <"">
##$SUBNAM3= <"">
##$SUBNAM4= <"">
##$SUBNAM5= <"">
##$SUBNAM6= <"">
##$SUBNAM7= <"">
##$SUBNAM8= <"">
##$SUBNAM9= <"">
##$SW= 20.0189188712717
##$SWIBOX= (0..15)
0 0 2 0 0 0 0 0 0 0 0 0 0 0 0 0 
##$SW_h= 4006.41025641026
##$TD= 16384
##$TD0= 1
##$TE= 0
##$TE2= 300
##$TE3= 300
##$TEG= 300
##$TL= (0..7)
0 120 120 120 120 120 120 120 
##$TP= (0..7)
150 150 150 150 150 150 150 150 
##$TP07= 0
##$TPNAME0= <>
##$TPNAME1= <>
##$TPNAME2= <>
##$TPNAME3= <>
##$TPNAME4= <>
##$TPNAME5= <>
##$TPNAME6= <>
##$TPNAME7= <>
##$TPOAL= (0..7)
0.5 0.5 0.5 0.5 0.5 0.5 0.5 0.5 
##$TPOFFS= (0..7)
0 0 0 0 0 0 0 0 
##$TUNHIN= 0
##$TUNHOUT= 0
##$TUNXOUT= 0
##$USERA1= <user>
##$USERA2= <user>
##$USERA3= <user>
##$USERA4= <user>
##$USERA5= <user>
##$V9= 5
##$VALIST= <valist>
##$VCLIST= <CCCCCCCCCCCCCCC>
##$VD= 0
##$VDLIST= <DDDDDDDDDDDDDDD>
##$VPLIST= <PPPPPPPPPPPPPPP>
##$VTLIST= <TTTTTTTTTTTTTTT>
##$WBST= 1024
##$WBSW= 4
##$XGAIN= (0..3)
0 0 0 0 
##$XL= 0
##$YL= 0
##$YMAX_a= 125281
##$YMIN_a= -184218
##$ZGOPTNS= <>
##$ZL1= 120
##$ZL2= 120
##$ZL3= 120
##$ZL4= 120
##$ABSF1= 10
##$ABSF2= 0
##$ABSG= 5
##$ABSL= 3
##$ALPHA= 0
##$AQORDER= 0
##$ASSFAC= 0
##$ASSFACI= 0
##$ASSFACX= 0
##$ASSWID= 0
##$AUNMP= <proc_1d>
##$AZFE= 0.1
##$AZFW= 0.1
##$BCFW= 1
##$BC_mod= 2
##$BYTORDP= 1
##$COROFFS= 0
##$CY= 11.3945322036743
##$DATMOD= 1
##$DC= 2
##$DFILT= <>
##$DTYPP= 0
##$F1P= 2.36226072786647
##$F2P= -0.459571619588291
##$FCOR= 0.5
##$FTSIZE= 0
##$FT_mod= 4
##$GAMMA= 1
##$GB= 0.15
##$INTBC= 1
##$INTSCL= 1
##$ISEN= 128
##$LB= 0.24
##$LEV0= 0
##$LPBIN= 0
##$MAXI= 10000
##$MC2= 0
##$MEAN= 0
##$ME_mod= 0
##$MI= 1.114404
##$NCOEF= 0
##$NC_proc= 0
##$NLEV= 6
##$NOISF1= 3.799351
##$NOISF2= 2.8
##$NSP= 1
##$NTH_PI= 0
##$NZP= 0
##$OFFSET= 15.70392
##$PC= 1
##$PHC0= -13365.66
##$PHC1= 24.00097
##$PH_mod= 1
##$PKNL= yes
##$PPARMOD= 0
##$PSCAL= 0
##$PSIGN= 0
##$REVERSE= no
##$SF= 200.130013532006
##$SI= 16384
##$SIGF1= 3
##$SIGF2= 2
##$SINO= 400
##$SIOLD= 16384
##$SREGLST= <1H.CDCl3>
##$SSB= 0
##$STSI= 0
##$STSR= 0
##$SW_p= 3612.71676300578
##$SYMM= 0
##$S_DEV= 0
##$TDeff= 0
##$TDoff= 0
##$TI= <>
##$TILT= no
##$TM1= 0
##$TM2= 0
##$TOPLEV= 0
##$USERP1= <user>
##$USERP2= <user>
##$USERP3= <user>
##$USERP4= <user>
##$USERP5= <user>
##$WDW= 1
##$XDIM= 8192
##$YMAX_p= 0
##$YMIN_p= 0
$$ End of Bruker specific parameters
$$ ---------------------------------
##NTUPLES= NMR FID
##VAR_NAME=  TIME,          FID/REAL,        FID/IMAG
##SYMBOL=    X,             R,               I
##VAR_TYPE=  INDEPENDENT,   DEPENDENT,       DEPENDENT
##VAR_FORM=  AFFN,          ASDF,            ASDF
##VAR_DIM=   8192,          8192,            8192
##UNITS=     SECONDS,       ARBITRARY UNITS, ARBITRARY UNITS
##FACTOR=    0.0002496,     1,               1
##FIRST=     0,             0,               0
##LAST=      2.0444736,     0,               0
##MIN=       0,             -184218,         0
##MAX=       2.0444736,     125281,          0
$$ Real data points
##PAGE= N=1
##DATA TABLE= (X++(R..R)), XYDATA
0 0 0 0 0 0 0 0 0 0 0 0 0 0 -8 8 -8 8 -8 16 -16 24 -24 32 -33 40 -48 56 -65 79 -88 103 -116 132 -152 169
34 169 -193 217 -245 273 -306 342 -381 424 -470 521 -576 637 -703 775 -855 941 -1037 1143
52 1143 -1258 1388 -1535 1699 -1883 2094 -2342 2630 -2973 3391 -3918 4591 -5501 6794 -8789
67 -8789 12306 -20318 80703 -69637 -129834 125281 -10881 -110402 56331 72520 -70026
78 -70026 -1899 42343 -33230 -26928 29958 -13782 -23370 14843 1674 -26912 7895 15164 -15573
91 -15573 -13784 8176 1858 18676 33722 -2125 -24967 1812 -4230 -16067 27477 37221 -12485
104 -12485 -3701 21109 -21200 -25435 24527 2838 -23568 15403 4069 -34500 4062 19330
116 19330 -23206 -8354 18295 -13311 -9026 27911 -1670 -35086 1386 18344 -14463 896
128 896 41490 10466 -25610 6051 13435 -23302 -7079 27892 7555 -10543 3967 2273 -9071
141 -9071 -1223 5802 -1005 -8286 -4694 3008 -3442 -12242 254 4243 -13252 -5691 19848 5383
155 5383 -14361 5591 7299 -19587 -8293 17930 5546 -990 14951 5662 -12804 -2516 9206
168 9206 954 -2497 6065 3229 -8702 -3470 6757 -2454 -6348 4704 1755 -7271 -766 1704
182 1704 -6229 -6436 -2460 -2564 -1829 2217 9534 6071 -7533 -4404 5599 -5864 -5480 15761 8915
197 8915 -11549 3238 12709 -8045 -4083 16939 1625 -12351 6123 4555 -14312 -1648 11830
210 11830 -6707 -11076 8242 4290 -10868 48 7972 -9537 -13483 4021 4357 -5289 3347 8642
224 8642 -2233 -3985 2768 3778 1966 1416 2630 2894 -3013 -3515 8919 6033 -5228 4449 7475
239 7475 -11009 -5588 11364 -3804 -13601 5694 3107 -14725 212 13171 -6509 -9897 7793
252 7793 -872 -14199 3662 11018 -7717 -4417 12127 411 -7577 11796 10766 -9105 -1103
265 -1103 9991 -5974 -5987 11635 4516 -7858 2125 4613 -5843 -2143 4374 -1453 -5762 -4411
279 -4411 -3545 -1728 -2306 -532 4099 -145 -5640 1386 4298 -4813 -2332 6587 -327 -6125 7001
294 7001 10197 -2473 -226 9885 -1408 -9402 6396 8548 -7612 -2405 8657 -6146 -10474
307 -10474 8289 5535 -9729 309 5893 -10244 -10030 5338 720 -8085 1876 7283 -3496 -3568
321 -3568 6895 3560 -7057 -510 7552 -1739 -3200 9151 6039 -5754 537 6503 -2255 -2186 7243
336 7243 1775 -7739 -3452 1236 -3150 -4089 3486 3516 -4914 -4279 2068 -2815 -7167 1850 3304 -5270
352 -5270 -845 6489 -198 -1992 5425 2435 -4116 1003 6112 1520 -660 3228 2246 -4413 -1543
367 -1543 7478 2330 -5171 2122 4024 -9463 -6801 5522 -1209 -7695 4309 4586 -8749 -3545
381 -3545 6823 -2063 -7309 3146 3656 -5944 543 9647 -987 -6548 6106 6056 -5498 1510 10287
396 10287 -1484 -6526 4546 2104 -6694 525 8083 -205 -5261 -87 -237 -5682 -3114 2728 -890
411 -890 -5930 -6 3821 -2991 -3430 3721 -26 -4736 3173 5821 -2952 -2381 6342 2487 -5486 1255
427 1255 8638 636 -2036 5998 1148 -9553 -717 7877 -3373 -4990 6044 199 -8294 1557
441 1557 3485 -7497 -2887 5949 -2579 -6743 2732 2667 -4839 -487 5719 -555 -3803 4964 6054
456 6054 -3032 -2848 3825 667 -1949 4928 5502 -2385 -1387 3014 -654 -3693 -68 1959 -1042 -2421
472 -2421 303 -716 -5009 -911 4397 -2337 -5952 2278 2333 -5452 -193 5041 -3815 -3709 7615 4350
488 4350 -4758 1702 6422 -2353 -3875 5366 3340 -4489 1931 7136 -3351 -5889 5004 1888 -6173
503 -6173 1543 4167 -7567 -4767 5830 -969 -6991 1299 3544 -4231 -2202 4140 -339 -5177 683
518 683 4932 -1066 -2771 4762 4698 -2274 489 4704 -1691 -1935 5656 2865 -4793 -398 4124 -2008
534 -2008 -3272 2453 1379 -4775 -2392 3128 -2150 -6580 1115 2917 -5015 -2481 4615 -1403 -4552
549 -4552 4173 3495 -4862 -261 6333 511 -2159 3952 3716 -2532 23 5524 790 -3643 2342 3013
565 3013 -4269 -1560 3313 -2410 -4445 3075 1038 -6466 -1844 3250 -3228 -4888 2164 1075 -4031
580 -4031 -293 4446 -419 -2946 3022 3838 -1965 495 5404 180 -2203 4699 3222 -3654 459
595 459 4978 -1411 -3993 1637 1315 -4147 -2242 2203 -1202 -5208 -136 2196 -3906 -3138 3204 -509
611 -509 -4146 2488 3374 -3533 -1010 5534 667 -3311 3260 4722 -2010 -774 5139 875 -3567 1987
627 1987 4303 -2892 -2524 4056 -180 -5932 1039 3208 -5222 -3276 4240 -990 -6107 1125 3005
642 3005 -3848 -2278 3817 664 -2940 1356 3707 -1072 -1296 4060 2086 -2532 1881 4572 -1586
657 -1586 -1874 3966 1718 -3985 543 3257 -2369 -3196 2129 656 -4419 -921 2763 -2456 -3587 2471
673 2471 454 -4625 177 3916 -2659 -2344 4184 1203 -3654 1691 4493 -1250 -1045 4433 1528 -2736
689 -2736 1535 3514 -1585 -1858 3188 741 -4068 604 3416 -3151 -3419 2887 125 -5201 188 3195
705 3195 -3324 -3065 2948 407 -3400 325 2966 -1288 -2194 2962 2098 -2872 632 5028 -372 -2604
721 -2604 3540 2563 -3488 531 4113 -1768 -3330 2459 1188 -3612 -337 2959 -1978 -3452 1671
736 1671 751 -3936 -871 2703 -2017 -3275 2316 1832 -3312 469 4006 -1241 -2386 3424 2372 -2392
752 -2392 880 4011 -511 -2110 3097 2565 -2567 -575 3723 -1490 -4224 2460 2155 -4221 -1017 2947
768 2947 -2021 -3600 1457 1182 -3425 -1027 2465 -1141 -2584 1469 2801 -1071 -637 2915 616 -1757
784 -1757 2310 2974 -1822 -785 3522 292 -1813 2452 2044 -2331 -701 1849 -1448 -2897 828 1200
800 1200 -2957 -1986 1794 -590 -3372 1070 1942 -3560 -1643 3272 -289 -2772 2782 2585 -2499 203
816 203 4403 396 -1786 2274 2469 -2168 -911 3286 167 -2150 2141 2283 -3634 -2124 3014 -508
832 -508 -4138 326 1178 -3585 -2002 2800 -703 -3552 1183 2712 -1950 -1812 2851 681 -2729 1331
848 1331 3448 -1179 -887 4752 2265 -2838 784 2407 -2058 -1524 3042 187 -3623 426 2326 -2020
864 -2020 -2250 1879 230 -3861 -386 1727 -3192 -2640 2725 1069 -2884 638 2962 -1008 -475 3156
880 3156 370 -2625 1351 3529 -286 -805 2779 1301 -1890 544 2872 -1459 -2311 1748 448 -4049
896 -4049 -601 2128 -1761 -1614 2134 -394 -3767 -184 1840 -1619 -2090 1557 1057 -1428 1005 3328
912 3328 -745 -1590 2876 2033 -2163 786 2797 -1099 -1379 2542 335 -2224 1297 2905 -1762 -2719
928 -2719 670 -333 -3228 -529 1580 -1659 -2424 1807 1188 -3126 -611 2545 -1338 -2141 2370 1101
944 1101 -2262 1284 3519 -852 -1488 2857 1828 -1911 402 2348 -1441 -2342 2290 1851 -2355 -13
960 -13 2534 -1811 -3261 1355 31 -3911 -864 2782 -1157 -2875 1970 2173 -2026 -760 2536 -163
976 -163 -2399 1719 2642 -1947 -633 3529 1106 -1482 2446 2626 -2212 -1010 2321 -571 -2879 1221
992 1221 2002 -1828 -1622 1394 -549 -2919 343 1209 -2894 -1961 2140 -110 -2770 1639 2099 -1880
1008 -1880 250 2984 58 -2044 1582 1627 -1600 -285 3351 1012 -1325 1496 2118 -2315 -2156 2259
1024 2259 110 -3099 404 2120 -2810 -2044 2219 31 -2956 457 1440 -2366 -1859 1395 -31 -2095
1040 -2095 827 2664 -451 -53 2830 823 -2059 824 2307 -1555 -885 3401 711 -2165 690
1055 690 1473 -1948 -1345 2031 -393 -3262 -692 945 -2142 -1976 2023 485 -2677 512 2119 -2334
1071 -2334 -1964 2258 454 -1985 1353 3020 -577 -517 2607 1239 -1805 445 2620 -646 -1987 2026
1087 2026 865 -3163 -56 2726 -1066 -1986 1631 -67 -3697 -1277 1145 -1495 -1632 1802 1077 -1598
1103 -1598 460 2300 -694 -1596 1953 1223 -1873 911 2624 -863 -1297 2602 1496 -1585 502 2277
1119 2277 -1419 -2001 912 183 -2274 99 1990 -719 -1735 802 127 -2632 -660 1603 -1431 -1868
1135 -1868 2124 1105 -1575 776 2576 -503 -698 2232 1528 -1695 279 1816 -504 -1597 1815
1150 1815 1731 -1237 18 1861 -1718 -2996 621 435 -2389 -539 1625 -995 -1991 1396 696 -2100
1166 -2100 -432 1699 -666 -1890 1411 1339 -1368 83 3005 586 -925 2263 1719 -2284 -537 2033
1182 2033 -853 -1434 2234 1593 -1611 -687 1124 -1086 -2705 466 715 -2430 -1426 1737 -363 -2194
1198 -2194 1340 1950 -1857 -677 2243 8 -2032 956 1469 -932 50 2981 898 -1194 1353 1246
1214 1246 -1702 -1100 1704 107 -1556 848 959 -1797 -1059 1606 -453 -2508 447 987 -2129 -1330
1230 -1330 1094 -441 -1483 1391 1867 -947 -155 1760 -61 -2064 884 1743 -476 409 2706 387
1246 387 -1713 842 1486 -1291 -792 1680 -213 -2212 176 850 -2014 -1088 1866 180 -1955 -80
1262 -80 485 -2013 -1575 1986 111 -1674 1506 2231 -1007 -672 1940 61 -1456 1504 2068 -939 -393
1279 -393 1985 560 -1826 644 2103 -1022 -1379 1155 -291 -3141 -57 1204 -1208 -1152 1355 75
1295 75 -2082 222 1194 -1538 -1224 1761 813 -1422 591 2344 -633 -737 2218 1035 -1300 756
1311 756 2079 -946 -1643 1427 549 -1597 795 2163 -1007 -1718 1023 -93 -2755 -501 1324 -997
1327 -997 -1204 1555 495 -2340 174 1987 -574 -1082 1795 951 -1357 575 1742 -399 -170 2278
1343 2278 1419 -1030 -89 1217 -920 -1407 951 779 -1638 67 1639 -1307 -1926 889 54 -1946
1359 -1946 -71 1202 -1473 -1456 1303 970 -1245 500 2104 -146 -769 1286 835 -1460 277 2441
1375 2441 -217 -717 2055 1325 -1554 -99 1199 -1530 -1846 1250 490 -2074 -580 1200 -1096 -1780
1391 -1780 1031 762 -1805 -529 1447 -1017 -1949 1442 1143 -814 596 2406 -73 -1002 1209 955
1407 955 -1380 -117 2135 403 -1082 1416 915 -2007 -847 1785 -383 -1995 560 496 -2026 -1027
1423 -1027 1148 -606 -1201 956 1236 -1192 -935 1026 -175 -1493 1047 1721 -476 197 2119 333
1439 333 -1252 1098 1220 -963 -275 1884 -282 -1459 445 652 -1276 -669 1095 -390 -2091 -174
1455 -174 539 -1657 -1053 1540 555 -1058 970 1512 -1393 -491 1748 -50 -1251 1169 1604 -517 -35
1472 -35 1743 36 -1076 955 1610 -888 -1060 1037 -261 -2049 325 999 -1123 -603 1352 -681
1488 -681 -2114 8 675 -1352 -636 1210 373 -1310 839 1653 -927 -884 1652 661 -1152 741 1769
1505 1769 -701 -695 1609 558 -1121 713 1475 -1063 -1278 748 -302 -1652 245 1181 -1064 -1288 792
1522 792 -202 -1886 191 1058 -1187 -1081 1734 363 -1390 758 1554 -697 -135 1970 1062 -1176 303
1539 303 1226 -670 -945 1307 938 -1091 -34 1147 -1140 -1375 777 -3 -1433 -294 1055 -831
1555 -831 -1008 878 491 -1199 153 1296 -343 -1125 1159 729 -1222 176 1874 96 -385 1372
1571 1372 893 -1380 -25 1377 -865 -1113 1247 462 -1525 -215 731 -1026 -1363 782 147 -1785
1587 -1785 -492 1116 -705 -1144 1038 719 -1203 -3 1613 -403 -1014 1474 1110 -932 479 1833
1603 1833 233 -721 915 876 -1350 -483 1098 -19 -1301 425 551 -1595 -692 891 -371 -1147 606
1620 606 500 -1239 -676 823 -356 -1331 850 1112 -764 -19 1800 -65 -832 977 1093 -856 -138
1637 -138 1742 194 -1284 756 960 -1135 -395 1349 -387 -1814 127 422 -1343 -638 1015 -115
1653 -115 -1453 389 1013 -1363 -709 1569 51 -1189 1028 1388 -672 -120 1617 385 -920 837
1669 837 1183 -733 -398 1014 114 -1319 49 1271 -638 -798 806 -447 -1436 60 935 -1197 -744
1686 -744 1288 -145 -1194 -10 893 -766 -206 1417 305 -841 609 1230 -603 -398 1117 287
1702 287 -802 934 937 -1263 -565 1133 -328 -1348 559 865 -1285 -1209 581 -290 -1765 381 1185
1719 1185 -973 -1016 1275 -11 -1211 798 1176 -719 -548 1271 730 -1092 528 1452 -360 -475 1342
1736 1342 522 -883 -139 1106 -408 -1276 766 507 -1333 -135 842 -1295 -1578 790 260 -1611 96
1753 96 954 -668 -806 1106 524 -751 310 1630 -23 -576 1173 581 -868 2 1369 -509 -297
1770 -297 1365 269 -1256 -78 737 -820 -697 559 394 -1254 -422 384 -813 -1163 752 381 -1106
1787 -1106 13 1052 -765 -677 1042 951 -602 125 1579 -229 -621 1259 636 -840 133 1422 -96
1804 -96 -1091 740 728 -1235 -622 834 -460 -1118 496 196 -1359 -559 1116 -264 -900 631 614 -780
1822 -780 -165 1430 -166 -768 1071 1016 -479 190 1414 92 -764 885 691 -854 -175 1097 38
1839 38 -1026 326 389 -1233 -402 803 -321 -1343 559 391 -1227 -571 1071 -322 -900 656 870
1856 870 -915 -51 1433 312 -499 761 1102 -439 -42 999 254 -946 681 794 -1008 -720 1134
1873 1134 -264 -1481 429 379 -1153 -571 740 -333 -1124 354 691 -576 -422 903 125 -932 368
1890 368 1109 -645 -355 1290 342 -650 611 1202 -534 -250 886 227 -846 454 871 -1121 -810
1907 -810 507 -110 -1216 -60 668 -957 -864 901 -85 -1280 381 1085 -551 -424 1238 414 -924
1924 -924 370 1135 -311 -727 893 388 -930 353 908 -473 -582 1042 246 -1314 -111 730 -789
1941 -789 -992 630 -148 -932 169 1028 -693 -942 545 5 -1010 345 947 -256 -219 1191 704 -828
1959 -828 376 1018 -366 -415 834 424 -784 107 794 -546 -1013 902 335 -961 -207 548 -773 -878
1977 -878 615 257 -1125 -288 1024 -401 -947 933 271 -680 262 1242 32 -536 907 639 -263 52
1995 52 1127 -395 -422 733 452 -1000 -513 881 -187 -811 341 503 -874 -298 563 -934 -1028 375
2013 375 246 -1033 -85 893 -143 -706 719 692 -797 53 1051 18 -457 779 838 -623 109 1171
2031 1171 -130 -960 255 703 -1033 -379 569 -419 -596 175 491 -988 -484 684 -318 -943 337
2048 337 721 -727 -236 985 403 -581 532 941 -544 -63 997 -241 -437 414 662 -434 -147 976
2066 976 169 -1291 78 251 -847 -599 460 -217 -1145 271 573 -1067 -348 789 -256 -918 325
2083 325 745 -591 -260 885 350 -789 740 953 -506 -265 848 -120 -1010 355 714 -567 -487 718
2101 718 130 -1157 -25 469 -725 -919 460 56 -1226 207 588 -722 -367 898 155 -709 283
2118 283 666 -680 -200 993 365 -469 271 641 -338 -476 644 91 -902 55 459 -391 -683 463 242
2137 242 -1048 -323 495 -745 -765 432 -111 -672 -280 491 -514 -449 575 373 -805 125 867 -178
2155 -178 -394 770 709 -381 410 1088 -328 -329 581 27 -827 66 637 -979 -829 503 -88 -840 -250
2174 -250 768 -602 -700 523 87 -1004 3 1017 -128 -222 1171 621 -740 39 968 -16 -421 443
2192 443 651 -560 -393 363 -371 -659 838 299 -1057 -212 334 -602 -857 478 96 -733 -68 729 -53
2211 -53 -669 370 622 -573 -106 980 -6 -459 780 747 -644 -55 924 -65 -396 696 318 -814
2229 -814 30 667 -239 -413 496 10 -950 -567 315 -689 -818 388 340 -841 -102 653 -145 -206 485 608
2249 608 -663 -28 979 15 -354 904 881 -459 25 934 -22 -690 288 417 -955 -418 772 -107
2267 -107 -842 418 241 -954 -546 381 -153 -645 160 333 -520 -392 977 -105 -452 556 840 -371
2285 -371 -150 915 -154 -630 690 994 -449 116 1053 -91 -871 252 575 -689 -353 483 -128 -835
2303 -835 18 337 -561 -316 477 177 -746 71 503 -609 -168 871 328 -529 449 709 -338 -125 824
2322 824 262 -540 -90 511 -342 -220 354 -2 -458 -178 613 -819 -720 532 -118 -751 132 297 -513 -177
2342 -177 648 87 -827 107 853 -341 -209 534 551 -771 563 579 -476 -462 796 -51 -915 29 786
2361 786 -589 -523 688 170 -783 0 516 -511 -554 123 55 -304 223 738 -487 -344 650 169 -621 130
2381 130 575 -368 -20 832 254 -677 26 465 -297 -179 672 -48 -603 -373 458 -303 -522 532 449 -663
2401 -663 -206 501 -652 -735 417 182 -757 -137 955 51 -312 723 390 -575 504 952 179 -192 495
2420 495 458 -477 -201 667 57 -542 478 -8 -936 -223 498 -84 -422 652 205 -568 -246 758 -422
2439 -422 -822 464 424 -403 -64 486 -164 -467 449 409 -153 -37 683 121 -534 250 477 -560 -325 872
2459 872 -353 -655 414 319 -793 -342 657 -220 -685 385 307 -716 -103 554 -157 -331 134 478 -351
2478 -351 -126 833 -75 -595 555 796 -303 44 654 -190 -661 434 221 -440 -65 497 -347 -695 204
2497 204 304 -538 -502 324 -58 -762 -26 146 -273 -199 429 55 -380 518 449 -424 -288 831 162 -450 354
2518 354 806 -383 -319 468 25 -506 150 503 -486 -456 303 -173 -693 -149 568 -661 -299 545 -167 -680
2538 -680 196 529 -194 -321 728 210 -293 278 437 -499 -181 799 88 -243 201 631 -320 -255 296 164
2558 164 -318 -203 -83 -609 -345 370 -15 -665 39 544 -376 -213 489 1 -585 127 569 -177 85 642
2578 642 267 -618 -61 733 -11 -348 672 307 -640 210 691 -220 -549 676 138 -676 -172 333 -493
2597 -493 -499 474 -20 -294 192 466 -159 -271 158 323 -291 102 813 -24 -241 542 431 -427 115 699 -375
2618 -375 -385 410 6 -603 -190 606 -283 -292 352 125 -782 -273 11 -632 -555 410 472 -405 -208 725 19 -157
2640 -157 753 435 -284 -4 938 -21 -403 405 107 -490 11 645 15 -315 145 126 -349 -186 431 -150
2660 -150 -821 82 287 -777 -117 360 -284 -492 87 343 -259 -325 542 58 -335 740 670 -258 -22 756
2680 756 111 -457 110 403 -201 99 463 -140 -584 310 384 -583 -239 192 -96 -847 45 170 -335 -394 432
2701 432 -284 -91 45 407 -377 39 697 136 -306 428 427 -327 -163 432 -7 -143 173 344 -382 -610 497
2722 497 -192 -399 286 129 -413 -556 237 -5 -654 213 304 -296 -179 353 41 -454 116 484 -152 -99 380
2743 380 215 -283 593 482 -319 -274 467 91 -503 41 357 -594 -461 393 -81 -511 -39 140 -298 -706
2763 -706 117 -9 -526 238 230 -325 -233 542 239 -730 252 549 -138 -139 664 112 -105 372 690 -112 -227 435
2785 435 97 -630 -158 291 -277 -484 -8 30 -713 67 326 -457 -368 388 -45 -497 107 578 -137 -365 485
2806 485 182 -286 75 598 -139 -327 620 428 -415 127 505 -168 -308 267 40 -324 -23 401 -337 -424
2826 -424 318 115 -437 -34 272 -548 -285 617 383 -428 327 405 -287 -168 463 -72 -251 -112 614 -3
2846 -3 -370 239 313 -497 16 377 -288 -637 137 293 -738 -143 481 -448 -578 334 97 -496 -95 430 -248
2867 -248 -232 399 537 -233 14 380 -61 -228 612 490 -286 122 492 -150 -544 196 387 -392 -303 401 -258
2888 -258 -664 225 363 -380 -250 174 88 -414 203 206 -384 224 380 62 -258 94 471 -181 21 455 182
2909 182 -301 586 254 -476 -267 274 183 -398 257 176 -355 -308 196 -98 -397 -54 234 -412 -344 167 -212
2930 -212 -414 491 479 -291 -109 511 144 -294 190 523 -144 -38 508 118 -327 190 351 -570 -35 552
2950 552 46 -774 -15 353 -373 -470 457 402 -508 -95 131 12 -284 480 303 -531 91 225 -45 -186 470
2971 470 246 -332 81 573 -97 -172 541 11 -385 115 407 -192 -391 126 167 -642 -65 105 -556 -370 73
2992 73 46 -420 -27 360 35 -202 470 362 -190 94 350 -3 -313 259 237 -357 182 499 -62 -192 348
3013 348 230 -394 -216 220 -270 -592 346 174 -234 -185 303 -146 -484 313 38 -357 -28 310 -63 -428
3033 -428 515 188 -159 279 456 18 -376 442 240 -308 112 277 -178 -430 198 71 -517 -79 525 -221
3053 -221 -554 186 46 -371 -231 390 -11 -375 380 428 -128 42 615 -234 -327 165 366 -304 119 552 163
3074 163 -129 264 373 -340 -39 282 -512 -406 163 -31 -300 -33 241 -139 -391 209 159 -467 -198 629
3094 629 -179 -360 389 416 -119 199 268 260 -20 106 327 -289 75 434 62 -258 280 227 -515 -260 276 77
3116 77 -558 82 104 -612 -241 454 -126 -258 153 209 -128 -214 451 123 -73 170 454 -114 -120 803 265 -126
3138 -126 -182 584 -40 -77 198 157 -464 165 358 -292 -75 246 -225 -477 190 -21 -393 -38 309 97 -375
3159 -375 126 317 -266 -94 437 38 -423 354 614 104 27 217 146 -498 154 252 -147 -234 336 -159 -314
3180 -314 155 8 -96 -154 32 -11 -327 -127 22 -220 15 366 216 -31 -37 300 -80 -365 405 291 -393
3201 -393 25 157 -145 -121 120 343 -612 -87 247 -520 -362 344 -1 -599 -119 224 -223 -290 286 112 -229
3222 -229 -168 320 -100 -223 474 326 -113 238 635 -471 -40 486 137 -208 64 416 -198 -283 273 242 -203
3243 -203 -21 260 -106 -212 171 281 -515 -181 312 -365 -53 199 378 -259 -194 265 -69 -214 265 230 -156
3264 -156 184 379 -29 -203 226 180 -295 -398 436 -87 -498 38 61 -565 -487 238 -510 -359 -154 314 -414
3285 -414 -180 414 70 -228 297 131 -363 69 340 -258 -175 268 277 -107 122 394 106 -102 -28 512 -392
3306 -392 -239 141 -26 -406 -54 264 -226 122 326 -260 -606 114 100 -173 -459 533 377 -292 272 113
3326 113 119 -240 367 -85 -402 150 63 31 30 514 -235 -234 567 361 -349 -166 229 -290 -437 243 127 -191 -367
3349 -367 243 51 -497 -204 197 -128 -120 323 33 -209 244 390 -270 -313 211 93 -420 22 388 -215 -428
3370 -428 376 49 -501 193 320 -192 -251 321 85 -650 227 146 -255 -482 586 -51 -351 4 253 -44
3390 -44 -264 240 143 -67 420 414 -171 -378 419 169 -206 21 275 -446 -156 16 32 -519 -110 123 -454 117
3412 117 295 152 -447 7 270 -158 -255 360 164 -27 91 535 -47 -86 -67 223 -86 34 374 49 -301
3433 -301 238 236 -301 -120 231 -193 -158 59 36 -584 -82 391 -232 -224 3 68 -437 -9 78 -24 -366 308 317
3456 317 172 284 210 36 -97 387 186 -319 95 244 -327 -192 107 78 -286 26 34 -104 -341 105 -38
3477 -38 -407 -327 160 -134 -148 397 82 -325 -220 57 -46 -109 171 228 -64 -289 369 -8 -228 211 213 -248
3499 -248 51 212 -15 -180 294 128 -403 148 72 -176 -453 192 157 -377 -27 429 125 -243 63 373 -143
3520 -143 -22 431 106 -38 173 154 6 133 257 -80 -180 181 404 -207 -292 455 -47 -234 26 104 -146
3541 -146 93 172 -239 -211 124 49 -398 -260 344 -124 -191 71 420 -166 -271 283 -1 -561 95 226 119
3562 119 -183 352 225 -407 174 81 -125 -153 43 -9 -388 -76 361 -265 -322 225 -209 -240 -96 129 -110 101
3584 101 126 381 -307 86 614 -131 433 139 128 2 79 217 -174 -64 119 -89 -262 263 290 -222 -421
3605 -421 9 86 -148 -29 32 -238 -170 -37 -5 -179 -42 147 -130 -281 382 83 -221 183 556 -74 -269
3626 -269 109 78 -223 -99 352 -18 62 178 5 -269 -51 240 -212 -457 2 249 -258 -232 271 36 -201
3647 -201 320 141 -184 -50 235 -272 -215 328 203 -635 7 147 -135 -48 208 41 -95 221 2 14 -137
3668 -137 167 220 -449 -135 207 -245 16 47 128 -347 116 477 -50 -301 146 217 -250 33 360 -130 -158 62
3690 62 140 -207 160 601 162 -348 312 311 -175 -288 148 70 -328 90 95 -500 -200 324 61 -378 321 104
3712 104 -146 124 169 130 -197 202 322 -44 -49 214 -121 -29 -74 103 -252 -283 211 133 -68 177 137 -376 -101
3735 -101 47 -117 -174 82 -34 -188 -232 227 79 -321 181 195 -396 -124 79 63 -160 178 286 -104 -150 396
3757 396 208 -21 88 314 -236 -299 -21 206 -293 63 215 -130 -358 165 -45 -257 204 192 -213 -201 99
3778 99 -157 -222 35 267 -47 -111 643 274 -26 61 223 -144 -2 488 152 -105 220 310 -340 -396 272 64
3800 64 -36 77 231 -217 -164 87 122 -359 -105 152 -209 -175 214 207 -254 74 332 101 -100 153 375 29
3822 29 184 560 -163 -88 140 151 -149 21 243 -87 -365 -72 14 -349 34 -25 -54 -564 76 -46 -65 -80 -7
3845 -7 -296 -173 19 354 -165 2 366 -78 -193 134 49 -12 -73 237 -49 -219 65 -113 -232 149 149 -185
3867 -185 -253 -307 42 -128 -133 -71 -226 -241 258 176 -177 -236 136 -88 -117 68 303 -281 -132 23 -3 -228 -83
3890 -83 -87 -196 -189 161 163 -342 85 -97 -436 13 343 58 -244 3 134 -248 135 190 168 -130 51 163 -116
3913 -116 53 266 25 -232 113 198 -171 51 459 84 -221 49 320 -329 -46 256 -16 -299 3 63 -270
3934 -270 -24 138 -133 -482 -30 366 -152 -304 253 -13 -88 240 136 -153 -76 120 270 -188 23 8 -163
3955 -163 -83 13 -28 -402 332 -49 -144 -58 -36 76 -252 42 -2 -208 -77 100 -16 -193 55 176 -329 0
3977 0 238 23 -26 137 379 -154 -152 237 59 -289 27 48 -139 -92 308 30 0 169 204 -61 -504 97 188
4000 188 -333 131 250 -234 -147 279 114 23 135 165 -298 -65 382 -220 -164 109 345 -220 -166 81 -5 -136
4022 -136 113 64 -43 -193 309 114 -175 239 246 1 5 95 184 -196 152 324 4 130 133 207 -133 -265 276
4045 276 -118 -221 311 315 -177 58 446 -95 -144 243 -41 -178 -19 561 7 -529 358 -60 -143 -63 170 -131
4067 -131 -478 187 145 -221 31 443 -233 -286 139 -189 -102 -76 277 141 -74 338 301 -196 -113 176 -48 -44 27
4090 27 -13 -46 25 293 -138 -427 -6 -30 -233 -110 -91 274 -270 -54 55 209 -200 312 34 -80 272 211
4112 211 -199 163 274 -14 -325 -79 261 -154 -99 196 -48 -174 102 80 -297 219 -5 -122 -364 -82 189
4133 189 -298 -133 352 148 -241 286 104 -247 -170 503 39 -44 -161 115 -120 -126 181 169 -166 348 247 -315
4155 -315 -152 158 67 -202 29 70 -312 -298 264 -78 -196 138 273 -34 -367 32 -53 -78 56 -16 131 45
4177 45 182 90 -62 71 245 -170 -145 449 224 -339 66 347 -324 -5 113 -52 -406 -177 194 -323 -149
4198 -149 9 -23 -328 259 431 -536 -303 96 -101 -436 200 501 -123 27 142 438 -124 -37 420 -256 82
4219 82 225 -18 49 -201 138 -197 -338 177 -216 -361 20 100 -28 -238 207 18 -122 -174 212 113 -177 296
4241 296 361 -259 73 546 26 -122 240 -20 -180 -8 111 -369 -275 7 31 -16 -112 270 79 -135 140 18
4263 18 -290 -214 276 123 -67 160 213 -94 -27 494 58 75 91 209 -83 -241 -33 -47 -62 -80 186 -109 -108 267
4287 267 -90 -376 48 123 -139 112 158 -133 -357 249 174 -222 -143 321 174 -107 51 25 33 -85 250 -150
4309 -150 79 82 74 -98 138 383 -123 -199 -18 210 -163 45 -69 46 -262 100 108 -204 -279 91 -63 -13 27
4332 27 -9 -251 193 84 169 -168 118 173 84 -63 272 58 -133 164 30 -278 -103 427 -36 -238 -43 417
4354 417 -408 -266 540 49 -201 -72 126 -16 -35 84 29 -103 256 268 -165 9 158 26 -104 139 137 -220
4376 -220 -206 57 -2 -255 314 130 -130 120 85 100 -387 107 -18 -295 -287 202 -213 -139 87 354 -278 -259 103
4399 103 -53 58 123 197 -103 11 262 334 -13 -186 36 -41 -217 226 -125 -146 8 192 -195 -266 48 167
4421 167 -214 -20 9 -48 -97 119 -48 -216 -242 149 -333 -132 200 135 -334 210 278 122 -14 311 91 -276
4443 -276 71 281 -3 -7 260 -101 -125 -59 204 -269 -227 57 -32 -372 55 65 -93 -58 87 31 -220 61 174
4466 174 -128 -229 276 -77 -89 -20 210 -85 -110 317 47 -94 51 83 -94 -272 87 432 -86 -27 -29 -129
4488 -129 -349 35 -228 -129 -122 246 -87 -343 -103 176 -37 176 294 -127 -149 372 359 -73 -171 451 -8 -138
4510 -138 91 116 -263 293 -23 -50 -238 -156 -156 70 34 104 82 -216 83 87 -7 103 361 -36 -229 55 357 -146
4534 -146 -228 314 185 117 114 376 -162 -229 319 70 55 263 -40 -128 -3 442 -179 -428 47 -41 -135 -262 365
4557 365 84 -74 250 85 -217 149 299 -4 -334 51 503 -161 -205 301 204 -65 106 299 -80 16 388
4578 388 32 -269 -114 88 -511 -216 228 -177 -318 201 90 -199 -90 197 86 -195 272 81 -145 -94
4598 -94 344 -204 -110 142 180 -369 98 204 23 -30 -211 -116 -167 115 2 41 -304 157 108 -100 -87 192 317
4621 317 -170 -27 272 -94 -150 181 -28 -90 363 -33 61 1 37 244 70 62 337 -261 27 438 170 -146
4643 -146 42 260 -105 -19 325 -4 -269 87 42 -192 -168 469 115 -71 -85 121 41 -477 245 55 47 136 364
4666 364 -112 -125 295 75 65 137 88 -86 -202 237 53 -305 -107 166 120 -197 114 61 -243 -2 -100 -114 -449
4689 -449 80 62 -135 -205 -40 95 88 108 213 -105 55 147 -52 38 -40 -17 -14 -88 101 -27 -484 111 -21 -369
4713 -369 -125 74 -56 -239 48 -43 -228 29 -14 -109 3 179 -10 64 209 39 36 -134 242 126 4 -18
4735 -18 137 -34 -507 455 361 -185 134 -103 126 -83 250 44 -416 27 251 75 -139 49 305 -262 49
4756 49 149 -279 -93 202 224 -302 152 209 106 -132 81 219 29 77 93 -116 -171 138 180 -108 -141 44 -152
4779 -152 -145 -295 43 12 -114 -6 -201 -219 254 271 205 -204 215 89 -286 58 -24 -61 -252 263 -252 -20 30
4802 30 101 -256 -136 240 -193 -112 -162 321 -177 -15 120 116 -39 40 -345 -282 -231 111 93 -402 -43 78 -8 142
4826 142 267 132 -93 148 42 -128 46 -181 -236 -53 118 291 -158 -141 14 -236 -14 -27 24 -276 116
4847 116 17 -169 -156 -112 152 -349 -475 76 135 -258 78 174 -123 17 344 123 -14 81 289 -13 44 294
4869 294 124 -166 124 115 -148 -133 123 -99 -61 -52 300 119 -107 317 -64 112 -59 247 -129 -125 116 44 7
4892 7 57 406 -56 138 298 239 -118 331 196 -142 -144 77 120 -114 -310 -255 -171 -73 -65 -105 -127 -48 148 -56 -223
4917 -223 114 -88 -204 164 268 -160 -201 401 -30 -101 -214 303 37 128 275 -206 -192 35 176 -16 -156
4938 -156 -51 279 -249 106 -43 -223 -56 125 25 175 -77 -6 -66 -137 169 158 -157 174 130 -293 -187 39
4960 39 83 -132 -272 200 90 -6 85 271 109 315 258 -28 -127 164 213 -284 -74 130 -397 -332 140 8 160
4983 160 19 93 -32 -128 -12 94 -46 -26 72 63 -205 -127 48 178 -185 315 -56 -175 51 -208 -234 -3 115
5006 115 -135 -42 189 100 -408 -306 -128 226 -240 -16 168 -335 -105 288 -120 -79 172 -5 31 128 306 157
5028 157 -74 33 173 -512 -220 251 -112 -274 118 -14 58 -36 184 -176 -233 -120 323 -34 -123 193 -69
5049 -69 -129 -53 -43 -131 94 235 27 -309 136 201 -43 -106 70 -246 -323 118 367 -363 46 54 90 -63 121 -64
5073 -64 -238 -369 77 -41 -152 79 153 -300 -250 260 -134 28 -133 137 -54 90 -20 128 -83 -31 134
5094 134 91 155 259 -64 -127 -68 45 -225 -213 226 -53 -183 68 196 -31 -31 237 248 -34 57 99 -193 151
5117 151 30 -152 -58 221 236 324 -65 -24 -131 -33 -343 172 -60 -262 218 144 -272 -305 -23 -424 -284 -64
5139 -64 -21 -477 -205 174 -83 -221 149 23 -255 -76 232 -25 -81 207 -72 -223 139 295 -140 14 281
5160 281 203 -51 -50 44 -68 39 18 59 -97 -244 39 200 132 12 -77 47 121 430 27 -265 150 -60 -169
5183 -169 -119 -10 18 -97 60 137 -402 12 230 50 4 -123 -110 -61 25 277 -89 -229 99 49 -223 -115 188
5206 188 -7 -314 137 -42 -85 -225 205 -178 108 182 81 127 69 73 24 -83 119 144 -131 267 337 156 -49
5229 -49 -69 189 -140 20 -61 -258 -183 121 64 -172 258 206 70 -233 98 -178 -175 -83 210 76 -85 -60 235
5252 235 -237 200 176 54 -224 244 -8 -54 -152 303 -6 -273 -40 -44 163 -298 112 -111 -205 -10 -154 -174
5274 -174 116 272 45 -223 -119 127 -1 -24 136 195 150 -29 136 72 77 296 -67 -181 221 272 -106 6
5296 6 170 53 119 16 150 -241 -48 175 125 -255 -162 80 -312 -79 59 -33 -177 61 209 -215 53 27
5318 27 50 -3 90 130 -322 149 89 172 -226 -86 16 -237 -62 75 131 -406 -71 26 -308 -65 308 6 -160
5341 -160 -23 225 -81 143 241 75 -179 -226 -13 -31 123 240 51 67 33 267 -98 46 -7 55 -325 60
5363 60 100 -269 -377 -144 -76 -353 -96 11 -185 228 -59 266 -144 -21 72 22 57 75 85 -78 -36 72 -74
5386 -74 -329 364 218 46 39 152 -178 -16 62 120 -73 -95 222 -85 -267 3 358 -152 -73 305 -103 -92 -30
5409 -30 156 -438 -21 99 -266 -88 508 162 192 -168 237 -75 52 -143 254 76 149 128 -7 -151 110
5430 110 249 -120 -328 -220 -27 -178 -30 14 72 79 224 100 -148 124 -255 -93 85 267 99 -126 61
5451 61 -130 -97 98 124 29 -316 123 64 -547 -90 187 15 14 150 101 -225 -463 -58 -46 -269 187 124 -140
5474 -140 -103 -117 60 -338 175 95 -60 -191 286 223 -164 308 302 -189 71 251 292 -224 166 71 -246 -41 -41
5497 -41 -58 -81 -276 -174 -242 -119 70 -203 -132 53 -18 15 -175 285 71 -72 -61 306 -46 -250 -51 -26 -51
5520 -51 -35 -1 -85 197 248 142 -136 -10 56 -92 65 -204 -161 -443 -46 167 -51 -22 160 -33 -148 65 219
5543 219 51 -6 332 -2 -122 -56 121 -8 -163 179 109 -178 135 114 -262 -157 180 200 -190 -60 42 2
5565 2 -198 40 146 -259 -118 270 -4 52 293 -44 -187 -23 109 -107 -36 257 173 -326 97 292 -149 -129
5587 -129 245 182 -203 106 227 -187 -290 89 29 -128 -138 -296 -26 25 -71 205 -193 -152 -51 -47 -265 23 -228
5610 -228 -373 108 128 -100 7 -27 88 128 -95 156 -199 -322 161 -158 -258 -110 101 43 -94 300 84
5631 84 -181 -226 -172 -132 -294 84 117 -143 -169 218 -56 -207 80 229 4 27 227 85 -343 112 -266 -430
5653 -430 87 288 -220 -51 195 46 -186 126 -33 -181 -167 -113 -44 -71 239 183 -54 41 202 -58 -251 242
5675 242 76 273 -71 209 -84 -182 -143 129 -117 -337 2 47 1 -45 339 -307 194 36 196 -463 -84 225
5697 225 108 -248 36 37 45 -93 52 157 -56 37 62 8 51 258 17 -121 109 247 -270 -210 391 23 -320
5720 -320 -9 -183 -135 -69 139 51 -128 176 -114 -90 28 165 108 -80 181 -11 67 -41 329 239 -150 244
5742 244 78 -186 -17 212 29 180 159 16 -65 -264 146 -46 -265 90 139 -256 -186 246 14 -176 161
5763 161 256 -73 -253 60 160 -17 154 202 -158 141 9 174 69 92 338 -217 -108 -109 -136 -133 58 41 -250
5786 -250 -170 303 -109 -37 -95 -44 2 -87 -232 -151 -133 29 261 -301 93 96 -172 -65 206 167 108 -9 217 -74
5810 -74 -230 -5 160 -283 -130 74 -94 -75 69 69 3 -286 -145 238 -27 99 -89 -125 -352 116 -78 -53
5832 -53 226 233 77 -78 68 154 -117 277 182 140 100 181 274 -159 106 -246 -57 -2 -87 -9 -316 -125 -51 -246
5856 -246 -156 -24 -122 -272 -56 290 -76 91 -92 240 -253 171 272 171 -171 14 50 -46 -125 -56 -17 -58 -45
5879 -45 -72 -38 -61 52 -38 -29 85 -60 -426 -66 -61 -29 -64 21 259 -138 -97 352 57 -215 -205 -126 -72 113 266
5904 266 -54 -207 10 -36 -153 -18 80 -37 23 -169 50 -150 -62 312 335 -93 290 -2 -236 122 -92 225
5926 225 -194 -206 132 -34 77 -208 224 -186 354 186 -262 -43 96 -75 -87 176 303 119 -49 -29 24
5947 24 -162 166 52 -15 108 202 -204 -65 -116 357 -251 -251 156 -93 -86 61 244 93 147 40 58 89 -84 51
5971 51 -327 -173 177 -36 -27 126 151 36 13 117 -221 85 62 -42 -127 69 86 -210 152 315 -121 -81 21
5994 21 177 74 -242 43 -4 -53 384 64 124 12 131 -4 126 -46 244 50 -47 196 -21 39 -255 97
6016 97 49 -484 -53 -59 -281 -48 106 145 -245 -139 222 112 -23 41 201 130 128 207 -72 -215 290 79 -77
6039 -77 -145 156 -114 -220 309 -314 -233 -113 12 -159 22 -101 53 -370 53 12 24 -27 242 53 -170 126
6061 126 307 -179 -564 66 -167 -5 -72 118 -35 34 -135 212 -182 -89 19 213 -17 -275 7 -185 -143
6082 -143 192 62 -411 289 -28 -219 -235 -214 5 -162 93 149 242 -132 416 -165 -11 178 -55 -44 32 90
6104 90 -284 120 234 57 -392 60 -72 -141 60 70 277 -270 -37 -47 -38 -213 -200 -19 -196 194 168 -157 92
6127 92 -106 175 -60 53 14 -39 -302 170 122 -280 -4 -3 -54 -45 155 -51 -346 43 31 -57 -261 161 50 -312
6151 -312 -76 -4 -32 -229 149 157 -50 63 335 -101 -5 141 198 18 -111 242 -135 -111 298 136 -17 -105 260
6174 260 146 -9 -217 -166 -386 -69 172 31 -355 293 -140 37 -252 -222 -22 -426 113 -168 151 -302 143
6195 143 73 69 76 162 -255 -234 105 323 -42 154 113 -241 -199 34 166 -114 -229 -129 -97 -155 258 -15 -245 -5
6219 -5 109 -301 -288 134 -160 -44 178 118 127 112 337 -93 -149 -70 160 -126 74 315 -156 -76 -66 217 -185 -151
6243 -151 -48 -45 -164 23 114 -170 -221 -104 241 -83 178 173 -60 -130 256 176 -165 9 253 -125 -54 298 385
6266 385 41 69 275 -46 -76 20 -186 -277 122 140 -79 -290 162 167 -62 -34 77 -184 111 17 37 -28 31 150
6290 150 74 -398 273 -49 -51 67 156 -245 -63 130 8 -362 66 152 -164 70 12 105 176 -188 266 -55 -138
6313 -138 127 204 -75 -149 187 30 -23 186 -117 -174 -24 278 24 -448 276 37 -74 202 81 -92 -26 -42
6335 -42 188 145 -121 242 -20 -79 -44 81 -18 -25 -99 -198 49 68 136 -314 71 67 198 -66 85 113 -64 -279 105
6360 105 134 64 -147 116 -16 8 118 101 -32 110 243 -169 60 240 -22 -202 -14 227 -288 -206 71 171
6382 171 -35 41 199 -112 -262 266 -6 -487 -7 140 -104 36 406 30 190 128 51 -110 -101 331 -166 -40
6404 -40 87 -45 -290 -10 187 14 -350 45 230 -236 -275 164 227 -263 308 48 -221 -13 67 57 -164 236
6426 236 104 -81 -85 335 218 -43 152 359 106 2 32 -230 31 -240 -222 -176 -83 -47 99 -47 -121 -18 -164
6449 -164 38 78 181 -219 287 226 35 193 294 70 -92 45 182 153 -220 424 100 -213 238 248 -58
6470 -58 -197 296 108 -224 -209 152 216 -91 -4 63 -297 -329 60 162 -25 380 -16 -192 99 -61 -306 -159
6492 -159 54 -50 -76 242 56 118 244 451 -43 -178 -115 -115 -34 -273 146 63 -401 76 99 -206 8 109 -17
6515 -17 -327 98 176 -125 -27 -60 116 -190 -223 137 -36 -125 242 96 -272 -180 1 49 -243 -13 -41 -184 200
6538 200 -110 -212 120 -104 169 -157 -223 58 44 -17 21 248 -154 -168 58 63 13 141 181 -34 35 254 106
6561 106 -140 194 76 -22 10 174 222 -139 78 163 -128 18 229 163 17 -148 -9 -185 96 168 -87 -148
6583 -148 136 186 159 -127 199 -70 -41 163 272 29 -322 60 -147 67 218 -53 175 -148 331 67 -342
6604 -342 -77 50 -80 146 67 86 -281 -191 61 -42 -88 118 27 -235 329 323 -190 -44 231 -123 -154 369 181
6627 181 -247 -14 21 -13 199 -48 18 -388 -126 -42 155 -174 230 273 -341 32 71 48 -132 184 335 71
6649 71 -51 290 135 -77 -25 -20 -109 -112 194 -169 -39 60 39 12 -137 -52 229 -199 386 104 93 -182 36 -67
6673 -67 -208 35 332 1 12 485 75 23 101 -7 -44 -269 -127 159 -204 -60 -22 50 16 178 69 3 -360
6696 -360 -47 13 -197 184 298 -484 53 45 -253 54 144 44 -116 157 245 202 -94 153 -58 62 -79 127
6718 127 64 -272 228 13 -87 261 -11 -95 123 -139 -114 -23 -152 95 -331 -299 89 -134 -188 52 -127 -275
6740 -275 -299 -2 -68 -316 32 146 -78 -32 24 13 -229 45 108 26 -38 160 -27 3 118 20 -252 -72 -229
6763 -229 308 -295 -132 133 202 -261 136 -172 -307 256 158 -154 80 73 55 -266 -388 193 -269 -158 198 292
6785 292 -124 144 115 109 -58 -25 104 -126 -113 111 17 -195 19 -85 -229 -291 -86 -268 -59 -2 7 -202 -114 12
6809 12 -195 19 -84 390 -72 -31 125 93 55 -262 141 -339 -63 120 -24 17 -185 -356 -188 136 141 -63
6831 -63 -102 -242 253 -204 41 89 84 -582 128 -56 -44 -77 -99 133 -5 33 223 -9 -101 128 18 -184 -180 -43
6855 -43 -177 -137 61 279 -209 395 299 -84 78 281 37 -23 171 126 -195 -149 429 -23 -133 -10 126 -67
6877 -67 22 96 99 70 147 -16 -339 71 130 246 -82 -132 -11 -337 -273 76 -7 -206 -66 -42 -228 -110 203 -114
6901 -114 -196 186 101 -1 -91 108 38 -386 31 10 54 147 -28 158 -61 -112 194 41 187 -8 -102 -190 208
6924 208 36 -281 -16 245 93 -395 20 -125 -23 4 36 51 -214 98 75 -167 -31 234 203 -189 -61 103
6946 103 -42 66 129 -14 99 -126 232 35 -28 128 134 -38 -74 257 74 -102 -99 91 -100 19 -55 -123 -111
6969 -111 18 191 -198 -39 187 160 -15 -59 129 -70 83 61 -448 -66 329 -143 -195 -89 140 133 94 -28
6991 -28 37 -89 -8 -13 -160 144 -183 16 -87 -206 122 -3 -106 29 117 -89 -155 260 -111 -93 62 -137 -132
7014 -132 -20 202 146 -166 9 59 -154 -250 337 -68 234 -164 -157 -259 -123 -25 102 106 84 38 -92 -90 100 -241
7038 -241 -357 -60 200 -73 26 -108 -57 65 -18 93 -106 -70 101 155 59 -154 -165 -58 -102 313 -164 -41 -20
7061 -20 36 -109 42 39 41 -303 235 96 -76 -169 177 100 -268 123 5 -208 32 -46 76 -51 70 -172 56
7084 56 -169 -190 253 -188 42 229 29 -78 138 -173 -20 30 206 -408 114 154 19 -276 285 211 129 -21
7106 -21 158 199 -128 248 -60 20 -157 21 30 -201 -82 174 -84 6 93 114 -45 -100 -43 102 -103 16 42 -206
7130 -206 69 58 -378 139 -128 135 -49 -83 132 30 -112 15 84 -217 237 242 114 110 158 65 -68 58 200
7153 200 -70 -173 210 -136 -262 158 -47 4 -38 81 -54 -483 261 248 -22 -169 248 -218 -36 -51 -60 -137
7175 -137 -190 -20 74 -8 15 256 -162 -14 254 1 -228 15 158 -162 -303 97 36 -52 -217 133 28 35 189
7198 189 108 -289 -78 -31 -63 -119 146 361 -227 265 425 -213 -132 -27 -33 -17 21 -58 -57 -11 69 -124 -250 132 -181
7223 -181 -40 -378 -232 162 -166 -325 189 33 -17 -48 -62 22 -143 139 -309 -50 316 -62 -6 -35 205 -80
7245 -80 38 411 1 -505 -56 79 -163 -142 52 7 17 -66 87 105 -421 129 83 -83 192 58 -141 100
7267 100 -180 127 29 -168 239 -80 -108 16 99 -203 91 72 -239 -302 -216 -92 -134 -80 -2 160 -352 -154 396
7290 396 -196 135 -43 23 -1 206 15 -234 5 318 17 -35 195 33 78 -83 230 -6 -82 170 138 -213
7312 -213 108 -44 -144 56 -144 395 -67 -82 86 -16 14 221 164 -93 -37 -122 13 -48 -107 43 85 -175 323
7335 323 65 94 53 181 163 176 325 206 -235 1 -173 -104 -3 183 226 98 -169 184 9 -248 -68 47
7357 47 26 -210 -109 -72 -333 -124 -14 -71 100 319 193 69 114 -87 -243 -125 -23 -214 -183 422 -7 39
7379 39 -121 148 -89 -140 65 55 80 47 -8 -440 -566 74 45 -199 -198 1 210 -90 116 81 52 -71 316 53
7403 53 -28 -153 31 164 -175 63 -77 -47 70 -5 48 -99 -48 -3 -17 -262 113 -238 6 428 48 -200 41
7426 41 411 -202 183 91 -252 -220 314 63 -221 -102 318 -67 32 199 77 -80 98 169 -230 -54 52 -61
7448 -61 -71 -184 142 -66 -265 158 46 -184 -13 -44 -3 42 -142 -59 21 257 145 12 -202 115 157 -97 34
7471 34 66 80 -41 -47 66 -43 -156 69 -101 -447 -130 62 -85 -361 44 77 -227 217 -80 -136 9 177
7493 177 -55 -214 -172 225 -131 -189 259 239 -103 30 -16 -115 -19 101 75 -282 310 53 -94 218 86 -133
7515 -133 -24 270 -28 -307 -28 395 -147 -219 108 30 -199 -115 220 179 33 79 322 -184 -140 66 102 15 241
7538 241 172 -107 68 77 -64 95 -128 239 24 39 156 88 -24 -306 -36 -61 -229 106 -175 -76 278 -4
7560 -4 -58 91 10 -65 -165 129 499 -107 140 171 -46 -144 -4 212 -96 -96 199 79 -190 -198 -145 -18 -1 -221
7584 -221 83 40 169 -21 -51 59 -46 -29 -9 -173 102 23 -41 45 -86 -42 -37 227 -118 -151 -62 201 17 -169
7608 -169 264 -209 -121 166 47 -214 148 215 -82 -234 -71 -139 4 -175 132 -197 -182 229 -123 -268 -38
7629 -38 81 108 270 -156 53 217 29 -12 -4 -282 -143 112 54 -125 213 -100 -115 313 -125 -47 -265 63 69
7652 69 -336 5 -86 -191 81 171 -77 -119 60 -64 45 -65 122 -83 135 99 59 128 34 385 -159 -64 267
7675 267 23 -274 -163 38 -283 -202 16 94 55 -93 71 137 -114 -185 -15 -89 -83 177 61 115 114 103 -154 47
7699 47 -68 -213 52 -14 177 126 -57 88 -72 27 -116 -59 157 21 180 -334 -346 55 47 -292 -149 100 295
7722 295 -272 45 229 21 79 42 -37 -235 186 -231 31 -62 353 -51 22 64 458 -146 99 21 6 -5 66
7745 66 3 -76 -106 29 127 66 58 120 -107 3 386 -269 -57 71 112 -9 -153 140 185 -149 -81 386 -179 -26
7769 -26 59 40 -135 -120 142 -87 -136 -85 -157 -303 134 -90 42 -317 -110 233 -35 110 108 -136 -15 -111 -126 0
7793 0 154 120 29 185 302 -31 -248 272 196 -28 102 -70 192 144 127 98 -288 -234 -101 -40 -124 184 82 -203
7817 -203 -386 231 -194 -68 253 243 -330 -22 224 237 -164 304 263 -98 -3 125 136 -157 -135 -234 -95 -357
7839 -357 -107 136 -154 50 -87 -105 56 102 -40 71 137 196 -147 107 27 137 -191 3 244 -112 -6 154
7861 154 153 -339 -334 0 251 -162 93 87 -440 -247 164 -54 -297 -78 256 -127 182 375 -151 -242 -23 -359
7883 -359 -87 252 -3 -100 -102 -80 -72 -13 242 99 162 113 -194 63 -19 -138 34 -187 43 -3 -90 3 -219 -10
7907 -10 -101 -146 25 128 238 -45 90 79 -20 -218 135 231 -72 277 -321 0 125 -242 34 -299 41 -55
7929 -55 -29 64 -130 -154 -164 1 -167 -128 -227 -285 97 150 104 -33 -113 19 14 -64 -153 45 -189 -225 110 -121 136
7954 136 130 -65 205 -68 129 156 -128 36 251 353 -163 129 95 -240 9 164 78 -50 -434 185 -6 88
7976 88 -238 -243 -126 7 -106 -5 -149 159 -39 74 97 96 297 -3 64 369 20 59 20 -78 -76 -70 -28 -92 -299
8001 -299 72 142 -155 -7 -163 -93 -164 -109 -29 69 -138 -36 -126 12 91 34 -103 50 67 -16 172 110 -68 -174
8025 -174 -10 51 -114 -174 24 -146 -25 252 -14 -174 271 178 73 45 -17 176 -43 55 346 -23 -59 46
8047 46 146 89 -17 53 135 -4 62 125 -98 139 211 -212 75 266 -30 -80 -16 75 242 -200 196 45 -329
8070 -329 112 -53 -32 17 138 1 -103 189 171 -128 -198 -11 310 -272 -142 124 18 -84 136 28 131
8091 131 184 344 14 -236 87 82 -260 -186 116 -97 -138 56 -61 -152 -147 -42 -112 -3 113 168 195 -180 70 -12
8115 -12 48 128 68 -67 213 -144 -164 -353 -95 -75 -140 280 21 18 257 100 23 -53 -304 -91 242 74 -76 -129
8139 -129 -69 118 91 26 172 99 196 55 -181 83 -187 -161 371 143 -50 38 280 -252 141 336 -42 -243
8161 -243 -217 45 -99 -201 -54 67 -198 174 5 202 244 215 -32 -55 -150 25 -68 383 43 3 -10 -157 99
8184 99 216 -106 -59 -71 -9 -100 32
8191C2
$$ Imaginary data points
##PAGE= N=2
##DATA TABLE= (X++(I..I)), XYDATA
0 0 0 0 0 0 0 0 0 0 0 0 0 0 0 0 8 -8 8 -8 8 -16 16 -16 24 -24 31 -32 40 -47 51 -59 67 -77 87 -96 111 -124
36 -124 139 -156 173 -192 213 -237 262 -291 321 -355 391 -431 473 -522 575 -634 699 -771 853
55 853 -948 1055 -1177 1323 -1497 1709 -1971 2309 -2764 3403 -4364 5973 -9126 17525 -84739
70 -84739 -184218 105538 45002 -121030 35922 97595 -72605 -36608 53002 -22401 -39172
81 -39172 34442 4016 -26190 16511 14988 -20143 7177 24024 -8677 -10515 18936 14013 10557
94 10557 18899 -11537 -34718 -206 11488 -6565 19333 30346 -22461 -26889 11194 -15001 -29260
107 -29260 21692 13369 -27466 4674 12784 -28488 -354 29207 -13782 -12976 24223 -793 -12050
120 -12050 23204 4588 -31792 3951 31433 -2494 -3223 32395 5127 -37346 -5598 17199
132 17199 -16482 -9755 27565 6853 -21462 -4377 2826 -9903 -3369 5355 -1897 -8605 -3573
145 -3573 4709 506 -7676 2445 10223 -4408 -2221 19579 7706 -16827 -1 11236 -12389
158 -12389 -5856 22872 10265 -7468 5523 2132 -16086 -5573 10330 714 -6830 1166 1127 -9835
172 -9835 -5212 6563 -381 -7834 2912 3259 -7376 -2036 3815 -3708 -3858 3268 3795 3267 5541
187 5541 7835 3636 -8448 -5902 7212 680 -3847 12860 8764 -14165 -3207 11836 -6493
200 -6493 -9226 12004 1052 -17487 -27 6323 -12236 -4378 12980 -3429 -12431 7236 7642
213 7642 -10391 -2713 9128 -5123 -10740 8247 11735 -1758 2256 8694 -1924 -5675 3581 4510
227 4510 395 -147 -12 279 -2800 -3755 5956 5047 -8817 -2993 4795 -10336 -9225 9860 -344
242 -344 -14320 4295 8473 -10500 -868 15202 -2940 -11655 7623 5251 -10243 3892 15078
255 15078 -3748 -5980 11674 4152 -8749 6475 9637 -11195 -7151 8748 -3199 -8847 8859
268 8859 4563 -11780 -2654 4803 -5990 -4757 4258 -1557 -6834 -2293 844 2109 1945 2098 4592
283 4592 1481 -3958 1580 6367 -1958 -2291 6950 2186 -4962 5682 9543 -4321 -5641 5533 -1857
298 -1857 -11207 2738 8111 -8703 -7282 7188 -3461 -10949 6920 7768 -10351 -3985 6871 -6485
312 -6485 -8354 9137 6743 -5096 2664 9282 -1452 -4166 6478 4575 -6135 -1332 8371 338
326 338 -4643 5913 4721 -8159 -3900 5425 -2745 -5583 3487 311 -9581 -4544 3292 -541 -2413
341 -2413 3372 3693 -4536 -4580 3180 982 -4294 3312 7010 -1934 -428 7551 1623 -3066 3507 2807
357 2807 -4392 -256 5303 321 -3743 219 650 -4314 -2501 5279 968 -8010 -2065 2782 -7623
372 -7623 -6861 7047 3011 -6555 2972 6768 -6282 -3624 8741 1593 -5984 4314 7023 -3359
386 -3359 -197 9211 -153 -7514 4268 7032 -5494 -2777 7460 -2717 -9896 2125 3247 -6551
400 -6551 -1304 6983 -1538 -7828 -1590 1093 -3907 -1836 4556 1506 -3917 974 5943 -774 -2626
415 -2626 4870 3036 -3150 2727 6286 -2394 -3344 5299 2544 -5516 -332 7335 -386 -5940 1377
430 1377 2 -9577 -2335 8115 -1877 -7395 4241 1878 -8545 121 5813 -5063 -3228 7360
444 7360 830 -5855 3412 5521 -2750 -304 6716 1027 -3751 3685 5220 -4158 -4693 3738 2006
459 2006 -2641 2278 3294 -4235 -4678 1301 -1016 -4547 -543 1874 -1471 -2995 85 433 -2831 -224
475 -224 5225 -191 -4989 2691 5051 -3093 -506 6583 -813 -3418 7157 5027 -6073 -1370 5370
490 5370 -2193 -5272 3794 3482 -5232 -1232 5171 -3817 -8134 3272 2880 -6943 -1316 4557 -5552
505 -5552 -5247 6508 2058 -6307 1618 5994 -2380 -2310 4844 1659 -3842 1726 5936 266 -2761 3689
521 3689 4400 -3292 -2101 3098 -1313 -3802 3288 2054 -6255 -2837 3573 -1387 -4649 1052 1413 -4355
537 -4355 -2684 3415 -26 -4884 1736 5796 -2249 -1985 5647 1559 -3713 3782 4892 -3986 -815
552 -815 6862 1800 -3696 1971 3156 -3531 -2362 3611 -318 -5533 -137 1991 -4376 -3544 2989 -1292
568 -1292 -4967 2241 2281 -5417 -1178 5455 -175 -3741 3483 4077 -1784 473 5254 1167 -2594 2499
584 2499 4293 -1819 -1273 3877 -282 -3930 1886 2277 -5040 -2317 3742 -1584 -5978 279 1850 -4217
600 -4217 -2375 2608 -98 -3990 624 4000 -1369 -1796 4160 2234 -2941 2596 5202 -2245 -1155
615 -1155 5657 1757 -3827 2067 4241 -2733 -3118 3067 294 -5312 -321 2966 -3533 -4413 2676 -136
631 -136 -6029 148 3881 -3600 -3259 4900 1270 -5044 1576 5019 -1701 -1324 4934 2311 -2204 1346
647 1346 4222 -357 -1921 3162 2061 -3414 -759 3712 -2294 -3980 2678 1145 -4909 -1102 2793
662 2793 -2242 -4138 1494 1409 -3709 -879 3413 -667 -2873 3109 2549 -3267 319 4990 -641 -2398
678 -2398 4173 2462 -3368 1022 4727 -1592 -2571 3043 1218 -3979 -572 2780 -2080 -3142 1883
693 1883 571 -4137 -772 3328 -2271 -4008 2723 1557 -4495 374 4497 -1564 -2519 3541 2042
708 2042 -2466 613 4019 -331 -2207 2653 2872 -2483 -569 4418 -437 -3869 1865 2204 -3934 -1719
724 -1719 3371 -1713 -4274 1337 1524 -3543 -1330 2610 -1322 -3558 1778 1979 -2689 -357 3671 205
740 205 -2592 2851 3556 -2054 -4 4436 -274 -3026 2741 2897 -2478 -504 3147 -522 -3427 1411
756 1411 1859 -3521 -2256 2470 -1034 -4499 1388 2516 -3824 -1906 3146 -678 -3712 1788 2518 -2400
772 -2400 -846 3128 994 -1674 1895 3513 -671 -1318 2788 1372 -2499 1058 2694 -2363 -1981 2680
788 2680 239 -2702 718 1046 -3121 -2311 1332 -833 -3051 725 1721 -1863 -1656 2423 703 -2596
804 -2596 883 3193 -1802 -1438 4231 1572 -2333 2493 3630 -1871 -469 3832 39 -3472 778
819 778 2034 -2697 -2288 2322 184 -3503 -43 1865 -3603 -3221 2891 389 -4234 361 2643 -2207
835 -2207 -1380 3511 1190 -2813 1464 3673 -956 -1773 3031 1947 -2107 909 3764 -1032 -1896 2906
851 2906 1242 -3907 -1098 2253 -2487 -2694 2336 265 -4148 -716 2545 -1373 -2693 1711 1047 -3035
867 -3035 -188 3190 -1158 -1922 3520 2738 -2168 500 3715 -556 -1570 2385 1007 -2427 745 3535
883 3535 -679 -2391 944 850 -2829 -919 1778 -1796 -2994 887 613 -3786 -816 2900 -555 -1937
899 -1937 1821 814 -2827 394 3228 -301 -1704 2735 2336 -874 631 3103 -793 -2281 2045
914 2045 1628 -2806 -582 2554 -1352 -2709 1526 656 -3177 -167 1909 -2460 -3803 613 812 -1939
930 -1939 -242 2505 -180 -1727 1851 1907 -2292 -493 3308 -28 -1792 2390 1955 -1646 623 3290
946 3290 -857 -2527 2075 1357 -2683 -1533 1432 -1442 -2646 1818 1946 -2551 -1749 1933 -1238 -3526
962 -3526 1210 1464 -2605 -227 3429 348 -2462 2268 3085 -1560 -913 2798 792 -2091 1403 2862
978 2862 -1732 -1504 3043 937 -2720 412 1226 -2968 -2670 1643 -221 -2891 669 2220 -2062 -2040
994 -2040 1515 353 -2308 421 2642 -1327 -1622 2637 1822 -1740 1583 3268 -1010 -805 3166 7
1010 7 -2624 748 1863 -1714 -717 2683 896 -2012 122 931 -2715 -2800 1627 277 -3639 -85 2426
1027 2426 -2047 -2022 2836 1202 -2556 607 2386 -1081 -1484 2242 1717 -1138 1009 3188 124 -1057
1043 -1057 1985 497 -2760 -99 2356 -1051 -1694 2283 286 -3413 -160 1704 -1841 -2216 1457
1058 1457 -216 -3181 -726 1871 -860 -1124 2822 1711 -1964 422 2760 -894 -1814 2388 1634 -1867
1074 -1867 1028 3324 -637 -1498 1594 580 -2807 -558 2067 -1088 -2530 896 727 -2745 -741
1089 -741 2565 -832 -2748 1142 637 -2944 -509 2621 39 -1123 2409 1728 -1548 212 2596 -197
1105 -197 -1335 1800 1372 -1526 210 2205 -943 -2116 1577 1240 -2494 -1008 1397 -1955 -2715 684
1121 684 658 -1960 -238 2156 -464 -2031 704 995 -1645 -257 2489 132 -1369 2363 2149 -1321
1137 -1321 248 2926 -335 -1417 1488 1239 -1969 -919 1891 -144 -1895 914 1297 -2322 -1646 1136
1153 1136 -1479 -3057 791 1482 -1497 -626 2143 -407 -1736 1465 1270 -1666 -422 2503 100 -1101
1169 -1101 1421 2063 -1251 6 2556 277 -2023 791 1208 -2919 -1409 1982 -327 -2045 1330
1184 1330 1244 -2284 -1796 972 -809 -2219 604 1662 -1576 -1057 1965 572 -1537 962 2292 -1003
1200 -1003 -846 2238 428 -2129 1015 2086 -639 -267 2369 412 -2284 -271 512 -2061 -1867 1381
1216 1381 438 -1663 190 950 -1989 -1586 1652 207 -2324 169 1479 -1467 -1068 1735 880 -673
1232 -673 1534 2156 -531 -1269 1619 636 -1867 433 2012 -424 -849 1888 -192 -2694 -165 1000
1248 1000 -1584 -1844 949 -288 -2362 142 1193 -989 -916 1905 1041 -2042 -100 1471 -1131 -673
1264 -673 2461 1461 -1203 916 1997 -922 -977 1474 250 -1615 447 1821 -993 -1406 1470 347
1280 347 -2466 -469 1546 -1384 -1979 563 -261 -2858 -142 2310 -290 -1016 1432 930 -1797 -89
1296 -89 1888 -425 -807 2127 1852 -1343 -63 1943 -549 -1076 1438 1007 -1882 -448 1544 -1345
1312 -1345 -1811 800 468 -1570 -44 1500 -1497 -2281 875 605 -1923 -321 2300 65 -1213 1397
1328 1397 1402 -1617 158 2559 -258 -1504 1402 1310 -1297 177 1788 -173 -1184 1206 696 -1829
1344 -1829 -1136 657 -1009 -1921 673 784 -1594 -280 1587 -1095 -1858 1145 1046 -1523 97 1741
1360 1741 -323 -958 1763 1495 -590 289 1788 112 -1244 1097 777 -1364 -42 1803 -219 -1573
1376 -1573 1058 759 -2485 -1531 903 -1083 -1770 1228 1064 -1992 -560 1473 -405 -1464 929 1497
1392 1497 -1295 -428 1805 84 -1142 1565 2026 -649 265 1789 -179 -1853 437 930 -1324 -752
1408 -752 1771 74 -1885 159 642 -1816 -1403 1355 -305 -2112 213 975 -1625 -846 1878 764
1424 764 -1009 865 1471 -1052 -730 1524 412 -782 1040 1774 -375 -767 1415 -2 -1960 405
1440 405 1325 -1429 -1125 1362 -408 -2332 62 1094 -1114 -933 1168 -85 -1789 -167 1648 -531
1456 -531 -531 2285 1011 -1107 686 1559 -906 -683 1676 511 -1203 1006 1543 -752 -762 1100 91
1473 91 -1841 329 1152 -1276 -1703 620 208 -1972 200 1582 -913 -1135 1039 -17 -2009 -44
1489 -44 1858 -269 -109 1711 750 -832 402 1776 -914 -863 1435 1002 -1305 62 1310 -878 -1151
1506 -1151 1326 561 -1936 -124 802 -1606 -2157 648 401 -1211 187 1734 -434 -1390 1156 955
1522 955 -1228 -50 1869 87 -877 1808 837 -1385 348 1742 -215 -1169 982 449 -1613 -562
1538 -562 1057 -781 -1110 682 950 -1302 -801 711 -850 -1817 722 745 -1096 -28 1527 -579 -1057
1555 -1057 1356 999 -854 121 1362 -144 -1084 1068 1151 -803 -451 1779 -7 -1066 783 333 -2061
1572 -2061 -1094 1291 -739 -1662 656 437 -1785 -604 1149 -566 -1257 826 971 -1175 -624 1525
1588 1525 300 -990 1118 1668 -958 -266 1778 35 -1198 870 1097 -913 -131 1583 -391 -1412
1604 -1412 200 437 -1568 -870 1212 -87 -1471 31 685 -1371 -829 1567 169 -1213 735 1154
1620 1154 -1032 -774 1351 257 -673 1019 1618 -731 -581 1349 -50 -1352 355 1369 -982 -762
1636 -762 1398 -183 -1822 220 796 -1635 -1026 1246 -535 -1721 266 823 -899 -381 1526 392
1652 392 -1097 313 1269 -683 -609 2072 777 -913 927 1662 -877 -667 1368 384 -1385 100 1106
1669 1106 -907 -1349 821 223 -1334 -204 924 -662 -1111 621 304 -1680 26 1229 -456 -403
1685 -403 1229 568 -894 387 1356 -173 -261 1340 578 -737 439 1123 -464 -996 1105 143 -1261
1702 -1261 209 634 -1098 -1093 1126 -289 -1496 282 960 -1074 -1056 818 348 -1135 460 1329 -739
1719 -739 -801 1302 682 -1141 568 1723 -627 -565 1612 859 -1495 -186 1223 -462 -879 870 457
1736 457 -1343 -571 805 -592 -1369 757 665 -1178 -293 1320 -522 -1228 990 802 -924 125 1514
1753 1514 -219 -909 1149 668 -681 16 1251 -140 -728 641 612 -1350 -410 1252 -667 -1337 526
1770 526 226 -1723 -489 668 -1002 -755 696 628 -808 -90 993 -126 -889 964 914 -910 135
1787 135 1264 -162 -836 1172 920 -871 -280 1243 -17 -861 557 677 -777 -392 1014 -41 -1109
1804 -1109 4 351 -1500 -697 1052 -364 -993 315 653 -843 -395 1205 434 -665 566 920 -485
1821 -485 -236 1384 459 -473 648 975 -882 -482 1145 -128 -1447 514 744 -1035 -265 755 -592
1838 -592 -1254 58 460 -762 -751 864 -38 -1382 535 1181 -583 -376 1321 440 -795 456 1006
1855 1006 -581 -236 1228 201 -885 394 717 -852 -673 695 123 -986 112 680 -986 -966 818
1872 818 174 -1211 83 614 -846 -926 1030 -86 -1033 544 1334 -155 -542 1302 517 -694 250
1889 250 1429 -393 -719 1051 426 -1211 103 966 -672 -794 604 -242 -1436 68 484 -892 -1041
1906 -1041 473 170 -903 157 874 -584 -492 788 776 -945 296 1392 -10 -633 1017 617 -773
1923 -773 591 987 -561 -886 680 500 -792 202 602 -675 -830 468 274 -1315 -669 900 -383
1940 -383 -1166 638 681 -823 71 1199 -589 -800 781 660 -611 117 1250 -60 -807 924 836 -911
1958 -911 -137 1104 -325 -704 479 418 -1012 -468 649 -764 -1134 616 387 -1021 -457 532 -461 -747
1976 -747 714 931 -743 -162 1039 -30 -565 881 987 -420 63 1037 20 -937 690 757 -896
1993 -896 -307 746 -280 -826 347 112 -1043 -656 743 -198 -955 362 557 -1023 -433 802 -185
2010 -185 -809 710 789 -474 -64 1227 19 -430 660 638 -537 -245 1009 102 -816 367 444 -720
2028 -720 -622 682 -379 -1331 -35 355 -889 -250 894 -32 -799 554 912 -582 -309 1047 224 -601
2046 -601 643 1182 -192 -390 1051 191 -540 652 824 -519 -690 619 121 -844 156 795 -789
2063 -789 -461 299 -33 -1271 -178 232 -671 -773 594 121 -635 516 729 -444 -534 965 516 -704
2081 -704 310 830 -353 -258 1085 465 -490 249 573 -520 -916 789 -79 -1095 112 553 -419 -620
2099 -620 526 -21 -1182 37 486 -596 -532 1120 292 -582 418 1094 -261 -691 834 481 -905
2116 -905 77 1056 -417 -206 831 455 -628 30 492 -527 -1078 332 76 -1053 -83 797 -295 -938
2134 -938 606 113 -1225 19 711 -662 -600 781 388 -658 207 943 89 -336 499 458 -439 -244 652
2153 652 -185 -375 735 521 -514 -67 632 -388 -1001 691 102 -987 163 417 -416 -795 531 379
2171 379 -837 -10 908 -310 -720 393 752 -477 -91 1101 240 -264 910 528 -911 -283 736
2188 736 -189 -768 362 501 -894 -469 329 -319 -844 345 203 -1128 -375 852 -83 -684 712 713 -412
2207 -412 -46 906 9 -564 326 683 -425 70 871 311 -616 542 732 -925 -489 601 -45 -964 267
2226 267 -40 -942 -436 404 -34 -623 119 595 -848 -366 693 -158 -589 347 737 -382 46 911 48
2245 48 -804 292 705 -522 -257 627 118 -529 330 461 -654 -388 366 -274 -974 -109 418 -821 -315
2264 -315 485 -102 -1003 126 306 -660 -417 803 23 -483 649 982 -373 -179 812 374 -697 429
2282 429 737 -672 -523 715 191 -934 449 674 -612 -874 334 -319 -996 76 237 -450 -724 671
2300 671 164 -764 151 801 -199 -400 520 149 -617 359 801 -348 -227 645 294 -815 115 327 -366
2319 -366 -325 557 232 -956 97 655 -305 -672 254 211 -828 -54 571 -351 -579 409 556 -416 397 768
2339 768 -392 -325 694 285 -827 287 846 151 -141 829 410 -520 -45 839 -661 -821 403 82
2357 82 -842 -222 533 -336 -516 286 304 -799 -179 229 -377 -803 306 522 -204 311 862 1 -776 787
2377 787 561 -619 240 652 63 -318 570 122 -713 -273 400 -285 -472 157 186 -845 -379 412 -289 -560
2397 -560 790 505 -818 14 766 -133 -418 618 547 -153 144 867 -66 -486 550 234 -454 180 785
2416 785 -229 -708 232 485 -536 -363 491 -235 -950 327 148 -996 -330 487 157 -134 590 195 -593
2435 -593 -407 686 104 -659 580 1018 -326 -223 953 210 -516 299 533 -574 -108 536 -251 -483
2453 -483 191 441 -505 -246 528 -171 -1145 88 316 -460 -449 774 121 -521 339 543 -447 -74 654 222
2473 222 -390 160 743 -439 -92 487 -170 -547 276 692 -686 -676 296 -61 -785 -2 553 -282 -565 515
2493 515 -107 -812 85 260 -425 -217 224 229 -441 117 709 -56 -611 762 474 -481 418 764 -598 -316
2513 -316 614 190 -627 463 412 -534 -310 223 -91 -415 -99 185 -144 -332 385 43 -483 86 662 -371
2533 -371 -579 463 199 -458 581 773 -126 62 974 150 -608 175 496 -268 -623 579 68 -708 -81
2552 -81 421 -379 -686 323 211 -396 -181 565 -460 -437 480 434 -448 73 742 -187 -428 602 349 -687
2572 -687 247 695 -72 -162 348 133 -585 -221 519 -340 -351 427 198 -734 -333 19 -416 -771 255 282 -416
2593 -416 -145 498 -476 -388 528 397 50 -25 725 -289 -302 168 315 -454 239 730 -114 -543 265 226 -592
2614 -592 -213 342 -322 -825 372 140 -531 -380 557 161 -544 315 207 -605 -569 624 29 -187 336 399
2634 399 -330 -251 503 -46 -559 420 365 -292 -58 556 -212 -231 184 232 -336 -65 96 -498 -710 21 240
2655 240 -938 -169 345 150 -461 141 290 -343 -175 545 -26 -316 545 348 -270 20 654 292 -300 106
2675 106 560 -357 -505 402 229 -711 185 351 -450 -271 276 -135 -572 -138 313 -513 -258 415 163 -252
2695 -252 137 645 -110 -12 550 242 -379 316 462 -303 -277 557 85 -497 55 344 -459 -327 376 -75 -473
2716 -473 33 267 -375 -705 340 226 -427 36 284 -190 -399 522 407 -290 192 786 -41 -81 713 160
2736 160 -358 88 432 -127 -112 368 52 -418 155 412 -427 -359 375 4 -710 14 506 -228 -594 262 -28
2757 -28 -540 136 724 -213 -177 389 226 -265 -96 642 -208 -250 577 82 -306 30 385 -202 -473 336 224
2778 224 -619 -60 299 -204 -375 28 344 -493 -201 238 -158 -166 341 169 -327 55 358 -156 -141 95 253
2799 253 -318 76 546 -162 -197 430 340 -507 50 384 -526 -428 118 349 -532 -169 466 -188 -559 92 169
2820 169 -380 -186 255 -197 -484 361 337 -436 -317 711 56 -385 521 556 -538 70 641 -170 -318 225
2840 225 468 -240 -180 136 -65 -429 147 473 -215 -200 85 -91 -559 160 250 -265 -117 532 105 -305 313
2861 313 518 52 4 514 80 -451 264 490 -197 257 630 28 -96 130 424 -639 -374 286 -210 -609
2881 -609 36 527 -337 -135 488 -103 -523 -133 345 -295 -43 757 271 -305 126 403 -162 -15 666 -64
2901 -64 -265 292 305 -266 -317 427 10 -471 83 423 -203 -647 156 -211 -535 226 251 -555 -287 259 35
2922 35 -566 108 310 -291 -85 473 98 -162 -52 584 -312 -251 509 142 -194 176 275 -262 -471 424 228
2943 228 -509 -35 -23 -266 -306 526 175 -493 -18 488 -185 -239 267 107 -417 88 472 -143 -172 371 311 -299
2965 -299 144 752 -276 -201 389 297 -507 184 178 -280 -359 430 -74 -349 -60 162 -370 -140 206 30 -505
2986 -505 26 571 -198 -390 466 154 -354 79 710 -164 -217 501 122 -242 60 719 -37 -272 52 324
3006 324 -471 -66 233 -208 -537 -116 96 -420 65 498 -257 -341 106 134 -188 -127 514 168 -368 500 142
3027 142 -565 4 654 -157 -262 549 428 -247 -326 444 -1 -337 266 321 -408 -158 293 -175 -553 249 8
3048 8 -247 -302 484 16 -251 38 283 -213 -231 414 195 -61 -13 412 -321 -29 480 72 -480 358 191 -418
3070 -418 -87 117 -77 -222 18 403 -249 -229 106 -130 -311 210 86 -529 -384 105 -30 -140 77 381
3090 381 -173 -116 680 23 -449 140 485 -336 -212 595 -228 -335 -92 78 -415 -315 301 -50 -290 -86
3110 -86 82 -592 -158 264 -71 -537 -92 484 55 -8 352 87 -283 167 279 2 -189 392 293 -10 92
3131 92 421 -377 -149 325 88 -407 172 349 -362 -200 252 113 -692 270 472 -590 -361 350 290 -359
3151 -359 322 246 -95 -26 378 29 -108 81 394 -137 -305 248 191 -45 -30 287 -63 -161 181 -66 -539 -58
3173 -58 515 -291 -389 306 -13 -353 -184 343 -182 -384 198 285 -213 -187 390 122 8 413 141 -114 115
3194 115 527 -41 -432 304 432 -173 -246 240 282 213 608 51 -400 -215 320 -363 -348 401 111 -369 -18
3215 -18 343 39 -213 235 11 -195 379 501 -3 -172 401 448 -84 -128 531 -187 -371 54 -74 -537 -47
3236 -47 355 -129 -163 174 148 -412 -238 163 -150 -378 251 408 -539 -75 548 50 -250 392 443 -194 -196 342
3258 342 -152 -352 292 334 -223 -173 281 -287 -443 -53 55 -326 -93 203 -196 -473 114 281 -286 -259 34
3279 34 -148 -74 211 371 -193 -159 368 11 -335 302 187 -346 31 265 -184 -200 299 309 -378 -58 189 43
3301 43 -149 -69 128 -334 -448 139 83 -368 29 221 -483 -92 252 72 -266 -168 430 -251 91 845 225
3322 225 -478 201 419 -172 -94 513 -54 -174 150 308 -215 -101 291 127 -480 91 104 -232 -376 262 295
3343 295 -474 221 239 -381 -218 224 113 -559 244 234 133 -60 431 223 166 83 261 -102 -171 140 104 -232
3365 -232 104 63 -238 -35 126 276 -53 -37 169 -62 -410 154 261 -180 295 364 -149 50 399 237 -267
3386 -267 200 391 -62 -212 306 139 -75 233 424 -120 -47 353 -171 -321 -50 265 -98 4 97 176 -455
3407 -455 -34 279 -195 -240 225 201 -406 110 44 -4 -213 154 545 -378 2 210 16 -444 88 407 -426
3428 -426 143 443 -127 -277 67 173 -346 -377 301 -138 -520 3 121 -203 -131 290 30 -279 48 523 -366
3449 -366 -74 294 162 -140 349 329 -99 -143 195 114 -191 22 58 -12 -87 283 45 -367 -205 444 -549 -276
3471 -276 160 -84 -368 36 283 -243 -314 267 167 -315 365 201 -160 -138 198 99 -57 648 260 74 -288
3492 -288 9 33 -210 306 396 -352 91 239 98 -442 -158 280 -295 -355 61 64 -134 128 244 -288 -2 462
3514 462 77 19 25 384 -118 -200 95 176 -333 192 46 -286 -301 7 55 -176 -98 206 -146 -78 228 -85 -515
3537 -515 12 113 -117 -53 63 97 -449 165 338 -128 229 335 298 -182 60 463 -251 -407 352 102 -162
3558 -162 228 409 63 -423 17 52 -124 -227 185 -71 -270 58 212 -306 62 392 -93 -180 333 161 -318
3579 -318 67 405 -53 -179 419 257 -485 43 348 -114 -325 155 48 -92 5 166 -181 21 380 139
3599 139 -57 21 110 -209 -289 251 189 -125 -204 249 85 29 134 354 -353 -9 280 9 -105 163 234 -131
3621 -131 268 337 -185 -259 250 132 -286 -217 257 -177 -428 83 119 -64 -141 336 -73 -234 301 384 -15 -75
3643 -75 258 -296 -356 4 205 -397 -269 250 -221 -358 153 282 -178 -71 246 57 -557 102 194 -269 -281
3664 -281 160 70 -225 65 181 -297 -142 274 -166 -375 206 46 -75 185 235 268 -307 143 103 -282 -335 239
3686 239 -85 -154 197 247 -438 -245 59 -30 -501 52 392 -179 -127 203 125 -166 233 543 -134 -231 396 -6
3708 -6 -333 353 447 -183 -140 542 176 39 -195 24 -246 -43 285 146 -25 -12 -68 -113 -118 134 141 -245 9 216
3732 216 -155 -420 238 -114 -338 53 121 -177 14 283 66 -256 325 265 8 -153 265 -85 -175 110 387
3753 387 -107 -81 151 85 -304 -68 218 -177 -260 249 -18 -233 266 365 -258 4 313 26 -482 -174 77
3774 77 -123 -148 382 308 -151 -78 346 -45 -420 361 118 -192 -201 230 170 -238 31 115 -244 -226 68 -144 -242
3797 -242 335 169 -221 35 393 140 -6 80 102 -264 -168 279 -96 -40 450 262 -220 -78 201 -150 -49
3818 -49 252 224 -46 172 172 -57 -315 271 178 -385 -183 -202 -92 -330 -6 28 -221 -143 192 9 -107 157 166
3841 166 -228 -74 231 114 -4 279 282 55 122 276 -241 -337 125 138 -133 -116 308 17 -405 138 -85 -452
3863 -452 -190 -11 290 -367 63 69 59 116 286 69 -150 -198 110 -123 24 406 9 -54 612 -134 215 41
3885 41 70 36 -247 -32 63 -204 -72 195 -90 -201 239 277 -119 -145 149 204 -36 145 124 -97 67 346 94
3908 94 -48 37 324 -208 -195 157 -24 -28 156 124 -126 -268 187 -230 -143 124 51 -200 -280 -88 -167 -185 -55 650
3932 650 -309 -172 213 33 -455 -93 406 -221 138 195 131 -1 215 223 -105 -88 229 100 -214 45 103 -267
3954 -267 -75 -52 -70 -362 -185 39 -263 -280 281 -56 -84 212 63 -93 -272 254 137 -298 149 220 6 -140
3976 -140 210 311 -169 -242 389 6 -283 290 276 -405 95 298 -405 -221 184 163 -231 -38 311 -36 -336
3997 -336 126 22 -200 26 225 144 -217 151 322 -20 106 24 -61 9 139 158 -132 -17 223 -154 -117 170
4019 170 -13 -202 -143 136 -230 -254 -62 9 -230 -195 -45 16 -132 143 384 -136 -309 288 -106 -71 447 77
4041 77 -104 88 346 -197 -320 -71 162 -222 -6 364 -150 -466 -178 5 -295 -325 210 4 -160 248 72
4062 72 -94 -164 163 -12 -19 176 259 -117 152 213 133 -126 40 209 -84 -1 255 70 -368 31 196 -125 57
4085 57 225 -78 -351 75 96 -342 135 18 -76 -210 -94 417 -27 -340 335 29 57 144 367 -51 8 309
4107 309 324 -435 47 143 -15 78 -90 80 -139 228 205 -6 -86 420 3 -323 -35 75 -211 -136 185 32
4129 32 -157 45 -18 -93 -23 118 33 43 134 397 -236 -141 83 50 -115 -16 -31 -263 -438 149 -112 -227 23 137
4153 137 -266 -395 108 -202 -347 -42 57 -388 4 295 111 -319 -18 185 -57 -293 275 60 -384 -117
4173 -117 219 -150 38 69 353 -461 99 319 -23 16 203 -91 -308 101 14 53 129 143 -71 -196 215 170
4195 170 -168 -34 205 297 -209 -7 274 19 -206 124 -65 -11 148 187 66 -130 -17 40 -407 17 -32 -40
4217 -40 -173 62 -48 -310 -239 110 -223 -256 187 24 -209 109 153 -252 -273 53 -44 -41 -74 272 92 -85 201
4240 201 78 -55 154 250 -56 -71 283 278 -387 -179 150 -155 -102 22 53 -71 -126 58 -64 -323 208 9
4262 9 -352 19 231 -74 -4 78 185 -135 -5 401 39 -61 206 378 -147 20 76 -75 -298 -58 110 -448
4284 -448 -286 271 -322 -296 80 130 -453 184 295 31 -125 1 311 -131 132 120 45 46 363 336 -150 34
4306 34 328 143 -256 -153 -54 -304 51 -23 -23 -160 -254 38 -158 -18 247 -72 -251 330 205 -306 -54 194
4328 194 83 -98 -85 127 15 19 377 131 -336 250 308 27 -99 97 68 -168 250 386 -321 -237 78 134
4350 134 -439 -14 94 -125 46 291 188 -544 204 5 -183 21 260 333 -171 115 87 -19 -353 477 131
4371 131 -41 -210 356 -18 -423 63 92 -413 -67 10 -144 -117 -43 33 93 -180 400 43 -50 101 108 -131 144
4394 144 248 -208 -122 272 185 -71 48 204 -72 -51 56 127 -257 144 91 -147 -225 -90 5 -210 20 -69 -226
4417 -226 -95 256 61 -16 -67 86 -232 -140 190 40 46 -60 288 132 -107 -100 112 -121 -138 156 -84 -32 315
4440 315 190 -158 -221 82 -147 -210 142 77 -115 -91 140 -141 -388 -244 -40 -457 -337 145 -199 -335 315
4461 315 472 -12 -92 144 19 -421 250 72 -67 3 73 21 -26 -50 93 -300 -107 52 -119 -37 -42 284 -130
4484 -130 -170 353 -25 -263 253 115 -202 1 304 142 -249 20 295 15 -78 156 -55 -249 140 169 -153
4505 -153 -421 194 121 -154 -44 154 -159 -109 17 -394 -285 -37 88 -64 -43 5 -107 -291 167 334 -53
4526 -53 7 421 279 -160 364 215 -100 8 256 -123 -224 222 -60 -147 162 200 -55 -89 -10 31 -20 -103 98
4549 98 24 -148 1 231 -52 -96 118 33 -216 -136 81 -380 27 240 4 -258 138 221 -162 -225 142 51 -178
4572 -178 249 111 -327 -282 79 -132 -405 -54 197 -199 -185 189 -257 24 70 93 -270 -126 -28 -129 -179 12
4594 12 78 -63 -77 234 21 -23 99 115 -74 -83 69 40 -361 -186 -247 -480 -139 -71 51 -348 -69 214 -183
4617 -183 -174 225 -94 -79 121 -24 -66 -84 67 -69 -171 226 296 -144 23 164 157 -225 -325 -82 -267 -257 230
4640 230 235 -392 144 -89 -291 -178 38 125 -1 -204 -130 46 -283 182 432 -146 93 333 -182 -130 -168 139
4662 139 12 159 -11 -29 -31 217 -28 -277 -93 181 -109 -385 -295 226 -401 121 267 -13 -147 -15 68 -46
4684 -46 -139 66 -117 -89 237 -48 -7 -23 84 -110 80 74 334 -297 -211 264 185 -143 170 95 -224 -324 84
4707 84 -55 -55 -384 75 -42 -235 172 -132 -177 31 9 49 84 177 -67 -116 181 166 -328 -175 252 -33 11 39
4731 39 173 -212 -402 376 -231 -277 151 196 -275 -323 -88 326 -451 -91 218 -96 -132 -148 -17 -93 264 406
4753 406 211 -66 100 133 -266 97 240 -1 -199 83 -63 -169 77 50 -170 -214 -210 80 -154 59 46 -247
4775 -247 -246 143 -101 -183 245 343 -33 -251 -45 76 -60 3 18 -62 -44 184 197 -111 -189 85 11 -180 318 -34
4799 -34 -428 -248 190 -101 50 124 -51 -43 269 -9 8 -24 -16 -87 -325 68 206 -139 -25 313 226 -270 -1
4822 -1 273 -130 -235 113 65 -169 127 192 -242 -174 73 2 -342 265 57 -39 -439 -44 107 -326 -81 35
4844 35 -274 -2 325 -192 9 73 434 326 -81 184 6 -71 37 197 2 -183 -196 -63 -276 -210 -43 -285
4866 -285 -385 142 -101 -197 136 95 19 48 -53 1 62 165 185 81 -175 222 -108 116 128 76 110 91 18 279
4890 279 -285 147 222 -126 -47 110 125 -189 88 -223 -280 -104 92 223 -110 102 280 -168 -147 10 123 -224
4912 -224 101 -70 -15 -94 69 71 -317 12 300 194 -113 72 356 -50 -7 205 86 -162 -11 -94 -218 -131
4934 -131 88 -203 -42 196 -302 -165 -88 402 109 -347 116 -264 -170 -171 163 -136 -280 78 152 -2 86 29
4956 29 -195 -149 118 50 -212 -27 -137 -31 -332 7 48 -164 -620 322 115 127 -35 162 -99 -120 158 -102
4978 -102 -391 40 359 -13 -164 135 -13 -277 177 278 -234 -258 25 -82 -103 -4 216 -424 -242 204 28
4999 28 -192 -137 -99 -354 -103 -33 -273 -199 52 109 -116 123 -118 171 -38 179 212 -7 179 244 176 -193 178
5022 178 397 241 -163 42 5 -229 -178 -88 -151 -61 -98 -275 -251 73 241 -170 45 178 219 -362 173 259 103
5045 103 -178 203 210 -384 266 481 -192 -166 158 198 -299 157 21 -17 14 86 199 -376 -266 -142 -12 -135
5067 -135 292 -88 -202 206 -99 -246 -220 211 -20 -206 107 26 -199 -193 200 -4 -116 -107 291 183 -283 79
5089 79 -234 67 93 440 -29 -5 388 -106 -112 74 128 4 74 203 -142 -5 -316 175 -46 -289 298 -19
5111 -19 58 -61 227 98 93 37 82 -103 -120 200 -117 -118 348 377 -179 -183 164 -55 -300 -91 11 -316 22 170
5135 170 -142 -277 139 199 -242 123 238 -18 -207 443 -14 -56 87 289 -165 38 250 47 -63 -21 102
5156 102 197 -51 284 105 -26 78 83 -173 -203 107 -37 -233 60 4 -246 -93 220 6 -154 -18 192 298
5178 298 -347 193 200 -142 -37 388 69 -63 63 307 -73 -238 147 -375 -184 -52 234 -159 -70 158 243
5199 243 -169 -109 237 9 -6 288 140 -266 -7 152 -72 -180 292 22 -389 147 96 -175 62 49 147 -33
5221 -33 222 251 -204 100 74 256 -151 -13 -117 -205 -270 101 -116 -165 42 408 84 54 -49 163 -212 118
5243 118 208 -34 79 212 -198 -150 203 -140 264 -195 156 156 -325 97 110 -189 -221 316 41 -190 -184 156 -212
5266 -212 -387 29 -4 -62 -107 371 34 -26 283 44 -166 296 332 -128 197 391 7 -180 6 167 -357 -40
5288 -40 241 126 -132 94 6 -84 -118 -33 -12 -262 -127 -76 82 -148 -107 120 -178 -141 202 200 -214 101 274 -24
5312 -24 -158 196 123 60 -225 -56 -182 2 280 24 -140 -54 47 -174 55 142 -4 -210 -15 112 -258 177
5334 177 -21 55 -70 195 64 -190 -143 173 -140 -361 115 140 155 10 371 96 -219 -173 60 -261 37 -496
5356 -496 -227 -68 -76 -162 -128 -53 44 119 -82 -16 186 -98 -161 -23 1 -33 263 131 36 106 33 -216 -115 -18 249
5381 249 201 -87 25 -14 0 -125 139 -116 -79 -7 -492 -463 54 57 -35 -106 117 -129 -66 169 172 30 33 252 59
5406 59 -102 161 51 26 -209 15 -106 -274 7 60 -163 158 152 -251 -92 37 -141 -369 -104 97 105 18 51
5429 51 312 -40 4 45 -24 0 189 288 -299 -61 130 121 -379 38 155 -321 -135 -160 -22 -24 94 93 -190 -158 99
5454 99 -216 -340 45 185 111 23 68 -135 -67 122 83 27 -170 35 -24 -136 117 150 2 -30 145 -33 -40 142
5478 142 106 -90 -137 172 185 95 176 357 -83 -194 -51 -41 -279 21 1 -214 -45 148 52 -49 -16 164 6
5501 6 -359 -24 2 -187 -22 260 15 -163 -70 34 -82 -106 364 -258 -182 -67 198 -79 -108 -275 -81 -118 78
5524 78 91 -353 -90 97 -92 -275 242 150 -164 -5 95 -178 -415 287 -138 -87 285 75 169 -174 -62 95
5546 95 -389 -47 -88 -213 -177 15 231 -85 -142 28 -100 -70 254 254 -67 172 106 219 151 155 -246 -211 138 318
5570 318 7 -37 136 81 235 1 240 -182 59 353 101 -124 -13 291 -69 -334 35 212 -104 7 58
5591 58 -117 -127 124 -57 -232 25 -27 -74 -252 -51 151 -155 12 287 47 -159 229 365 -176 -18 -42 47
5613 47 -240 40 -71 -103 56 103 -359 -142 -19 158 183 122 -47 -34 -110 203 40 -271 -170 132 -91 -66 155
5636 155 156 -30 -123 191 -41 -91 207 92 -181 -61 207 -142 -309 270 181 -214 224 275 36 -8 175 194 -244
5659 -244 189 203 -24 -196 111 193 -141 -85 -36 106 -66 98 -1 122 233 189 -161 -181 12 237 -155 -118 262
5682 262 327 -98 -152 287 -209 -119 259 -114 -97 81 66 101 -239 265 -132 73 122 174 -20 -22 -27 -13 -202 -109 70
5707 70 63 124 -174 -58 -338 -143 75 63 -212 274 -155 -182 -87 180 -312 37 0 109 -64 22 419 34 -344
5730 -344 291 136 -19 79 287 323 -203 -69 73 -146 -171 20 -45 60 -8 45 -506 38 73 -222 -234 -72 218
5753 218 -179 -66 -72 -78 90 125 548 161 -215 94 -226 77 -8 -202 -157 40 443 -71 -14 189 -103 -22 -60
5776 -60 42 -301 -39 167 12 -451 -101 55 -53 -291 192 301 -69 -32 34 -145 -216 232 47 18 -32 296
5798 296 43 -61 214 37 1 -111 194 38 -115 186 -54 -446 -30 81 -214 -155 143 24 -282 32 59
5819 59 -92 -167 388 -101 -269 -32 32 -100 -102 102 65 -49 185 414 211 -53 42 151 61 -123 64 -155 -355
5842 -355 205 -68 -69 157 247 -323 -269 -90 -30 -468 10 -6 32 -144 -111 -8 -378 -30 213 -87 -265 314 -50
5865 -50 -86 -6 -49 34 -153 109 106 94 -137 -14 -181 -185 191 -169 -109 -38 170 98 -244 -296 200 -36 52 149 -150
5890 -150 -91 16 227 -75 62 306 -46 30 436 102 -159 -155 345 -49 -348 35 -45 -113 -212 118 -84 -192
5912 -192 51 -17 -226 -173 143 -15 -201 -7 -196 -147 -79 41 33 27 213 155 197 16 65 52 42 309 145 -77
5936 -77 -195 84 -18 -88 -32 231 99 -143 16 47 -162 -220 257 -126 -53 195 -26 -142 95 276 -199 -227
5958 -227 381 -22 72 117 271 -171 -151 122 54 14 335 124 60 -10 35 212 -24 -163 253 -143 -143 266 127
5981 127 -79 6 -35 -168 -45 189 94 -122 144 141 -153 -209 64 -216 -4 126 251 -123 155 -132 413 -498
6003 -498 -59 264 -225 -344 140 18 -390 61 88 -9 -175 -231 -150 -293 24 47 -52 -266 154 163 -260 -4 34
6026 34 26 92 219 169 -41 91 -57 -38 -241 77 38 -240 -146 62 -57 -257 -57 13 -283 9 238 -302 -16
6049 -16 -90 248 -144 82 1 -95 -128 139 4 -121 180 101 -19 -102 -103 336 -271 -125 -67 69 -111 1 95 -168
6073 -168 -56 39 118 -76 280 160 -121 68 -124 145 -247 -36 126 -166 245 234 -9 -35 65 287 -116
6094 -116 62 250 -73 -92 -148 94 -247 -337 156 -41 -236 -149 23 -227 5 147 149 -449 -37 194 -94 80
6116 80 -22 -57 -27 346 363 -7 -251 -42 65 -243 -130 -141 -47 58 79 -45 -107 -316 79 -180 6 -30 -254
6139 -254 -209 -199 80 -158 39 -61 -115 -257 22 183 11 67 -212 261 35 132 260 -77 -118 344 70 -84
6161 -84 71 178 -126 -143 -50 -11 -51 -130 -8 -204 -265 -37 120 -75 90 190 40 -72 91 129 -238 43 305
6184 305 95 -11 283 210 -141 -61 43 110 -12 342 -15 -167 42 45 147 220 -151 207 -288 -123 -55 -239
6206 -239 -86 62 -52 -217 75 99 -133 -127 102 -74 -17 -42 224 -213 -206 18 8 -48 -144 -1 -167 -199 204 45
6230 45 -85 -226 294 -108 -182 115 25 -285 -141 299 -233 -67 183 72 -39 13 -6 16 -373 -128 -50 -348
6252 -348 41 208 -59 28 213 20 -179 185 240 228 85 -238 184 143 -48 100 117 -26 62 -342 -247 -148 -68
6275 -68 -170 -375 119 80 -199 -133 3 -173 -205 22 242 -240 -121 260 51 -9 -11 -126 -433 -24 173 -158
6297 -158 131 114 -155 -85 12 123 -253 -158 -14 38 170 54 6 -374 -215 -228 -36 31 -70 278 64 -39 -43
6320 -43 267 126 -188 235 55 -211 125 87 -107 -30 16 -49 -185 -314 -16 10 -115 129 221 104 263 51
6342 51 -81 -12 72 24 -334 202 280 -88 4 262 236 -77 261 87 -254 -100 -42 95 177 93 350 -134 174
6365 174 118 76 -125 255 99 -197 161 67 142 -276 225 67 -168 180 100 -3 133 32 151 -113 117 138
6387 138 -194 -30 -121 160 -142 -211 335 6 -205 -138 353 38 -97 146 105 -80 53 257 -208 -142 -5 21
6409 21 80 185 254 -41 -221 318 420 -56 -7 214 0 -213 429 7 -295 304 85 -172 -2 79 -39 -346
6431 -346 -45 205 -610 -255 349 142 -38 -103 44 87 -31 164 140 -168 -82 220 -147 -193 178 38 -238 73
6453 73 380 10 -65 97 -19 -127 -248 117 4 25 290 3 -304 30 106 -134 -66 -97 -127 -188 67 185 -126
6476 -126 -70 -107 89 -213 -244 167 272 -67 103 -38 -195 -91 46 -137 128 99 -53 -240 57 346 151
6497 151 -181 -22 -12 -139 -150 40 52 -215 128 176 -408 -87 275 -163 5 73 242 -336 -52 348 -59 -103
6519 -103 -24 124 -27 -168 156 110 16 -67 81 -230 -63 305 -252 -165 158 158 -362 -113 28 11 97 283 130
6542 130 -116 187 -57 360 -153 255 295 -218 -77 218 -95 179 -194 -22 -101 -11 204 74 -145 -34 -135
6563 -135 -95 192 156 66 -344 -57 476 -152 -21 84 41 38 180 212 -133 -142 103 170 157 275 40 -297 -29 187
6587 187 141 -171 2 -65 3 -51 103 182 122 118 322 -102 -17 201 -93 -267 80 187 -133 -201 327 -10 -128
6610 -128 143 -11 -27 69 216 159 -202 195 -57 -138 -36 -31 171 -34 -227 -147 -47 -301 246 -193 -403 25
6632 25 94 -34 -51 89 -80 -232 135 167 -40 -88 40 57 -120 225 352 -54 -150 127 387 -261 -91 63
6654 63 -41 -389 118 6 -131 -14 33 -120 57 56 138 -373 15 -37 2 75 164 309 -132 79 301 149 -110
6677 -110 232 320 -163 180 -92 83 -17 176 -262 -187 37 72 -220 -45 183 -45 20 -424 10 30 -238 -60
6699 -60 -346 82 -331 -7 0 -338 134 103 -138 42 87 -60 55 -142 -101 -75 68 182 27 45 -67 80 -30
6722 -30 -16 135 8 -341 -96 38 -149 16 35 87 -238 22 -119 -122 -100 99 92 -115 174 70 -319 -66 148
6745 148 -219 -211 142 50 -110 1 -27 200 -177 93 -44 -259 212 28 -50 -235 -231 -76 -316 -308 -131 -33 -61 132
6769 132 82 -264 234 -77 -109 28 97 43 -53 231 38 65 -275 -38 210 -149 4 -74 -112 -170 -370 128 -338
6792 -338 -241 72 -252 -65 -141 34 -276 -244 186 -118 -107 87 -67 11 -23 312 -171 67 -100 197 -203 -154
6814 -154 261 15 30 81 191 -337 114 311 -119 -36 -34 199 116 -75 3 -279 -301 -127 -9 -171 -17 82 -86
6837 -86 201 27 -141 30 -194 1 -116 -16 69 172 -414 -434 47 -48 -132 61 334 110 -59 -39 136 41
6859 41 210 98 -222 39 -111 -85 -185 41 96 -182 -113 162 174 77 143 425 -299 226 158 -191 112 -73 253
6882 253 -239 -79 -150 -113 -93 -48 87 -236 -313 292 -30 -176 -74 316 -151 110 -23 -7 -207 -103 -20 2 -282
6905 -282 127 54 -237 -81 -40 6 -13 329 150 -117 15 159 2 -212 439 211 -144 -95 116 -45 -292 281
6927 281 -147 139 -61 177 11 -87 -69 68 26 299 11 -105 -221 120 110 -281 78 31 -255 -104 211 -33
6949 -33 -37 -68 71 131 -1 65 192 42 -67 55 -281 -19 145 137 -42 -228 198 -2 132 172 116 -110 -237
6972 -237 247 86 -61 176 34 164 -213 5 -61 -134 -159 189 21 -265 -64 46 -168 143 -72 -292 -345
6993 -345 346 -148 -110 99 271 -149 45 325 -194 -79 162 -74 -108 67 36 159 -252 81 238 -100 -131
7014 -131 77 -119 -185 -84 140 -132 -124 -22 14 -234 68 179 -42 170 103 77 172 15 -94 66 -114 47
7036 47 69 -175 89 69 -332 109 33 59 -3 -67 128 -68 2 201 93 -303 84 -6 -49 -168 89 26 -142 299
7060 299 89 78 -76 -243 22 5 100 169 -45 -323 228 40 -339 -4 51 153 -31 138 214 0 170 91
7082 91 -138 -98 66 38 171 -68 162 6 49 337 -170 -209 -52 254 185 -38 -58 231 -92 251 223 29 31
7105 31 178 53 96 -16 123 -81 31 -68 84 -341 8 45 -178 -111 166 95 -311 -132 185 111 -57 260
7127 260 10 -27 131 -111 -1 -91 115 18 -85 -19 53 -180 -178 -164 17 6 31 -194 149 -156 35 128 -171 103
7151 103 128 -167 -13 163 39 -52 -14 113 101 -125 -28 -27 -222 -27 133 -149 48 41 14 -30 33 -87 -163 -178 -75
7176 -75 77 -390 82 -119 91 160 -142 -34 -342 -43 364 -20 -57 191 275 -49 188 73 117 -26 254 438
7198 438 -126 -340 285 68 9 39 157 -79 -19 127 152 -147 -59 -238 -126 -51 148 7 -303 121 94 -9
7220 -9 -39 18 -329 -365 73 30 -145 -143 120 -128 142 83 -44 -47 41 103 -70 -67 176 158 8 -165 203 247 -132 240
7246 240 60 -161 -21 -24 -118 24 -24 43 -308 -70 -98 13 -281 -162 167 -162 -193 -14 157 191 171 -128 -196
7269 -196 64 -139 82 38 -112 -170 125 -183 140 -50 -456 -24 242 -6 -433 231 92 -264 -169 234 -104
7290 -104 162 -100 15 143 116 383 -183 57 164 -12 -212 222 50 135 -270 113 -28 -1 -64 334 -192
7311 -192 -203 -127 -102 -237 22 -111 237 -118 9 30 -127 122 -151 67 -74 -93 -57 -48 -185 331 81 361 317
7334 317 324 119 -36 -54 -144 -204 -89 -32 -128 295 -8 -52 -42 243 56 -356 -97 -47 -168 25 -51 -3 -139 239
7358 239 206 -34 -277 -200 271 -255 -123 5 -185 -194 85 -5 -60 -7 81 -249 38 119 -38 -234 155 147 31 -197
7382 -197 -15 -88 -46 -46 60 -233 -37 120 164 -83 -110 261 91 113 18 16 117 55 17 -66 -133 -7 51 -288 33
7407 33 92 146 28 -163 297 -181 -166 312 83 -355 65 13 -213 -139 347 20 -75 150 6 -131 254 85
7429 85 -128 -41 -120 203 -90 -140 123 2 -133 -148 -225 -77 -14 220 -17 7 -93 225 -70 27 -36 -67 21 -127
7453 -127 28 -112 93 155 115 -225 -20 267 44 79 271 -237 -207 10 30 -243 -138 150 2 93 43 296
7475 296 -19 -261 168 -229 -92 -41 230 -116 64 130 -53 0 -9 99 -31 55 227 22 -15 -89 198 -17 20
7498 20 244 1 -355 -56 -105 -236 -84 -159 -26 -40 -91 168 -214 -294 79 11 44 -180 152 -184 -223 181 76
7521 76 -193 383 23 -24 -268 141 -65 -173 -97 -76 -72 139 229 64 -234 -356 138 -111 79 162 -11 -284 -180
7544 -180 39 -173 -32 154 -116 29 139 -119 -19 -120 257 102 -147 220 249 -119 -57 209 -232 29 -229
7565 -229 362 121 46 114 -171 -170 -96 199 -145 -63 156 -163 -190 31 172 60 -198 224 156 -157 210 298 -11
7588 -11 46 60 -173 24 -56 140 -63 -100 65 6 -168 149 70 -72 -235 57 -146 45 173 18 93 -35 255
7611 255 80 59 27 235 89 -32 102 -6 -101 3 133 78 68 -84 152 -123 -75 172 -148 -217 119 116 -263
7634 -263 195 156 -106 -254 -117 -77 57 -139 -145 -206 -173 -155 196 -67 84 46 -14 -197 96 91 69 -162 143 181
7658 181 -141 59 63 -200 13 228 7 48 6 -92 -154 -251 -65 -144 -12 1 -122 37 17 59 56 80 16 128 17
7683 17 -101 -19 -183 -317 8 114 135 -65 261 -190 -112 -2 228 -39 76 112 -423 -134 -132 -146 221 -32 136
7706 136 -169 -368 -23 158 -145 2 -96 175 37 -154 240 50 -112 57 -112 -133 -72 -55 -291 -95 11
7727 11 20 45 61 94 -124 39 -86 -12 -146 -151 -206 146 -395 44 144 152 -123 211 78 -40 208 -48 -16 -27 294
7752 294 -147 -25 54 2 -126 47 236 -46 -89 182 36 100 7 161 -66 -121 -197 126 10 -172 89 -250
7774 -250 160 55 -136 29 -61 -7 -141 81 -12 40 142 99 171 -152 188 -144 -122 -208 207 184 42 95 17 -202
7798 -202 -181 161 233 -91 -40 112 -18 -221 -47 354 -240 18 -46 100 -334 -334 -84 209 -96 163 91 -101
7820 -101 146 10 79 -155 58 -93 2 -83 -227 -347 17 -37 -100 -8 86 13 166 46 57 -12 149 -70 23 -152
7844 -152 -194 111 -6 -196 41 125 97 74 208 125 57 61 284 -35 -11 -11 -247 -133 -7 37 -79 -230 150 167
7868 167 -150 -111 -124 -44 -2 214 -34 -214 -179 -144 -8 -95 73 -60 -24 136 176 -64 -38 10 -55 -16 -149 14
7892 14 -118 -242 36 -230 -20 -75 127 119 37 -86 85 30 -169 248 -240 -58 46 71 -28 9 -65 -231 -206 -279
7916 -279 20 82 5 51 -84 -190 -161 131 -223 -15 256 15 179 246 56 -110 -57 245 26 -86 -208 33
7938 33 -503 93 -162 31 80 -25 33 -287 -297 75 0 -155 58 261 -101 -86 88 -156 -179 311 50 -63
7960 -63 -358 -82 -161 -282 -176 -37 -149 -27 -47 -31 -151 21 -90 0 92 170 -141 35 118 102 -105 25 172
7983 172 157 -78 -47 -101 -61 -61 142 48 98 99 126 149 121 35 -31 -216 135 175 -246 12 60 -199 -72 -40 243 90
8009 90 -178 69 75 -24 -70 158 -188 -101 75 -53 -37 -72 -61 -80 153 75 230 -86 44 92 52 -187 -158 255 91
8034 91 -63 -161 55 -121 -104 273 -384 -115 113 -67 -26 -47 121 58 -1 226 96 -285 25 266 14 65 -254
8057 -254 -164 -81 -70 -27 -62 -474 215 -155 -166 192 -273 78 84 -68 4 -205 -46 -6 -98 -261 112 -130 -387 91
8081 91 -90 -19 25 7 54 -152 12 151 -334 55 283 -104 -172 -81 -43 133 -356 104 13 -158 -53 -48 -60 144
8105 144 180 -200 -203 -107 -47 -271 246 103 -194 -67 95 -16 102 -164 112 3 68 68 -50 -124 22 122 -200
8128 -200 -260 -344 289 -18 14 54 -17 136 161 -144 118 18 -22 -69 -27 -96 -59 -269 56 178 -29 -173 -81 -61
8152 -61 -252 197 165 4 17 259 60 -104 -71 41 55 18 121 15 42 -201 115 212 141 -28 -134 40 6
8175 6 -72 -26 143 51 193 -230 80 128 -117 -3 12 143 -102 89 430 -78
8191g8
##END NTUPLES=NMR FID
##END=
