##TITLE=1H_SL62-I2-mix-f2
 CDCl3, 8 sc, 
 2.9.2021
##JCAMPDX= 6.0         $$ Bruker NMR JCAMP-DX V2.0
##DATA TYPE= NMR FID
##DATA CLASS= NTUPLES
##ORIGIN= UXNMR, Bruker Analytische Messtechnik GmbH
##OWNER= root
$$ XWIN-NMR		Version 3.5
$$ Thu Sep  2 08:47:04 2021 Russian Standard Time (UT+4h)  she@DPX200
##.OBSERVE FREQUENCY= 200.1312
##.OBSERVE NUCLEUS= ^1H
##.DELAY= (6, 6)
##.ACQUISITION MODE= SIMULTANEOUS
##.ACQUISITION SCHEME= undefined
##.AVERAGES= 8
##.DIGITISER RES= 18
##SPECTROMETER/DATA SYSTEM= spect
##.PULSE SEQUENCE= zg30
##.SOLVENT NAME= CD2Cl2
##.SHIFT REFERENCE= (INTERNAL, CD2Cl2, 0, 15.7039)
##AUDIT TRAIL= $$ (NUMBER, WHEN, WHO, WHERE, WHAT)
$$ ##TITLE= Audit trail, XWIN-NMR		Version 3.5
$$ ##JCAMPDX= 5.01
$$ ##ORIGIN= Bruker BioSpin GmbH
$$ ##OWNER= she
$$ F:/spectra/data/she/nmr/H-F/1/audita.txt
$$ ##AUDIT TRAIL=  $$ (NUMBER, WHEN, WHO, WHERE, WHAT)
(   1,<2021-09-02 08:45:40.48 +0400>,<she>,<DPX200>,
      <created by zg, POWCHK disabled, PULCHK disabled
       configuration hash MD5:
       00 E9 B6 7A A2 85 ED C7 34 08 36 98 17 FE 4E 26
       data hash MD5: 16K
       B5 A6 76 6C 6F C3 73 4A 52 7E 77 B4 9A B7 BB 67>)
$$ ##END=
$$ 
$$ hash MD5
$$ B0 EE B4 F7 8C 24 B9 26 21 BB 63 2C 56 58 EF 74
##$RELAX= 
##$RELAX= 
##$RELAX= 
##$RELAX= 
##$RELAX= 
##$RELAX= 
$$ Bruker specific parameters
$$ --------------------------
##$DU= <F:/spectra>
##$EXPNO= 1
##$NAME= <H-F>
##$PROCNO= 1
##$TYPE= <nmr>
##$USER= <she>
##$AMP= (0..31)
100 100 100 100 100 100 100 100 100 100 100 100 100 100 100 100 100 100 
100 100 100 100 100 100 100 100 100 100 100 100 100 100 
##$AQSEQ= 0
##$AQ_mod= 1
##$AUNM= <au_zg>
##$AUTOPOS= <>
##$BF1= 200.13
##$BF2= 200.13
##$BF3= 200.13
##$BF4= 200.13
##$BF5= 200.13
##$BF6= 200.13
##$BF7= 200.13
##$BF8= 200.13
##$BYTORDA= 1
##$CFDGTYP= 0
##$CFRGTYP= 5
##$CHEMSTR= <none>
##$CNST= (0..31)
1 1 145 1 1 1 1 1 1 1 1 1 1 1 1 1 1 1 1 1 1 1 1 1 1 1 1 1 1 1 1 1 
##$CPDPRG= <>
##$CPDPRG1= <>
##$CPDPRG2= <>
##$CPDPRG3= <>
##$CPDPRG4= <mlev>
##$CPDPRG5= <mlev>
##$CPDPRG6= <mlev>
##$CPDPRG7= <mlev>
##$CPDPRG8= <mlev>
##$CPDPRGB= <>
##$CPDPRGT= <>
##$D= (0..31)
0 1.2 0 0 0 0 0 0 0 0.06 0 0.03 0 0 0 0 0.0002 0 0 0 0 0 0 0 0 0 0 0 0 
0 0 0 
##$DATE= 1630557940
##$DBL= (0..7)
120 120 120 120 120 120 120 120 
##$DBP= (0..7)
150 150 150 150 150 150 150 150 
##$DBP07= 0
##$DBPNAM0= <>
##$DBPNAM1= <>
##$DBPNAM2= <>
##$DBPNAM3= <>
##$DBPNAM4= <>
##$DBPNAM5= <>
##$DBPNAM6= <>
##$DBPNAM7= <>
##$DBPOAL= (0..7)
0.5 0.5 0.5 0.5 0.5 0.5 0.5 0.5 
##$DBPOFFS= (0..7)
0 0 0 0 0 0 0 0 
##$DE= 6
##$DECBNUC= <off>
##$DECIM= 32
##$DECNUC= <off>
##$DECSTAT= 4
##$DIGMOD= 1
##$DIGTYP= 9
##$DL= (0..7)
0 120 120 120 120 120 120 120 
##$DP= (0..7)
150 150 150 150 150 150 150 150 
##$DP07= 0
##$DPNAME0= <>
##$DPNAME1= <>
##$DPNAME2= <>
##$DPNAME3= <>
##$DPNAME4= <>
##$DPNAME5= <>
##$DPNAME6= <>
##$DPNAME7= <>
##$DPOAL= (0..7)
0.5 0.5 0.5 0.5 0.5 0.5 0.5 0.5 
##$DPOFFS= (0..7)
0 0 0 0 0 0 0 0 
##$DQDMODE= 0
##$DR= 18
##$DS= 0
##$DSLIST= <SSSSSSSSSSSSSSS>
$$ [...]
##$SUBNAM2= <"">
##$SUBNAM3= <"">
##$SUBNAM4= <"">
##$SUBNAM5= <"">
##$SUBNAM6= <"">
##$SUBNAM7= <"">
##$SUBNAM8= <"">
##$SUBNAM9= <"">
##$SW= 20.0189188712717
##$SWIBOX= (0..15)
0 0 2 0 0 0 0 0 0 0 0 0 0 0 0 0 
##$SW_h= 4006.41025641026
##$TD= 16384
##$TD0= 1
##$TE= 0
##$TE2= 300
##$TE3= 300
##$TEG= 300
##$TL= (0..7)
0 120 120 120 120 120 120 120 
##$TP= (0..7)
150 150 150 150 150 150 150 150 
##$TP07= 0
##$TPNAME0= <>
##$TPNAME1= <>
##$TPNAME2= <>
##$TPNAME3= <>
##$TPNAME4= <>
##$TPNAME5= <>
##$TPNAME6= <>
##$TPNAME7= <>
##$TPOAL= (0..7)
0.5 0.5 0.5 0.5 0.5 0.5 0.5 0.5 
##$TPOFFS= (0..7)
0 0 0 0 0 0 0 0 
##$TUNHIN= 0
##$TUNHOUT= 0
##$TUNXOUT= 0
##$USERA1= <user>
##$USERA2= <user>
##$USERA3= <user>
##$USERA4= <user>
##$USERA5= <user>
##$V9= 5
##$VALIST= <valist>
##$VCLIST= <CCCCCCCCCCCCCCC>
##$VD= 0
##$VDLIST= <DDDDDDDDDDDDDDD>
##$VPLIST= <PPPPPPPPPPPPPPP>
##$VTLIST= <TTTTTTTTTTTTTTT>
##$WBST= 1024
##$WBSW= 4
##$XGAIN= (0..3)
0 0 0 0 
##$XL= 0
##$YL= 0
##$YMAX_a= 164001
##$YMIN_a= -198958
##$ZGOPTNS= <>
##$ZL1= 120
##$ZL2= 120
##$ZL3= 120
##$ZL4= 120
##$ABSF1= 10
##$ABSF2= 0
##$ABSG= 5
##$ABSL= 3
##$ALPHA= 0
##$AQORDER= 0
##$ASSFAC= 0
##$ASSFACI= 0
##$ASSFACX= 0
##$ASSWID= 0
##$AUNMP= <proc_1d>
##$AZFE= 0.1
##$AZFW= 0.1
##$BCFW= 1
##$BC_mod= 2
##$BYTORDP= 1
##$COROFFS= 0
##$CY= 11.3945322036743
##$DATMOD= 1
##$DC= 2
##$DFILT= <>
##$DTYPP= 0
##$F1P= 2.36226072786647
##$F2P= -0.459571619588291
##$FCOR= 0.5
##$FTSIZE= 0
##$FT_mod= 4
##$GAMMA= 1
##$GB= 0.15
##$INTBC= 1
##$INTSCL= 1
##$ISEN= 128
##$LB= 0.24
##$LEV0= 0
##$LPBIN= 0
##$MAXI= 10000
##$MC2= 0
##$MEAN= 0
##$ME_mod= 0
##$MI= 1.114404
##$NCOEF= 0
##$NC_proc= 0
##$NLEV= 6
##$NOISF1= 3.799351
##$NOISF2= 2.8
##$NSP= 1
##$NTH_PI= 0
##$NZP= 0
##$OFFSET= 15.70392
##$PC= 1
##$PHC0= -13367.56
##$PHC1= 23.20097
##$PH_mod= 1
##$PKNL= yes
##$PPARMOD= 0
##$PSCAL= 0
##$PSIGN= 0
##$REVERSE= no
##$SF= 200.130013532006
##$SI= 16384
##$SIGF1= 3
##$SIGF2= 2
##$SINO= 400
##$SIOLD= 16384
##$SREGLST= <1H.CDCl3>
##$SSB= 0
##$STSI= 0
##$STSR= 0
##$SW_p= 3612.71676300578
##$SYMM= 0
##$S_DEV= 0
##$TDeff= 0
##$TDoff= 0
##$TI= <>
##$TILT= no
##$TM1= 0
##$TM2= 0
##$TOPLEV= 0
##$USERP1= <user>
##$USERP2= <user>
##$USERP3= <user>
##$USERP4= <user>
##$USERP5= <user>
##$WDW= 1
##$XDIM= 8192
##$YMAX_p= 0
##$YMIN_p= 0
$$ End of Bruker specific parameters
$$ ---------------------------------
##NTUPLES= NMR FID
##VAR_NAME=  TIME,          FID/REAL,        FID/IMAG
##SYMBOL=    X,             R,               I
##VAR_TYPE=  INDEPENDENT,   DEPENDENT,       DEPENDENT
##VAR_FORM=  AFFN,          ASDF,            ASDF
##VAR_DIM=   8192,          8192,            8192
##UNITS=     SECONDS,       ARBITRARY UNITS, ARBITRARY UNITS
##FACTOR=    0.0002496,     1,               1
##FIRST=     0,             0,               0
##LAST=      2.0444736,     0,               0
##MIN=       0,             -198958,         0
##MAX=       2.0444736,     164001,          0
$$ Real data points
##PAGE= N=1
##DATA TABLE= (X++(R..R)), XYDATA
$$ plain form
0 0 0 0 0 0 0 0 0 0 0 0 0 0 -8 8 -8 8 -16 16 -16 24 -25 32 -40 48 -56 64 -73 87 -98 113 -130 149 -169 191
34 191 -215 243 -274 306 -344 384 -425 473 -528 585 -646 715 -787 869 -957 1053 -1161 1279
52 1279 -1409 1555 -1719 1900 -2107 2345 -2620 2942 -3325 3794 -4377 5129 -6136 7570 -9771
67 -9771 13629 -22311 87139 -94456 -135708 164001 -23033 -132593 72996 70695 -92133
78 -92133 12460 63375 -41048 -42055 37448 -793 -35629 5494 26675 -22326 -21581 21280
90 21280 6427 -30037 8462 30112 -483 -486 17285 -8827 -15058 5078 4505 8644 20190 -1390
104 -1390 -3580 11886 -16340 -18162 21264 -3435 -23881 20880 5505 -37627 6989 22712 -29263
117 -29263 -10485 30026 -7374 -25205 17715 14602 -30295 -11239 33657 2598 -22614 28884
$$ packed form
0@%%%%%%%%%%%%qJ6j6J6k4L2l2M0m9N7p2Q8j04J20j37J60j85K11k43K79l18L60
34A91m06M58n17N80o50P28q09Q98j001J113j231J361j502J656j826K010k214K440
52A279k688K964l274L619m007M452m965N562o267P119q171R506j1265J3706j7341
67i771K3400l5940J09450j81595m1252K99709j87034j09560K05589k301j62828
78i2133J04593N0915j04423j007P9503l8241l4836M1123K1181m9001P45M2861
90B1280j4853l6464L8499K1650l0595lJ7771k6112o231K0136n73M139J1546k1580
104a390k190J5466k8226j822L9426k4699k0446M4761j5375m3132M4616J5723n1975
117b9263J8778M0511l7400j7831M2920l113m4897J9056M4896l1059k5212N1498
$$ plain form
129 28884 26000 -34895 -4934 33146 -21067 -21314 38795 9601 -30762 11426 20487 -24254 -11587
142 -11587 22555 -2268 -24152 4459 15221 -15064 -15142 15540 4782 -20856 2137 21382 -7918
155 -7918 -14544 15076 3660 -19760 5592 18204 -6982 -2093 16775 1362 -13023 287 10829
168 10829 534 -8945 5409 13293 -11659 -11421 17719 -25 -22887 9406 14886 -19278 -5525
181 -5525 17805 -8681 -17816 9451 7162 -13896 56 18351 -2692 -17095 8308 12165 -17142
194 -17142 -4398 25225 -1039 -18788 14921 14021 -19521 -2331 21472 -5018 -13095 12160 6032
207 6032 -14434 -2291 9572 -5009 -10653 5660 7952 -9740 -7669 10542 -2001 -17970 4620
220 4620 14387 -11689 -6498 16618 -379 -15019 7861 12245 -8375 -4033 13606 2850 -12355
$$ packed form
129B8884k884o0895K9961L8080n4213k47O0109k9194m0363M2188R061m4741J2667
142a1587L4142k4823k1884K8611J0762l0285p8L0682j0758k5638K2993J9245k9300
155g918o626K9620j1416k3420K5352J2612k5186M889J8868j5413j4385J3310J0542
168A0829j0295r479J4354P884k4952K38K9140j7744k2862L2293N480l4164J3753
181e525K3330k6486r135K7267k289k1058J3952J8295k1043j4403K5403L857k9307
194a7142J2744K9623k6264j7749L3709r00l3542J7190K3803k6490q077K5255o128
207F032k0466J2143J1863j4581n644J6313K292j7692K071J8211j2543j5969K2590
220D620R767k6076N191K3116j6997j4640K2880M384k0620M342J7639j0756j5205
$$ plain form
233 -12355 3308 14790 -7263 -8541 16911 3117 -19588 6080 14679 -17884 -9188 18597 -4176
246 -4176 -18793 10065 10184 -15712 -5225 12532 -3369 -12458 6060 9216 -8844 -4929 12880
259 12880 2121 -10880 8643 13324 -10445 -4807 15250 -2028 -12593 10504 9760 -11457 -2085
272 -2085 11616 -2520 -10882 3589 6564 -9191 -9387 7588 2217 -13512 1154 13000 -9011
285 -9011 -9758 13507 2428 -15089 5099 12254 -9584 -5089 14464 4298 -9686 4388 11924
298 11924 -5223 -8623 10453 6915 -12697 -958 13417 -7476 -12171 12437 4651 -15785 1104
311 1104 10621 -11848 -10589 10914 1973 -12927 2231 11672 -6343 -9222 10659 6309 -13574
324 -13574 278 16329 -5512 -10684 14975 7346 -14755 4005 14548 -8782 -6933 12893 437
$$ packed form
233a2355J5663J1482k2053j278K5452j3794k2705K5668Q599l2563Q696K7785k2773
246d176j4617K8858J19k5896J0487J7757j5901r089J8518L156j8060L915J7809
259A2880j0759j3001J9523M681k3769N638K0057j7278j0565K3097p44k1217R372
272b085J3701j4136q362J4471K975j5755j96J6975n371j5729J4666J1846k2011
285i011p47K3265j1079j7517K0188P155k1838M495J9553j0166j3984J4074P536
298A1924j7147l400J9076l538j9612J1739J4375k0893m695K4608p786k0436J6889
311A104R517k2469J259K1503q941j4900J5158R441j8015k879J9881m350j9883
324a3574J3852J6051k1841n172K5659p629k2101J8760J0543k3330J849J9826j2456
$$ plain form
337 437 -12814 1910 7494 -6304 -6376 6685 2889 -10066 -2908 7356 -4886 -10324 7597 5724
351 5724 -11128 670 11961 -5465 -6939 10175 3872 -8760 2519 9599 -2353 -5453 7389
364 7389 6089 -8377 -1841 12190 -2014 -12398 7573 7616 -15187 -2952 13689 -6734 -12237
377 -12237 10220 4142 -14710 -125 10776 -6155 -8601 7796 4572 -9196 330 11806 -2202
390 -2202 -9188 8853 8314 -10748 -218 13857 -3502 -9862 9552 5357 -11135 72 10988
403 10988 -3692 -9212 5396 4848 -9950 -4418 9671 -1840 -11986 4948 8678 -10943 -4220
416 -4220 12478 -3525 -11074 9691 7679 -11105 -587 12302 -2089 -8440 6553 8017 -5786
429 -5786 -2044 10085 -438 -10384 4649 8409 -8899 -4606 10875 -2155 -11383 5750 4895 -10479
$$ packed form
337D37j3251J4724N584j3798p2J3061l796j2955P158J0264j2242n438J7921j873
351E724j6852J1798J1291j7426j474J7114o303j2632J1279P080j1952l100J2842
364G389j300j4466O536J4031j4204j0384J9971M3k2803J2235J6641k0423n503
377a2237K2457o078j8852J4585J0901j6931k446J6397l224j3768R526J1476j4008
390b202o986J8041n39j9062J0530J4075j7359o360J9414m195j6492J1207J0916
403A0988j4680n520J4608n48j4798N532J4089j1511j0146J6934L730j9621O723
416d220J6698j6003p549K0765k012j8784J0518J2889j4391o351J4993J464j3803
429e786L742J2129j0523r946J5033L760j7308M293J5481j3030r228J7133q55j5374
$$ plain form
443 -10479 -1764 8460 -3743 -7963 4755 4434 -7254 -2654 8187 557 -7904 4771 9279 -7064
457 -7064 -4693 10972 500 -9020 7021 8630 -8564 -2392 9470 -2013 -8002 4730 4990 -6429
471 -6429 -3582 6162 -1094 -9051 1679 7109 -6564 -6517 8526 588 -10488 3631 7842 -8581
485 -8581 -3096 11547 -24 -8213 5507 7208 -6513 -3192 9118 1933 -8158 3503 9400
498 9400 -6892 -6155 10711 1109 -12318 4523 8673 -11002 -5928 10344 -1626 -10449 4369
511 4369 6023 -7657 -3618 7697 -216 -8716 2384 8332 -4910 -5419 9112 3858 -7875 3020
525 3020 9615 -5840 -4189 10470 1443 -8694 3314 7116 -5367 -4247 5796 1115 -7983 -693
539 -693 5993 -4681 -8427 5673 3698 -10096 -699 9277 -5453 -7006 9006 2597 -9328 2602
$$ packed form
443a0479Q715J0224j2203m220J2718l21j1688M600J0841p630q461J2675M508j6343
457g064K371J5665j0472r520J6041J609j7194O172J1862j1483n989J2732K60j1419
471f429K847R744p256p957J0730N430j3673M7J5043p938j1076J4119M211j6423
485h581N485J4643j1571q189J3720J701j3721L321J2310p185j0091J1661N897
498I400j6292P37J6866r602j3427J6841M150j9675N074J6272j1970q823J4818
511D369J654j3680M039J1315p913q500J1100N948j3242n09J4531n254j1733J0895
525C020O595j5455J651J4659r027j0137J2008L802j2483J120J0043m681r098P290
539f93O686j0674l746J4100j975j3794R397R976j4730j553J6012o409j1925J1930
$$ plain form
553 2602 8954 -4002 -3647 7888 3189 -6132 1300 8353 -2267 -5954 6452 3657 -8286 -95
567 -95 7437 -5654 -6650 6706 688 -9724 353 5995 -5993 -5611 5529 1371 -6958 783 6943
582 6943 -2884 -5081 6554 4877 -6564 585 9762 -2694 -6189 8250 4212 -8617 1882 8704
596 8704 -4752 -5549 6552 1229 -8135 -339 5289 -3751 -6682 3906 2982 -7907 -1753 7427 -3397
611 -3397 -6763 6526 3796 -7740 866 8107 -2881 -4739 6990 3978 -5744 513 7343 -1512
625 -1512 -5500 5170 5094 -6966 -2376 7804 -2277 -8612 4757 4652 -9110 -2379 8375 -3320
639 -3320 -7995 4946 3884 -7424 -1413 6839 -1129 -5801 3923 5433 -5014 -2118 7784 610
653 610 -6859 5083 6220 -6489 -1599 8492 -1572 -6689 5057 3749 -6444 -1901 5826 -1577
$$ packed form
553B602O352j2956L55J1535m699r321P432P053j0620l687J2406k795j1943Q191
567i5P532j3091r96J3356o018j0412J0077N642j1988L82J1140m158q329P741O160
582F943r827k197J1635j677j1441P149R177j2456l495J4439m038j2829J0499O822
596H704j3456p97J2101n323r364P796N628r040k931J0588r24j0889O154R180j0824
611c397l366J3289k730j1536Q606P241j0988j858J1729l012r722O257O830q855
625a512l988J0670p6j2060M590J0180j0081o335J3369j05j3762O731J0754j1695
639c320m675J2941j062j1308O011Q252p968m672R724J510j0447K896R902p174
653F10p469J1942J137j2709M890J0091j0064n117J1746j308j0193M543P727p403
$$ plain form
667 -1577 -6302 2358 4230 -5951 -3307 6334 -368 -7651 2934 5533 -6256 -2615 8018 -702
681 -702 -7087 4685 5408 -5774 -1338 7104 -356 -5206 3397 4617 -4104 -2487 6093 654 -6692
696 -6692 2601 5400 -6050 -3349 7336 -1219 -7683 3724 3997 -6747 -2113 6238 -1572 -5904
710 -5904 2782 4347 -4348 -2866 6308 827 -6414 3027 7143 -4776 -3290 7999 996 -6841 3726
725 3726 6166 -5588 -2706 6422 -111 -6254 2479 4365 -4853 -3671 4928 331 -6934 918 5314
740 5314 -5182 -4985 6483 532 -7582 2651 6132 -5215 -3098 6658 233 -5442 2949 5683
754 5683 -3315 -2585 5778 2254 -5753 633 6377 -3899 -5294 6396 2061 -7669 1157 5741 -5425
769 -5425 -4330 5583 -7 -6426 971 4167 -3505 -3489 4088 1860 -4802 152 5744 -2381 -3698 5686
$$ packed form
667a577m725Q660J872j0181K644R641o702p283J0585K599j1789L641J0633q720
681g02o385J1772P23j1182M436Q442p460m850Q603J220q721J617Q580n439p346
696f692R293K799j1450K701J0685q555o464J1407K73j0744M634Q351p810m332
710e904Q686J565q695J482R174n481p241R441M116j1919J486J1289p003p837J0567
725C726K440j1754K882R128o533o143Q733J886r218J182Q599m597p265P852M396
740E314j0496J97J1468n951q114J0233L481j1347K117R756o425n675Q391K734
754E683q998P30Q363l524q007O386N744j0276j395J1690m335r730Q826M584j1166
769e425J095R913n590o419P397L196p672J6P577k228o662M954N592q125j317R384
$$ plain form
785 5686 2819 -5575 1441 6345 -3067 -3253 5834 1565 -5634 1157 4264 -3401 -3413 4170 1296 -5607
801 -5607 -845 4640 -3089 -5296 4325 2268 -6916 172 5965 -3302 -3927 5708 1688 -5327 1720
816 1720 5795 -2178 -2674 4727 2506 -4339 300 5800 -1467 -4309 4735 2739 -7061 -254 6081
831 6081 -3696 -5450 4742 1033 -6597 377 4901 -3726 -4339 4177 1944 -5273 -522 5561 -1395
846 -1395 -4548 4128 4174 -4729 -284 7062 -1439 -4797 4994 3462 -5600 198 5787 -2380 -4399 3395
862 3395 2334 -4601 -1626 4543 -1483 -5459 2281 2709 -5655 -2017 5527 -1699 -4900 4004 3034 -4790
878 -4790 468 5432 -1190 -3399 4326 3665 -3708 -878 5288 -252 -4433 3145 4192 -4618 -1984
893 -1984 5539 -1424 -5837 2965 3050 -5468 -1116 4801 -2261 -4824 2739 2110 -4146 -1355 4116 -338
$$ packed form
785E686k867q394P016M904r412j86R087m269p199O791L107p665j2P583k874o903
801e607M762N485p729k207R621k057r184P088N793r267o25R635m020p015P047
816A720M075p973m96P401k221o845M639N500p267k842R044j996r800O807O335
831F081r777j754J0192l709p630O974M524q627o13Q516k233p217M751O083o956
846a395l153Q676M6q903M445P346q501l358R791j532r062N798N589q167k019P794
862C395j061o935K975O169o026l976P740M28q364L638P544p226l201Q904r70p824
878d790N258M964o622k209P725o61p373K830O166n540m181P578J047q810K634
893a984P523o963m413Q802Q5q518M352N917p062k563P563o29o256K791N471m454
$$ plain form
909 -338 -3769 2563 4007 -3262 -1605 5704 317 -4369 3377 3922 -4308 -606 5247 -1343 -4031 3394
925 3394 2908 -4456 -1734 3792 -823 -4788 1585 2861 -4246 -2684 4875 -555 -5802 2042 4018
940 4018 -4649 -1765 5641 -607 -4289 3385 3941 -3496 -867 5140 446 -3868 2246 3943 -2996
955 -2996 -2540 5034 463 -5424 1829 3854 -4662 -2619 4547 -908 -5722 2167 3321 -4148 -2277
970 -2277 4246 346 -4475 1121 4075 -2903 -2467 4972 1674 -4994 1856 5470 -2552 -2497 5233 952
986 952 -4638 1662 3638 -3227 -2507 4204 709 -4414 479 3200 -2816 -3403 3061 1189 -5154 375
1002 375 4226 -3047 -3246 4658 776 -4783 2046 4537 -2895 -1776 4434 717 -3474 1683 4280
1017 4280 -1558 -2185 3927 1587 -4446 289 4592 -2761 -3960 4340 865 -5399 752 3799 -3518
$$ packed form
909c38l431O332J444p269J657P309n387m686P746N45q230L702N853o590k688P425
925C394m86p364K722N526m615l965O373J276p107J562P559n430n247P844J976
940D018q667K884P406o248l682P674N56p437K629O007m694m314O114J697o939
955b996M56P574m571n887P253K025q516K043P166n455m814P889J154p469J871
970b277O523l900m821N596K954o978M36P439l298o668O850L614q022N5P730m281
986I52n590O300J976o865P20O711l495n123M893K721o016n87O464j872o343N529
1002C75L851p273j99P904l882n559O829K491p432J119O210l717m191N157K597
1017D280n838o27O112k340o033M735M303p353j199Q300l475o264O151L047p317
$$ plain form
1032 -3518 -2956 3516 482 -4032 456 3492 -2028 -2636 3632 1884 -3449 505 4769 -1797 -2785 4242
1048 4242 2001 -4249 1425 4982 -2655 -2792 3916 754 -4553 675 3470 -2558 -3677 2885 1370
1063 1370 -4795 -468 4194 -2369 -4115 3601 2125 -5183 524 4416 -2185 -2752 4275 1989 -3296
1078 -3296 594 4250 -1038 -2471 3114 2682 -3485 -619 4053 -1848 -3941 3357 2100 -4920 -599
1093 -599 3900 -2759 -4116 2927 1267 -4150 -271 3461 -1579 -2900 2680 2266 -3381 -667 4345
1108 4345 -623 -3419 3200 2975 -3715 -25 5140 -926 -3110 3223 2083 -3901 -481 2970 -1758
1123 -1758 -3107 1817 1952 -3366 -1178 3342 -1430 -3959 2133 1948 -3969 -831 4512 -1237 -2864
1138 -2864 3128 2219 -3472 166 3903 -1072 -2559 2450 2436 -2827 -411 4032 -21 -3362 2228 2639
$$ packed form
1032c518N62O472l034m514M488L036n520o08O268j748n333L954M264o566r88P027
1048D242k241o250N674L557p637j37O708l162n307N228K795o028j119O562j515
1063A370o165M327M662o563j746P716j476p308N707L892o601n67P027k286n285
1078c296L890L656n288j433N585m32o167K866M672n901k093P298j257p020M321
1093e99M499o659j357P043j660n417L879L732n040j321N580m14n647K714N012
1108D345m968k796O619k25o690L690N165o066k184O333j140n984L420L451m728
1123a758j349M924J35n318K188M520m772k529O092j85n917L138N343n749j627
1138b864N992r09n691L638L737m975j487N009j4n263K416M443m053l341N590M11
$$ plain form
1154 2639 -4086 -1607 3833 -1142 -3956 2508 1990 -3829 -753 3456 -1545 -3418 1903 2043 -3217
1169 -3217 -1033 3818 -98 -3560 2314 3385 -2877 -914 4283 -474 -3900 2702 2687 -3716 -540
1184 -540 4260 -524 -3449 2025 1919 -3247 -1680 3035 -287 -4014 1346 2921 -3469 -1983 4175
1199 4175 9 -4540 2178 2897 -3454 -1254 3779 -160 -2892 2534 3150 -2072 -1356 3349 56 -3224
1215 -3224 1037 2879 -2217 -1781 3791 -41 -3895 1194 2549 -3447 -1924 3280 -480 -3940 1190
1230 1190 2180 -2984 -1636 3206 353 -3060 913 2801 -2320 -1953 3624 1112 -2831 1772 3398
1245 3398 -2284 -1654 3489 97 -3305 1396 2727 -2337 -2011 2636 267 -3504 573 2669 -2422
1260 -2422 -2261 2742 -322 -4100 723 3348 -2246 -1919 3633 316 -3145 1394 2718 -2147 -1117
$$ packed form
1154B639o725K479N440m975k814O464n18n819L076M209n001j873N321J40n260
1169c217K184M851l916l462N874J071o262J963N197m757l426O602j5o403L176
1184e40M800m784k925N474j06n166J567M715l322l727N360J575o390J486O158
1199D175m166m549O718P19o351K200N033l939k732N426O16n222P16M705l293l280
1215c224M261J842n096M36N572l832l854N089J355n996J523N204l760l460N130
1230A190R90n164J348M842k853l413L973J888n121L67N577k512l943M603J626
1245C398n682O30N143l392l402M701J331n064L26M647k369l771M077K096n091
1260b422J61N003l064l778M823K625n594L27N552l317l461M539J324m865J030
$$ plain form
1275 -1117 3351 912 -2716 1122 3271 -1629 -1893 3108 1241 -3530 394 2880 -2684 -2574 3117
1290 3117 486 -3988 855 2753 -2629 -2430 2448 544 -3097 314 3093 -1478 -2369 2988 1672
1305 1672 -3240 871 3677 -1353 -1849 3355 1161 -3229 513 3111 -1780 -1845 3015 787 -3431 -117
1321 -117 2836 -1917 -3010 2147 971 -3591 -116 3337 -1825 -2888 2755 1602 -3438 171 3384
1336 3384 -1459 -1885 2595 1341 -2142 1064 3019 -656 -2132 2276 1634 -2917 -577 3448 -1088
1351 -1088 -2713 2467 1359 -3744 -239 2971 -2054 -2766 2299 844 -3227 -28 2779 -1131 -1999
1366 -1999 2143 1722 -2589 -148 3296 -922 -2295 2940 2229 -3052 574 3652 -1121 -2533 2165
1381 2165 981 -3321 -298 2509 -1107 -2710 1799 1564 -2992 -769 2765 -1022 -3193 2034 1736
$$ packed form
1275a117M468k439l628L838K149m900k64N001j867m771L924K486n564J10N691
1290C117k631m474M843J898n382J99M878j904l641L411K779m571q91N357j316
1305A672m912M111K806n030m96N204k194m390L742K598m891o5M860k228m218L314
1321a17K953m753j093N157j176m562L475L453n162j063N643j153n040L609L213
1336C384m843m26M480j254l483L206J955l675j476M408o42m551K340M025m536
1351a088j625N180j108n103L505L210n025p12N065j455m071L199K807l910q68
1366a999M142m21m311K441L444m218j373N235p11n281L626L078m773j412M698
1381B165j184m302L023K807l616j603M509k35m556K223L534l787k171N227k98
$$ plain form
1396 1736 -3111 -410 3434 -1129 -2142 2650 1825 -2524 95 2955 -770 -2305 2260 2291 -2278 -643
1412 -643 3257 -570 -3173 1967 2070 -3364 -1117 3065 -1081 -3338 1614 1511 -3198 -877 2222 -616
1428 -616 -2642 1077 1727 -2321 -856 3153 398 -2273 1695 2646 -2427 -802 3507 -204 -2548 2158
1444 2158 1812 -2446 -683 2551 -538 -2563 1187 1638 -2554 -1611 2153 -430 -3130 1075 2305 -2525
1460 -2525 -1155 3229 -337 -3050 1762 2117 -2004 -281 3080 37 -2253 1671 2100 -1779 -968 2602
1476 2602 446 -2301 1307 2120 -2387 -1467 2692 -351 -3256 1204 1550 -2911 -1395 2455 -447 -2410
1492 -2410 1012 1883 -1973 -1107 2819 222 -2576 1104 2860 -1847 -1232 3455 687 -2792 1432 2650
1508 2650 -2097 -1375 3069 42 -2738 951 1653 -1939 -1477 1982 22 -2757 558 2051 -1952 -2080
$$ packed form
1396A736m847K701L844m563j013M792q25m349K619K860l725j535M565L1m569J635
1412f43L900l827k603N140J03n434K247M182m146k257M952j03m709K321L099k838
1428f16k026L719O50m048J465M009k755k671L968R51n073J625M309l711k344M706
1444B158l46m258J763L234l089k025L750M51m192R43L764k583k700M205J230m830
1460b525J370M384l566k713M812L55m121J723L361l043k290L924M29l879Q11L570
1476B602k156k747L608Q13m507R20M159l043k905M460L46m461J516L850k902j963
1492b410L422Q71l856Q66L926k597k798L680J756m707O15M687k768l479M224J218
1508B650m747P22M444l027k780L689P02l592M62L459j960k779L315J493m003j28
$$ plain form
1524 -2080 2627 348 -3018 630 2575 -1960 -1305 3157 300 -2186 1416 2591 -1370 -1157 2431
1539 2431 600 -2332 592 2340 -1317 -1885 2287 1039 -3237 362 2273 -1994 -1973 2200 121 -2463
1555 -2463 441 1745 -1578 -1442 2079 791 -2056 283 2547 -1126 -1388 2610 1115 -2230 913
1570 913 2717 -1571 -1630 2474 529 -2417 653 2410 -1745 -1559 1820 297 -2622 112 1805 -1635
1586 -1635 -2227 1997 950 -2584 20 2856 -1422 -1544 2420 602 -2391 625 2648 -1193 -1127 2099
1602 2099 1418 -1992 163 2231 -963 -1901 2026 1070 -2420 178 2527 -1297 -2358 2021 630 -3201
1618 -3201 -53 2182 -1631 -2035 1533 704 -2543 88 2625 -389 -1836 2018 1146 -2378 -272 2507
1634 2507 -229 -2052 2366 1223 -2391 -184 2499 -1362 -1825 1660 1041 -2577 -420 1934 -756
$$ packed form
1524b080M707k279l366L648J945m535O55M462k857k486L602J175l961K13L588
1539B431j831k932K924J748l657n68M172j248m276L599J911m267K1M173k079k584
1555b463K904J304l323J36L521j288k847K339K264l673k62L998j495l345L143
1570I13J804m288n9M104j945k946L070J757m155J86L379j523k919K734J693l440
1586a635n92M224j047l534K604K836m278j22L964j818k993L016K023l841O6L226
1602B099o81l410K155K068l194r38L927r56l490K598K349l824j061M379j391l831
1618c201L148K235l813m04L568q29l247K631K537l014j447L854q72l524K106K779
1634B507k736j823M418j143l614K207K683l861m63L485o19l618K157K354k690
$$ plain form
1649 -756 -2185 1435 1152 -2552 -825 2561 -863 -2586 1839 1730 -2217 72 2819 -716 -1832 1755
1665 1755 1394 -2026 287 2240 -401 -2054 1238 1507 -1838 -676 2290 -240 -2369 1175 1255 -2405
1681 -2405 -813 2525 -980 -2195 1442 1107 -1950 -462 2126 -654 -1754 1433 1409 -1845 -436 2601
1697 2601 -58 -1881 1731 1731 -1922 -346 2494 -745 -1819 1663 1411 -1993 -534 2113 -740 -2459
1713 -2459 868 1238 -2065 -1229 2405 -180 -2343 1152 1647 -2240 -858 2625 -376 -2281 1691 1712
1729 1712 -1620 -342 1832 98 -1942 1353 1829 -1766 -1048 1870 242 -2353 637 1792 -1810
1744 -1810 -1164 2284 -454 -2640 1087 1551 -2178 -841 2090 -235 -2018 895 1571 -1700 -1072 2007
1760 2007 518 -1983 1133 2278 -1303 -1004 2380 251 -2303 1323 1852 -1620 -1064 2102 -74 -1926
$$ packed form
1649g56j429L620k83l704J727L386l424j723M425j09l947K289K747l535j116L587
1665A755l61l420K313J953k641j653L292K69l345J162K966k530k129L544Q0l660
1681b405J592L338l505j215L637l35l057J488K588k780j100L187k4l254J409L037
1697B601k659j823L612%l653J576K840l239j074L482k52l404J459K647k853j719
1713b459L327L70l303Q36L634k585k163L495M95l887J382L483l001j905L972K1
1729A712l332J278K174j734k040L295M76l595P18K918j628k595K990J155l602
1744a810O46L448k738k186L727M64l729J337K931k325j783K913O76l271O28L079
1760B007j489k501L116J145l581K99L384k129k554L626N29l472N56L166k176j852
$$ plain form
1776 -1926 753 1475 -1548 -1208 1600 -32 -2227 589 1775 -1565 -1350 2123 29 -2085 694 1882
1792 1882 -1537 -801 2204 374 -1727 979 1761 -1136 -1034 1847 515 -2109 430 1954 -1529 -1700
1808 -1700 1697 320 -2430 557 1670 -1890 -1265 1489 -236 -2184 284 1641 -1315 -1114 1673
1823 1673 377 -1802 544 2195 -1240 -1147 1900 744 -1846 613 1960 -1356 -1090 1935 393 -1978
1839 -1978 403 1445 -1313 -1637 1574 485 -2388 -5 1651 -1265 -1699 1726 744 -2214 300 1962
1855 1962 -1037 -1366 1855 810 -1753 664 2013 -540 -1193 1751 1101 -1512 293 1841 -792 -1670
1871 -1670 1556 1104 -2468 -22 2103 -1082 -1760 1286 256 -2079 39 1473 -760 -1285 1421 602
1887 602 -1631 -107 2153 -508 -1699 1726 1353 -1799 245 2465 -728 -1510 1503 833 -2030 110
$$ packed form
1776a926K679P22l023L40K808j632k195K816J186l340K15L473k094k114K779J188
1792A882l419P36L005j830k101K706P82k897J02K881j332k624K539J524l483j71
1808a700L397j377k750K987J113l560O25K754j725j948K468J357k956K01K787
1823A673j296k179K346J651l435R3L047j156k590K459J347l316K66L025j542k371
1839a978K381J042k758l24L211j089k873K383J656k916m34L425r82k958K514J662
1855A962k999l29L221j045k563K417J349k553o53K944o50k613J805J548k633q78
1871a670L226m52l572K446K125l185o78L046j030k335K118J434k233n25K706q19
1887F02k233J524K260k661j191L425l73l152K044K220l193p82L013o70k863K140
$$ plain form
1903 110 2311 -883 -1211 1241 777 -1828 -373 1571 -998 -2005 908 611 -2114 -336 1769 -502
1919 -502 -1545 1486 745 -1704 242 2137 -453 -1338 1191 1179 -1447 -143 2138 -251 -1630 1245
1935 1245 882 -1672 -638 1389 -791 -1901 1309 821 -1967 -438 1561 -506 -1617 975 1036 -1539
1951 -1539 -283 1568 -284 -1459 1023 1498 -1482 -502 1998 -12 -1683 1310 1686 -1593 -398 1975
1967 1975 -217 -1493 953 1074 -1389 -708 1435 -418 -2062 850 1104 -1845 -642 1975 -213 -1952
1983 -1952 976 1329 -1630 -339 2339 -134 -1293 995 1256 -1261 -410 1847 -38 -1394 738 1407
1999 1407 -1419 -1028 1735 -44 -1562 952 1117 -1842 -812 1584 -302 -1642 967 1069 -1592 -666
2015 -666 1668 -108 -1776 616 1527 -1001 -718 1942 499 -1636 985 1680 -961 -829 1808 75
$$ packed form
1903A10K201l194l28K452m64k605J455J944k569j007K913k97k725J778K105k271
1919e02j043L031p41k449J946J895k590q85K529j2k626J304K281k389j379K875
1935A245l63k554J034K027k180j110L210m88k788J529J999k067j111K592O1k575
1951a539J256J851j852j175K482M75k980R80K500k010j671K993L76l279J195K373
1967A975k192j276K446J21k463O81K143j853j644K912K54k949J203K617k188j739
1983a952K928L53k959J291K678k473j159K288K61k517Q51K257j885j356K132O69
1999A407k826L91K763j779j518K514J65k959J030K396j886j340K609J02k661R26
2015f66K334j776j668K392R11k528K83K660j443k135K621O95k641J32K637j733
$$ plain form
2031 75 -1818 724 1196 -1291 -764 1690 -91 -1660 569 1110 -1449 -1099 1122 132 -1926 389 1464
2048 1464 -878 -979 1736 275 -2034 570 1234 -1022 -847 1634 235 -1291 567 1369 -647 -800
2064 -800 1424 580 -1670 156 1668 -1090 -1280 1449 101 -1802 296 1195 -1302 -968 1329 242
2080 242 -1613 405 1370 -942 -995 1364 960 -1476 701 1870 -1089 -1030 1521 562 -1518 594 1586
2097 1586 -801 -893 1364 72 -1682 -30 1285 -1024 -1042 1078 436 -1888 38 1443 -792 -1495
2113 -1495 1130 557 -1512 177 1614 -774 -924 1361 798 -1208 424 1463 -792 -1054 1448 573
2129 573 -1274 62 1215 -617 -1522 1182 517 -1579 -131 1352 -967 -1380 1003 244 -1743 398
2145 398 980 -673 -1108 1105 970 -1219 145 1725 -275 -930 1542 959 -1334 176 1708 -850
$$ packed form
2031G5j893K542M72k487N27K454j781j569K229N41k559L50K221r90k058K315J075
2048A464k342j01K715j461k309K604O64k256J75K481j399j526J858Q02k016j53
2064h00K224q44k250J826J512k758j90K729j348j903K098Q99k497L34K297j087
2080B42j855K018R65k312n3K359m04k436K177J169k959N9K551r59k080K112R92
2097A586k387r2K257j292j754J652J315k309j8K120o42k324J926J405k235p03
2113a495K625n73k069J689J437k388j50K285n63k006J632J039k255k62K502q75
2129E73j847J336J153j832r05K704o65k096J448J483k319m13K383p59j987K141
2145C98N82j653m35K213j35k189J364J580k000o55K472n83k293J510J532k558
$$ plain form
2161 -850 -1073 1247 394 -1314 74 1349 -802 -1207 847 579 -1308 -668 953 -712 -1262 1251 679
2178 679 -1523 -120 1524 -686 -1011 1125 905 -1241 41 1351 -555 -1005 995 889 -1139 36
2194 36 1126 -322 -1530 784 864 -1489 -568 1226 -845 -1639 810 465 -1479 -154 1247 -641 -1108
2211 -1108 930 898 -1146 -356 1541 -83 -1022 1225 966 -1261 -323 1510 -298 -1256 1216 789 -1137
2228 -1137 -156 1447 -260 -1151 966 856 -1139 -813 1022 -141 -1476 579 1089 -1034 -337 1359
2244 1359 -113 -1458 766 1474 -1035 -260 1476 93 -1220 957 937 -746 -270 1397 -125 -1385
2260 -1385 374 846 -1126 -619 1376 -287 -1477 345 887 -1556 -638 1031 130 -1238 443 849
2276 849 -1036 -256 1180 -84 -1167 539 1123 -811 -610 1435 468 -1195 889 1184 -865 -528 1232
$$ packed form
2161h50k23K320q53j708J388J275k151m05K054k68j887O40J621j665n50K513n72
2178F79k202J403J644k210l25K136k20k146J282J310j906m50K000j06k028J175
2194C6J090j448j208K314Q0k353R21J794k071p94K449l45j944J325J401j888m67
2211a108K038l2k044P90J897j624r39K247k59k227R38J833j808r58K472m27j926
2228a137R81J603j707q91K117j10j995L26J835j163j335K055N10k123O97J696
2244A359j472j345K224P08k509P75J736j383j313K177k0j683M76J667j522j260
2260a385J759M72j972N07J995j663j190J822N42k443R18J669r01j368J681M06
2276H49j885P80J436j264j083J706N84j934K01K045r67j663K084K95k049L37J760
$$ plain form
2293 1232 217 -1224 644 889 -803 -686 1155 127 -1454 -104 753 -1143 -1155 1058 48 -1391
2309 -1391 559 1268 -738 -573 1648 59 -1003 654 1231 -709 -519 1370 207 -1131 466 1089
2325 1089 -1006 -533 1133 -31 -1455 458 1006 -1110 -895 1281 30 -1146 384 1217 -1001 -964
2341 -964 1129 60 -1071 286 1133 -592 -548 1407 454 -965 308 1382 -284 -658 1308 525 -1184
2358 -1184 340 1014 -612 -640 705 262 -1555 -30 872 -1053 -1030 898 426 -1299 -24 1177 -686
2375 -686 -892 995 271 -1002 87 1031 -648 -423 1426 394 -1012 158 1000 -380 -691 734 670
2392 670 -1381 46 1334 -663 -1040 1010 674 -1320 114 1053 -625 -998 1048 463 -808 154 1131
2409 1131 -260 -1166 912 828 -840 -36 1460 -84 -729 1123 813 -1075 -22 1042 -182 -1005 763
$$ packed form
2293A232j015j441J868K45j692J17J841j028j581J350Q57j896j2K213j010j439
2309a391J950P09k006J65K221j589j062J657N77j940J90J889j163j338J597O23
2325A089k095M73J666j164j424J913N48k116K15K176j251j176J530Q33k218L7
2341i64K093j069j131J357Q47j725M4J955r53j419J273J074j666l74J966p83j709
2358a184J524O74j626k8J345m43j817J525R02j925K3J928m72j725J275J201j863
2375f86k06J887p24j273J089R44j679K25J849j032j406J170Q42j380l11J425o4
2392F70k051J427J288j997l77K050l36j994J434R39j678l73K046n85j271R62R77
2409A131j391r06K078q4j668Q04J496j544o45J852l10j888J053J064j224q23J768
$$ plain form
2426 763 335 -1180 -147 915 -637 -939 601 672 -1128 -421 1346 -277 -1085 684 620 -1267 -137
2443 -137 1131 -515 -785 983 621 -1007 -179 984 -412 -1022 793 595 -1105 50 1163 -323
2459 -323 -993 723 583 -1098 -443 919 -522 -1077 713 658 -1099 -244 1128 -328 -1054 757 785 -849
2477 -849 -589 1150 -168 -710 722 961 -779 -257 1340 -121 -937 684 664 -1056 37 1186 -354
2494 -354 -917 493 578 -1110 -493 878 212 -1346 233 937 -735 -421 1204 68 -910 529 844
2511 844 -699 -349 1039 -14 -648 414 887 -730 -525 755 10 -1055 541 778 -753 -757 1090
2528 1090 -236 -1188 211 429 -1017 -443 1039 -11 -825 474 1120 -817 -283 1031 126 -872 541
2545 541 1045 -610 -607 990 374 -882 605 915 -759 -374 1042 4 -990 559 642 -900 -570 796
$$ packed form
2426G63m28j515J033J062j552l02J540P1j800P07J767j623q08J769o4j887J130
2443a37J268j646k70J768l62j628Q28J163j396o10J815j98j700J155J113j486
2459c23o70J716j40j681O55J362j441n55J790n5j757Q55J372j456p26J811K8j634
2477h49K60J739j318n42J432K39j740N22J597j461q16J621k0j720J093J149j540
2494c54n63J410Q5j688O17J371o66j558J579P04j672L14J625j136r78J439L15
2511H44j543L50J388j053o34J062M73j617K05J280p45j065J596K37j531mJ847
2528A090j326r52J399K18j446N74J482j050q14J299O46j937N34J314r05r98J413
2545E41N04j655LJ597o16j256J487L10j674L85J416j038r94J549Q3j542L30J366
$$ plain form
2563 796 -204 -1263 193 813 -545 -697 941 190 -1085 222 1124 -781 -295 928 16 -1070 493
2580 493 708 -661 -438 1038 435 -947 282 945 -647 -690 751 30 -940 354 989 -651 -630 964
2598 964 -69 -923 309 991 -572 -772 874 103 -812 -136 944 -394 -838 823 562 -1072 242
2615 242 998 -452 -479 717 252 -1262 122 824 -652 -512 830 -99 -713 67 775 -644 -800 571
2633 571 47 -773 7 661 -570 -668 864 372 -721 214 924 -411 -694 985 516 -842 134 801
2651 801 -484 -808 703 528 -997 -237 610 -635 -855 594 306 -1021 122 791 -433 -748 685
2668 685 354 -765 169 1140 -383 -643 799 433 -833 -133 987 -280 -546 942 491 -772 70
2685 70 841 -445 -844 537 424 -945 -309 806 -495 -971 287 536 -877 -164 937 -384 -677
$$ packed form
2563G96j000j059J456O20j358j52J638p51j275J307R02j905M86J223r12j086J563
2580D93K15j369K23J476o03j382J229O63j592m3J441p21r70J294O35j640K1J594
2598I64j033q54J232O82j563k00J646p71r15O76J080j338m44J661k61j634J314
2615B42P56j450k7J196m65j514J384P02j476J40J342r29o14P80P08j419j56J371
2633E71n24q20P80O54j231r8J532m92j093R35P10j335k83J679m69j358R76O67
2651H01j285l24J511j75j525P60Q47j245k20J449k88j327J143O69j224l15J433
2668F85l31j119R34R71j523k60J442l66j266P00J120j267k66J488m51j263Q42
2685G0P71j286l99J381j13j369O36J115j301m76J258K49j413P13J101j321k93
$$ plain form
2702 -677 540 597 -1231 9 1147 -312 -334 770 712 -847 -153 900 -37 -770 407 503 -827 -109
2720 -109 593 -275 -1006 305 305 -763 -171 614 -291 -831 311 221 -885 -348 686 -95 -834 589 761
2739 761 -557 -395 935 176 -656 588 766 -678 -549 880 -136 -679 482 685 -914 -212 675
2756 675 -46 -849 265 445 -844 -470 503 -308 -1132 490 646 -678 -319 850 -83 -724 313 671
2774 671 -431 -361 919 3 -699 514 642 -597 -222 882 -17 -844 279 586 -556 -625 827 -42
2792 -42 -759 410 659 -792 -122 797 -224 -643 364 533 -545 -382 951 267 -742 425 916 -566
2810 -566 -126 919 194 -856 285 919 -603 -623 779 -11 -1070 163 423 -380 -379 625 -130 -1017
2828 -1017 286 559 -639 -613 575 288 -982 304 743 -313 -326 711 33 -746 312 901 -420
$$ packed form
2702f77J217N7j828J240J138j459k2J104n8j559O94J053r37p33J177R6j330P18
2720a09P02q68p31J311%j068N92P85r05n40J142r0j106N37J034p81p39J423J72
2739G61j318J62J330p59q32J244J78j444J29J429j016n43J161K03j599P02Q87
2756F75p21q03J114J80j289L74R73q11q24J622J56j324L59J169r33o41J037L58
2774F71j102P0J280r16p02J213J28j239L75J104q99q27J123L07j142o9J452q69
2792d2p17J169K49j451O70R19j021m19J007J69j078J63J333o84j009J167M91j482
2810e66M40J045p25j050J141O34j522k0J402p90j059J233K60q03JJ004p55q87
2828a017J303K73j198K6J188k87j270J286M39j056j3J037o78p79J058N89j321
$$ plain form
2845 -420 -527 781 213 -796 -15 993 -472 -510 554 230 -843 224 867 -682 -568 724 47
2862 47 -757 9 791 -476 -556 516 364 -646 246 840 -34 -345 690 295 -859 49 728 -319 -752
2881 -752 769 267 -589 -13 463 -566 -437 330 79 -780 473 570 -691 -662 619 274 -785 -84 527
2900 527 -493 -647 733 147 -392 -8 760 -173 -354 389 567 -584 -91 501 -73 -594 571 369 -743
2919 -743 -67 643 -312 -569 486 214 -582 -124 612 -232 -713 578 234 -707 27 823 -124 -804 379
2938 379 159 -522 -56 981 -242 -525 757 574 -635 -270 855 -228 -617 345 341 -959 -208 775
2956 775 -361 -771 342 593 -688 45 628 -352 -300 745 388 -609 187 542 102 -501 483 636 -506
2975 -506 -99 651 -129 -729 370 411 -691 -81 637 -309 -757 276 403 -523 -227 394 -351 -693 321
$$ packed form
2845d20j07J308n68j009P81J008j465l8J064l24j073J067O43j549J14J292o77
2862D7q04P66P82j267q0J072j52j010Q92N94q74l11J035l95j154R08O79j047m33
2881g52J521n02q56N76M76j029J29P67k51q59J253R7j261K9J281l45j059P01O11
2900E27j020j54J380n86n39L84P68r33j81P43J78j151M93N92n74n21J165k02j112
2919g43O76P10r55k57J055k72p96M58P36q44m81J291l44r41P34P96r47o80J183
2938C79k20o81M66J037j223k83J282j83j209L65J125j083l89R62mj300P51R83
2956G75j136m10J113K51j281P33N83r80N2J045l57r97P96L55m40o03R84J53j142
2975e06M07P50p80o00J099M1j102O10P18r46m48J033J27r26K96O21p45l42J014
$$ plain form
2994 321 427 -512 -241 820 -34 -643 540 711 -414 -87 893 46 -518 392 674 -450 -218 668 71
3013 71 -453 220 365 -519 -442 701 -187 -1036 266 384 -319 -282 732 66 -635 205 634 -464 -139 609
3033 609 196 -1006 324 561 -383 -243 730 -96 -763 201 433 -458 -207 556 -1 -888 118 559 -531
3052 -531 -136 540 94 -761 368 542 -386 -410 614 283 -486 138 539 -432 18 787 75 -380 142 645
3072 645 -403 -253 581 143 -531 299 387 -503 -302 867 -196 -829 110 253 -895 -484 393 -278 -432
3091 -432 347 602 -367 -267 676 204 -603 240 782 -237 -209 531 269 -630 -70 657 -337 -477 425 304
3111 304 -846 156 553 -414 -507 716 407 -964 80 493 -499 -297 480 345 -643 137 446 -175 -367
3130 -367 736 356 -342 38 578 -119 -554 616 153 -694 89 501 -395 -199 556 253 -541 -346 351
$$ packed form
2994C21J06r39K71J061q54o09J183J71j125L27R80q47n64R10K82j124K32Q86n97
3013G1n24O73J45q84P7J143q88q49J302J18p03L7J014o66p01Q40M29j098L25P48
3033F09m13j202J330K37r44J40R73q26o67R64K32q91K51P63n57q87J006M41j090
3052e31L95O76m46q55J129J74r28k4J024l31p69O24M01r71M50P69p12m55N22N03
3072F45j048J50Q34m38o74Q30Q8q90K01J169j063o33R39J43j148M11Q77o71j54
3091d32P79K55r69J00R43m72q07Q43N42j019K8P40k62q99N60P27r94j40R02j21
3111C04j150J002L97r67r3J223l09j371J044M13r92K02P77j35r88P80L09o21j92
3130c67J103l80o98L80N40o97m35J170m63q47P83M12q96J96P55l03p94J95O97
$$ plain form
3149 351 -388 -216 681 139 -362 32 478 -422 -416 687 66 -522 -164 590 -295 -368 702 210 -617 173
3169 173 656 76 -389 545 -5 -522 -73 490 -99 -596 250 261 -499 -196 480 -187 -298 502 189 -769
3189 -769 -182 383 -73 -310 384 259 -494 -71 356 -229 -253 449 704 -650 -102 661 -242 -484 606 235
3209 235 -441 -258 553 -234 -471 288 130 -523 -99 760 -13 -694 550 181 -839 -171 410 41 -494
3228 -494 327 448 -534 405 658 -124 -312 84 402 -505 -202 579 -272 -658 247 356 -346 30 610 100
3248 100 -559 175 158 -424 -146 648 -156 -480 579 330 -321 64 684 -23 -399 227 674 -430 -92 414
3268 414 -202 -308 436 499 -459 -243 492 11 -589 335 470 -521 -267 342 -127 -503 143 424 -555 -500 445
3289 445 95 -504 177 318 -235 29 601 307 -431 300 528 -343 -240 289 27 -587 -62 295 -509 -167
$$ packed form
3149C51p39J72Q97n42n01L94M46r00OJ103o21n88L58P54q85p3J070m92q27P90
3169A73M83n80m65R34n50n17M49N63n89m97Q46J1p60L03O76o67j11Q00l13r58
3189g69N87N65m56k37O94j25p53M23M27n85k4P02K55j354N48P63r03k42J090l71
3209B35o76J83Q11p87k37P59j58o53M24Q59p73o81J244l69j020O68N81l69n35
3228d94Q21J21r82R39K53p82j88L96L18r07L03P81q51l86R05J09p02L76N80n10
3248A00o59P34j7n82K78P94q04l24J059k49o51L85O20p07l76O26M47j104L38N06
3268D14o16j06P44O3r58K16P35m81o00R24J35r91K54O09m69l76O46K81r79N5R45
3289D45l50n99O81J41n53K64N72k94p38P31K28q71J03N29k62o14N25L57q04L42
$$ plain form
3309 -167 346 28 -351 9 432 -283 -426 451 -83 -559 71 318 -229 -222 349 291 -388 298 458 -104 60
3330 60 818 230 -409 72 278 -387 2 572 -43 -469 247 511 -411 -375 521 117 -359 192 334 -261 -175
3351 -175 436 197 -647 148 542 -383 -342 451 9 -340 -77 350 -297 -590 359 467 -442 -77 485 -431
3371 -431 -497 471 -46 -549 119 532 -230 -473 338 155 -585 -35 383 -430 -217 379 -172 -356 400 453 -171
3392 -171 -297 563 196 -516 242 767 50 4 297 197 -299 88 588 -335 -331 296 173 -650 -28 272 -96
3413 -96 -300 271 394 -412 -253 544 -153 -352 268 273 -369 284 436 -121 -279 455 466 -302 151 319 -263
3434 -263 -345 545 173 -440 -34 584 -357 -517 240 150 -615 112 489 -146 -306 225 157 -101 10 683 -48
3455 -48 -372 245 -66 -506 80 653 -226 -453 376 184 -351 -227 360 -276 -393 521 102 -300 -320 462 -252
$$ packed form
3309a67N13l18l79L60M23p15j43Q77n34m76O30K47n47PN71n8o79O86J60n62J64
3330F0P58n88o39M81K06o65L89N70o15m26P16K64r22L6Q96m04m76N51J42n95Q6
3351a75O11k39q44P95L94r25M1P93m42l49K63M27o47k93R49J08r09L65N62r16
3371d31o6R68n17n03O68M13p62k43Q11j83p40N50M18q13K13N96n51j84P56N3o24
3392a71j26Q60l67p12P58N25p17m6K93j00m96L87N00r23MO27j23q23O22L00l68
3413i6k04N71J23q06J59P97o97j99O20No42O53J52n57j58P34J1p68M53J68n82
3434b63q2Q90l72o13M06O18r41j60P57r0p65P27L77o35j60N31o8k58J11O73p31
3455d8l24O17l11m40N86N73q79k27Q29j92n35J24N87o36j17R14m19m02k0P82p14
$$ plain form
3476 -252 -285 5 128 -293 115 195 111 -309 423 227 -250 21 290 -111 -300 427 220 -369 -41 283 -97
3497 -97 -148 151 282 -416 -216 231 -148 -349 120 184 -391 -91 452 -55 -371 -84 293 -459 50 188 -199
3518 -199 -441 353 485 -272 11 163 187 -282 74 274 -205 113 411 -110 -313 152 130 -501 -128 441 25
3539 25 -413 -41 266 -325 -136 107 54 -520 96 272 -57 -94 248 75 -437 357 115 -219 -324 486 244
3560 244 -356 418 231 -218 -438 436 -62 -452 294 291 -379 -89 314 39 -495 193 307 -439 71 479 328
3581 328 -588 151 162 -336 -281 311 220 -520 487 452 -210 -138 532 -17 -404 456 360 -367 -258 138 -104 -471
3603 -471 144 279 -454 -50 33 277 -394 210 251 -465 -43 467 203 -260 540 360 -290 -154 397 165 -240
3624 -240 125 214 -256 -184 429 3 -296 67 168 -187 -36 177 68 -431 -152 433 -245 -310 357 -129 -443
$$ packed form
3476b52l3K90J23m21M08Q0q4m20P32j96m77K71K69m01j89P27k07n89L28L24l80
3497i7n1K99J31o98K00M47l79k01M69O4n75L00N43n07l16K87L77p52N09J38l87
3518a99k42P94J32p57K83J52K4m69L56K00m79L18K98n21k03M65k2o31L73N69m16
3539B5m38L72L07n91J89K43n3n74O16J76l29l7L42j73n12P94k42l34j05Q10k42
3560B44o00P74j87m49k20Q74m98l90P46lo70K90M03k75n34O88J14p46N10M08j51
3581C28r16P39J1m98N5N92r1p40J007l5o62P2O70n49l87Q60r6p27J09L96k42l67
3603d71O15J35p33M04Q3K44o71O04M1p16M22N10k64m63Q00j80o50J36N51k32m05
3624b40L65Q9m70P2O13m26k99L63J01l55J51K13j09m99K79N85o78o5O67m86l14
$$ plain form
3645 -443 51 339 -259 -241 508 275 -270 78 548 -616 -155 456 47 -408 242 387 -35 -646 252 -8
3665 -8 -490 214 165 10 -214 113 216 -298 -30 230 -136 -266 277 366 -309 4 391 -123 -282 196 283 -69
3687 -69 0 153 111 -154 487 145 -427 70 447 -96 -241 213 -7 -441 -299 515 218 -441 415 183 -474
3708 -474 -119 411 -229 -320 23 129 -348 -7 343 -144 -458 511 214 -516 -42 270 -139 -292 31 29 -361
3729 -361 95 585 -58 -213 34 267 -473 179 298 154 -234 225 -48 -502 -98 347 14 -237 396 55
3749 55 -198 270 89 61 -52 487 349 -42 7 557 -475 -439 108 189 -346 -62 339 -27 -323 88 95 -492
3771 -492 -147 381 -181 -343 181 190 -131 -301 374 -16 -498 160 211 -453 -81 374 49 -300 189 43 -431
3792 -431 -96 421 -107 -659 30 531 -67 -168 190 -2 -440 24 145 -54 141 335 68 -250 225 449
$$ packed form
3645d43M94K88n98J8P49k33n45L48M70j164M61O11m09m55O50J45m22o11Q98k60
3665hm82P04m9j55k24L27J03n14K68K60l66j30N43Q9o75L13L87n14j59M78Q7l52
3687f9O9J53m2k65O41l42n72M97L77n43j45M54k20m34J42Q14k97o59Q56k32o57
3708d74L55N30o40r1L43J06m77L41L50m87l14R69k97p30M74L12m09j53L23kl90
3729c61M56M90o43j55K47K33p40O52J19j44l88M59k73m54M04M45l33k51O33l41
3749E5k53M68j81k8j13N39j38l91M9N50j032L6N47Q1n35K84M01l66k96M11Pn87
3771d92L45N28n62j62N24Rl21j70O75l90m82O58N1o64L72M55l25l49M89j46m74
3792d31L35N17n28n52O89N01n98j01L58j92m38M64J21j99J95J94k67l18M75K24
$$ plain form
3812 449 -312 60 561 96 -384 37 271 -238 -183 211 -42 -426 355 319 -222 -207 206 -260 -339 -126 461
3833 461 -130 -480 342 -28 -213 -103 361 -318 -322 300 17 -109 199 250 -144 55 22 219 -407 188 -35
3854 -35 -92 -67 500 -64 -281 -90 -8 53 -298 274 37 -281 95 363 -200 -140 318 89 -480 197 -78 -252
3876 -252 -325 313 183 -130 181 119 -187 -161 47 34 -249 112 211 -124 -262 -44 215 -285 -29 73 -354 -318
3898 -318 107 119 -217 27 523 52 -200 281 134 -317 92 216 -288 42 246 57 -309 -114 290 -48
3918 -48 -60 420 180 -315 89 186 -263 -271 396 322 -431 -117 65 -81 -388 169 40 -441 83 222 20 -229
3940 -229 297 365 -349 34 301 -130 -36 171 180 -79 244 152 34 -46 147 219 -121 181 258 -324 -536 141 -213
3963 -213 -74 64 105 -291 -75 157 -9 -333 21 543 113 -290 169 120 -182 -77 261 -119 -269 255 427
$$ packed form
3812D49p61L72N01m65m80M21K34n09N5L94k53l84P81l6n41J5M13m66p9K13N87
3833D61n91l50Q22l70j85J10M64o79mO22k83j26L08N1l94J99l3J97o26N95k23
3854c5n7K5N67n64k17J91Q2O1l51N72k37l18L76K68n63O0M58k29n69O77k75j74
3876b52p3O38j30l13L11o2l06K6K08j3k83L61R9l35j38K18K59n00K56J02m27L6
3898c18M25J2l36K44M96m71k52M81j47m51M09J24n04L30K04j89l66J95M04l38
3918d8j2M80k40m95M04R7m49qO67p4p53L14J82j46l07N57j29m81N24J39k02k49
3940b29N26O8p14L83K67m31R4K07Rk59L23r2j18q0J93P2l40L02P7n82k12O77l54
3963b13J39J38M1l96K16K32j66l24L54N22m30m03M59m9l02J05L38l80j50N24J72
$$ plain form
3984 427 -381 164 163 -27 -148 313 323 -252 -138 242 -275 -402 339 120 -247 9 373 -175 -37 -152 227
4005 227 -307 -32 366 -234 -301 245 270 -237 -34 183 -69 -298 103 95 -65 -205 162 -176 -274 -121 312 -58
4027 -58 -19 87 -208 -381 -65 472 -108 -15 320 75 -109 340 276 -246 -316 334 -5 -202 209 -70 -477 -93
4049 -93 153 182 -74 -12 326 -249 36 554 161 -288 16 192 -167 0 105 -33 -90 -145 173 55 -351 46
4071 46 -73 -190 29 466 -345 155 252 -47 -214 239 225 -423 -28 279 135 -207 71 135 -112 -152 249 93
4093 93 -184 197 467 -237 -11 236 5 -502 162 268 95 -402 219 212 -348 88 315 -11 -82 420 41
4114 41 -258 153 270 -31 -205 523 83 -155 77 159 -184 -373 148 -56 -280 -103 168 -486 36 257 124
4135 124 -199 -84 193 -239 -123 202 89 -341 -240 280 128 21 105 103 -397 -80 78 -64 -391 421 69
$$ packed form
3984D27q08N45jj90j21M61J0n75J14L80n17j27P41k19l67K56L64n48J38j15L79
4005B27n34K75L98o00o7N46K5n07K03K17k52k29M01qj60j40L67l38r8J53M33l70
4027e8L9J06k95j73L16N37n80R3L35k45j84M49o4n22p0O50l39j97M11k79m07L84
4049i3K46K9k56O2L38n75K85N18l93m49L04J76l59J67J05j38n7n5L18j18m06L97
4071D6j19j17K19M37q11N00R7k99j67M53j4o48L95L07j44l42K78O4k47m0M01j56
4093I3k77L81K70p04K26K47k31n07O64J06j73m97O21pn60M36K27l26p1N02l79
4114D1k99M11J17l01j74P28m40k38K32Q2l43j89N21k04k24J77K71o54N22K21j33
4135A24l23J15K77m32J16L25j13m30J01N20j52j07Q4kn00L17J58j42l27Q12l52
$$ plain form
4156 69 -107 -9 213 -440 -28 109 -69 -323 -224 312 -141 -501 72 112 -244 -153 240 28 -59 71 269 -445
4178 -445 -83 284 14 15 180 117 -287 -154 165 100 -253 170 165 -291 -50 159 -204 -80 125 232 -84 -7
4200 -7 -1 -374 -323 151 181 -304 -226 149 -105 -134 87 235 -233 -157 34 3 148 177 -74 -236 -194 198 -50 -192
4224 -192 -92 141 -219 -85 219 -81 -221 -19 309 -161 -256 6 -161 -31 236 -119 -339 -152 184 29
4244 29 -193 -83 216 -158 -194 154 15 -158 -41 173 108 58 60 -88 -207 281 123 -202 -90 242 -110 -118 -13
4267 -13 328 -243 20 124 113 -233 291 344 -127 113 36 19 21 -101 -147 -292 -65 236 -22 -184 -36 46 -395
4290 -395 -4 282 19 -225 165 152 -259 -141 -3 135 -285 78 275 -296 -117 143 151 -284 -158 130 -312
4311 -312 -152 152 -39 -106 -114 130 -210 112 153 -49 -227 87 358 -20 -136 91 85 -278 88 285 -150 55
$$ packed form
4156F9j76R8K22o53M12J37j78k54R9N36m53l60N73M0l56R1L93k12q7J30J98p14
4178d45L62L67k70JJ65o3m04J33L19o5l53M23nm56K41K09l63J24K05J07l16P7
4200gOl73N1M74L0m85P8L75k54k9K21J48m68P6J91l1J45K9k51j62M2L92k48j42
4224a92J00K33l60J34L04l00j40K02L28m70r5K62j67J30K67l55k20J87L36j55
4244B9k22J10K99l74l6L48j39j73J17K14o5n0Kj48j19M88j58l25J12L32l52qJ05
4267a3L41n71K63J04j1l46N24N3m71K40p7j7Kj22m6j45K27L01k58j62J48Q2m41
4290c95L91K86k63k44L90j3m11J18J38J38m20L63J97n71J79K60Qm35J26K88m42
4311c12J60L04j91o7qK44l40L22M1k02j78L14K71l78j16K27ol63L66J97m35K05
$$ plain form
4333 55 421 215 -194 109 189 -74 -164 134 108 -248 30 340 -9 12 304 -121 -201 -33 -20 -199 -205 442 104
4356 104 -265 -55 34 -277 -25 203 141 -267 165 202 -142 -159 132 154 -120 -47 245 -188 -102 189 53 -130
4378 -130 6 24 -151 -234 138 -9 -418 -64 172 -130 -422 -116 171 -140 -13 234 -215 116 169 169 -213 179
4400 179 147 -46 -286 37 210 50 -136 495 -355 -306 406 346 -263 -351 244 -107 21 186 198 24 -151 380
4422 380 -265 -234 -159 -2 -217 84 249 -192 -70 93 347 -276 28 446 52 -177 5 91 -51 -18 261
4443 261 -170 -151 182 39 -172 -29 242 0 122 197 310 -258 7 65 29 -174 311 142 -395 80 -14 138
4465 138 53 95 189 -83 25 217 -158 -315 37 -66 18 -143 191 -16 -115 226 194 -48 -35 208 8 -204
4487 -204 136 13 -171 -128 235 269 -81 497 52 -330 -9 423 -59 -493 75 101 -109 33 65 85 -191 87
$$ packed form
4333E5L66k06m09L03Q0k63r0K98k6l56K78L10l49K1K92m25q0J68J3j79oO47l38
4356A04l69K10Q9l11K52K28o2m08M32L7l44j7K91K2k74P3K92m33Q6K91j36j83
4378a30J36J8j75q3L72j47m09L54K36l02k92L06K87l11J27K47m49L31N3%l82L92
4400A79l2j93k40L23J73j60j86O31q50M9P12o0o09q8N95l51J28J65J2j74j75N31
4422C80o45L1P5J57k15L01J65m41J22J63K54o23L04M18l94k29J82Q6j42L3K79
4443B61m31J9L33j43k11J43K71k42J22P5J13n68K65N8l6k03M85j69n37M75r4J52
4465A38q5M2R4k72J08J92l75j57L52j03Q4j61L34k07r9L41l2k42J3K43k00k12
4487b04L40j23j84M3L63L4l50N78m45l82L21M32m82m34N68K6k10J42L2K0k76K78
$$ plain form
4509 87 357 24 -153 148 72 -27 -120 256 -212 -109 40 64 -276 2 107 -345 -187 148 -18 -247 210 158
4531 158 -11 -270 104 -125 -295 66 224 -130 -353 194 -159 59 -124 3 -344 98 424 -161 -146 243
4551 243 75 -193 -187 -222 -152 89 210 160 -226 25 -21 48 -314 49 246 123 -85 112 289 -161 226 24
4573 24 -328 -72 325 -13 -324 43 185 -372 -342 16 -39 -118 135 75 54 -220 -115 60 -353 111 48 -155
4595 -155 192 140 75 -20 -122 294 -61 275 67 310 -255 -130 -36 161 -228 213 -57 -359 122 259 -23
4616 -23 -289 -11 -157 -156 -296 33 -31 -303 35 234 -157 -164 275 -262 -158 293 202 -157 -196 320 -90 -310 -211
4639 -211 -73 -309 175 315 -254 273 269 -8 -51 27 257 101 152 -31 6 -139 71 77 -137 -83 71 -153 -38
4662 -38 75 222 -164 12 81 32 -244 -83 189 40 233 97 228 -323 -62 59 80 -272 -81 265 -149
$$ packed form
4509H7K70l33j77L01p6r9r3L76m68J03J49K4l40K78J05m52J58L35j66k29M57n2
4531A58j69k59L74k29j70L61J58l54k23N47l53K18j83J27l47M42L26n85J5L89
4551B43j68k68Ol5P0K41J21n0l86K51m6O9l62L63J97j23k08J97J77m50L87k02
4573B4l52K56L97l38l11L67J42n57L0L58n5p9K53o0k1k74J05J75m13M64o3k03
4595a55L47n2o5r5j02M16l55L36k08K43n65J25R4J97l89M41k70l02M81J37k82
4616b3k66K78j46Jj40L29o4k72L38J99l91pM39n37J04M51r1l59l9N16m10k20R9
4639b11J38k36M84J40n69N27mk77m3P8K30j56N1j83L7j45K10Ok14N4J54k24J15
4662c8J13J47l86J76O9m9k76J61K72j49J93j36J31n51K61J21K1l52J91L46m14
$$ plain form
4683 -149 -133 116 -283 -240 289 349 73 -143 115 -47 -206 -93 92 -126 -100 219 -83 -152 19 239 -26 -106
4705 -106 311 -237 -273 -134 242 -327 -122 269 -249 -355 -65 -19 20 93 45 -104 -64 130 119 -244 -344 145
4727 145 -69 -248 -39 -187 -83 -109 92 -59 -92 -86 283 -327 46 295 2 -130 -64 -45 -3 -156 176 68
4749 68 -222 1 333 -372 -149 28 -186 -64 212 81 -82 84 396 -72 -205 259 -40 -406 -39 75
4769 75 24 -108 83 153 -359 -84 -11 110 -140 24 -23 -283 26 147 191 -179 142 138 -194 -16 47 -2 -107
4792 -107 -2 272 -431 -48 239 135 -157 93 -78 -167 -85 191 -16 -41 39 139 -226 -284 433 63 -152 265
4814 265 279 -11 119 -36 -92 -167 154 83 -9 -162 155 -147 -178 -2 127 -189 20 178 -19 -173 -176 323 -200
4837 -200 -124 29 121 -317 286 22 -106 -207 -56 38 -41 -5 143 -196 2 46 101 -79 -70 265 23 -279 -9
$$ packed form
4683a49J6K49l99M3N29O0k76k16K58j62j59J13J85k18K6L19l02o9J71K20k65q0
4705a06M17n48l6J39L76n69K05L91n18j06K90M6L9P3m8j49M0J94j1l63j00M89
4727A45k14j79K09j48J04k6K01j51l3OL69o10L73K49k93j32O6J9M2j53L32j08
4749F8k90K23L32p05K23J77k14J22K76j31j63J66L12m68j33M64k99l66L67J14
4769G5n1j32J91P0n12K75P3J21k50J64m7k60L09J21M4l70L21ml32J78O3m9j05
4792a07J05K74p03L83K87j04k92K50j71q9Q2K76k07k5Q0J00l65n8P17l70k15M17
4814B65J4k90J30j55n6p5L21p1r2j53L17l02l1J76J29l16K09J58j97j54lM99n23
4837b00P6J53R2m38O03k64j28j01J51R4p9L6J48l39J98M4N5j80RL35k42l02K70
$$ plain form
4860 -9 191 -50 -56 -30 -138 -318 94 211 -298 41 43 -181 -364 119 228 -136 84 -67 7 -185 88 -182 -185
4883 -185 113 400 -171 -139 78 94 -134 -111 -27 78 -85 82 159 -27 -129 255 -158 -336 -49 62 -164 -15
4905 -15 -11 -299 29 319 -8 -429 91 416 -40 -183 47 4 -254 -16 228 59 -25 116 -123 -140 -136 134 -67
4928 -67 -260 22 132 -126 -94 229 12 36 253 233 -176 -208 302 109 -128 -182 -104 -362 -11 62 -251 -289 -13
4951 -13 311 -280 -8 24 -170 -161 86 33 -78 -133 69 -135 -25 173 -55 -241 141 139 7 -94 297 -164 39
4974 39 -61 -9 -375 17 298 246 -10 79 202 135 -132 0 -41 -50 -80 7 -274 -125 184 142 -131 -187 189 -100
4998 -100 -316 -75 -46 -88 58 157 -66 -109 -38 -37 -49 -177 310 -295 -171 21 111 -136 -248 31 -77 -79 217 59
5022 59 76 -3 84 165 -77 -125 358 16 32 173 -153 -307 -166 185 -204 76 119 -8 42 353 -2 -242 142
$$ packed form
4860iK00k41oK6j08j80M12J17n09L39Kk24j83M83J09l64K20j51P4j92K73k70l
4883a85K98K87n71L2K17J6k28K3Q4J05j63J67P7j86j02L84m13j78K87J11k26J49
4905a5Mk88L28K90l27m21N20L25m56j43K30m3k58K38K44j69q4J41k39j7MK70k01
4928f7j93K82J10k58L2L23k17K4K17k0m09l2N10j93k37n4P8k58L51P3l13l8K76
4951a3L24n91K72L2j94RK47n3j11n5K02k04J10J98k28j86L82kj32j01L91m61K03
4974C9j00N2l66L92K81n2k56Q9J23o7k67J32m1rl0Q7k81J49L09m2k73n6L76k89
4998a00k16K41K9m2J46R9k23m3P1Jj2j28M87o05J24J92R0k47j12K79j08kK96j58
5022E9J7p9Q7Q1k42m8M83l42J6J41l26j54J41L51l89K80M3j27N0L11l55k40L84
$$ plain form
5045 142 58 -181 -14 50 269 6 -143 315 -361 39 -3 85 -295 -37 36 -71 -245 -117 17 -568 -203 142
5067 142 181 -234 77 114 -31 -287 117 162 132 -261 -120 -277 -168 28 106 -115 145 194 -151 -189 137 -52
5089 -52 81 42 100 49 -55 133 -33 -266 137 134 -313 -143 216 -23 -76 -99 198 -36 -24 343 8 -155 -163 20
5113 20 -147 91 236 111 -258 -33 323 -66 -171 -34 3 -309 -56 156 0 -144 253 -76 -273 -82 303
5134 303 17 -7 111 19 -186 -130 -71 -164 -107 69 17 -10 75 144 80 -195 285 172 -117 137 198 -157 -232 195
5158 195 126 -273 -314 204 -96 -113 142 82 372 45 11 -223 -91 -109 105 -294 -124 239 -105 -34 171 -49
5180 -49 -22 -10 106 -161 -263 209 86 -68 106 390 -145 114 -37 -206 -55 -264 4 254 -150 -102 260
5201 260 -80 78 17 -226 -148 -105 111 -78 -154 111 -194 -132 -119 101 -93 -89 80 -64 0 305 -72 -190 -62
$$ packed form
5045A42q4k39J67O4K19k63j49M58o76M00m2Q8l80K58P3j07j74J28J34n85L65L45
5067A42L9m15L11L7j45k56M04M5l0l93J41j57J09J96P8k21K60M9l45l8L26j89
5089e2J33l9N8n1j04J88j66k33M03lm47J70L59k39n3k3K97k34J2L67l35j63qJ83
5113B0j67K38J45j25l69K25L56l89j05J37L7l12K53K12j56j44L97l29j97J91L85
5134C03k86k4J18r2k05N6N9r3N7J76n2k7Q5O9o4k75M80j13k89K54O1l55p5M27
5158A95o9l99m1N18l00j7K55o0K90l27l4k34J32j8K14l99J70L63l44P1K05k20
5180d9K7J2J16k67j02M72j23j54J74K84n35K59j51j69J51k09K68K50m04M8L62
5201B60l40J58o1k43P8M3K16j89p6K65l05O2J3K20j94MJ69j44O4L05l77j18J28
$$ plain form
5224 -62 121 -104 14 -68 136 -168 -296 103 195 -145 107 -167 7 -210 141 -57 -242 -135 148 38 -132
5245 -132 268 -300 -60 178 45 187 -54 235 115 -103 -55 325 -159 -160 214 -33 -17 86 142 -241 -207 130
5267 130 77 -60 298 -43 -193 -172 271 39 -111 -146 214 45 -165 150 208 -14 10 70 196 -23 -154 -111
5289 -111 -178 234 1 -39 12 167 230 -114 5 105 -153 11 52 -96 -287 369 -175 -62 -267 98 -211 -135
5311 -135 161 102 -194 -193 164 -66 -172 206 176 -31 93 186 27 -43 -160 276 -301 -143 122 -19 130 44
5333 44 -7 -218 -210 -133 -258 -180 -69 242 93 -85 384 -25 -150 -33 337 91 -96 -25 -351 -89 34 93 -33
5356 -33 79 -57 140 10 237 28 -73 -271 189 102 -225 83 26 46 138 235 172 -146 -71 217 -344 316 68
5379 68 -81 -27 -82 178 -111 -130 -35 102 -70 -31 91 -174 -261 243 139 -202 98 94 60 -44 140 -100 -203
$$ packed form
5224f2J83k25J18q2K04l04j28L99R2l40K52k74J74k17L51j98j85J07K83j10j70
5245a32M00n68K40K38j33J42k41K89j20k18M8L80m84jL74k47J6J03N6l83L4L37
5267A30n3j37L58l41j50K1M43k32j50l5L60j69k10L15N8k22K4O0J26k19j31M3
5289a11o7M12k33m0N1J55O3l44J19J00k58J64M1j48j91O56n44J13k05L65l09P6
5311a35K96n9k96JL57k30j06L78l0k07J24R3j59p0j17M36n77J58K65j41J49q6
5333D4n1k11QP7j25P8J11L11j49j78M69m09j25J17L70k46j87P1l26K62J23N9j26
5356c3J12j36J97j30K27k09j01j98M60q7l27L08n7K0R2R7o3l18P5K88n61O60k48
5379F8j49N4n5K60k89j9R5J37j72L9J22k65q7N04j04l41L00ml4j04J84k40j03
$$ plain form
5402 -203 333 329 -273 -124 -18 -164 183 -98 217 303 78 244 352 -184 -76 -12 -2 -138 220 -35 34 199
5424 199 -166 -94 -116 -188 -62 75 96 92 253 -137 -124 -142 -154 40 -91 -192 -90 116 -5 -367 128 406 -157
5447 -157 -106 -53 -213 -54 62 -54 -192 -85 110 173 -140 -312 39 -185 -216 55 221 -108 -113 119 -371 89
5469 89 56 132 -181 -21 57 -183 -105 -160 24 45 71 331 166 -150 63 14 17 32 119 -68 -75 174 229 -12 -74 0
5495 0 -131 -361 158 212 94 69 76 -246 -189 49 -91 -147 -4 143 -204 -57 -18 214 -83 -212 163 5 -77
5518 -77 71 66 -159 -123 159 -378 -376 -55 125 -22 -101 34 52 -171 -202 140 -112 170 363 185 -39 214 239
5541 239 -118 100 102 -207 139 313 45 -326 283 105 132 -173 -30 243 49 138 137 4 36 261 -68 -128 -283
5564 -283 190 169 -301 163 -83 -255 35 89 -97 -87 67 -78 -17 12 65 285 126 -131 127 -18 27 22 17 -264
$$ packed form
5402b03N36mo02J49J06j46L47k81L15Q6k25J66J08n36J08O4J0j36L58k55O9J65
5424A99l65P2k2p2J26J37K1mJ61l90J3j8j2J94j31j01J02K06j21l62M95K78n63
5447a57N1N3j60J59J16j16j38J07J95O3l13j72L51k24l1K71J66l29nK32m90M60
5469H9l3P6l13J60P8k40P8n5J84K1K6K60j65l16K13m9LJ5Q7j87pK49N5k41o2P4
5495@j31k30N19N4j18k5Pl22N7K38j40n6J43J47l47J47L9K32k97j29L75j58q2
5518g7J48nk25L6K82n37KL21J80j47p9J35J8k23l1L42k52K82J93j78k24K53K5
5541B39l57K18Kl09L46J74k68l71O09j78K7l05J43K73j94Q9jj33L2K25l29o0j55
5564b83M73k1m70M64k46j72K90N4j86J0J54j45O1K9N3K20j59k57K58j45M5nnk81
$$ plain form
5588 -264 44 158 -355 253 111 130 132 199 62 -88 -41 256 129 -179 -94 167 -126 29 155 -259 -107 -75
5610 -75 -281 55 -129 295 46 -165 39 329 -131 37 121 128 -26 -121 -6 -11 -8 120 131 -175 -42 -230 -149 -25
5634 -25 -63 107 139 215 -135 171 -107 506 62 -129 77 -18 -38 41 244 229 -166 -83 86 -89 -192 35 294
5657 294 -303 21 125 -176 -19 23 61 82 51 285 39 -291 72 152 -124 34 47 94 -82 -115 -1 -187 81
5680 81 20 -132 -193 203 198 -363 139 173 23 -62 121 -32 -235 -131 -50 -53 -182 42 -131 -132 -7 77 -56 -402
5704 -402 -146 -16 134 -56 461 71 -351 -62 -243 -99 -62 216 -138 186 164 101 -400 -390 213 -125 -323
5725 -323 144 12 12 -50 62 18 21 46 60 117 54 287 -79 -191 366 78 -71 -49 115 91 -141 142 163 -219
5749 -219 184 162 29 4 21 323 26 -114 49 -242 -552 -47 312 -21 -51 -16 -201 12 72 150 -104 -6 317
$$ packed form
5588b64L08J14n13O08j42J9KO7j37j50M7K97j27l08Q5K61k93J55J26m14J52L2
5610g5k06L36j84M24k49k11K04K90m60J68Q4Pj54r5J15nLJ28J1l06J33j88Q1J24
5634b5l8J70L2P6l50L06k78O13m44j91K06r5k0P9K03j5l95Q3J69j75j03K27K59
5657B94n97L24J04l01J57M2L8K1l1K34k46l30L63Q0k76J58J3M7j76l3J14j86K68
5680H1o1j52o1L96nn61N02L4j50q5J83j53k03J04Q1lj29K24j73jJ25Q4j33l46
5704d02K56J30J50j90N17l90m22K89j81J44L7K78l54L24k2o3n01J0O03l38j98
5725c23M67j32%o2J12m4LK5J4N7o3K33l66j12N57k88j49K2J64k4k32K83K1l82
5749b19M03k2j33k5J7L02k97j40J63k91l10N05L59l33l0L5j85K13O0P8k54R8L23
$$ plain form
5772 317 60 -255 116 58 -283 -113 124 123 139 271 -66 -201 -109 -47 338 19 75 131 -207 -80 29 6 -25
5795 -25 90 238 -347 -5 41 93 -442 -70 164 -4 -137 162 71 -224 -117 -80 -195 -14 231 -93 -46 85
5817 85 36 -124 -107 196 -22 -101 -117 34 66 13 119 253 144 61 325 -144 -27 239 -190 -299 192 24 157
5840 157 144 176 0 -148 -147 376 -89 156 91 211 -34 -198 -49 -245 -126 148 283 -266 2 217 67 -269
5862 -269 8 172 48 311 190 -81 65 -239 -166 -188 -167 24 -70 -171 90 117 -451 163 -119 -76 -94 359
5884 359 5 41 88 -75 -94 -89 -42 -72 -38 -79 -21 -75 -59 128 -256 -1 125 10 82 -183 137 -19 -94 119 72
5909 72 65 -139 55 -150 -31 62 204 -291 -182 336 161 113 113 175 124 -46 169 26 -91 90 68 111 32 6
5933 6 -21 -83 91 187 96 75 55 133 118 -87 222 -138 -72 278 171 21 -119 146 -72 28 56 -65 114 -112
$$ packed form
5772C17k57l15L71n8l41J70K37jJ6J32l37j35R2O2L85l19N6N6l38J27J09k3l1
5795b5J15J48n85L42M6N2n35L72K34j68j33K99r1k95J07L7j15J81K45l24M7J31
5817H5m9j60J7L03k18p9j6J51L2n3J06J34j09q3K64m69J17K66m29j09M91j68J33
5840A57j3L2j76j48JN23m65K45o5J20k45j64J49j96J19K74J35n49K68K15j50l36
5862b69K77J64j24K63j21k71J46l04P3k2K1J91r4j01K61K7n68O14k82M3j8M53
5884C59l54L6M7j63j9NM7l0L4m1N8n4J6J87l84K55J26j15P2k65L20j56p5K13m7
5909G2pk04J94k05J19R3J42m95J09N18j75m8%O2n1j70K15j43j17J81k2M3p9k6
5933Fk7o2J74R6r1k1k0P8j5k05L09l60O6L50j07j50j40K65k18J00K8j21J79k26
$$ plain form
5957 -112 189 171 12 124 147 -132 126 138 -18 -110 339 274 -250 -204 53 14 -295 110 203 46 -34 264 80
5980 80 -195 12 193 -104 -121 140 88 46 80 -8 -238 -186 282 143 40 -1 95 17 145 137 -98 26 329 201
6004 201 -87 64 77 112 20 79 17 -150 20 141 -23 -200 98 185 -82 13 214 -155 -251 -57 223 -180 84
6027 84 75 -233 -192 -9 -15 -299 50 95 -99 -315 -38 143 -175 141 8 135 6 -163 370 -143 -81 113 91
6050 91 -193 -91 205 -75 -92 245 226 -47 -61 35 -129 3 -3 156 -260 -86 10 -227 36 160 -60 -57 272
6073 272 23 -195 -21 225 -61 -122 43 218 -35 -311 -33 331 -91 -17 44 -279 -138 136 -122 28 89
6094 89 376 33 -217 -235 110 -1 -105 0 73 -18 -227 -12 72 88 286 36 -395 217 12 -104 -97 13 -88
6117 -88 -296 30 -173 143 18 251 -18 -161 -68 -161 -122 -93 -86 80 -118 68 24 -20 -145 -50 -6 -106 80 142
$$ packed form
5957a12L01j8j59J12K3k79K58J2j56r2M49o5n24M6K57l9l09M05R3j57q0K98j84
5980H0k75K07J81k97j7K61n2m2L4q8k30N2M68j39j03m1R6p8J28qk35J24L03j28
6004B01k88J51J3L5r2N9o2j67J70J21j64j77K98Q7k67R5K01l69r6J94K80m03K64
6027H4rl08M1J83ok84L49M5j94k16K77J81l18L16j33J27j29j69N33n13O2J94k2
6050I1k84J02K96k80j7L37j9k73j4R6j64J32oJ59m16J74R6k37K63J24k20LL29
6073B72k49k18J74K46k86o1J65J75k53k76K78L64m22P4O1l23J41K74k58J50O1
6094H9K87l43k50j8L45j11j04J05P3r1k09K15Q4J6J98k50m31O12k05j16PJ10j01
6117h8k08L26k03L16j25K33k69j43R3r3L9K9PJ66j98J86m4m4j25R5M4j00J86O2
$$ plain form
6141 142 -277 -96 284 226 -180 -16 14 -102 86 239 353 154 52 23 -140 122 169 -103 101 66 8 -268
6163 -268 -81 325 29 -39 -23 -47 -217 6 -88 -118 -73 -14 160 26 -291 56 -96 -66 27 182 34 -150 142
6186 142 -271 35 447 -36 -53 -51 88 150 -160 161 -364 -124 268 233 124 -109 -58 125 -123 -315 232 -20
6208 -20 46 462 41 -284 -44 234 46 6 -129 148 -129 -106 76 -91 -113 176 -57 54 159 -121 -85 -348
6230 -348 398 -11 8 99 -99 -151 -214 -149 150 -454 -205 2 157 -5 296 304 -146 -326 336 -35 -195 -238 116
6253 116 143 -157 9 -63 -101 -79 -65 -94 -102 246 -5 -123 413 56 -131 64 79 241 -239 76 -85 -303 42
6276 42 298 -28 -114 123 118 -28 -58 192 -75 -149 101 263 -134 -16 68 -59 -187 20 86 -48 -62 -86 -60 9
6300 9 -27 111 0 -195 167 164 -27 241 52 -66 -64 174 107 -33 23 -67 57 -107 -107 138 -375 241 -3 97
$$ packed form
6141A42m19J81L80n8m06J64L0j16J88J53J14j99j02k9j63K62M7k72K04l5n8k76
6163b68J87M06k96o8J6k4j70K23r4l0M5N9J74j34l17L47j52L0R3J55j48j84K92
6186A42m13L06M12m83j7KJ39O2l10L21n25K40L92l5j09k33N1J83k48j92N47k52
6208b0O6M16m21l25K40K78j88m0j35K77k77K3J82j67k2K89k33J11J05k80L6k63
6230c48P46m09J9R1j98n2o3O5K99o04K49K07J55j62L01Qm50j80O62l71j60m3L54
6253A16K7l00J66p2l8K2J4k9qL48k51j18N36l57j87J95J5J62m80L15j61k18L45
6276D2K56l26q6K37nj46l0K50k67p4K50J62l97J18Q4j27j28K07O6j34j4k4K6O9
6300Il6J38j11j95L62lj91K68j89j18KK38o7j40N6r0J24j64%K45n13O16k44J00
$$ plain form
6324 97 74 76 3 -300 493 151 9 -26 132 102 -136 43 253 -1 -53 70 -28 -213 -44 203 -89 313 -53
6347 -53 -60 -119 116 -197 -189 -47 221 195 -370 376 156 -127 11 247 -81 173 -5 250 143 -31 8 100 -138
6370 -138 -73 -220 104 39 255 -70 184 -52 171 -159 -58 52 121 -208 -73 73 108 -179 19 309 -139
6391 -139 -83 -9 -93 -228 137 161 -110 93 -167 25 -25 178 -122 42 162 28 -30 9 238 -83 -419 -210
6413 -210 153 -78 37 5 -164 -354 -216 143 -94 -239 134 268 -126 119 151 -63 -61 263 139 -97 133
6434 133 57 36 -16 256 -1 -150 -299 66 -325 -131 415 -118 -167 -51 -110 -59 -203 99 151 -229 194 41
6456 41 -15 -6 86 126 -58 -27 6 158 -133 192 169 -11 63 86 -36 -206 -35 126 -254 108 118 -96 -8 -95 292
6481 292 -219 19 419 29 -292 451 248 -88 72 -122 -168 39 74 -17 -168 169 250 52 -90 7 68 -99
$$ packed form
6324I7k3Kp3l03P93l42j42l5J58l0k38J79K10k54n2J23r8j85J69K47k92M02l66
6347e3pn9K35l13QJ42K68k6n65P46k20k83J38K36l28K54j78K55j07j74L9R2k38
6370a38O5j47L24o5K16l25K54k36K23l30J01J10O9l29J35J46L5k87J98K90m48
6391a39N6P4q4j35L65K4k71K03k60J92n0K03l00J64J20j34n8L9K29l21l36K09
6413b10L63k31J15l2j69j90J38L59k37j45L73J34l94K45L2k14KL24j24k36K30
6434A33p6k1n2K72k57j49j49L65l91J94N46n33m9J16n9N1j44L02N2l80M23j53
6456D1n6RR2M0j84L1L3J52k91L25k3j80P4K3j22j70J71J61l80L62J0k14Q8q7L87
6481B92n11K38M00l90l21P43k03l36J60j94m6K07L5r1j51L37Q1j98j42R7O1j67
$$ plain form
6503 -99 -39 -7 56 -43 70 85 -4 70 161 -46 -271 74 92 -146 -30 243 12 59 -45 97 6 -91 -35 -34 2 322
6529 322 -31 48 -119 102 97 57 98 -34 75 163 205 212 -78 136 45 -307 -67 -114 27 -284 115 -283 -314 -137
6553 -137 151 4 -86 -54 -33 174 40 259 10 45 -107 -35 38 -50 -231 -208 -133 -96 -2 56 -111 -2 -45 78
6577 78 92 133 131 -63 99 -61 -9 144 304 -112 -53 230 92 -113 295 268 -147 32 142 136 -10 -2 238 82
6601 82 -27 119 112 87 -26 -8 -302 -90 79 46 -90 22 52 62 -51 427 -78 -31 225 276 -61 21 161 45
6625 45 -269 59 -123 -116 -148 212 22 -198 -156 57 -26 -174 67 -64 -248 20 -81 -118 -141 165 103 -76 367
6648 367 220 -25 -278 24 -141 -93 32 25 -150 165 78 41 9 222 -47 163 -49 292 26 -30 74 94 34
6671 34 -203 99 60 -289 -13 -18 -165 5 253 307 -224 20 4 86 -202 1 112 -148 175 247 -151 -38 132
$$ packed form
6503i9O0L2O3r9J13J5q9P4R1k07k25L45J8k38J16K73k31M7j04J42r1r7N6JL6L20
6529C22l53P9j67K21nm0M1j32J09Q8M2Pk90K14r1l52K40m7J41l11L99l98l1J77
6553a37K88j47r0L2K1K07j34K19k49L5j52P2P3q8j81K3P5L7R4N8j67J09m3J23
6577G8J4M1kj94J62j60N2J53J60m16N9K83j38k05M08k7m15J79J10oj46QK40j56
6601H2j09J46pk5j13J8k94K12J69l3j36J12L0J0j13M78n05M7K56N1l37Q2J40j16
6625D5l14L28j82Pl2L60j90k20M2K13q3j48K41j31j84K68j01l7k3L06o2j79M43
6648C67j47k45k53L02j65M8J25pj75L15q7l7l2K13k69K10k12L41k66n6J04K0o0
6671C4k37L02l9l49K76nj47J70K48N4n31K44j6Q2k88K03J11k60L23P2l98J13J70
$$ plain form
6694 132 196 -197 -88 -117 -111 -108 69 177 -11 223 428 -18 111 -128 -161 -340 96 118 240 66 0 -13 -56 165
6718 165 -21 63 -114 11 -184 122 -53 234 14 -309 234 131 6 104 -21 57 -159 112 -192 -122 -225
6739 -225 -78 63 -66 35 27 -25 -164 173 183 -125 3 29 -93 -72 -209 -10 -62 241 -8 20 -77 -56 144
6762 144 -56 111 -99 -106 -437 55 -224 57 -134 38 -222 -169 -33 -66 190 -128 109 -57 0 188 -18 -18
6784 -18 -229 -15 31 17 207 75 -91 102 89 -242 -120 50 -58 -299 -27 17 -160 -274 318 163 -265 223
6806 223 212 -304 -350 348 104 -370 -182 -72 -175 -95 11 -114 -46 117 56 23 -84 269 -94 -306 -22 28
6828 28 -219 -333 -187 10 -29 -32 61 -141 -330 202 41 -117 25 -130 -345 7 35 143 -278 -50 156 -9
6850 -9 50 165 -158 -89 191 200 -54 -17 216 -1 -22 128 -115 -125 50 5 -145 -368 -58 180 -150 25 84 8
$$ packed form
6694A32O4l93J09k9OLJ77J08j88K34K05m46J29k39l3j79M36K2J22j74o6j3m3K21
6718A65j86Q4j77J25j95L06j75K87k20l23N43j03j25R8j25P8k16K71l04P0j03
6739b25J47J41j29J01qn2j39L37J0l08J28K6j22K1j37J99n2L03k49K8r7K1K00
6762A44k00J67k10pl31M92k79K81j91J72k60N3J36l3K56l18K37j66N7J88k06%
6784a8k11K14M6j4J90j32j66J93j3l31J22J70j08k41K72M4j77j14N92j55m28M88
6806B23j1n16m6O98k44m74J88J10j03Q0J06j25O8J63o1l3j07L53l63k12K84N0
6828B8k47j14J46J97l9lR3k02j89N32j61j58J42j55k15L52K8J08m21K28K06j65
6850iN9J15l23O9K80Rk54L7K33k17k1J50k43j0J75m5j50k23L10K38l30J75N9p6
$$ plain form
6874 8 -215 14 -91 -407 -187 71 49 -108 -121 90 -261 79 -61 -38 -250 46 40 -73 -350 -59 -3 -4 -174
6897 -174 344 74 -81 106 -74 -88 -86 316 -111 -206 143 251 -76 -116 108 21 -257 65 118 139 108 -51 110
6920 110 -244 109 183 -157 65 302 130 -90 351 423 230 -88 -84 -28 -237 -276 217 -37 220 342 -122 -195
6942 -195 310 -29 -96 -33 25 -25 -30 189 35 -29 107 -99 49 115 107 114 -114 212 -22 -152 -77 108 79 -257 144
6967 144 -2 -235 -77 184 192 -219 89 -129 -234 -373 184 -86 -91 -102 131 -134 -212 196 68 -98 69 92
6989 92 53 -322 113 34 216 54 194 -471 -106 -29 -142 -54 44 252 -181 119 -37 200 -191 45 17 -68 -90
7012 -90 -19 -114 -102 63 -143 74 -233 -12 127 -40 140 96 -71 -28 -21 67 111 -87 259 -17 -157 -79 74 1
7036 1 75 112 -3 -103 214 193 -404 -172 337 -4 53 167 -86 21 -57 108 -154 -43 291 90 -237 236
$$ packed form
6874Hk23K29j05l16K20K58k2j57j3K11l51L40j40K3k12K96oj13k77K91N6jj70
6897a74N18k70j55J87j80j4KM02m27r5L49J08l27m0K24q7k78L22N3K1l1j59J61
6920A10l54L53P4l40K22K37j72k20M41P2j93l18MN6k09l9M93k54K57J22m64p3
6942a95N05l39o7O3N8n0nK19j54o4J36k06J48O6qPk28L26k34j30P5J85k9l36M01
6967A44j46k33J58K61Qm11L08k18j05j39N57k70nj1K33k65p8M08j28j66J67K3
6989I2l9l75M35p9J82j62J40o65L65P7j13Q8R8K08m33L00j56K37l91K36k8q5k2
7012i0P1r5J2J65k06K17l07K21J39j67J80m4j67M3PQ8M4j98L46k76j40P8J53p3
7036AP4L7j15j00L17k1n97K32N09l41N7J14k53J07p8J65k62J11L34k01l27M73
$$ plain form
7058 236 198 85 -194 203 131 -172 187 63 -274 -231 183 31 -145 58 215 -405 -27 -80 -10 81 -33 335
7080 335 -124 -136 138 -52 -412 -20 146 177 -16 3 73 -152 105 -40 -161 -202 -86 -90 -246 45 197 147 -31
7103 -31 185 223 -92 -93 325 147 -278 101 -21 -74 -312 25 -35 115 108 207 -77 93 126 -73 9 24 151 -41
7127 -41 -236 125 106 -140 198 179 -12 -303 10 44 -102 -262 58 -202 -77 193 50 9 -121 -2 -50 -228
7149 -228 82 -33 66 -19 67 -134 -30 146 140 -51 -6 -103 -269 28 125 -91 -290 -14 -93 -394 -352 325 194
7172 194 -173 -250 253 -142 -17 128 47 -76 -34 41 -20 -153 162 -104 -56 160 0 -162 -28 196 9 17 83
7195 83 161 45 8 -26 -42 -200 104 52 -208 128 37 -25 -29 -205 150 168 174 275 472 -35 240 185 -125 -100 150
7220 150 -30 -9 -171 -131 125 -152 -49 -172 -100 -57 -6 -189 -157 80 189 -27 155 97 -146 -40 120 159 -247
$$ packed form
7058B36l8j13k79L97p2l03L59j24l37M3M14j52j76K03J57o20L78n3P0R1j14L68
7080C35m59j2K74j90l60L92J66L1j93J9P0k25K57j45j21m1J16mj56K91J52n0j78
7103c1K16L8l15jM18j78m25L79j22n3k38L37o0J50pR9k84J70L3j99Q2J5J27j92
7127d1j95L61j9k46L38j9j91k91L13L4j46j60L20k60J25K70j43m1j30J19m8j78
7149b28L10j15R9q5Q6k01J04J76oj91M5r7j66K97R7k16j99K76p9l01M2O77j31
7172A94l67p7N03l95J25J45q1j23M2P5o1j33L15k66M8K16j60j62J34K24j87QO6
7195H3P8j16l7l4j6j58L04n2k60L36r1o2mj76L55J8OJ01J97n07K75n5l10K5K50
7220A50j80K1j62M0K56k77J03j23P2M3N1j83L2K37J09k16J82n8k43J06J60L9m06
$$ plain form
7243 -247 -100 60 -164 3 142 207 -251 202 -50 -121 48 90 84 -193 89 207 364 -111 163 -101 -476 22
7265 22 88 -19 -186 -73 -49 -248 -95 223 -85 74 264 0 -143 -21 87 -141 133 193 128 -17 256 -12
7287 -12 287 65 159 20 -131 48 372 83 -254 103 -66 -60 49 157 14 -107 -25 8 74 -71 201 -201
7309 -201 -222 -149 117 52 -89 122 -2 -38 -109 44 -283 45 227 1 -269 -31 152 -107 -143 -132 -127 139 331
7332 331 -24 -140 -136 -23 69 -65 -194 201 -109 -18 308 50 101 185 237 1 -27 167 69 -29 -137 -64 -151 13
7356 13 50 206 -199 115 227 -55 115 169 -78 -181 -96 201 -78 -161 -211 80 147 95 111 -45 41 14 180 -74
7380 -74 224 287 -162 -160 156 -33 -4 -26 125 -212 -58 96 112 -126 101 203 -147 187 61 -125 -166 -262 16
7403 16 23 170 157 -61 -202 -209 81 -208 -413 145 65 -99 122 -205 -23 -245 125 126 -80 -24 105 -50 -250
$$ packed form
7243b47J47J60k24J67J39O5m58M53k52p1J69M2ok77K82J18J57m75K74k64l75M98
7265B2O6j07j67J13K4j99J53L18l08J59J90k64j43J22J08k28K74O0o5j45K73k68
7287a2K99k22R4j39j51J79L24k89l37L57j69OJ09J08j43j21Q2L3O6j45K72m02
7309b01k1P3K66o5j41K11j24l6p1J53l27L28J82k26k70K38J83k59l6J1NK66J92
7332C31l55j16MJ13R2j34j29L95l10R1L26k58N1Q4N2k36k8J94r8r8j08P3q7J64
7356A3L7J56m05L14J12k82J70N4k47j03Q5K97k79q3n0K91O7n2J6j56Q6k7J66k54
7380g4K98O3m49KL16j89K9k2J51l37J54J54J6k38K27J02l50L34j26j86m1r6K78
7403A6PJ47j3k18j41pK90k89k05N58q0j64K21l27J82k22L70Jk06N6J29j55k00
$$ plain form
7426 -250 187 35 80 11 139 -187 -267 223 -60 -6 -209 -111 -116 -303 199 -8 -118 0 197 30 -103 -24 53
7449 53 -271 -298 56 -87 2 -37 151 -270 84 88 -219 -123 358 32 -298 -32 251 -205 -186 41 227 -101 145
7472 145 38 -66 -57 40 47 -269 10 137 90 -217 33 -56 -224 -104 52 -78 -258 -76 1 20 202 56 78
7495 78 -164 210 92 -158 -56 89 294 91 -13 108 -105 -140 180 90 -373 -8 257 -343 -250 190 66
7516 66 -301 283 -110 1 -160 246 107 -207 350 -1 -166 -104 241 -31 -121 -137 132 92 178 143 149 -143 -42
7539 -42 26 -276 -108 160 -127 -34 83 307 -131 71 323 -212 -339 473 193 -19 -178 145 176 -136 332
7560 332 211 -22 -409 69 -34 -130 313 -18 160 -104 -124 -64 2 130 150 161 -201 140 -26 39 189 182 -59
7583 -59 -244 166 -243 23 -111 86 -31 -59 193 18 43 23 56 -107 -207 -58 101 12 -74 173 78 -126 160
$$ packed form
7426b50M37j52M5o9J28l26q0M90k83N4k03R8nj87N02k07j10J18J97j67j33P9P7
7449E3l24k7L54j43Q9l9J88m21L54Ml07R6M81l26l30K66K83m56J9K27J86l28K46
7472A45j07j04RR7Pl16K79J27m7l07K50q9j68J20J56j30j80J82P7J9J82j46K2
7495G8k42L74j18k50J02J45K05k03j04J21k13l5L20r0m63L65K65o00R3M40j24
7516F6l67N84l93J11j61M06j39l14N57l51j65O2L45k72r0j6K69m0Q6l5Ok92J01
7539d2O8l02J68K68k87R3J17K24m38K02K52n35j27Q12k80k12j59L23L1l12M68
7560C32j21k33l87M78j03r6M43l31J78k64k0O0O6J28K0J1l62L41j66O5J50pk41
7583e9j85M10m09K66j34J97j17k8K52j75K5k0L3j63j00J49J59q9q6K47r5k04K86
$$ plain form
7606 160 -161 -299 -105 204 -2 -151 -19 168 -149 -8 30 -221 -215 289 -262 -70 -107 -44 84 -40 158 -61
7628 -61 -232 -96 209 124 -176 64 -227 -186 169 201 92 84 343 -80 -231 70 178 302 14 298 114 -54
7650 -54 22 275 4 -136 165 120 -91 111 -47 -140 -22 -53 281 14 -101 -95 -236 -115 19 -138 -334 -28
7672 -28 277 -21 -308 130 107 -247 129 13 -274 -328 -26 26 -12 -125 70 28 -305 167 -40 -100 -139 200 195
7695 195 49 416 36 -165 -152 173 -137 -81 -4 5 -286 -140 136 -28 -234 147 5 -188 19 -59 -223 64
7717 64 -1 67 -5 58 118 457 -52 -110 -71 -104 -345 194 -227 108 63 251 -124 156 -21 -25 -15 31 115 -39 30
7742 30 10 32 -144 67 112 -259 -51 196 -96 -90 45 -1 -289 189 65 -84 173 101 -125 -61 9 347 -1
7765 -1 -57 163 64 -79 -14 156 -93 22 -121 -81 207 461 72 -186 89 229 299 -414 89 310 111 -21
$$ packed form
7606A60l21j38J94L09k06j49J32J87l17J41L8k51ON04n51J92l7O3J28j24J98k19
7628f1j71J36L05q5l00K40k91M1L55L2j09qK59m23j51L01J08J24k88K84j84j68
7650e4P6K53k71j40L01m5k11K02j58r3J18l1L34k67j15Oj41J21J34j57j96L06
7672b8L05k98k87M38k3l54L76j16k87n4L02N2l8j13J95m2l33M72k07o0l9L39n
7695A95j46L67l80k01J3L25l10N6P7Rk91J46K76j64k06L81j42j93K07p8j64K87
7717F4o5O8p2O3O0L39n09n8L9l3k41N39m21L35m5J88l75K80j77mJ0M6Q4j54O9
7742C0k0K2j76K11M5l71K08K47k92OJ35m6k88M78j24j49K57p2k26O4P0L38l48
7765an6K20r9j43O5J70k49J15j43M0K88K54l89k58K75J40P0p13N03K21j99j32
$$ plain form
7787 -21 159 117 -204 25 -24 123 32 28 234 -1 83 -10 20 -93 57 33 0 15 78 96 35 117 -1 -200 -11
7812 -11 -130 53 -171 51 -82 -106 -130 127 131 -137 2 159 245 103 211 97 -59 256 216 -431 112 36 -3
7835 -3 -150 -23 86 -340 -90 -57 112 -180 -38 7 -19 124 95 82 -283 152 79 -69 -102 -156 -4 -343 219
7858 219 86 -113 -57 291 3 -117 34 3 16 140 102 25 -163 100 22 165 -266 152 -137 -312 -115 82
7880 82 -84 -64 344 73 -198 24 58 -90 -211 113 -72 -138 -82 79 -99 -287 198 -215 -249 114 159 59
7902 59 -139 281 -159 -14 36 152 -119 -77 38 -195 -245 -14 208 -90 -379 -91 -99 -179 193 271 54 -4 112
7925 112 308 -43 39 -87 32 126 68 81 -208 -63 141 -166 191 204 -105 -169 128 71 -130 -75 19 -103 -405
7948 -405 -131 219 -396 -51 -84 109 -81 61 -25 86 219 16 29 92 33 329 311 163 163 -37 42 -175 465
$$ packed form
7787b1J80m2l21K29m9J47r1mK06k35Q4r3L0j13J50k4l3J5O3J8o1Q2j18j99J89
7812a1j19J83k24K22j33k4k4K57Mk68J39J57Q6j42J08j14j56L15m0o47N43p6l9
7835cj47J27J09m26K50L3J69k92J42M5k6J43k9j3l65M35p3j48l3n4J52l39N62
7858B19j33j99N6L48k88j20J51l1J3J24l8p7j88K63p8J43m31M18k89j75J97J97
7880H2j66K0M08k71k71K22L4j48j21L24j85o6N6J61j78j88M85m13l4L63M5j00
7902E9j98M20m40J45N0J16k71M2J15k33n0K31K22k98k89K88qq0L72P8k17n8J16
7925A12J96l51Q2j26J19R4n8J3k89J45K04l07L57J3l09o4K97n7k01N5R4j22l02
7948d05K74L50o15L45l3J93j90J42q6J11J33k03J3O3n9K96j8j48%k00P9k17O40
$$ plain form
7971 465 -67 93 225 -50 -406 -198 232 -156 112 226 -101 -288 -32 140 132 -149 67 381 17 152 -64
7992 -64 210 -253 81 210 -78 104 440 -22 40 184 -115 -55 24 128 88 -161 108 197 -109 -3 -65 -236
8014 -236 -21 239 107 -257 -96 56 -329 -6 77 36 -206 78 206 83 -94 186 20 -104 93 307 166
8035 166 -187 54 -13 -126 126 296 -88 -86 105 198 43 -95 20 -124 21 248 -108 48 -1 195 -372 -203
8057 -203 -46 151 -98 143 251 114 198 154 115 -133 130 171 136 -84 73 53 -27 -172 -7 252 -300 259
8079 259 -57 -450 28 1 -96 -347 116 16 -113 29 108 292 -551 -55 42 -129 80 231 -122 -177 -49 298
8101 298 -8 114 36 -130 -374 106 202 -392 102 77 -201 -284 -23 -213 -40 17 184 -27 -109 24 -126 -147
8123 -147 -245 299 -36 -295 -72 202 -288 91 342 118 -425 289 94 -18 -223 205 -146 -418 226 -36
$$ packed form
7971D65n32J60J32k75l56K08M30l88K68J14l27j87K56J72qk81K16L14l64J35k16
7992f4K74m63L34J29k88J82L36m62O2J44k99O0P9J04m0k49K69Q9l06J06o2j71
8014b36K15K60j32l64J61J52l85L23Q3m1k42K84J28j23j77K80j66j24J97K14j41
8035A66l53K41o7j13K52J70l84KJ91R3j55j38J15j44J45K27l56J56m9J96n67J69
8057b03J57J97k49K41J08j37Q4m4l9k48K63M1l5k20J57k0q0j45J65K59n52N59
8079B59l16l93M78k7r7k51M63j00j29J42P9J84q43M96R7j71K09J51l53n5J28L47
8101B98l06J22p8j66k44M80R6n94M94k5k78q3K61j90J73N7J67k11q2J33j50k1
8123a47r8N44l35k59K23K74m90L79K51k24n43P14j95j12k05M28l51k72O44k62
$$ plain form
8143 -36 -32 62 118 -37 -292 -165 -32 -217 -18 250 -31 -328 326 213 -101 -136 267 48 -376 -39 -67 -5 -114
8166 -114 418 -175 -157 123 101 -139 -284 1 -34 -310 23 -4 -154 -124 -1 -224 -364 -12 49 136 23 56 4
8189 4 -28 -66
$$ packed form
8143c6MR4N6j55k55J27J33j85J99K68k81k97O54j13l14l5M03k19m24L37k8O2j09
8166a14N32n93J8K80k2k40j45K85l5k76L33k7j50L0J23k23j40L52O1Q7j13L3n2
8189Dl2l8
8191f6
$$ Imaginary data points
##PAGE= N=2
##DATA TABLE= (X++(I..I)), XYDATA
$$ plain form
0 0 0 0 0 0 0 0 0 0 0 0 0 0 0 -8 8 -8 8 -8 16 -16 16 -24 24 -32 33 -40 48 -53 60 -71 81 -91 103 -115 131
35 131 -147 165 -184 207 -230 255 -281 313 -346 382 -422 465 -513 564 -621 684 -755 833 -920
54 -920 1016 -1129 1257 -1404 1577 -1784 2034 -2348 2751 -3289 4045 -5184 7083 -10795 20628
69 20628 -99419 -198958 142014 39587 -153076 51217 107794 -92614 -25336 75154 -33161
80 -33161 -56670 41187 17327 -34764 4852 34041 -12528 -21394 24461 18737 -22217 7403 35990
93 35990 -1056 -15317 9101 -6806 -18052 8236 12327 2454 9653 -7191 -17622 1796 -10587
106 -10587 -20367 17579 7157 -25704 11251 15274 -32276 490 32384 -17998 -15162 32896 2828
119 2828 -26763 14237 21492 -22514 -10309 36126 11337 -26360 13970 25105 -34774 -18767
$$ packed form
0@%%%%%%%%%%%%%qJ6j6J6j6K4l2L2m0M8n6O5p3Q8j01J13j31J52j72J94k18K46
35A31k78L12l49L91m37M85n36N94o59P28q04Q87r78J077j185J305j439J588j753
54i20J936k145K386k661K981l361L818m382N099o040P334r229J2267j7878L1423
69B0628j20047r9539L40972j02427j92663K04293N6577k00408O7278J00490j08315
80c3161k3509R7857k3860n2091L9616K9189m6569q866M5855n724m0954K9620K8587
93C5990l7046j4261K4418j5907j1246K6288M091r873P199j6844j0431J9418j2383
106a0587r780L7946j0422l2861L6955M023m7550L2766L1894n0382K836M8058l0068
119B828k9591M1000P255m4006J2205M6435k4789l7697M0330J1135n9879J6007
$$ plain form
131 -18767 34225 -9312 -28549 31498 14971 -38113 -490 23301 -21836 -17842 22224 2890
143 2890 -24923 2908 19328 -10017 -14718 16164 11593 -16927 329 23348 -4297 -18000 13083
156 13083 10629 -16629 3056 21741 -5318 -9524 12689 410 -16481 -720 10928 -247
168 -247 -10091 1199 10230 -10041 -15054 13631 5386 -22175 4150 19343 -15459 -10642 19302
181 19302 -1966 -17927 10486 13705 -10250 -1255 17516 -455 -17708 5479 16110 -11532
193 -11532 -7389 23080 2483 -23056 7888 16683 -18508 -8763 20280 -2830 -19096 7653 8028
206 8028 -15506 -5071 11392 -2118 -10477 4999 8982 -7694 -8494 9763 3682 -14019 4197
219 4197 18339 -6959 -9433 15979 4082 -14926 5497 14801 -7562 -7446 11231 3102 -13558
$$ packed form
131a8767N2992m3537j9237O0047j6527n3084L7623K3791m5137L994M0066j9334
143B890k7813K7831J6420k9345m701L0882m571k8520J7256K3019k7645j3703L1083
156A3083k454k7258J9685J8685k7059m206K2213j2279j6891J5761J1648j1175
168b47r844J1290R031k0271n013K8685q245k7561K6325J5193l4802M817K9944
181A9302k1268j5961K8413L219k3955Q995J8771j7971j7253K3187J0631k7642
193a1532M143L0469k0597k5539L0944Q795l5191R745K9043k3110j6266K6749L75
206H028k3534J0435J6463j3510q359J5476L983j6676q00J8257o081j7701J8216
219D197J4142k5298k474K5412j1897j9008K0423R304k2363J16J8677q129j6660
$$ plain form
232 -13558 -199 13555 -5649 -13017 10978 4950 -20696 -396 16327 -13636 -13211 18227 2161
245 2161 -19241 7577 15033 -13192 -7367 14568 1807 -11516 6219 12222 -6232 -5696 12094
258 12094 5150 -11079 3716 12947 -9914 -10158 12900 970 -14941 5985 10883 -12428 -7329
271 -7329 10375 -2009 -12863 1958 7414 -7340 -8715 8541 6529 -10153 -143 14662 -3997
284 -3997 -11098 12279 7515 -13844 2520 15736 -6512 -7628 13631 5103 -11981 -69 10318
297 10318 -5873 -11720 7017 7185 -12994 -5428 12207 -4291 -14158 9183 8025 -15411 -2526
310 -2526 13103 -7308 -10784 12202 7281 -10852 1707 13318 -3620 -9391 9408 8737 -11543
323 -11543 -2196 16295 -2441 -13627 10815 9362 -16013 -2149 14428 -7689 -11921 10043 2085
$$ packed form
232a3558J3359J3754j9204p368K3995o028k5646K0300J6723k9963M25L1438j6066
245B161k1402K6818P456k8225N825K1935j2761j3323J7735O003j8454N36J7790
258A2094o944j6229J4795R231k2861k44K3058j1930j5911K0926M898k3311N099
271g329J7704j2384j0854J4821N456j4754j375J7256k012j6682J0010J4805j8659
284c997p101K3377m764k1359J6364J3216k2248j116K1259q528j7084J1912J0387
297A0318j6191n847J8737J68k0179P566J7635j6498r867K3341j158k3436J2885
310b526J5629k0411l476K2986m921j8133J2559J1611j6938n771J8799o71k0280
323a1543R347J8491j8736j1186K4442j453k5375J3864J6577k2117m232K1964p958
$$ plain form
336 2085 -14392 -155 9260 -5048 -6877 6366 4148 -8908 -3238 9040 -538 -8346 7437
349 7437 9226 -8706 -1200 12951 -2004 -8702 8992 5887 -9252 -175 9450 -2517 -7840 4439
363 4439 5069 -8613 -5084 9554 -1033 -14111 3725 9262 -13023 -6193 14819 -2079 -13670
376 -13670 8991 8465 -12797 -1304 13524 -2285 -8849 8050 7786 -7617 -1379 11405 -436
389 -436 -10071 5962 8965 -9976 -4410 12199 -2072 -12557 5936 6809 -11552 -3371 10469 -3245
403 -3245 -10793 3865 6276 -8064 -4899 9734 1582 -10950 3590 11266 -7314 -5966 13298
416 13298 1247 -11349 8039 10405 -10004 -3787 12691 -597 -10279 4583 8384 -6372 -5398
429 -5398 7351 72 -11494 1724 8913 -7673 -7710 9504 492 -12390 3665 7954 -8621 -3294
$$ packed form
336B085j6477J4237R415j4308j829J3243k218j3056N670J2278r578p808J5783
349G437J789j7932P506J4151j4955o698J7694l105j5139R077R625j1967n323J2279
363D439O30j3682L529J4638j0587j3078J7836N537k2285O830K1012j6898j1591
376a3670K2661n26k1262J1493J4828j5809o564J6899k64j5403O238J2784j1841
389d36r635J6033L003j8941N566J6609j4271j0485J8493Q73j8361Q181J3840j3714
403c245p548J4658K411j4340L165J4633q152j2532J4540P676j8580J348J9264
416A3298j2051j2596J9388K366k0409O217J6478j3288r682J4862L801j4756R74
429e398J2749p279j1566J3218P189j6586l7J7214r012j2882J6055M289j6575N327
$$ plain form
443 -3294 10339 -642 -7951 5067 6819 -5301 -2254 8712 2581 -7479 2716 9251 -5637
456 -5637 -6982 9318 3354 -10456 3387 8753 -9039 -6384 8546 -1006 -9860 2829 5945 -6592
470 -6592 -4686 5481 789 -7936 1053 8470 -4036 -7056 8166 4273 -9478 2311 10208 -5531
484 -5531 -4562 11139 2146 -9689 3568 7809 -6216 -5243 7891 2464 -8941 332 8570 -6064
498 -6064 -9015 8500 3298 -12745 690 9973 -8598 -7860 10985 2064 -10675 3754 8600 -5978
512 -5978 -4292 8574 2277 -7021 2424 9373 -2509 -5886 7411 5145 -8459 -452 8950 -4681
526 -4681 -7238 7695 2229 -10370 501 7234 -5115 -6441 5087 1796 -7884 -1592 6661 -2010
540 -2010 -7356 5365 6802 -7658 -1458 10865 -1714 -8235 8271 5771 -8499 922 10073 -2658
$$ packed form
443c294J3633j0981p309J3018J752j2120L047J0966o131j0060J0195O535j4888
456e637j345J6300n964j3810J3843N366j7792K655J4930r552q854J2689L116j2537
470f592J906J0167m692q725Q989P417j2506l020J5222l893j3751J1789P897j5739
484e531R69J5701q993j1835J3257M241j4025R73J3134n427j1405R273Q238j4634
498f064k951J7515n202j6043J3435R283j8571P38J8845q921j2739J4429M846j4578
512e978J686J2866o297r298R445O949j1882l377J3297k266j3604Q007R402j3631
526d681k557J4933n466j2599J0871O733j2349j326J1528l291r680O292Q253q671
540b010n346J2721J437j4460O200J2323j2579o521J6506k500j4270R421R151j2731
$$ plain form
554 -2658 -5947 6071 3676 -7227 -1545 6753 -2428 -8302 3447 4200 -8260 -2927 7418 -3856
568 -3856 -8149 5738 3186 -8891 -280 8372 -3116 -5546 6680 4051 -5623 796 8263 -957
582 -957 -5348 5033 5456 -5881 -1874 9024 -1422 -8495 5333 4646 -9415 -1679 8407 -4581
596 -4581 -8312 4946 2483 -7951 -1501 6460 -2085 -6571 3738 5228 -5749 -1992 8439 136
610 136 -6390 5962 6174 -6628 -631 9072 -1493 -6305 5379 4417 -6528 -2002 6453 -1298 -6753
625 -6753 2622 4811 -6836 -4426 6929 -652 -9307 2941 6633 -7695 -3895 9083 -244 -8088
639 -8088 4674 6510 -5860 -1793 8109 591 -5823 3281 6123 -4240 -3542 7113 1641 -7286
653 -7286 1958 6804 -6068 -4501 7492 -415 -8342 3150 4870 -6463 -3362 5559 -386 -6394
$$ packed form
554b658l289J2018k395j0903N682Q298r181n874J1749P53j2460N333J0345j1274
568c856m293J3887k552j2077Q611Q652j1488k430J2226k629r674O419P467r220
582i57m391J0381M23j1337M007J0898j0446p073J3828o87j4061P736J0086j2988
596d581l731J3258k463j0434O450P961q545m486J0309J490j0977L757J0431q303
610A36o526J2352K12j2802N997R703j0565m812J1684r62j0945M526Q455p751n455
625f753R375K189j1647K410J1355p581q655J2248L692j4328L800J2978r327p844
639h088J2762J836j2370M067R902p518o414R104K842j0363O98J0655n472q927
653g286R244M846j2872J567J1993p907p927J1492J720j1333L101Q921n945o008
$$ plain form
667 -6394 1855 5212 -4113 -3687 6149 1817 -6758 1837 7425 -4003 -3786 7946 1429 -7152 3220
682 3220 6586 -5020 -3035 6449 389 -6390 1882 4769 -4007 -3920 4986 1206 -6849 806 5679
697 5679 -4778 -5007 6421 620 -7928 2536 5866 -5288 -2968 6541 394 -5779 2580 5748
711 5748 -3167 -3288 5820 2499 -6212 1166 7360 -4091 -5249 6586 2241 -7900 1475 6333 -4986
726 -4986 -4926 5957 665 -6810 785 5135 -4301 -4547 4703 2237 -6167 481 6567 -2798 -4783 6412
742 6412 3423 -6716 1558 7208 -3952 -4078 6770 2303 -5821 1587 5696 -3180 -4308 4207 2288
757 2288 -6441 -1141 5866 -2904 -6614 4645 2914 -7828 -607 6780 -3766 -5513 5521 2264
771 2264 -5929 801 5716 -1972 -3503 4411 3577 -4021 -588 5959 -703 -4713 4258 3439 -5608 -780
$$ packed form
667f394Q249L357r325M26R836m332q575Q595N588j1428K17J1732o517q581J0372
682C220L366j1606J985R484o060o779Q272K887q776Q7Q906l780q055P655M873
697E679j0457k29J1428n801q548J0464L330j1154K320R509o147o173Q359L168
711E748q915j21R108l321q711P378O194j1451j158J1835m345j0141R375M858j1319
726d986O0J0883n292p475P595M350r436k46R250k466q404O648O086r365j985J1195
742F412k989j0139Q274N650j1160j26J0848m467q124P408M109q876j128Q515j919
757B288q729N300P007q770l710J1259j731j0742P221P387j0546j747J1034l257
771B264q193O730M915p688j531P914q34p598L433O547o662m010Q971q19r047M828
$$ plain form
787 -780 6146 -2699 -5250 4260 1620 -6444 -602 4144 -3339 -4379 3194 2198 -4781 -1122 5131 -944
803 -944 -5036 3723 4156 -5431 -333 7282 -1283 -4730 5440 3575 -5332 496 5784 -1761 -4289
818 -4289 3760 2866 -4647 -1446 4795 -1444 -5773 2993 3069 -6486 -1905 6240 -2042 -6051 4031 3067
834 3067 -5977 -271 6025 -1788 -4140 4534 3708 -3966 -650 5789 -190 -4419 3319 4946 -4338
849 -4338 -2149 6303 -700 -6258 3043 3915 -5817 -2115 5375 -1742 -5689 2169 3327 -4247 -2270
864 -2270 4535 -291 -5036 2187 4366 -4027 -2055 6561 646 -4975 3735 4534 -3946 -1022 5674
879 5674 -392 -3898 3158 3551 -3964 -2310 4206 186 -5170 1210 3991 -4254 -3671 4581 -237 -6432
895 -6432 2066 4572 -4809 -2209 5121 -510 -4787 2506 4018 -3189 -1385 4715 1105 -3357 1930
$$ packed form
787g80O926q845k551R510k640q064N842M746p483j040P573r96o979L659O253o075
803i44m092Q759M33r587N098P615q565l447J0170j865q907N828N288p545k528
818d289Q049q94p513L201O241o239m329Q766P6r555M581Q145q282m009J0082r64
834C067r044N706O296p813k352Q674q26p674L316O439n979m229P738J627r284
849d338K189Q452p003n558R301Q72r732L702P490p117l947P858J158p574J977
864b270O805m826m745P223K179q393J972Q616n915n621Q710P99q480K924O696
879E674o066l506P056L93p515J654O516m020n356O380K781q245N83Q252m818o195
895f432Q498K506r381K600P330n631m277P293J512p207J804O100l610m462N287
$$ plain form
910 1930 4218 -2588 -2578 4923 984 -5553 1756 4147 -4421 -2467 4735 -654 -5110 1732 3223 -4626
926 -4626 -2754 3834 37 -4510 981 4116 -2984 -2929 4800 1176 -5310 1533 5360 -3277 -2675 5784
942 5784 1146 -4604 2427 4377 -3615 -2406 4377 512 -4703 696 3878 -2918 -3616 4042 1243
957 1243 -5657 316 4393 -3671 -3835 4740 613 -5314 1713 4648 -3081 -2430 4716 1364 -4328 938
973 938 4725 -1562 -2931 4543 2814 -4844 203 5637 -2013 -4095 4127 1520 -5421 100 4030
988 4030 -3047 -3618 3169 1270 -4637 -466 3350 -1899 -3664 3074 2255 -3902 -352 5336 -1302 -3568
1004 -3568 4307 2349 -4475 910 4809 -2158 -2701 4012 1645 -3851 505 3955 -1610 -3555 2237
1019 2237 1502 -5098 -1203 4589 -1921 -4549 3515 2157 -5342 -357 4487 -2185 -3528 3874 1941
$$ packed form
910A930K288o806J0P501l939o537P309K391q568J954P202n389m456O842J491p849
926d626J872O588l797m547N491L135p100N5P729l624o486O843L827q637O02Q459
942E784m638n750P031J950p992J209O783l865n215N399L182o796o98P658k799
957A243o900N973M077q064j64Q575m127n927P027K935p729O51P146l352n692N266
973I38L787o287j369P474j729p658N047N434p650k082Q222k607o941N521L930
988D030p077n71O787j899n907M171L816n249j765O738q19o157L550N688o638k266
1004c568P875j958o824N385L899o967n43O713k367n496M356L450n565j945N792
1019B237p35o600L895N792o510k628Q064j358p499M985M844o672j343P402j933
$$ plain form
1034 1941 -3782 110 4331 -745 -2692 3218 2599 -3313 -424 4252 -1074 -3736 3218 2598 -4603
1049 -4603 -348 4157 -2370 -4283 2788 1333 -4544 -288 3449 -2043 -3742 2330 2359 -3906 -1046
1064 -1046 4625 -775 -3981 3549 3284 -4026 -384 5552 -989 -3150 3478 2420 -3840 -406 3954
1079 3954 -1055 -3549 2223 2547 -3800 -1954 3540 -1008 -4746 2016 3083 -4265 -1598 4312 -1292
1094 -1292 -4097 2809 2813 -3688 -316 4304 -280 -2856 2635 2936 -2674 -1060 4276 105 -3699 2146
1110 2146 3290 -3621 -1528 4288 -696 -4098 1967 2149 -4343 -1585 3310 -1054 -3440 2136 2091 -3044
1126 -3044 -1553 2871 220 -3604 1995 3482 -2943 -1334 4722 113 -3510 2759 3257 -3451 -975
1141 -975 3795 -504 -3287 1710 2492 -2758 -1802 3130 -148 -4129 569 2522 -3872 -2470 3930 21
$$ packed form
1034A941n723L892M221n076j947N910o19n912K889M676n326k662O954o20p201
1049d603M255M505o527j913P071j455n877M256L737n492j699O072K9o265K860
1064a046N671n400l206P530k65p310L642N936o541k161O628j058o260L434M360
1079C954n009k494N772L24o347J846N494m548l738O762J067p348K667N910n604
1094a292k805O906Mo501L372M620m584k576N491L01n610J614N336m171l804N845
1110B146J144o911K093N816m984l402O065J82o492K758M895m364k386N576m5n135
1126c044J491M424k651l824N599J487o425J609O056m609l623O269M98o708K476
1141i75M770m299k783M997P82n250R56M932l278l981M698J953o394J402O400l909
$$ plain form
1157 21 -4248 2106 3150 -3232 -1280 4068 -143 -3529 1993 3219 -2449 -1082 3610 776 -3180
1172 -3180 1452 3653 -2563 -2400 3869 151 -4514 1520 3162 -3365 -1769 3966 -702 -4107 704
1187 704 2162 -2990 -2323 3087 675 -3585 808 3700 -2504 -2382 3796 1219 -4033 1253 4209 -2406
1203 -2406 -1756 4017 860 -3328 1267 3322 -2324 -2504 2552 523 -3485 412 3183 -1936 -2500 2823
1219 2823 416 -4398 324 3433 -2862 -2617 3366 628 -3428 1154 3317 -1706 -1584 3345 1010
1234 1010 -2803 646 3167 -1489 -2214 3274 1831 -3469 521 3017 -2267 -2665 2851 826 -3716
1249 -3716 482 2675 -2049 -2570 2194 592 -3101 153 3205 -1713 -2602 2629 1289 -3073 760
1264 760 3888 -1719 -2209 3639 1231 -3291 732 3370 -1606 -1736 2751 1067 -3460 -86 2802 -1998
$$ packed form
1157B1m269O354J044o382J952N348m211l386N522J226n668J367M692k834l956
1172c180M632K201o216J63O269l718m665O034J642o527J596N735m668l405M811
1187G04J458n152O67N410k412m260M393K892o204J22O178k577n252N286K956o615
1203b406O50N773l157m188M595K055n646j80N056k029m008L897K771n119n64N323
1219B823k407m814M722L109o295K45N983k738m056M582K163n023J22M929k335
1234A010l813L449K521m656p25N488j443n300L990K496n284l98N516k025m542
1249c716M198K193m724n21M764j602l693L254L052m918q89N231j340m362L833
1264G60L128n607m90N848k408m522M023K638m976j30M487j684m527L374K888m800
$$ plain form
1280 -1998 -3004 1981 1504 -3665 -592 3113 -1891 -3312 2933 1648 -3633 96 3383 -1188 -2441
1295 -2441 2558 1730 -2404 536 3357 -625 -2358 2487 2281 -2732 -162 3538 -1060 -2924 2465
1310 2465 1121 -3292 -175 3073 -1384 -3066 1975 1213 -3375 -1015 2882 -1294 -2885 2112 2256
1325 2256 -2854 -648 3817 -952 -2691 2694 2559 -3018 -253 3376 -509 -2522 2381 1678 -2631
1340 -2631 -248 2583 -1029 -3037 1204 1633 -2846 -1406 2811 -955 -3172 1824 1689 -3394 -913
1355 -913 3155 -1147 -2904 2354 1960 -2182 -74 3411 -167 -2096 2023 2331 -2019 -813 3367 -55
1371 -55 -2987 1820 2258 -2875 -1078 3141 -1189 -3541 1416 1267 -3192 -860 2887 -931 -2898 1352
1387 1352 2029 -2391 -1375 3151 -11 -3033 1634 2477 -2548 -697 3621 -122 -2617 2099 2307 -2753
$$ packed form
1280a998j006M985m77n169L073L705n004j421O245j285n281L729L287m571j253
1295b441M999q28m134K940K821l982j733M845k06n013K570L700m598j864N389
1310B465j344m413L117L248m457j682N041p62m588K360L897m176j591M997J44
1325B256n110K206M465m769j739N385j35n577K765L629l885k013M903p03m309
1340b631K383K831l612k008M241M29m479J440M217l766k217M996j35n083K481
1355i13M068m302j757N258l94m142K108L485l578j929M119L08m350J206M180l422
1371e5k932M807M38n133J797M219m330k352M957j49m459K332L747l818j967M250
1387A352O77m420J016M526l162l022M667Q43n025J851M318l743k495M716K08n060
$$ plain form
1403 -2753 -764 2698 -383 -2753 1134 2212 -2491 -2007 2242 -193 -3713 1023 2573 -2787 -2033
1418 -2033 3307 -209 -3248 1616 2552 -2084 -846 2958 62 -2394 1327 2380 -1542 -897 2735
1433 2735 862 -2697 1074 2468 -2286 -1961 2951 153 -3064 949 2370 -2635 -1799 2534 -344
1448 -344 -3079 682 2067 -2010 -1819 2231 949 -2561 992 3043 -1475 -1586 2752 512 -3000 1291
1464 1291 2930 -1590 -1034 2986 538 -2625 623 2172 -1694 -1608 2229 434 -2965 80 2148 -2247
1480 -2247 -2281 2456 655 -2878 648 2499 -2130 -1403 2736 700 -2109 1181 2588 -1498 -1383 2558
1496 2558 1014 -2479 764 3103 -1351 -2037 2731 627 -3319 174 2448 -2008 -1986 2427 210 -3157
1512 -3157 80 1921 -1838 -2418 2009 675 -2479 99 2512 -967 -2058 2713 1277 -2743 530
$$ packed form
1403b753J989L462l081k370L887J078m703M84M249k435l520M736J550n360P54
1418b033N340l516l039M864R36m636J238L804k896k456L721J053l922O45L632
1433B735j873l559L771J394m754L25M912k798l217M013J421n005Q36M333k878
1448c44k735L761J385m077J91M050j282l510L553K051m518j11M338k240l512M291
1464A291J639m520N56M020k448l163L248J549l866Q6L837j795l399L045K068m395
1480b247l4M737j801l533L526J851m629P27M139k036k809L290J407m086J15L941
1496B558j544l493L243K339m454o86M768k104l946L493K274m456K2M413k217l367
1512c157L237J841l759n80M427j334l154K578K413l479j091M771j436m020L273
$$ plain form
1527 530 3204 -1025 -1533 2913 1114 -2509 631 2444 -1336 -1890 1824 774 -2625 -350 2415 -1227
1543 -1227 -2486 1821 818 -3251 -55 2886 -1184 -2653 2140 1107 -2557 358 2696 -886 -1473
1558 -1473 1967 1226 -2145 36 2869 -378 -2118 2121 1626 -2567 -23 2519 -1137 -2298 1906
1573 1906 891 -2959 -130 2315 -1527 -2226 1403 748 -2797 -312 2628 -842 -1868 1767 1614 -2109
1589 -2109 -50 2851 -527 -1965 2273 1594 -2563 128 2813 -628 -1854 1876 1309 -2492 -587
1604 -587 2082 -952 -2420 1272 1239 -2297 -1055 1991 -954 -2502 1672 1361 -2545 -234 2540 -803
1620 -803 -2293 1569 1826 -1891 -202 2629 -421 -2159 1374 1579 -2037 -543 2762 135 -2079 1367
1636 1367 1745 -2598 -959 2369 -830 -2137 1348 1165 -2443 -881 2182 -389 -1860 1119 1685 -1722
$$ packed form
1527E30K674m229n08M446j799l623L140J813l780n54L714j050l399K275K765l642
1543a227j259M307j003m069L196K941m070j469M793j033l664K915K338l582n87
1558a473L440p41l371K181K833l247j740M239m95m193K544K542l656j161M204
1573A906j015l850K829K445l842o99L629o55l545K485K940l470j026L635j53l723
1589b109K059K901l378j438M238o79m157K691K685l441j226L730n67l801J905
1604e87K669l034j468L692l3l536J242L046k945j548M174l11l906K311K774l343
1620h03j490L862K57l717J689K831l050j738L533K05l616J494L305k627k214L446
1636A367L78m343J639L328l199j307L485j83l608J562L063k571j471K979N66l407
$$ plain form
1652 -1722 -864 2677 -56 -2096 1670 2520 -1837 -732 2875 -374 -2290 1646 1817 -2029 -709 2371
1668 2371 -518 -2454 698 1757 -1758 -1277 2114 -22 -2695 734 1873 -2241 -1288 2480 272
1683 272 -2139 1383 1794 -2014 -784 2387 199 -1402 941 1893 -1610 -760 2145 297 -2067 805
1699 805 1819 -1922 -1066 2303 -268 -2705 967 1186 -2234 -1079 2104 -229 -2273 869 1742 -1433
1715 -1433 -1258 2259 667 -2405 1130 2377 -1622 -1016 2867 381 -2335 1201 2241 -1785 -1160 2022
1731 2022 145 -1739 458 1590 -1801 -1497 1681 463 -2421 218 2087 -1698 -1889 1864 327
1746 327 -2558 930 2107 -1602 -1144 2226 622 -1855 935 2116 -1005 -1035 2016 1069 -1765 167
1762 167 2214 -1218 -1590 2146 501 -2611 269 1535 -1489 -1604 1339 110 -1970 413 1543 -1305
$$ packed form
1652a722Q58L541k733k040L766Q50m357J105L607l249j916L936J71l846J320L080
1668B371k889j936L152J059l515M81L391k136k673L429J139m114R53L768k208
1683B72k411L522M11l808J230L171k188j601K343R52l503Q50K905j848k364K872
1699H05J014l741Q56L369k571k437L672K19l420J155L183k333k044L142Q73l175
1715a433J75L517j592l072L535J247l999O06L883k486k716L536J040m026O25L182
1731B022j877j884K197J132l391L04L178j218k884K639J869l785j91L753j537
1746C27k885L488J177l709M58L370j604k477K790J181l121l0L051r47k834J932
1762A67K047l432l72L736j645l112K880J266l024j15K943j229k080K383J130k848
$$ plain form
1778 -1305 -1515 1486 720 -2250 391 2182 -805 -1618 1917 1176 -2159 593 2333 -1009 -1106 1921
1794 1921 486 -2065 80 1639 -1072 -1336 1732 676 -2168 -138 1569 -1228 -2210 1424 832 -2491
1810 -2491 -63 1959 -1021 -1588 1972 1076 -1490 361 2189 -574 -928 1932 1179 -1712 -253 2118
1826 2118 -639 -1777 1552 1052 -2073 84 2030 -1313 -1828 1640 258 -2539 -209 1475 -1126
1841 -1126 -1373 1282 1005 -1977 -220 2149 -519 -1909 1568 1226 -1924 -151 2408 -546 -1609 1758
1857 1758 1043 -1828 22 1699 -522 -1627 1515 895 -1792 -366 1678 -847 -1963 1007 1013 -2086
1873 -2086 -531 2204 -627 -1695 1277 985 -1923 -161 1963 -435 -1239 1397 1277 -1255 -417 2090
1889 2090 -8 -1674 1275 1483 -1857 -513 2135 -536 -2094 803 954 -2122 -579 1478 -736
$$ packed form
1778a305k10L001p66k970K641J791k987q13L535p41l335K752J740l342r7L027
1794A921j435k551K145J559k711k64L068j056k844K030J707k797r82L634n92l323
1810b491K428K022k980n67L560q96k566J851J828k763l54K860p53k891J459K371
1826B118k757j138L329n00l125K157J946l343n15L468j382k797K330J684k601
1841a126k47K655k77k982J757K369k668j390L477l42l150J773K559k954j063L367
1857A758p15k871J850J677k221j105L142o20k687J426K044k525j116K970Ol099
1873b086J555K735k831j068K972k92k908J762K124k398q04K636j20k532Q38K507
1889B090k098j666K949K08l340J344K648k671j558K897J51l076J543K057k214
$$ plain form
1904 -736 -1580 845 929 -1502 -459 1596 -74 -1767 899 1494 -1540 -458 2157 61 -1579 1386
1920 1386 1715 -1549 -64 2153 -216 -1468 1044 1039 -1765 -1241 1743 -281 -1879 832 1076 -1562
1936 -1562 -1209 1573 -165 -1918 1090 1192 -1500 -675 1917 55 -1584 1098 1460 -1026 -538 2151
1952 2151 116 -1446 735 1720 -1029 -659 1890 122 -1919 856 1284 -1677 -1178 1417 -162 -2181
1968 -2181 875 1176 -1444 -867 1596 157 -1933 536 1517 -1126 -752 1866 472 -1778 468 2048
1984 2048 -1263 -656 2004 349 -1382 620 1324 -1128 -827 1504 313 -1889 458 1093 -1231 -1134
2000 -1134 1617 86 -1742 -83 1498 -1291 -1285 1661 -64 -1455 571 1699 -857 -721 1770 635
2016 635 -1441 465 1703 -881 -1136 1685 739 -1511 440 1689 -1081 -1342 1503 113 -1832 55
$$ packed form
1904g36q44K425Q4k431J043K055j670j693K666N95l034J082K615k096j640K965
1920A386L29l264J485K217k369j252K512nk804N24K984k024j598K711K44k638
1936a562L53K782j738j753L008J02k692Q25K592j862j639K682L62k486M88K689
1952B151k035j562K181R85k749L70K549j768k041K775M28k961M99K595j579k019
1968b181L056L01k620N77K463j439k090K469R81k643L74K618j394k250K246J580
1984B048l311O07K660j655j731K002P04k452L01K331j191k202K347O35k324R7
2000a134K751j531j828J659J581k789OK946j725j391K026J128k556J36K491j135
2016F35k076J906J238k584k55K821r46k250J951J249k770k61K845j390j945J887
$$ plain form
2032 55 1180 -1350 -1207 1314 306 -1854 29 1569 -868 -1164 1289 800 -1505 271 1823 -784
2048 -784 -775 1708 676 -1523 579 1698 -889 -977 1465 509 -1708 195 1445 -765 -1488 948 537
2065 537 -1668 -104 1381 -788 -1371 1222 807 -1837 -54 1550 -896 -1050 1651 870 -1272 214
2081 214 1597 -546 -928 1411 1096 -1413 -37 1723 -532 -1508 1232 748 -1778 37 1470 -846
2097 -846 -1351 1160 500 -1685 41 1206 -496 -1346 1002 1145 -1449 -402 1942 -329 -1433 1251
2113 1251 858 -1474 265 1741 -397 -1503 1318 1176 -1522 -377 1218 -432 -1461 943 860 -1422
2129 -1422 -484 1294 -433 -1553 737 927 -1426 -356 1518 -537 -1037 1245 859 -1365 -291 1396
2145 1396 -321 -1087 1146 924 -754 -177 1926 -116 -1587 941 1054 -1185 -659 1631 -576 -1489
$$ packed form
2032E5J125k530J43K521j008k160J883J540k437k96K453m89k305J776J552k607
2048g84RK483j032k199K102J119k587q8K442r56k217J903J250k210p23K436m11
2065E37k205J564J485k169n83K593m15k644J783J604k446j54K701p81k142J486
2081B14J383k143l82K339l15k509J376J760k255r76K740m84k526J815J433k316
2097h46n05K511o60k185J726J165j702q50K348J43k594J047K344k271j104K684
2113A251l93k332J739J476k138j106K821j42k698J145J595j650j029K404q3k282
2129a422R38J778j727j120K290J90k353J070J874k055n00K282l86k224J074J687
2145A396j717p66K233k22j678N77K103k042j471K528J13k239N26K290k207r13
$$ plain form
2161 -1489 893 840 -1576 -102 1326 -322 -1398 660 964 -1310 -392 1578 -201 -1191 1142 1138 -1186
2178 -1186 -173 1571 144 -985 952 1049 -1330 -396 1487 -187 -1250 837 839 -1042 -759 1078 -16
2195 -16 -1675 579 889 -1364 -671 1195 216 -1668 639 1019 -1168 -574 1557 73 -1131 1085 1490
2212 1490 -499 -671 1366 134 -1003 771 1220 -1172 -740 1116 18 -1666 445 639 -1415 -574
2228 -574 1308 -497 -1617 306 1215 -980 -588 1117 -40 -1409 657 1448 -856 -814 1319 358 -1385
2245 -1385 451 1333 -938 -444 1476 203 -1229 780 1002 -860 -974 714 339 -1208 273 1202
2261 1202 -979 -1128 1148 134 -1393 135 1090 -1101 -800 1263 320 -1348 630 1259 -636 -674 1191
2278 1191 590 -751 357 1460 -767 -896 1221 417 -1410 375 1306 -1206 -1055 1034 313 -1607
$$ packed form
2161a489K382n3k416J474J428j648j076K058L04k274R18J970j779r90K333mk324
2178a186J013J744j427j129J937R7k379R34J883j674j063K087Kj881K83J837j094
2195a6j659K254L10k253O93J866r79j884K307L80k187N94K131j484j204K216M05
2212A490j989j72K037j232j137J774M49k392M32J856j098j684K111J94k054Q41
2228e74J882j805j120J923R09k195L92J705j157j369K066P91k304M2K133r61j743
2245a385J836Q82k271M94J920j273j432K009K22j862j14J688l75j547J481R29
2261A202k181j49K276j014j527J528R55k191L01K063r43j668J978O29j895l8J865
2278A191o01j341J108J103k227j29K117q04j827J785R31k512J51K089p21j920
$$ plain form
2294 -1607 -16 926 -1022 -744 993 148 -1208 173 973 -624 -855 1017 265 -1151 366 1380
$$ packed form
2294a607J591R42j948K78J737q45j356J381Q00j597k31J872p52j416J517J014
$$ [...]
8191a65
##END NTUPLES=NMR FID
##END=
