##TITLE=1H_SL62-I2-mix-f12
 CDCl3, 8 sc, 
 2.9.2021
##JCAMPDX= 6.0         $$ Bruker NMR JCAMP-DX V2.0
##DATA TYPE= NMR FID
##DATA CLASS= NTUPLES
##ORIGIN= UXNMR, Bruker Analytische Messtechnik GmbH
##OWNER= root
$$ XWIN-NMR		Version 3.5
$$ Thu Sep  2 09:04:25 2021 Russian Standard Time (UT+4h)  she@DPX200
##.OBSERVE FREQUENCY= 200.1312
##.OBSERVE NUCLEUS= ^1H
##.DELAY= (6, 6)
##.ACQUISITION MODE= SIMULTANEOUS
##.ACQUISITION SCHEME= undefined
##.AVERAGES= 8
##.DIGITISER RES= 18
##SPECTROMETER/DATA SYSTEM= spect
##.PULSE SEQUENCE= zg30
##.SOLVENT NAME= CD2Cl2
##.SHIFT REFERENCE= (INTERNAL, CD2Cl2, 0, 15.7039)
##AUDIT TRAIL= $$ (NUMBER, WHEN, WHO, WHERE, WHAT)
$$ ##TITLE= Audit trail, XWIN-NMR		Version 3.5
$$ ##JCAMPDX= 5.01
$$ ##ORIGIN= Bruker BioSpin GmbH
$$ ##OWNER= she
$$ F:/spectra/data/she/nmr/H-F/1/audita.txt
$$ ##AUDIT TRAIL=  $$ (NUMBER, WHEN, WHO, WHERE, WHAT)
(   1,<2021-09-02 09:02:59.29 +0400>,<she>,<DPX200>,
      <created by zg, POWCHK disabled, PULCHK disabled
       configuration hash MD5:
       00 E9 B6 7A A2 85 ED C7 34 08 36 98 17 FE 4E 26
       data hash MD5: 16K
       21 04 9E 20 0E F6 42 E9 4F 58 6A E8 D9 4F 79 07>)
$$ ##END=
$$ 
$$ hash MD5
$$ 9A 55 1B A7 CE 0C 75 B3 D1 CE A9 64 FB A1 27 DA
##$RELAX= 
##$RELAX= 
##$RELAX= 
##$RELAX= 
##$RELAX= 
##$RELAX= 
$$ Bruker specific parameters
$$ --------------------------
##$DU= <F:/spectra>
##$EXPNO= 1
##$NAME= <H-F>
##$PROCNO= 1
##$TYPE= <nmr>
##$USER= <she>
##$AMP= (0..31)
100 100 100 100 100 100 100 100 100 100 100 100 100 100 100 100 100 100 
100 100 100 100 100 100 100 100 100 100 100 100 100 100 
##$AQSEQ= 0
##$AQ_mod= 1
##$AUNM= <au_zg>
##$AUTOPOS= <>
##$BF1= 200.13
##$BF2= 200.13
##$BF3= 200.13
##$BF4= 200.13
##$BF5= 200.13
##$BF6= 200.13
##$BF7= 200.13
##$BF8= 200.13
##$BYTORDA= 1
##$CFDGTYP= 0
##$CFRGTYP= 5
##$CHEMSTR= <none>
##$CNST= (0..31)
1 1 145 1 1 1 1 1 1 1 1 1 1 1 1 1 1 1 1 1 1 1 1 1 1 1 1 1 1 1 1 1 
##$CPDPRG= <>
##$CPDPRG1= <>
##$CPDPRG2= <>
##$CPDPRG3= <>
##$CPDPRG4= <mlev>
##$CPDPRG5= <mlev>
##$CPDPRG6= <mlev>
##$CPDPRG7= <mlev>
##$CPDPRG8= <mlev>
##$CPDPRGB= <>
##$CPDPRGT= <>
##$D= (0..31)
0 1.2 0 0 0 0 0 0 0 0.06 0 0.03 0 0 0 0 0.0002 0 0 0 0 0 0 0 0 0 0 0 0 
0 0 0 
##$DATE= 1630558978
##$DBL= (0..7)
120 120 120 120 120 120 120 120 
##$DBP= (0..7)
150 150 150 150 150 150 150 150 
##$DBP07= 0
##$DBPNAM0= <>
##$DBPNAM1= <>
##$DBPNAM2= <>
##$DBPNAM3= <>
##$DBPNAM4= <>
##$DBPNAM5= <>
##$DBPNAM6= <>
##$DBPNAM7= <>
##$DBPOAL= (0..7)
0.5 0.5 0.5 0.5 0.5 0.5 0.5 0.5 
##$DBPOFFS= (0..7)
0 0 0 0 0 0 0 0 
##$DE= 6
##$DECBNUC= <off>
##$DECIM= 32
##$DECNUC= <off>
##$DECSTAT= 4
##$DIGMOD= 1
##$DIGTYP= 9
##$DL= (0..7)
0 120 120 120 120 120 120 120 
##$DP= (0..7)
150 150 150 150 150 150 150 150 
##$DP07= 0
##$DPNAME0= <>
##$DPNAME1= <>
##$DPNAME2= <>
##$DPNAME3= <>
##$DPNAME4= <>
##$DPNAME5= <>
##$DPNAME6= <>
##$DPNAME7= <>
##$DPOAL= (0..7)
0.5 0.5 0.5 0.5 0.5 0.5 0.5 0.5 
##$DPOFFS= (0..7)
0 0 0 0 0 0 0 0 
##$DQDMODE= 0
##$DR= 18
##$DS= 0
##$DSLIST= <SSSSSSSSSSSSSSS>
$$ [...]
##$SUBNAM2= <"">
##$SUBNAM3= <"">
##$SUBNAM4= <"">
##$SUBNAM5= <"">
##$SUBNAM6= <"">
##$SUBNAM7= <"">
##$SUBNAM8= <"">
##$SUBNAM9= <"">
##$SW= 20.0189188712717
##$SWIBOX= (0..15)
0 0 2 0 0 0 0 0 0 0 0 0 0 0 0 0 
##$SW_h= 4006.41025641026
##$TD= 16384
##$TD0= 1
##$TE= 0
##$TE2= 300
##$TE3= 300
##$TEG= 300
##$TL= (0..7)
0 120 120 120 120 120 120 120 
##$TP= (0..7)
150 150 150 150 150 150 150 150 
##$TP07= 0
##$TPNAME0= <>
##$TPNAME1= <>
##$TPNAME2= <>
##$TPNAME3= <>
##$TPNAME4= <>
##$TPNAME5= <>
##$TPNAME6= <>
##$TPNAME7= <>
##$TPOAL= (0..7)
0.5 0.5 0.5 0.5 0.5 0.5 0.5 0.5 
##$TPOFFS= (0..7)
0 0 0 0 0 0 0 0 
##$TUNHIN= 0
##$TUNHOUT= 0
##$TUNXOUT= 0
##$USERA1= <user>
##$USERA2= <user>
##$USERA3= <user>
##$USERA4= <user>
##$USERA5= <user>
##$V9= 5
##$VALIST= <valist>
##$VCLIST= <CCCCCCCCCCCCCCC>
##$VD= 0
##$VDLIST= <DDDDDDDDDDDDDDD>
##$VPLIST= <PPPPPPPPPPPPPPP>
##$VTLIST= <TTTTTTTTTTTTTTT>
##$WBST= 1024
##$WBSW= 4
##$XGAIN= (0..3)
0 0 0 0 
##$XL= 0
##$YL= 0
##$YMAX_a= 79918
##$YMIN_a= -109284
##$ZGOPTNS= <>
##$ZL1= 120
##$ZL2= 120
##$ZL3= 120
##$ZL4= 120
##$ABSF1= 10
##$ABSF2= 0
##$ABSG= 5
##$ABSL= 3
##$ALPHA= 0
##$AQORDER= 0
##$ASSFAC= 0
##$ASSFACI= 0
##$ASSFACX= 0
##$ASSWID= 0
##$AUNMP= <proc_1d>
##$AZFE= 0.1
##$AZFW= 0.1
##$BCFW= 1
##$BC_mod= 2
##$BYTORDP= 1
##$COROFFS= 0
##$CY= 11.3945322036743
##$DATMOD= 1
##$DC= 2
##$DFILT= <>
##$DTYPP= 0
##$F1P= 2.36226072786647
##$F2P= -0.459571619588291
##$FCOR= 0.5
##$FTSIZE= 0
##$FT_mod= 4
##$GAMMA= 1
##$GB= 0.15
##$INTBC= 1
##$INTSCL= 1
##$ISEN= 128
##$LB= 0.24
##$LEV0= 0
##$LPBIN= 0
##$MAXI= 10000
##$MC2= 0
##$MEAN= 0
##$ME_mod= 0
##$MI= 1.114404
##$NCOEF= 0
##$NC_proc= 0
##$NLEV= 6
##$NOISF1= 3.799351
##$NOISF2= 2.8
##$NSP= 1
##$NTH_PI= 0
##$NZP= 0
##$OFFSET= 15.70392
##$PC= 1
##$PHC0= -13367.45
##$PHC1= 28.40097
##$PH_mod= 1
##$PKNL= yes
##$PPARMOD= 0
##$PSCAL= 0
##$PSIGN= 0
##$REVERSE= no
##$SF= 200.130013532006
##$SI= 16384
##$SIGF1= 3
##$SIGF2= 2
##$SINO= 400
##$SIOLD= 16384
##$SREGLST= <1H.CDCl3>
##$SSB= 0
##$STSI= 0
##$STSR= 0
##$SW_p= 3612.71676300578
##$SYMM= 0
##$S_DEV= 0
##$TDeff= 0
##$TDoff= 0
##$TI= <>
##$TILT= no
##$TM1= 0
##$TM2= 0
##$TOPLEV= 0
##$USERP1= <user>
##$USERP2= <user>
##$USERP3= <user>
##$USERP4= <user>
##$USERP5= <user>
##$WDW= 1
##$XDIM= 8192
##$YMAX_p= 0
##$YMIN_p= 0
$$ End of Bruker specific parameters
$$ ---------------------------------
##NTUPLES= NMR FID
##VAR_NAME=  TIME,          FID/REAL,        FID/IMAG
##SYMBOL=    X,             R,               I
##VAR_TYPE=  INDEPENDENT,   DEPENDENT,       DEPENDENT
##VAR_FORM=  AFFN,          ASDF,            ASDF
##VAR_DIM=   8192,          8192,            8192
##UNITS=     SECONDS,       ARBITRARY UNITS, ARBITRARY UNITS
##FACTOR=    0.0002496,     1,               1
##FIRST=     0,             0,               0
##LAST=      2.0444736,     0,               0
##MIN=       0,             -109284,         0
##MAX=       2.0444736,     79918,           0
$$ Real data points
##PAGE= N=1
##DATA TABLE= (X++(R..R)), XYDATA
$$ [...]
1971c63P07l31m10J77M00o08k55O32M93r14K21P69q97p0P64R8q43O76N88j115
1991b81l4J065l22o55M10M04m60j75L04K82r06L41N48p61m21R78k75o98K80P83
2011D07r68k6P85j45n61L26M42l01l05P69M03j182M80M42n02k99P84j97n70K02
2031a6P33p00n21P96k79n38J39N63n60k77N06L74o79n4Q32n63l36Q53K45j024
2051e06K92P91m16k44M99J55n80K47L90l07m32P75j73p92JO65j27p15N75n3m79
2072d34M4M88l71m07N34J73o95K37Q22n18m91P84Q8l40J83M11j08n19N52J14n69
2093b2q2Q58m42q78R86o1q85K89N59j37p30L15L87l11m73P19k37m18M46M54r70
2114f33M16M44J9o13N34L14r32L05N74n35k40N80L41o28K1L75k09m42N82k8n24
$$ y = [-363, 344, 13, -397, -220, 180, -428, -683, -51, 442, -472, -251, 518, -379, -449, 315, 413, -430, 246, 834, -281, -315, 750, 428, -227, 183, 587, 127, -48, 256, 538, -368, -27, 521, -240, -661, 317, 42, -656, -376, 407, -561, -587, 198, 53, -508, -182, 260, -41, -346, 423, 826, -356, 124, 566, 64, -235, 549, 352, -218, -16, 717, 17, -504, 292, 13, -525, -386, 177, -383, -660, -154, 220, -459, -513, 319, -244, -580, 273, 518, -506, -214, 577, 161, -83, 416, 571, -9, 238, 628, 321, -111, 664, 491, -301, -300, 365, 238, -477, 98, 45, -434, -390, 98, -273, -680, -146, 27, -668, -431, 391, -127, -618, 166, 254, -86, 97, 508, 400, -119, 433, 547, -22, -104, 754, 312, -566, 420, 359, -526, -237, 322, 185, -545, -230, 157, -154, -627, 92, -145, -563, -117, 337, -633, -217, 227, 246, -367, 167, 481, -451, -146, 428, -107, -347, 233, 574, -54, -33, 342, 133, -309, 273, 245, -279]
2135b79j18N94k32o54O74K26n96j39N35n3o97P57J31m2m85N30K44q31L77N58j55
2156C45p82P91K31r76L53N62o00j02O49m11m61L65J55m55k6K08J57m39K5O86j95
2177H0n81P95J25r13M00O93o61k55O11R7o28K56P00n31k34L84J11o17K3P16n02
2198F9n65N84K0n21J24N50m89n51J215k16p10K35N65o54j35N29J96l17j22O33
2218D40j53m14N80M80q11j72O55o16j9K47K98q65J18O16m38n67N99M00o16K39
2238AL3n2o12M31N46j146L60Q77j59r85J057J90m28k46N83k42k74K52N53q00o6
2259a27K14j29m60N25K32o14j56J012n56q42Q10K42p72J84O20m32k87O01J07k96
2279a24k19O61j00n86M57N49n91j09O34m56n14N54N13q39n1O61j40q04N93J90
$$ y = [-279, -397, 197, -35, -689, -15, 211, -385, -524, 11, -42, -739, 18, 149, 107, -378, 152, 396, -435, -58, 500, 345, -437, 354, 585, -391, -38, 524, -76, -178, 471, 60, -401, -36, 119, -336, -362, -154, 3, -436, -411, 275, 80, -501, 294, 419, -494, -94, 599, -62, -317, 294, 391, -237, 19, 719, 188, -46, 338, 449, -168, -145, 571, 69, -496, 88, 108, -413, -289, 261, -228, -779, 436, 220, -490, -255, 310, -344, -479, 50, 246, -71, -193, 440, 287, -127, 453, 933, 122, -50, 605, -11, -30, 217, 515, -350, -232, 384, -54, -621, -22, 378, -238, 1, 34, -18, -630, -199, 347, -799, -439, 438, 279, -706, 351, 541, 113, -133, 450, 208, -66, 186, 739, -61, -127, 87, -42, -502, 23, 255, -359, -515, 497, -59, -901, -91, 151, -621, -437, 183, -249, -536, 65, 172, -124, -343, 318, 218, -368, 89, 638, 47, -62, 572, 116, -398, 156, 669, -170, -221, 440, 300, -504, 89, 279]
2299B79n25j10L61J77p64J9N80l03m00O84K05o00K01P69p42OP45m48m00K71L75
2320C80j81j76P35n23k25JK13p9m79N95j47n81K17N11p73J5N09K47q91K47N11
2341A26o21J68M91k4m33r6Q02k29n37M29M60p57J16O23m14l50M88K17o92M20J58
2362C45l22l39L44k1k65l45M87m0l67O36k65n38J90Q34k95m95P36N2m51J64O33
2383F78o11l60O32l3m01K22L27m39m29O30K17p59j91Q25m69j16K41M53r15K88
2403b10N23m86k50O21M4m93J66N66j94o23N77K12m46l3O00m63n02O34J66o98J60
2424a29M21m07j00N53j54l13l29M86P0l46L67K4m40j05M82k7m54M0J075j032k7
2445c45N80k4l14L60K08m03j66O03m36j61L22J32l74j58L77j03o25L95M84n33
$$ y = [279, -246, -356, 5, 182, -582, -563, 17, -286, -686, -2, 203, -397, -196, 573, -169, -163, 582, 134, -266, 5, 380, 199, 23, 758, 235, 10, 11, 224, 145, -334, 261, 114, -467, -250, 261, -512, -497, 12, 259, -632, -385, 126, -495, -327, 164, 140, -293, -389, 413, 184, -353, 76, 536, -221, -105, 518, 104, -246, 242, 459, -233, 187, 345, 23, -316, 28, 7, -258, -603, -116, -156, -523, 113, -152, -690, -500, 334, 39, -456, 280, 332, -119, 45, 678, 67, -293, 339, 306, -95, 127, 454, 15, -414, 216, 433, -326, -517, 308, -161, -277, -36, 417, -498, -210, 313, -173, -423, 198, 242, -251, -85, 481, 287, -336, 241, 453, 7, -26, 574, 111, -391, 243, 409, -289, -129, 292, -115, -215, 338, 184, -129, -458, 28, 98, -248, 119, 143, -297, -402, 80, 53, -401, -361, 714, -318, -345, 235, 211, -103, 257, 465, 62, -104, 499, 63, -98, 224, 356, -18, -176, 201, 98, -527, -132, 352, -181]
2465a81n7J54jk29L10m1mk89L63Ol29M30L96m48k18N14o5o94M99O09q93k63Q66
2488D35j23n34LM62m20j46M75J7o23Q9N51k77j84K69M15o28J55L70n05k38O89
2509B52J07o90N44L02l30l05M58j44k75J21N04o22K46n3om74J64J60j22o26O69
2530a20N48r20L42K21k76k29O64j42m59P7P57n31l33L07L63l65j16P58p3q08O82
2551C47P9m44J40M08k31k14J46K11r61L93L53j85n95L90N09q19K46M12m0n56K50
2572a61K94n24Q5R66q24r2O92J04n69k85P61m11k20L90J05j06j58N21n12m26J83
2593a87K12m34J9O76m65k54M09K84n58n3N20J21p73M42M71n05j78O09j76l74K11
2614A7L25p36L06N56k93l08J88M90l96k71M08j79k53K0M00m21l01N47J6n73J80
$$ y = [-181, -238, -84, -85, -314, -4, -45, -49, -338, 25, 31, -298, 132, 528, 80, -138, 376, 311, -383, 116, 725, -168, -431, 435, 312, -222, -219, 243, -177, -323, 152, 169, -454, -365, 186, -91, -275, -6, 409, -219, -64, 306, -199, -437, 252, 359, -331, 213, 515, 185, -120, 338, 194, -81, 40, 544, -78, 168, 115, 109, -365, -201, -41, -163, -789, -120, 428, -492, -150, 71, -205, -434, 230, 88, -371, -294, 463, -68, -401, -94, 269, -96, -212, 546, 473, -335, 347, 426, -18, 122, 530, 299, 85, 231, 442, -519, -126, 227, 42, -553, -163, 346, -473, -227, 185, 145, -411, -161, 133, -391, -306, 660, -164, -256, 436, 540, -29, -314, 447, 36, -184, 206, 311, 205, 47, 568, 56, -370, -187, 25, -409, -390, 286, -179, -433, -24, 260, -298, -351, 169, 290, -483, -41, 430, -75, -253, 356, 180, -194, 17, 342, -394, -88, 468, 175, -133, 55, 545, 149, -122, 286, 107, -146, -126, 274, -147, -448, 99, 115, -458, -278]
2635b78L47j37l17P74k11m46L77O03n32r3L40j35k77Q4L25n92J51K74J84n63J64
2656D2N84n47l65K20K15l96j83O73m94q6L95O7m84O5K38J7j81K77Q7m99L08O09
2678E62o33l5K93m0k94K35K58l63l02L22L16q43L40M31j96m02M15j41l46K4O81
2699B82m60l22N76J59m46P0M46l92p8K59J49l49K05N9p7mP6J65l77o9L31j02k08
2722a07J02K61q04L91K91r9m08J93K12m78J56L83l24k83M37M35m26k33P58l00
2742A57l03K86M29p55M1M89j46l39K23M01m46m69P30k12k88J5L76l54k38N48J24
2763B69p99O08J20m64j15N83j48l70M89J47m75m6M87j9l43J72r7j9J8r5L19o6
2785A56l9R9k12k12L96q6m91K44M74q26J64M95l23p1K63K38k79k50N75J20n49
$$ y = [-278, 69, -68, -385, 389, 178, -268, 109, 712, 180, 87, 427, 292, 15, 99, 424, -168, -17, 257, 441, -122, 42, 626, 79, -286, -66, 149, -247, -430, 243, -251, -337, 58, 125, -359, -294, -56, -39, -220, 57, 144, -355, -47, 562, -71, -106, 187, 147, -147, 88, 346, -17, -319, 3, 319, -524, -184, 247, 51, -351, 64, -77, -423, -399, 282, -178, -500, 76, 235, -211, -141, 305, -87, -165, 94, 243, -106, 99, 158, 81, 77, 153, 318, -59, -128, 203, 101, -107, -5, 256, -548, -157, 134, 35, -373, -180, 32, -446, -290, 93, -231, -514, -77, 358, -68, -301, 457, 157, -146, 140, 569, -186, -145, 344, 198, -141, 82, 483, 37, -432, 298, 86, -202, -187, 189, -165, -403, 145, 269, -530, 78, 198, -266, -381, 202, 54, -316, 173, 320, -155, -201, 286, 267, -76, 96, -1, -20, -2, -97, 222, 156, 117, 216, 4, -208, 188, 102, -389, -145, 329, -497, -333, 162, -161, -232, 31, 269, -10, -260, 315, 435, -114]
2806a14K7L52j28l43M33J68l98J68L63q63K45L59j55n10K56O4k9j28L50j03m76
2827d62L60K86l14l04M97l2j45l5N09l37l57N14K50n86L83K5k68r6N82j20m78
2848a28J05L86m52j73N48l31l60J45N71k52m63M28J86n92J82J58j30l97P42Kl20
2869a45K23K25j46m56O12K18o00K75P9l44j25M08N5p72M70M35n41j01J65l1k8
2890a24j49N31m46J09J3K59n85l1N59k0o69N10K44n38L74J76j08l07N64J17m18
2911F1k43O12k56n09N66o0m62j83P63j31l64L37K3n94L36L7q7q4K97l4l23n7P06
2934C51k24l82L08K12l34n5P66n60k42K91L48n56j91M48l3k52J46L05n90r5L19
2955b0L0m06K03L43l99J9M08o9m05J92N07o67K71M35k57l61K06O32o64j90N36
$$ y = [-114, -87, 265, 137, -206, 227, 395, -3, 165, 528, -335, -90, 269, 114, -396, -140, -76, -105, -233, 117, 14, -462, -102, 184, -130, -434, 63, 31, -114, -149, 360, 23, -334, 180, 430, -156, 227, 252, -16, -112, 470, 350, -128, -23, 363, -89, -262, 286, -45, -405, -260, 311, 59, -404, 24, 210, -382, -200, -42, -172, -569, 173, 175, -145, 78, 303, 157, -299, 313, 531, -69, 206, 285, -59, -184, 224, 279, -493, -23, 412, -129, -230, -65, -96, -124, -273, 258, -188, -79, -66, 193, -392, -423, 136, 116, -553, -43, 201, -337, 37, 213, 105, -202, 362, 479, 61, -182, 430, 174, -335, 231, 171, -291, -474, 289, 158, -206, 131, 154, -440, -104, -67, -154, -238, 59, 25, -298, -355, 351, 127, -255, 53, 265, -69, -124, 642, 82, -160, 131, 479, -77, -268, 180, 147, -105, 41, 346, -244, -339, -20, 10, -396, -193, 150, -249, -230, 178, 109, -296, -104, 403, -264, 7, 442, 185, -176, 30, 662, -2, -192, 344]
2976C44K2o98J17N14l37j52P70l53o20J19O07m60k79K64K58n83K81N9n8p4J06
2997a53L79m47K00K63l57J16J30J49k13m2M11n67K2L91j4n28L07J41k22k25L12
3018E3J09m20K00N1k18k59L83K53l48L9N48n81M8L02K3l44J96K75l99L6L30M2
3040C19m73K78K81m21j29M44j47l65j1M01j87m31L12K79n15L8M14r3l87M72J70
3061B49l43J62J29r9n10N36K72l20n6K83o1k31o3K79j98j21L06j36k37J41P2r1
3083c7j29L28m09r9K38R2k67J60k2O6k36Q3M34l40K36J81k83K8N2N49o88L25M8
3106C10r1k08K42J99o01j57N55n4n95K42J85k87l03O69k89j39J46L38l40k19O46
3127B49l13P5M1N8k29P0M89j91q9j7n2j48k01N47j42l63Q9M15j57m05L71L0k95
$$ y = [344, 366, -332, -215, 299, -38, -190, 580, 227, -393, -274, 333, -127, -406, -142, 116, -467, -186, -127, -185, -259, -153, 226, -221, -21, 242, -115, 1, 131, 280, 67, 25, 436, -131, -109, 282, 268, -260, 47, 188, -34, -259, 53, 162, -258, -58, -7, -225, -484, -101, 152, -196, -157, 391, -190, -142, 160, 183, -161, 35, 310, -89, -53, 277, 319, -154, 124, 405, -16, -145, 299, 152, -213, -224, 177, -10, -441, -129, 150, -365, -327, 87, -6, -393, 79, 249, -94, 68, 197, 98, -412, 124, 396, 76, 20, 303, 242, 11, -52, 227, 29, -92, 214, 78, -159, -18, 54, -37, -166, 162, -247, -346, -108, -16, -283, -123, -145, -79, -315, -232, 202, -138, 98, 279, -4, 24, 76, 625, -63, 262, 310, 219, 11, 253, 452, -149, -306, 249, 195, -400, -158, 27, -260, -563, 106, -183, -322, -176, 162, -178, -397, 249, -64, 11, 52, 110, -119, -49, 440, 249, 160, 143, 91, -57, -258, 289, 147, -216, -127, 288, 131, -274, 97, 127, -168]
3150a68n4N54m52k53J74L14o64N93l0p2MJ64J74k87M8K91n52K01K26k38M6L08
3172C27o4m21P9K96K00q12K87K78j28k83N26K4o53J8N49l48L2J81rj05J9j62N
3195a64k86M06K22k59J02L39j29m35M68J27k10M6Rj44k04K14L05n47K0L35l61
3216a46qq7K62n12J86L47l11J17K18K60n15k4K58k52P3K43J49m67J56L38k4m85
3238b24N21k78m8j79L69j45m27M38K05m05L5J80n4j53J00L70m16Q4J75r8j00J7
3260c3J04j74j09N02J9l07L87k86j23o3N00k72j22M0K29k54NK59k67j83K08Pq2
3283a5k99M87k52k14K23J90m24K22L07j07k40O8M6J26o9J46j07K0oL15o97l5P85
3306D70j15n34J31J83k56j70N08j67n56M36J92k55l24P97l30k39L80J17m51j99
$$ y = [-168, -222, 332, -120, -373, -199, 115, -549, 44, 14, -58, -54, 110, 284, -3, 45, 336, -216, -15, 211, -27, 19, 327, 263, -158, -79, 217, 417, -395, -108, 170, 42, -241, 285, 309, -344, -326, 223, -125, -93, 88, 79, -26, -7, -169, -164, -450, -44, 178, -81, 21, 360, 231, -204, 264, 391, 181, 227, 236, 92, -112, 102, 407, -140, -120, 215, -146, -154, -241, 21, -491, -305, 42, -269, -152, 66, 326, -189, -213, 45, -207, -134, 109, 258, -209, -53, 285, 261, -224, 297, 19, -29, -208, 161, 16, -411, 27, 232, -173, -138, 42, -12, -165, -65, 305, -111, -27, 148, 50, -50, -33, 71, -103, -212, 290, 309, 2, 389, 103, -20, -83, 417, 145, 23, 63, 292, 38, 43, 302, 35, -148, 60, 67, -15, -314, 173, -79, -293, -70, 120, -304, -82, 225, 118, -122, -54, -8, 118, 49, 195, 88, 108, 102, 417, -280, -315, 470, 355, -179, -48, 135, -121, -291, 217, 50, -506, -70, 122, -133, -457, 340, 10, -229, 151, 268, -183, -382]
3326c82N58J29l08R5J82k64rK57m7k62J93K25n00O3L10k34J11j00J53l62N7j1
3348a46q6q2J31L92k65k43L15p9j50L26Q9k84j99M74k4m6m5L03l66J90n2J31m45
3371a61M5J20P0l47K40J90m56L01R4k31q9L58j51j02O7N3r7k23K80P2j4R4K14
3394C27j54l48K95K41n50N5N11j92k28K92Rp30L37L83m95M5K03K25l89L0l6j53
3416c22K08j80N86l61r9L46j03k25L38K27n99J01M50k86j39P6R8o4j00L70j75
3437A47m88M32Mj75k90M43q9l86N28P0m43J31N8L3l74K53L46l08M5K62k92j46
3459b39L97K45k05l24J68J56n10L19K42j55l3NN2m24J80J69J34l53K46k15l41
3480d86L10k2J8R6L13k22n2N2K29j50j30J58j89L4K48L0r9J0m3L5j84K37J93l69
$$ y = [-382, 176, 305, -3, 92, 274, 10, 1, 258, 211, -51, 142, 367, -133, -70, 240, 6, 117, 17, 170, -192, -135, -146, -232, -314, -183, 209, -56, -299, 16, -63, -213, 113, 202, -82, -281, 193, 169, 123, 78, 381, 15, 205, 153, 284, -161, -116, 4, 74, -273, -33, 157, -299, 2, 96, -135, -224, 134, -17, -119, -52, 1, -96, -319, -39, 33, 19, 113, 327, 173, -175, 120, 361, -189, -134, 377, 185, -43, 249, 258, -472, -135, 248, -247, -202, 1, 226, -163, -133, -169, -322, -114, -294, 292, -69, -168, 178, 75, -150, 188, 415, -184, -83, 367, 81, -58, 18, 116, 52, -48, 322, 147, -341, 91, 95, -80, -370, 73, -16, -402, 126, 196, -247, -116, -58, -25, -399, -146, 200, -108, -63, 199, -93, -239, 158, 403, 198, -126, 42, 198, -312, 7, 249, 94, 61, 66, 118, -306, -126, 43, 177, -176, 70, -145, -486, -176, -198, -180, -84, 229, 7, -45, 7, 236, 86, -44, 114, -75, -41, 207, 237, 138, 148, 105, 140, -44, 193, 386, 17]
3504A7k24J93ml28K89K68l09J65j03pj71j4l9L46l31M69o2l88O0N14k78k14N73
3527D22j63o75M37P3k28p0M38L22q93M73J06m68J09K28k59QN3K61k78k89K50J55
3549A2k01J9P47m58q2J11q9j79L3L01o2o7J70m3l56R8k5M31l59J50K05m72q5K76
3573G5L5n72M64J73k26j5N22p07k8J80K03l8k65K38k42K20J3n3J87k70K54J5n15
3596c52N78J75k91q2K54k13k10M31J9l47j34K24p4Oj35K40k95O2J09j72j99O25
3618B19P4m32P2N6J95k43M11k37j17J26J06O5o19K93L8j61m4M36k17l88K60L82
3640B75n05p1Q9K82l15lL51l01M2K21l3j50m4K5K73k12M63n24k1N82j68l11N5
3663@k2Ok27M04m5k86J55K11j71j75J96K83n45M3R8N9j82M62j57k0n19M75k3m46
$$ y = [17, -207, -14, -18, -346, -57, 211, -98, 67, -36, -43, -214, -228, -267, 79, -252, 217, 155, -233, -173, 341, 63, -151, 422, 259, -416, 21, 94, -134, -204, 234, 556, -337, 136, 242, -226, -117, 111, -148, -140, -87, 174, -104, -393, -143, 12, -189, -170, 577, 119, 37, 148, 59, -120, -87, 214, 152, 85, 255, 212, -144, -46, -71, 360, 1, 151, 356, -116, -201, 75, 110, -462, 2, 175, -51, -66, 456, -251, -279, -99, 104, 66, -199, 39, -203, 17, 30, -23, 164, -106, 148, 163, -352, 226, 401, 110, 28, 282, 69, -141, 290, 309, -38, -172, 52, -22, -16, -151, 89, -206, -144, -35, -207, -406, 219, 293, -139, -67, -11, 184, -59, 352, 115, -2, 124, 230, 295, -324, -31, 7, -154, -198, 238, 21, -367, -107, 275, -230, -301, -212, 70, -245, -248, 103, -198, -156, 65, 32, -118, -162, -137, 136, -76, 387, -137, -158, 424, 256, -55, 0, -22, -16, -243, 161, 116, -170, -15, 196, 25, -150, 46, 329, -216, -173, -75, -16, -198, 264, 107, 87, -432, 43, 20, -426]
3687d26N31M8j91k3NL28l98K37K53l18r1j69L10j06k55M15l49q7N70j37n95K16
3709b32R9L11k47K21j25l57K93P6O0j07O2J70j63j27L81k87j27L53O0l61j54L14
3731A13M2m34J44Q6N7p1K62k60j06J16J11l39P6K52j04l10L14Qj10p3R0J0o6M90
3755B98K3m93J79K11j81j21M8J24k45O3L29j16l61J05J86n9k45L33j03lk52P46
3777D66m88O2o0J07m50K66M12m24J94LJ61l57J22K27l82L87j28j61k69J93L27
3798B08j82l32L51K6n11N73Ll50m2M14q1k21L20jn61J06K91K6l50M69M2j10j84
3821i6K60J05n04J33N97o22J14J88J43n24K25J15k4l97L47Nk05K09J92l37j48
3842b24M08Ol36J41J71l32J89J70j0j23k7J60j09l01M56k16k25J2M53k16l10M20
$$ y = [-426, 105, 153, -38, -61, -56, 272, -126, 111, 364, 46, -45, -214, 96, -10, -265, 150, -199, -286, 284, 147, -448, -232, -133, 178, -69, 152, 27, -330, -37, 39, 99, -8, 54, 224, 61, -66, 315, 28, -99, 254, 314, -47, -201, 113, 155, -279, -135, -49, 8, -63, 199, -61, -167, -51, 60, -279, -203, 49, -55, -365, -51, -43, -153, -226, -136, -126, -192, 298, 321, -172, 7, 218, 37, -84, -36, 88, -157, -94, 235, 119, -242, -137, 49, -10, -255, 78, -25, -28, -280, 466, -22, 40, -20, 87, -363, -97, 315, -109, 85, 88, 249, -108, 14, 241, -141, 246, 118, -43, -312, -119, 208, 26, -306, 45, 71, -440, 133, 136, -214, -256, 158, 77, -144, 176, 175, -386, -280, 11, 37, -313, 156, 198, 88, -96, 164, 269, -235, -102, 495, -127, -13, 175, 318, -206, 19, 134, 110, -287, 60, 65, -140, 69, 261, -76, -224, 184, 190, -146, -5, 166, -166, 23, 193, 183, 60, 33, 193, 84, -217, 239, 23, -202, -190, 263, 47, -263, 157]
3864A57r8j13K1R7j08j83L57j6m22O9N12k99J07K48k71j54K16P5j85r5J40N1k81
3887a75n5K94K55m57J45J01j11p2K54j42k06M0MJ8R5p2J95l39M45j84q7j04K91
3910A33lm12M25P3j57k35M83j54l23J46K80j96Q2L7n9m41N12j41j22j95M64q7
3932A10k84J91n0k15l4J92K8m7j45L95l54j36M63j17R6O8L5m26M45o5j06l86M45
3955A03j04o5Q8L96l96k93L44J1J87m56m3J50j01K2K96j18r7K46k39l9J52N9k19
3978a16J9J09K63k18j36M71k22k13J42j31j26Q3K08l42J99L46j91k50%R5M1l11
4000b80J60J85m65J28N50o42L65n8N2q5j7L79m20j01M57k7l87K75p4R3m06O29
4022C11l54L67o09L00k74n6L26L06o11K35L02n54J10L27k45k3J70P3r3k40M06
$$ y = [157, 59, -54, -33, 64, -44, -227, 130, 114, -308, -239, 273, -26, 81, 329, 58, -96, 120, 195, 10, -85, 55, 106, -175, -230, 64, 319, -138, 7, 108, -3, -75, 179, 37, -169, -129, -125, -107, -12, -84, 111, -228, 217, 33, -54, -158, 133, 130, -282, 143, 216, 59, -176, 307, 153, -170, -24, 256, 60, 142, 179, 120, -321, 191, 50, -72, -267, 197, 110, -174, 17, -33, -248, -282, -90, -62, -109, -254, 141, -213, -349, 114, -3, 93, 161, 196, -230, 215, 150, 44, -342, 103, -1, -66, 22, 418, 22, -271, 73, 84, 271, -185, -228, -78, -179, -157, 139, 21, -76, 170, -69, -108, 44, 103, -116, -97, 12, 275, 57, -79, 392, 170, -43, 99, -32, -158, -75, 133, -209, -10, 336, 145, -105, -105, -10, 31, -280, -120, 65, -400, -272, 278, -364, 1, -57, -5, -90, -107, 272, -148, -249, 208, 181, -206, 69, -5, 88, -318, 311, -43, 324, -285, 15, -259, -315, 11, 317, -294, -59, 243, -311, -201, 126, -119, -142, 28, 101, 8, -232, 174]
4043A74l33K56k77N39k00j59J66J1k48N1J07Q7j19M3k26J13k63N26n44J60l6J91
4065A9j92k63M16J87k89J90J3j40N7K46m8k37m3QJ38j04K81q6k36J42J50j30Q4
4088A63K53l15l90J02J02J06l95N10Q5n58L03j43Q0j84K21jk01L31j3l71M14L19
4110D18n32r8M56k5j98O6Q2k00K42p9j01K97l58L48m43j39L69l2j05p6R0K23l95
4133a90J72J11l15J15L08n4j73J92j8J43n33N80j61j20J8p0R5j40K51j60j38j75
4155b62M29J1k34K24j53l11K22K84m98j63M24j41m6L22oO6l97L46O7n32K22L40
4177B14m09L35k1k5q4O8O6k79kM61J27m92m8N0j5j74L19j32k1J10J45l43J58J69
4201A77j89m56L62j57J90qK25Jm51L08K41M7k70J08j87J47l03O18m99L0J53j96
$$ y = [174, -159, 97, -180, 359, 159, 0, 166, 177, -71, -20, 87, 174, 55, 98, -128, -15, -278, 248, -296, -136, -172, 19, -173, -436, -20, 167, -122, 68, 81, -59, -2, 244, 196, -41, -84, -76, 62, -42, 239, 153, -83, 59, 209, 79, 163, 416, 101, -289, -187, -85, 21, -374, 136, 221, -337, -34, -177, -97, -281, -60, -61, -262, 69, 56, -315, 99, 418, -114, -212, 244, 219, 21, 87, 169, -31, 211, 132, 31, 328, -30, 318, -125, -264, 105, 73, -32, -108, -18, 205, -190, -18, 93, -222, -107, 201, 147, -26, 166, 148, 291, -242, 338, 177, 57, 75, 5, 100, -40, 211, 51, -87, -262, 167, 178, -56, 168, 15, -296, -74, 210, -288, -451, -27, -168, -214, 108, 102, 168, -229, 117, 184, -348, -126, 214, -195, 140, 119, 94, 10, 78, 144, -135, -137, 324, 451, -41, -89, -39, -54, -228, 91, -41, -62, 48, 193, -150, 8, 177, -12, -468, -106, -263, -73, -81, 144, 145, -306, 2, 243, 290, 20, 128, -59, 88, -215, 403, -96, -66, 87, -109]
4223a09j26J20K27j80M6j28K82j17n0J87r1k19K17q4q6%K21J12l54L63K10p50
4245c09Q4L38L6k29K25K00n05J17L20n42M00j01j6q2J0R6K7k50p2R1L5P6J63k86
4269a74J42J77j17k30k33O49p3k90K49K22k03l04O9J65l96L43P9K7n2P3j18m94
4291d89N40j46j22K61K33k58r8M1J59j57k12O15j94l01K12M6J30l55L90k22l00
4312b27M68k08Q3k15L25j70k37L46Q4l92j09M46j20l9Q4k58L63l52m3K39o0o6
4334e8J10j06j59N4K65n9J7K1l17lN08j58m26M40J71j00l09N2L88m21r3L82k24
4357b5l21L32k1m2Q6J34J4k72K53j03L4J12o8j12M6J31L3j16m9M2k13J12K71j38
4381A20Rj20J38k86K74j08J1P4k87K93O2l45j2J27j74J84K73l46l39M69J49k04
$$ y = [-109, -235, -115, 112, -68, -22, -150, 132, 15, -35, 152, 61, -158, 59, -25, -111, -111, 110, 222, -132, 231, 441, -309, -225, 113, 149, -80, 145, 345, -160, -43, 277, -265, 135, 34, 18, -64, -54, 42, 69, -181, -253, -162, -127, -51, 112, -174, -32, 145, 28, -202, -435, 214, 141, -149, 100, 322, 119, -185, -116, 49, -347, -4, 75, 102, 50, 123, 5, -489, 51, -95, -217, 44, 277, 19, -79, -38, 121, -36, -248, 367, 173, -128, 84, 130, 260, -95, 295, 73, -227, 241, 33, 116, -99, 226, 56, -181, 165, 249, -143, -252, 194, 74, 35, 119, -139, 224, -128, -171, 68, 8, -58, 52, -54, -213, -159, 106, 47, 64, 85, -232, -235, 273, 115, -311, 129, 300, 200, -109, -57, 331, -90, -183, 199, -25, -346, -14, -35, -77, 9, 143, 157, -115, 138, 35, 69, 181, 113, 1, 47, 178, 211, 95, 46, 88, -125, -13, 258, 120, 129, 9, 147, -139, 135, 27, 38, 112, -175, 118, 180, -165, -177, -50, -224, -40, 233, -113, -452, 17, 166, -38]
4403c8J31r8R8m62M52K83n59J86K11k89L4L93j61k20j14L10j14j29n8L98m75L02
4425H1j76J51n7k60J61l1K88J87n70k4O7L21k50J57J90o5l80K41J79k05J04R0
4447A99k24L4J42J49n39L41k24J20k02J51K67l63M0J41Q4j7k14J66Ok02L15P1
4469B41m02n6M27k99K7K83j85j20PL95j53k96J78P4j26j88J42J5j49K59K8m50
4491c48K15J77r4q4L65j65k22M46k51Qj8K49j31l56J37M09j18k22J51L7n33M71
4513A23R7k01J69k6m4l37j4L18j06k20K92n3%q8K09j50j16M57j72q4m5K84l79
4536h6J20j1K60k75J39k77K86q2j32n4n2J10J77J09l23L68o0m98J65K02r5R0k87
4559b06L11l04P2J13L78o74R7M92k70J8J78J5l72K97J21n97K77J64j66J21j1o4
$$ y = [-38, 93, -5, 93, -369, 83, 366, -193, -7, 204, -85, -51, 342, 181, -39, -153, 157, 43, -86, -144, 254, -221, 81, -95, 56, -1, -261, -100, -131, 157, 344, -226, -250, -183, 138, -112, 45, 235, 170, -210, 31, 210, 5, 109, 199, -25, 9, 151, 300, -239, 102, -122, -2, -204, -53, 214, -149, -109, 32, 116, 99, -115, 51, 57, -145, 170, 241, -161, -217, 210, -89, -62, 221, 36, -84, -77, 318, 165, -131, 47, 121, -5, -193, -51, -36, -185, 74, 102, -348, -133, 44, -50, -134, 231, 66, -156, 290, 39, 47, 29, 278, 147, -209, -72, 337, 219, -3, 148, 185, -348, 123, 220, 19, 188, 162, 118, -219, -233, 85, -21, -241, 51, -2, -2, -90, 119, -31, -147, 310, 138, 54, 9, 293, -86, 34, 23, 283, 8, 147, -130, 156, 74, -58, -112, -164, -54, 123, 232, -91, 277, 217, -281, -116, 86, -9, 81, -206, 105, -199, -127, -14, 364, -310, -213, 279, 9, 27, 205, 220, -152, 145, 266, -331, -54, 110, -56, 65, 54, -10]
4581a0j76L1J81K98n78L94K26o72Q1N24l37l2N5L10k78j46K22Q0j53J54J65k47
4603I2j15J92M3n25O69J26p06J04M84l05k89J47J36q5K16k2p5m43K28P0K29l30
4625a59K30j70l79L26K67n01K37M61l52k00J92K29k44J63K75n65K08J8j80K05
4645F1n1J63j17j48K21mm80L57M8J64k74L10j77J4j61J56R3m71L98N4j52j07K46
4668A43J89m83R1j9QmJ95j10k15J16L42l71j27J06M4K2M7l3k12K88N7jl65K59
4692c3J01j05J33k71K5J46l4j04J71j68M65j42N8m27L91k43k03K71P7m8p0K32
4714B22l24k00L97j09j03J73o3j43J7m1J82n9l01M59r8J22n0j82L32k62K36j27
4736G8k0J61r8l29K67L98n33j63M42j01l88J71O1O0n3J76O3k59O6n0j00J27J20
$$ y = [-10, -186, -155, 26, 324, -254, 140, 366, -306, -225, 299, -38, -70, -15, 295, 17, -129, 93, 173, 20, 174, 339, 92, -23, 169, 212, -313, 356, 482, -224, -120, 364, 59, -230, -83, 53, -32, 184, 162, 87, -356, -128, -58, 171, -159, 71, -99, -478, -152, 115, -386, -149, 312, -40, -240, -48, 181, -63, 100, 375, -190, 18, 36, -144, 61, 10, 173, 56, -92, 129, 125, -355, 2, 50, 214, -60, 250, 73, 87, -74, 82, 175, -296, 102, 156, 4, -103, 143, 332, -151, -60, -79, -71, -75, 120, 10, -205, -89, 253, -118, -245, -139, -95, -73, -26, -59, -271, 17, 74, 73, -292, -33, 68, -37, 96, -175, -150, -4, -38, -142, 29, -139, 326, 184, 242, -185, 206, -37, -240, 31, 108, 60, -10, 222, -102, -302, 95, -14, -117, 56, -7, -150, -133, -174, 8, -51, -352, 107, 9, 131, 81, -101, 231, -31, 205, 78, 58, 219, 121, -208, 59, 457, -76, -239, 203, 102, -286, -115, -54, 6, -47, 129, 192, -67, -1, -51, -151, -24, 96]
4759I6l9k18K25K92n55p6K00K26l05K39m7j43MO2J59k46n3K69l35KN98k40k77
4782a62J2p9L6P7K77p4j96r3K19m0j31K93M6k40L2L62k92j00K89k40L05k09m9
4805D3k1j03L12k62q0j2J82l46L33N1j92J09j46L75l02m0m0J90j70L22j64K03
4827B42l61m6K53n2n5j45L66j00j88N14m85J27l8J69k44K07l33J66J7P6J2j08
4849fRK16l43j08N38m82K74k20K91j59J80L9n36R7K42K42k59N1O5j74k00M08J3
4872A78k25l0RL48l19J24om41J02K60O1j4n5j22k00K97P9j03K32k24J10K5j35
4895d9J40p0j35j19L95k3j45J71j60O2k04J80q3j61J97J75m1j71k2K32k50K21
4917A40k90O6j42J96J10j50P6J20kj88K76m41K13L40l55J8K28P3r2m13L94j55
$$ y = [96, 57, -161, 64, 356, -199, -275, -75, 151, -154, 85, 38, -105, -101, -39, 120, -126, -179, 90, -245, -243, 355, 115, -162, -150, -229, -193, -116, 161, 87, -109, -202, 17, -23, -154, 139, 185, -55, -23, 339, 47, -53, 236, -4, 301, 92, 43, 22, -81, 231, -31, -111, -123, 59, -287, 46, 97, -95, 14, -132, 243, -59, -99, -139, 51, -119, 203, 39, 242, -119, -165, 88, 36, -19, -164, 202, 102, -86, 428, -57, 70, 32, 201, -43, 164, -169, -3, 14, 90, 102, -6, 3, 219, -124, -232, 306, -176, 98, -122, 169, 10, 190, 229, -307, -210, 32, 274, 15, 66, 131, -43, -243, 165, 178, -47, -77, -68, 280, -39, 85, 79, -362, -260, 0, 61, 47, -8, -130, -330, -33, 46, -57, 175, -49, 61, 86, -49, 91, 21, -114, -233, 162, 139, -6, 165, 5, 67, -137, 43, -40, -201, -4, 171, 130, -41, -63, 169, -81, 140, -150, -84, -226, -30, 80, -70, 6, 126, 124, -64, 212, -229, -16, 324, -31, -13, 215, 288, 196, -217, 177, 22]
4939B2j87J04K56k62j66J44K10o6k3r0l2j36J78kJ71j68J76k0k91j32L24Q6j5
4962H1K77k26k34L28K44m76r5R6K47k45J44k62P6m1J87j44r3l82N26j26M2J95
4984A19l13J40J52L5k4J4o9j64J94N7K17l46l5K81k40q3J79j2k33m8J79Kj08J60
5008E4j3j13k9O9J58k71J24oj8K9Q3j47K20L0J30k79q4L58m7j41j08J81k09P2
5032D3J65k66J60k47L34k00K63l62J67K7k59K63j80o7K38M5j88k08J29J96k09
5053a56N4K09l38L60j23j9K07k48J90r1K8J82p7k45L52j43J7k07J32j50J27J4
5075G5j91j5jJ45j40j10J25K4j58K34K43l76K12m7J08l60R9L41o8l35L10N1n81
5098d15K60L78l08J83J53q1j92N1k46mK93j04J44m54J16L09j23k85L26J26k42
$$ y = [22, -165, -61, 195, -67, -233, -89, 121, 55, 32, -58, -90, -226, -48, -50, 121, -47, 129, 109, -182, -314, 10, 96, 81, 358, 132, -102, 226, 470, -6, -101, -5, 242, -3, 141, -121, -45, -86, 101, -43, -136, -518, 8, -118, -76, 119, -194, -54, 98, 133, 109, 123, 54, -110, 84, 141, 358, 12, -23, 258, 18, -65, 114, 102, -131, -179, 0, 2, -106, 54, 41, -72, -101, -32, 126, -145, -21, -27, -45, -16, 67, -80, 140, 170, 300, 21, -63, 295, 248, 107, -1, 180, -29, 43, 208, -58, 102, -145, 189, -11, 252, -110, 57, 84, -175, 88, -92, -159, 79, 124, -64, -272, -143, 53, -156, -102, 107, -231, 129, 6, -13, 194, -54, 136, 45, 73, 255, 178, -67, 285, 142, 159, -48, 84, -66, 61, 75, -116, -131, -132, 13, -127, -237, -112, -88, -246, -12, 231, -145, 67, 20, 128, -232, -133, 208, 140, -195, 115, 166, -415, -155, 223, -85, 98, 251, 170, -22, 29, -217, -221, 72, -32, 112, -342, -226, 83, -40, -325, 1, 127, -115]
5119a15n9K99k47O8P5K1l95J82K03K2j0k1Q9j60P2R9n3m24J78PQQ2J02j28J97
5144I2j62K21k57j04N72m73K63j66K44k58J30L6r2KJ9K30k27j75K46j14k09L92
5166B10k16j37J12p5P9J3k4J58l6k26M01j26J0j10j07k74M52P9j59L7p5R5j37
5189e6K57K1m53R4K37R9m07K20R5j08p8J64k88J16J27J45k84r5K17q8P5l70M84
5212A24j77J78q5J58J5n6r1j23K1m5K85l51K2J27L13k35L3j02Q1j28K09k97j49
5235b73J45L04n49L74j17K37l65R9K49k62j11K96k72J20J35q5k3Q8L60m06P3J14
5257A31J28j96j04J22k06N5p6L23Qj83R9k31R0j06L36l69P5K24l27J09J06lj88
5280a83P9J7J85j03J43p6J55k78K69J23l82J87n4j22p8M22k09j83J32Q5k01J74
$$ y = [-115, -174, 125, -122, -54, 21, 42, -353, -171, 32, 54, 44, 23, 112, -48, 24, 123, 70, -354, -176, -169, -161, -79, 23, -105, 92, -70, 151, -106, -210, 362, -111, 152, -14, 230, -28, 102, 138, 46, 48, 67, 297, 70, -105, 141, 27, -182, 210, -6, -143, -31, -106, -27, -14, -38, 120, 84, -142, 259, 133, 143, 33, -74, -348, 104, 183, 24, 61, -14, 81, -56, 201, 222, -231, -137, 100, 199, -208, 12, 107, -1, -79, 85, -203, -87, 40, 185, -99, -194, 23, -65, 10, -360, 124, -53, 125, 40, 198, 213, 157, 66, -57, -36, -81, 204, -147, -125, 2, 315, 80, 113, 11, 92, -36, 173, -124, -273, -128, 176, -373, 1, -116, 121, -244, -145, 104, -158, -269, 27, -245, -125, 10, -75, -98, -10, 350, -56, 17, 131, 259, 63, -41, 81, -125, -70, -146, 177, 185, 2, 101, -130, -40, -146, 190, -179, -104, 120, -207, -98, 8, 5, -183, -104, -87, 98, -5, 138, 62, 217, -61, 208, 331, -51, 136, 82, -40, -118, 304, 95, -88, 44, 129, -72, 102]
5302A02j66j0l5N1K32j40k58M46O8l66K22N1l13L6R8Q9k69L94j51j79J89J37k6
5325B02l50p8M51p9j27m5j27L7K38J32j17k86J45P0k12K82M4j65j53J24K3R7l34
5348b28J74j11K74O0k66j1j89L28j6O4K0R5j42l17L46k29m3K87J43k12j5J00k94
5371a82L7J51j48P1j35J62M0K8j94M4Q1j14L75nl12m8J22P1o9K13j7k55j5L44
5395B45k67j3K74k98j20M30l81k2j52M73p4M9j29L07l94J46rj21J54O8k5J7O2
5418B20L3j26n38M18J71j45j04K2J99r9k64M85l28j46J75L5k3J13k70j01Q8K93
5440A08k02j27K49N6j76p4K39J01m74K54o4j8N5J36n1l57K53J62k4k22J93R3k91
5463a81K01J43j37r3N5R8j04L1j50M29n02J95j3j90K68K72m18j25L89q3l24L48
$$ y = [102, -64, -74, -109, -58, 174, 34, -224, 222, 290, -76, 146, 197, -116, -80, 18, 107, -162, 232, 81, -98, 91, 228, 202, -148, -226, 225, 146, 19, -26, -153, -116, 122, 254, 137, -149, -4, 66, -146, 136, 180, 15, -138, -14, 9, 106, -228, -54, -165, 109, 169, -97, -108, -297, 31, 15, 79, 99, 194, 52, -265, 81, -148, -191, 96, 239, 27, 12, 112, -182, -145, 6, -142, -71, -206, -44, -4, 24, -170, -126, -45, -159, 216, 211, -101, -149, -27, 44, -25, 188, 171, -84, -99, 245, -22, -35, 239, -59, -179, 251, -130, -152, -304, 169, 95, 144, 15, 322, -72, 74, 65, -56, 98, 166, 141, 158, 220, 253, 127, -411, 7, 178, 33, -71, -49, 150, 51, -213, 272, -56, -202, -27, 8, -15, 98, -172, -273, -185, 108, -94, -221, 28, 84, -92, -166, 73, 174, -300, -46, -110, -128, -73, 63, 12, -345, -92, 70, 46, -176, 17, 110, -181, 20, 163, 26, -67, -12, 86, -18, 13, -137, 292, -210, -15, -28, -218, 50, 322, -96, -221, 168, 85, -239, 109]
5485A09K44j81j58J2J96l65K49L6J6j60J1J68k41k12J36j6q6K48k0o9q6K75j90
5508h4k39L58j19n6J23K50m10P4K4J02j50P5K73o8j84Q5RRl42L37M2k46K84l44
5532a97J66l04M20n5j6m9j26J94j26K40j16M0j0j77N7J02K4j39J2l7J55j13o1
5555a16L78j89l02N59m44K32m80K60k6O5K73m46K02j75J08L25j85l14K72j26p2
5576b01J24K21k8j45J27K5k94K53j86N3L38j94j43J65J16l65J95jO7j66q4M99
5598C76j96k43L6QQ3k28L34j69%O4j71J01j89M25l12k9L86j43M3j85J8K43j36
5621A16q6M5q7j76L20k01j02L0K73l43Q5J20J64j66l39L79l9J7j46L3j23K84J63
5644B21l83P0K28m4j04j97J80j49M13n17N94m57L42J14k18M9k6j92j1O3j53o7
$$ y = [109, 353, 172, 14, 26, 222, -143, 106, 142, 158, -2, 9, 177, -64, -276, -140, -156, -242, 6, -14, -83, -169, 106, -84, -323, 35, -84, -140, -17, 233, -177, -103, -79, 23, -127, -52, 221, 153, -31, 54, 63, 72, -270, 67, 109, -137, 147, -197, -31, -335, 85, 30, 14, -35, -161, 33, -93, 147, 31, 71, 61, -116, -59, 43, 67, -72, -60, -97, 58, -55, -116, 262, 73, -229, 330, -114, 118, -362, -102, -128, -63, 210, -236, -34, -209, -101, 224, 39, -275, -3, -129, -201, -77, 144, 116, -29, 98, 123, -171, 82, -104, -51, 287, 93, -50, 115, 231, -134, 61, 60, 127, -39, -123, 376, 180, -63, -27, -19, 64, -164, 170, 1, 1, 65, -106, -5, -194, 231, -81, -110, 276, 133, 176, -9, 9, 252, 116, 30, 75, -12, -188, 132, -69, -171, -141, 132, -211, -126, -6, 158, -8, -347, 32, -7, 10, -136, -103, -226, 58, 221, -162, -92, 136, 92, -12, -209, -29, -178, 235, -282, 312, -145, 197, 311, 93, 142, 116, -76, -87, -24, -177, -244]
5666b44R7L00k55j43j44N49j19m59M98K59k11k67J49Q1n7J79R3l37j56K25J21
5687A59k08P8%L78r18N34P6r3O9R1n2l17O8L28l97J78j47J51J31j85jl09L85K1
5711B0J0j94L61j44J8j70J96Q2j50K35m16L98j59Qo0l23M40K2m18J59n9j78L03
5734a9j16K43n4J67k44J45k36K38r8n4j23M52l09J73J70l19n3N0L71m58r7J98
5756B7J97k74j90R0r7n1J83J18j89o6K41k01jJ76J71j66l9K77L8k10J05Q5l65
5779a41J09J24l4j88L21j14k99J73J5M3j86K16O1j00o3mL7j95K09J43l26M4P7
5802g8p8K10j21J50l10Q0K76k05K57k18L2l2o6K86j68L27l7j63l25l7K79Q6k64
5825a19K39k01j72K24J15N8j79KJ23j79J15K4j41Q8J25j09J7K6K72n08K62J60
$$ y = [-244, -147, 153, -102, -245, -389, 160, 41, -418, 80, 339, 128, -139, 10, 91, 34, 213, 306, -31, -187, 38, 159, -49, 29, 29, 407, -511, 23, 99, 6, 75, 166, 114, -203, -135, 193, -204, -26, -173, -22, 109, -76, -77, -386, -1, 20, 30, -164, 197, 53, 71, -99, 97, 179, 29, 264, -152, 246, 87, 95, 35, -288, 152, 174, -244, -85, -144, -322, -19, -135, 108, 54, 221, -23, 122, -114, 124, 26, -28, -151, 301, -8, 165, 335, 16, -37, 13, 384, -74, -171, 27, 224, -50, -240, -150, -247, -298, -115, 3, -186, -252, -11, -212, -213, -37, 134, -32, -71, 206, 244, 34, 139, 224, -141, -32, 92, 58, -130, 191, 77, -222, -49, -34, 9, -177, 39, 100, 0, -63, -67, -30, -225, -16, 127, -199, -155, -78, -156, 54, -67, 83, -227, -147, 129, -76, 181, -37, -5, -37, -103, 183, 15, 342, 305, 142, -183, -220, 59, 145, -119, 120, -81, -253, -29, 86, 144, -35, -33, 90, -89, 26, 50, -91, -3, 122, 13, 30, 56, 328, -180, 82, 242]
5847B42O4n9L8n17L58l24J24J54j99K0R6j2j77OL34j59l74N13l7ml30K51j44J46
5871A0n4j75M4M05q7q3k42K44l0Q2j35K10m23L44k05J93j42M2Kr0m1J71r6k48
5895c04J04K4J96j19L92l36j7J50M6j22o7P7k6j67K29Q1k6j69J85j75r3k8K73
5918A08R0l78J63K48n38J25K63N9k84K7L2j42L34k18p0J38O5j74K07k64O10m57
5940e6r8n0rL55k39j45J83J85J17j52Q1m35M29k35pM75j11l69%K19k94J88r2Q7
5964B7j54K36j27j6mo8J44l02L10O0O3k44L1j23k4K98j69N4Ll0J61j97k7O0P8
5989D0pJ0j11n9lM20m20j21J52n8J46J66k34r8J61j8K03k98J55J30O2k17J3J1
6013B5j46L4Q4n1J88Q0l57L62p8l33k3J47J86k42j07K32p9K23k25p5K24M8q5O6
$$ y = [242, 306, 247, 285, -232, 126, -198, -74, 80, -119, -99, -3, -15, -192, -186, 148, -11, -385, 128, 91, 87, -243, 8, -136, 10, -44, -219, -175, 230, 143, 60, -182, 62, 32, 114, -21, 189, -234, 110, -95, 98, -44, -2, 0, -90, -131, 40, -56, -304, -200, -176, 20, -99, 293, -43, -60, 90, 136, 14, -53, 24, -2, -169, 60, 141, 115, -54, 131, -44, -137, -165, 108, 198, -180, -17, 231, -307, -182, 81, 140, -144, -117, -85, -227, 107, -111, -181, -43, 22, -152, 55, -209, 401, -56, -154, -204, -213, 142, -97, -242, -59, 126, 243, 91, 172, -263, 166, -69, -76, 399, 288, -81, -81, 138, -156, 32, -60, 27, -127, 109, -18, -34, -38, -106, 38, -264, 46, 106, 169, -75, -44, -167, -191, 107, -62, -8, -5, -35, 126, -71, -98, -38, 40, 33, 43, -68, -127, -130, 290, -130, -251, -99, -157, -11, 155, -79, -177, -16, -34, 169, -129, 26, 156, 218, 1, 14, 25, -121, -87, -3, -54, 134, 214, -143, 219, 141, -192, -215, -68, 118, -124, -231, 1, -78, 145, -80, -155, 69, 117, 32, 98]
6037I8j17r8Q1K47j16l69K93j12k43M26L04m44J78j56R4k82L71j66k69J81L6p
6059g0q4L7J50p0n6j81L39j17K09k32n8J80j4J40l19O7r9M07m16L40j25p4J53
6082A07K02k10k24J37q6k4j54L46j21J72k29L2q0l8K93J03m62K16O3l91K51J50
6104E3J04j05J02L0k01j04L00r1j28M3j6j30K51j24l65K46P3M08m91j12M93l46
6126a10M3P6L0jk97L79l5j79K10k19o5J13K78j15q8K76l58N17l41l6J95l68J46
6149E1o1J5J69j61O2j69L41k73j86J15L23k73k35L18K67o06J21K78j79rL00k49
6171d1L7n6K56J40j56j5k11j79K65q3k55J32K57M1q3J72l1n3m38J70R3j34L13
6194A41k4j02k65J15K94l54J44K01J4k20J0J79j13K66k34J2l61M04q6qo6J65J55
$$ y = [98, -19, -117, -36, 211, 95, -274, 19, -93, -336, 90, 394, -50, 128, -28, 66, -216, 155, -11, -280, -99, -63, -70, -154, -117, 33, -37, -93, -274, 65, -52, 157, -75, -133, 47, 33, 173, -146, -79, -178, 229, -187, 153, 28, -46, 107, 309, 99, -125, 12, -74, -98, -252, 94, -27, 145, -84, -52, -132, -170, 123, 226, -236, -20, 43, -348, -97, 53, 157, 52, 154, 184, -17, -121, 179, 88, -40, 3, -13, -143, 108, -16, -381, -135, -62, 346, -145, -257, 236, -110, -67, 9, 39, 38, -259, 120, 85, -94, 116, -103, -168, -55, 223, 108, 20, 296, -62, 455, 114, 78, 273, -95, 51, -10, 5, 174, 13, 75, -94, 247, -26, -212, -97, 226, -47, -282, 36, 303, -303, -182, 96, -83, -92, 208, -41, -4, -60, 196, 336, 180, 165, -46, -225, 40, -43, -298, -166, 91, 132, 49, 221, 190, 137, -301, -131, -38, -172, 141, 117, 15, -250, -135, 159, -195, -51, 150, 164, -56, -46, 133, 20, 286, 52, 64, -297, 107, 21, 13, -53, 112, 267]
6217B67k76o3J43k6l18L98k10n2K37Mk54K37K61k18k82K80n3L0K01k53K26o33
6239c54L53K08j45j52k12K93k5M5j63J01l05O66l95k02L75n6l56K10O5j7j07J02
6261g1j00J04J8O3R8j20K45K4p0j13R5r9j90M3J98l32L43k86J35J27k28J80J13
6284A77j74J20j02j25J38M7j68J43l1J29j73pQ7o0j98M04l78Nm5L18j9k01L34
6307B21j43l05J00K59k90p9J54n4j98M13k4j74K25j03k28j18K78J0L0r1K99j65
6329A7k6M1K84l44J7j1J54k47K22m1j9o4n6J26k38j2K49k33M2P3K41m70K68L28
6353C01o46J49j5K28k50K70n9J75l30K74j5q9k94K75%J6K18M5k68J74O4m7j61
6376A5K81j73n4j00P7Jj77j4oJ82k8O8N4o1L40l81j66j58L60j38p9J61J41j62
$$ y = [267, -9, -72, 71, 45, -273, 125, -85, -137, 100, 104, -150, 87, 348, 130, -152, 128, 75, 105, 306, 53, 279, -354, -1, 207, 62, -90, -302, -9, -34, 11, -152, -51, -356, 310, -85, -287, 88, 32, -324, -114, -49, -66, -173, -71, -171, -67, -49, 14, 112, -8, 237, 261, 191, 78, 173, 74, -116, -73, 125, -207, 136, -150, -15, 112, -116, 64, 177, 3, 123, 21, -104, 34, 81, -87, 56, 25, 154, -19, -26, 61, 1, -197, 207, -171, -166, -211, 107, 88, -113, 221, 78, -227, -127, 132, -158, -237, -83, -137, -335, 78, 54, -120, 105, 2, -226, -344, -66, -56, -26, -117, 182, 17, -9, 32, 316, -28, -11, -22, 132, -115, 107, 66, 47, -17, -73, 53, -185, -197, 52, -181, -139, -66, 175, -295, -27, 301, -345, -196, -211, 17, -233, 37, -22, 153, -177, 97, 82, -7, -301, -26, -26, -10, 208, 253, -15, 159, 223, 176, 15, 296, 123, 69, -31, 46, 47, -130, -144, -150, 32, 4, 72, 126, 65, 405, 24, -142, -300, 60, -78, -157, 4, 145, -17]
6400a7n12O03k33K06Rp9q9J06Q2l5j05Q6K4k34kK59p4o4j0J63l52J05J18Q2k61
6425b24J53K45j76K8j47J94P0o7j18R3j8J46j63j3R0n1J23l0l37L6qJ00J03k6
6449Cj50J03m1L8m0J32n6n4M85l44k72k3J73M1j01MJ53Rn2L51l78J70M1j14k98
6474b20J74J20K22l13J14j63j18j6pJ4J75j3J66l31J28M1j47o5L00J74l52O8L47
6497B98k94mK36o38L64J91P0r2j55J09l0k61Q1Q2k6J15mM1J59j81mj09l1J58j7
6522E8m25M92K81l96J53j66j38R9J84J23l07J13Q7m3j93J80j31M4p7J89J81n67
6544b59K64J05K0m86R3M10k81n7J16J13k51J8L02k74R8K45j29L5J83k52k01L19
6566A31m5o9j58K82nL3j28P8j49k16R1j14K48q9qM4K9J17r2rn7Q8N2n7k2OQo7
$$ y = [-17, -529, 74, -159, 47, 56, -23, -112, -6, 76, 41, -64, 22, 46, -188, -190, 69, -5, -69, -79, 84, -268, -163, -45, 37, -224, -71, 174, -2, 26, -121, 73, 143, 76, -42, 51, 33, 179, 16, 3, 93, 42, 165, 135, -202, -166, -174, -74, 29, 3, -147, -44, -85, -47, -87, 45, -11, -65, 420, 76, -196, -219, -46, -5, -106, -102, 51, 60, 8, 359, -19, 151, 192, 78, -220, -46, 74, 296, -17, 97, -66, -184, -200, -207, -193, -18, -31, 135, -196, -68, -27, -174, -239, 61, 235, -117, -49, 298, 4, 0, 236, -402, -38, 153, 223, 131, -24, 85, 55, -206, -125, -43, -69, 46, 42, 83, 242, 61, 57, -52, -83, 75, 58, -367, 125, 406, 10, 163, -3, -141, -42, 142, 265, -42, 71, 158, 115, -78, 102, -29, 15, -62, 127, 308, -259, 5, 110, 130, -356, -263, 147, -134, -191, -75, 38, -213, -195, 107, -167, -69, 176, 47, 82, 265, 13, -188, 131, 86, 17, -141, 141, 136, 169, 41, 119, -30, -246, -155, -269, -21, -110, -118, -74, -45, 72, -20, -29, -86, 2, 54, -3, -25, -19, -11, -78]
6594g8q7K10o9J8J55k15K8o9K11k85K32R1j46K9J62q8r2k98M51J3j92K8R3j66
6618f4k38M47j92K44j93K20n36L12rk04J24K74j33r1K66k57m2n4J41K38l55j30
6640b32L04Lk55MK85l28J79L25n69J34J51K48p33O21p3J51l86K71k3P0l00L24
6662A71j59J32k39J02Oj73J60o0OJ54K73o31J55K29l16PL3J7J07r2K34k35LJ80
6686F4q0L8JJ36l35R0L05k3k70p2M70j90oj84lk7M5J41j54r4L02k0j6m89M93l0
6712I2k54L54l35K2R2K25j93k09J08K56j90r2M59l74j01K58k82M5j2L0jJ57j41
6735h6J55O8l22J84p8J10M4k05K24j91J5j14KK99K46k84k06L0Q9k6J75j74n6J00
6759aJ07k00K8n2K40l37L81r1M8j24J1O8l93J92J73p3o1Q7K77l43N7O7k13J45
$$ y = [-78, -165, 45, -24, -6, 149, -66, -38, -107, 104, -181, 51, 142, -4, 25, 187, 99, 7, -291, 160, 173, -19, 9, 102, -64, -302, 145, -47, 197, 4, 224, -312, 0, -9, -213, -89, 185, 52, -39, 227, -30, -72, -126, 15, 253, -102, -232, 72, 75, -180, -176, 109, -219, -40, 285, -284, -150, 1, 249, -484, 137, 64, 215, -171, 100, 77, 147, -153, 171, 12, 144, -95, 7, 13, -160, 0, -60, -54, 100, 373, -258, -103, 126, -190, -183, -150, -133, -26, -118, 116, -119, -116, 64, -16, 22, 23, 159, -176, -86, 219, 196, -74, -146, 324, 134, 128, -56, -59, -86, -41, 100, -54, -148, 154, 134, 118, -371, 122, 92, -162, 192, -143, -121, -29, 196, 3, -206, -98, 158, -32, -124, 335, -39, -140, 118, -164, -119, -131, -101, -102, 55, -86, 69, 137, -185, -1, -79, 31, 75, -130, 94, -97, -82, -196, -194, 105, 351, 67, -139, -109, -20, -46, 129, -45, -101, -1, 106, -94, -66, -118, 122, -215, 166, 75, 123, -1, 10, 78, -315, -123, 50, -23, -84, 3, 280, -63, -6, 61, -152, -7]
6783gP8J68m23j01L81m8k69J42K84k81J39Q2Qk02M6J76N8l96K79l3j17j36K06
6806C4lj90M11P7j81j17Rq3o9K2Q2m31M19L07j67k16R3L68l74j47K46r3M0K0j38
6831h1j2R0L43k89l16K52K48l34K89j19K66n78L3L19k13k2J92m8k09P0J4k6J29
6854bR9j93m6j7J21l12M33j33j43J46O4J48l26j52N1K81N3K00k69N1J3r7j06r9
6878b35K10q3J55N9j09M0J4O9lj01J8r0K35q8k49L41m08L05P4l88J72J36j2pq9
6903c4PKp1J45j50M3j56K35L13n71K35j17J58l46L46L3q4J79r7k48K31L0Jj97
6927a13P9K14j21j87L22j58L8l8K23J4m03Q9k64NJ36K68l14J98Q4pn3O7QK3k14
6952a04L24l17N3K38o8j29Q8j1j58k37M35j82j68K15j8K24j71r0J50j29k41J18
$$ y = [-7, 71, 239, -184, -285, 96, 48, -221, -79, 205, -76, 63, 145, 153, -49, -3, 173, 231, -165, 114, 81, -36, -172, 34, 31, -159, 252, 329, 148, 31, 40, -43, -112, -90, -8, -439, -20, 287, 120, -96, -3, 365, -9, -156, 90, -3, 37, 57, -81, -93, -3, 340, 51, -265, -13, 235, -99, 190, 71, 337, -241, -208, 111, -102, -124, 68, 20, -189, -119, -105, -131, -2, 97, -96, -142, -159, -38, -350, 83, -50, -193, -47, 17, 165, -161, -313, -262, 19, 72, 272, 3, 54, 67, -30, -136, -235, -25, -108, 47, 106, -3, 37, 51, 120, 117, 16, 34, -56, 179, 91, -158, 183, -225, 80, 154, -234, -62, 74, 62, 55, -34, -27, -25, -96, 49, -101, -58, -214, 21, 334, -237, -2, -119, 39, -307, 39, 72, -12, 167, 70, -178, 53, 83, 84, -113, -34, 180, 59, -128, 194, 36, 74, 36, 259, 273, -130, -41, -305, -300, -164, 104, -210, -12, 72, 65, 12, 79, 87, 110, -104, 220, -97, -44, 194, 126, -3, 85, 74, -84, -321, 114, -68, -236, -21, -39, 185, 14, -76, 74, -55, -296, -178]
6974a78M24k03j21L77m66JM01N0k07J20pk37K02K00k84m0N5j07o2J00Q4q2r8j61
6998b39M57p3k52L34j91k45k8N34l18j95K79J8j15nJ56l4p4L21j79pl68M64m5
7021A95l14J3P6q5J36R4l3j8j12K85k86J41j1q3j46N8K73k95K2M49j58j39k7O7
7045A02o4k93M34k61k71J44J66K00j28J13k03J57J0r6k27L81j37N3k22L45p5j66
7067c8l00L39j93K11l2R3m50Q2M50k59J74r0J06J8k16L61j39j67l6K14R6n83M32
7090G3n6p3K52j27J5m01K79k47K23j7L11k12j18J48k24J39Q6k31K96k38R5K77
7112B50m80K50Q0l1j96M72J66p35J19K87j30j61l3J82J35j38No5j07R3M66m42
7134a3J28M3j40K46m01K92k11j26J64qN5n6j73j37J41K68Ko6J41L2k65J30Q5O6
$$ y = [-178, 246, 43, -78, 299, -167, -166, 235, 285, 78, 198, 191, -46, 156, 356, 72, 32, 87, -20, -82, 18, 102, 20, -78, -239, 218, 145, -107, 227, 36, -209, -237, 297, -21, -216, 63, 81, -34, -39, 117, 83, 9, 330, 151, 144, -224, 240, 195, -119, -106, -30, -115, 21, 115, 82, 64, -48, 237, -49, 92, 81, -2, -148, -90, 183, -112, -90, 359, 201, 62, 35, 102, 38, -255, 179, -82, -353, -209, -43, 157, 29, 142, -61, 96, 106, 10, -217, 164, 27, 80, -142, 203, 128, -38, -338, 1, -192, 19, -13, 80, -370, -288, 162, -97, 77, -13, 93, 111, -105, 256, 117, -50, -86, 128, 224, -359, 73, 17, -56, 196, 69, 84, -317, -38, -285, -62, -79, 232, 20, -98, 50, -174, -35, 51, -180, 116, -122, -27, 250, -230, 20, 100, 69, -127, 345, 511, -224, -105, 182, 52, -109, -142, 40, 175, 37, 42, -23, -130, -37, 429, -13, 115, 158, 18, 264, -137, 155, -56, -182, -18, -26, 29, -27, -200, -337, -196, 72, 74, 8, 149, 181, -84, 46, 131, 197]
7158A97k05j65J84r3j39K03j46R8L08k22n9J40j94j14KK77O9mk51K91m12k8L47
7181H4kp7K65q6j50j16n0j4J2n5L98j70K5p3R1k87n7K06j07n5K78J01l73K41Q0
7206A09Jj82N9J75j05j31K78mj50Q8p9J15k50J44J1j18M11m48J51j81j67M28k97
7229a42M99m02q2n3M50l69j09J30J36l93J46K00Q4l48J05N15j43N4k34k25J73
7250hJ93o3j26k7J75k02j47K10n7j20J59J96j15l7O2j44j10J66J5K4k47N5J6k07
7274c39M48M8j77K8k32M53j32j2k05%J46J09J8k3l13J74J09k92K28K98m68q6J01
7297a19K94q9l62L24l1j89Q9M8j05j21L72r4l06O64n02PJ33j60J63K3L51l94l39
7320c43M43R1m01J13M2K39k99n6K20P0k32K06k09P8L03P6l46m9l3J67MQ6K42o02
$$ y = [197, -8, -173, 11, -82, -221, -18, -164, -66, 242, 20, -39, 101, -93, -207, -205, 72, 141, 137, -114, 177, -235, -263, 84, 82, 5, 270, 184, 34, -82, -132, -146, -134, -189, 209, 39, 64, -9, 82, -205, -262, -56, -163, -218, 60, 161, -212, 29, 109, 110, -72, -13, 162, 57, -74, 204, 200, 50, 138, 59, 174, -76, 68, 79, -39, 372, -76, 75, -106, -273, 155, -142, 357, -45, -127, -180, 270, -99, -208, -78, 58, -335, -189, 11, 95, -253, -148, 367, 224, 278, 44, -181, -8, 185, 122, -4, -31, 144, -58, -205, 5, -52, -172, -13, 183, 68, 31, 93, -51, -161, 5, 20, 44, -203, -148, -132, -339, 109, 157, -20, 8, -224, 229, 97, 85, -120, -120, 26, 135, 153, 130, -183, -9, 100, -192, 36, 334, -134, -220, -119, 175, 86, -276, 48, 17, -172, -83, -35, -140, -261, 111, 17, -289, 375, -127, -120, 13, -147, 16, 39, 390, -4, -343, 100, 191, -210, -97, -55, 184, -115, -171, 49, 119, -113, 93, -116, -38, 265, 341, -5, -54, -87, 80, 84, 170, 412, -190]
7344a90L0N8K43j33r2J17K96k21k33M09n20K51J10n1r4j71K10j88J23P3k2J67
7366A72l61K71N9j24N2r2oj2K71j71j10k9j6J34K5mk65J12J02O4L2j07L19m34
7390a18P9Q2l54J36J67j80J68k9K22j53j65r6L09N1o2K05m02K0L12l45J17J55
7412A19L4j61jK4J79k28l8J9J28k42J86j5o5p7K76j12o5j46L64l34J76J55l30
7435a54L08k8j15p4j50K56l20L01Q9LJ9j01J16Nm58M01l5l27L22n2k06R3q8J02
7459i3M5K34N2l99J05j96K04O0q1L6K7J5k03K76m6r4L14j67O2j08J02J1%J02k97
7484c9J20J47k23O6l79M26k49q9k4M29J07m22M0j12J31K0J61P6j50k9j9J32k85
7507a65L24q3k75L47j66k8J15J9K8l41K44j08N0L29k23k04r0K23Q2k79J1N6J83
$$ y = [-190, -160, -102, 141, 8, -84, 33, 329, 108, -125, 284, -236, 15, 125, 74, -20, -191, 19, -169, -46, 27, 5, 172, -189, 82, 141, 17, 69, -23, -29, -41, 230, 59, -51, -80, -96, 38, 63, 59, -206, -94, 8, 72, 104, -3, 316, -118, -39, 43, -311, -175, -8, -188, -20, -49, 173, 20, -145, -241, 68, 119, 57, 262, -140, -120, 192, -153, -36, 119, 153, -8, -9, 15, 194, -34, -72, -53, 75, -167, 19, 4, -61, -138, 138, 26, -39, -185, 179, -155, 21, 176, -154, 154, 126, 11, -63, -213, 43, -277, 24, 113, 116, 135, 34, 150, 155, -303, 98, 63, -264, 58, 6, -200, -107, -195, -93, -48, 186, 238, -161, -56, -252, -48, 12, -69, -33, -6, 9, -194, 82, 36, -58, 256, 89, 151, 43, 145, 156, 156, 258, -39, 81, 228, 5, 71, -308, 118, -131, -220, -244, 185, 292, -130, -90, -202, -71, -51, 110, 186, 36, 7, -12, 120, -165, 159, 76, -199, 148, -18, -46, 69, 88, 116, -225, 19, -89, -39, 290, 67, -137, -227, -4, 78, -201, -190, -134, 49]
7530D9k36Q9N4k01K78rk3R9J80j93k74K55K37j17l36M13k79q0J23Or1p7K75o1
7554H1O2j02Ol39O8L90j2m12J54N2k36K1L37r8l9j43K98j9k74ML93l14L05k56
7578g3j03O2L50l10o2K91r7j39J85j63N4J93l08J99l32K53o0J86n7n19K79M00
7600B29l52R5j22J45K9K03p6j19n1L03j77j7J88m73k62N62J33q9j90M5J43l30
7622a83J21K76j22j98k5N15n03M1j2l8Q6M72k06k88J16J08j39m7m9J32k20R6K45
7645A78l0L03n36J08j55k6J91qq7J4j44J97k64L81l72L57k32j18J86J3K0k8j0
7668f2J23N4m4j00OJ96k94K25j16L1MM8j69J09j12p4K19j99J37R6m0K8j36Q2j51
7693a39L13l30j05K44P1m5k06J22J57j84j90N23j65p3K35l18p2J16K24l09K95
$$ y = [49, -187, -98, -44, -245, 33, 24, 1, 100, 280, 87, -187, 68, 305, 188, -148, 265, -14, -94, 29, 35, -56, -133, 142, 81, 143, 41, 47, -292, -224, 166, 154, -258, -104, -52, -288, -267, 70, -28, -67, -210, 88, 69, -205, -201, 192, -122, 183, -73, -176, -114, 236, -74, -136, 155, 58, -81, 104, -59, -5, 188, -120, 79, -253, 0, -60, 126, 69, -450, -171, 229, -123, -28, -150, -5, 24, 227, 151, 32, -19, 284, 107, 90, 278, -195, -457, 105, 238, 149, -41, 4, 147, -183, -62, 214, 92, -106, -131, 384, -119, -78, -90, -128, -42, 430, 224, -64, 52, 160, 21, -26, -75, 57, -163, -67, 178, 148, 451, -85, 23, -132, -158, 33, 25, -62, -48, -192, 5, -259, 122, -250, 107, -125, -243, -57, -44, -24, -52, -62, 61, 115, 71, -29, -23, 173, -121, 104, -12, 19, 23, 71, -98, 11, -101, -175, 44, -155, -18, 78, 38, 66, -70, 12, -139, 174, -156, -261, -17, 54, 9, -197, -75, 82, -102, -292, 231, 66, -7, 228, -90, -162, -46, 178, -131, 164]
7714A64l06J33k09R9K07n9j35j15K34o4J25K28l51K5K05j91o0L25j28K25l96q9
7736a33j35J47K54jk28K58l04J19QJ74j13K4p6K08j33k29m7L70k38N6N6l2oL0
7760B9p3N0k06K17m2M3j26K35p8q1J26K62l58K14r6j0Q4j45J12j6j3qp0j5j36
7785a01J01m90M64k7N6j7j95K79L3m0j64j37M1J08J22j99K04R0m1j99K50k33K15
7808A20m0J10j48k25K37Qq5J4J86m18L20p7K23j38j96QJ52k14Q1j5j14L45P3l08
7832a01K6L34j91j10N6k5O3j64J69j88J89J2j04j18l0K80j67N2j02j50M28J6m01
7855b26L62k72J18m9J72l18L31K08k98j0M12m33k0p4L70k59j3L21l42O7J05m2
7877A10l70L00N9l33J40J84K0k46j69K83m0k54K43J05j9rJ2j53M6j02L15l95L54
$$ y = [164, -142, -9, -218, -119, 88, 29, -106, -221, 13, -51, 74, 302, -49, -24, 181, -10, -70, 255, 127, 352, -44, -133, -268, -121, 133, 132, -96, 162, -142, -23, -15, 159, 46, 70, -6, 202, 69, -160, -207, 163, -75, -19, 37, 5, -1, 29, -44, 6, -200, 17, -25, 18, -108, 127, 49, -32, 94, 356, -2, 212, 116, 106, 190, 45, 157, 141, 128, 120, 50, 35, -101, 0, -490, -26, -53, 3, -14, -209, 70, 103, 63, -101, -238, -197, -89, 33, -166, 38, 128, 87, -112, 138, -95, 120, 80, 190, 42, -183, 54, 62, -23, -9, 177, -241, 79, 2, 225, 87, -109, -101, 51, -163, -82, -97, -211, 134, 207, -101, -75, 259, 68, -42, 14, -11, 52, -112, 57, -131, 58, 70, -34, -152, -182, 98, -69, -17, -119, -269, 159, 175, -226, 136, -136, -18, -67, 105, -213, 118, 326, 28, 18, 430, -3, -23, -97, 273, 14, 1, 322, -20, 47, 152, 110, -260, 40, 99, -234, -94, 90, 110, -136, -305, -22, -62, -316, -73, 32, 13, 4, 16, -137, -91, -193, 122, -273, 81]
7900H1K34l45j08J85M9n0k04K87l13K24P4O7m17L28O1j77k0L43o0k84N1N5J8j99
7924a20J85j13q8j38K41JJl8K92l62K70j76Orj24K08o2K22J09n8p05N48k70J78
7948bJ26%J20k73P0N3l86M2K27K54m18k3J85P3J0l0j4k3m5J16K35m91K56ok1J18
7974A53R6m92L13j15M4N6j26K01j97j4K62r3l12K18J97j82j57J71J07k19j78L20
7996E3Q5j74J70l4R2p2k0j62L18M0l19K23l87K01N1j90J58o2l38J34N87m24k40
8019c10K46J33pJ2L0n9l54L33p5J67k53L59j1j51l4K26m20K68n9j84J13J45j55
8042d0o5K26K2p4k49J09M3j47j10M31l29J24r3L41j19l04L62L6j29j16J94j82
8064f9J61j44R3J03k8k06J14q1J05j6j97M94k78K9j70L47l43k1K21k40J48J3K
$$ y = [81, 315, -30, -138, 47, 96, 46, -158, 129, -184, 40, 114, 181, -236, 92, 153, -24, -44, 299, 239, -45, 6, 61, 79, -120, 65, -48, -136, -274, -33, -32, -31, -69, 223, -139, 131, -45, -39, -48, -172, 36, -26, 196, 305, 247, -458, 90, -180, -2, 124, 124, 244, -29, 41, 94, -292, -250, -23, 231, -187, -210, -25, 48, 58, 28, 14, -9, -54, 62, 297, -194, 62, 56, 35, 153, 249, -243, 70, -45, -1, 55, -71, 130, -67, -81, 181, 88, -224, -6, 191, 9, -148, 23, 130, -89, -267, 53, 138, -36, 134, 100, 192, 120, 100, -62, 256, 296, -23, 200, -187, 14, 65, -125, 33, -29, -367, -233, 354, -70, -310, -64, 69, 62, 74, 104, 45, -309, 24, -51, 116, -137, 222, 211, 60, 26, 252, -168, 100, 41, -143, -30, 115, -40, -105, 121, 143, 69, -180, -71, -28, -175, -285, 146, -183, -59, -152, 189, 70, -234, 128, 164, 35, -81, 113, -69, 92, -52, 41, 144, 116, -90, 24, -57, 48, 32, -165, 329, 51, 80, -90, 257, -86, -107, 114, -126, 22, 35, 37]
8087C7J44k71O5oKj10L14j65M2j4p1J32J22j26k31PJ22L56k89R6j21J2m46J56
8111b43K71j36Mj23n2K18N5J83k75O6L33j51j7k49J33M1j51K72J0l69QK21j5K6
8135F0j07J33p8K6l0Q6P3m6R6l39Q1m4j70o9M53j66k40K25L15L4o26L52m6o7J48
8160E4j2j68Q9m4K2J32K4r3K05m8Nj31J80m60J56l6l5L92k92K2O2J52P9l07L4
8185a8m2j65J28J23o4L4
$$ y = [37, 181, -90, -25, -31, -29, -139, 175, 10, 52, 38, -33, 99, 221, 95, -136, -129, -7, 349, 60, 156, 35, 47, -399, -243, 28, -108, -104, -227, -279, -61, -6, 177, -98, -32, 301, 150, 133, -116, 17, 58, -93, 179, 189, -180, -172, 49, 34, 60, -47, 86, 8, 34, 4, 90, 163, 117, 213, -126, -45, -89, -259, -328, 125, -41, -281, -56, 259, 293, -333, 19, -27, -94, 54, 42, -126, -37, -81, -59, 73, 97, 4, 209, 161, 166, 35, 215, -245, -89, -125, -160, 232, -60, -38, 24, 176, 255, -52, -18, -60, -225, -97, 26, -38, -4]
8191d
$$ Imaginary data points
##PAGE= N=2
##DATA TABLE= (X++(I..I)), XYDATA
0@%%%%%%%%%%%%%%%%Qj6J6j6J6j6K4l2L2m0M8n4O2p2Q1q9J04j19J34j50J67j85
38i7K07k31K57k87L18l50L87m27M70n20N74o32O96p66Q44r32J031j142J268j413
58g45J582j785K028k328K708l206L892m894O507r482J6656o2618n7599J76362
72F7078m5194r4606R7317K2994r7410L2003M4997m0867l605L3153j5367j1348
84a0855J4795M746j1407N043R908r949r234J4766L497p861N618m607j8144R964
98c720J2638j2539M843J3122k1935q119K1533j1113j2306K6420m404k3715K2249
111B954N541k7007J7910J7059k6961K516K3149j3572p289J6606m799j4484P276
124a101J3984p322r912J4846K423k6739N391K4129k1338r818L0166q259k5375
$$ y = [0, 0, 0, 0, 0, 0, 0, 0, 0, 0, 0, 0, 0, 0, 0, 0, 0, 8, -8, 8, -8, 8, -8, 16, -16, 16, -24, 24, -30, 32, -40, 41, -48, 56, -63, 71, -79, 88, -97, 110, -121, 136, -151, 167, -183, 204, -223, 247, -273, 301, -331, 365, -401, 443, -489, 542, -600, 668, -745, 837, -948, 1080, -1248, 1460, -1746, 2146, -2748, 3759, -5723, 10933, -51685, -109284, 67078, 21884, -72722, 24595, 47589, -49821, -17818, 27179, -13688, -17293, 15860, 493, -10855, 3940, 8686, -2721, 2322, 12230, 2281, -6953, 7813, 11310, 3449, 9067, 4460, -13684, -3720, 8918, -3621, 1222, 14344, -7591, -15710, 5823, -5290, -17596, 8824, 4420, -19295, 2954, 8495, -18512, -602, 16457, -10504, -7988, 15161, 1589, -5700, 10906, 6107, -8377, -1101, 12883, 5561, -4351, 10495, 12918, -13821, -8430, 15699, -5639, -15457, 14709, 6450, -18925]
137a8925J8337P974j9848O722J2788j2971k692J1546k362n212M227K199j66j526
151I1M73P037j772r791N016O562j0496O73J1981l879q423M297R31n338j267M044
167A39K564o651k265R752m858j0041J3202K565j6199R632J1271j6517J521J4870
181H985j0790o034J3791j095q025O862M333o511m054M505L172n660j276R168l227
196D144j1263P910N574j2252R55J1387q618p024J0343k01p897M325M321m263r37
211c496K748K949j637m166N317K613q527L286J0568p864m995J1327l776r729Q381
226B999L155q287J267M697l583l857K020L919l019n530N627L332r802K016J0832
241E786q640n949J2844j187j0491Q885N452r513M87O987k751l464M048K772l051
$$ y = [-18925, -588, 7386, -12462, -5740, 7048, -5923, -8615, 2931, 569, -4643, -416, 1783, 1617, 91, 564, 7601, 5829, -3962, 1054, 7616, -2880, -2207, 9774, 5895, -2528, 1769, 2700, -2638, -3905, 139, 2703, -3948, -6213, 3539, -1319, -11360, 1842, 4407, -11792, -2160, 9111, -7406, -5885, 8985, -1805, -7839, 5952, 4857, -3168, 3694, 8027, 1516, -2538, 1967, 5139, -521, -1797, 7371, 4144, -7119, 791, 6365, -5887, -4932, 6455, -2163, -9187, 1156, 955, -6942, -2617, 1704, -2559, -3496, -748, 2201, 564, -3602, 1715, 4328, -4199, -913, 9655, 1791, -3204, 8123, 4347, -5382, 2999, 6154, -2133, -866, 3831, 248, -3609, -1589, 2330, -689, -6219, -592, 2740, -7062, -5046, 5786, -2854, -8803, 4041, 2854, -7637, 1248, 6700, -2813, -2326, 4661, 1910, -1554, 2494, 5266, 2215]
256B215l359M235K019p089O19P176o073n993R203p16r509O934M431j0129J097
271d939P707m752k812M768O85l327o06L681K608m412l9P390l988o361Q594K865
287G062j0355L884O980q103k320P615k127n042J768K557k444l240K400L722n352
302b995k876P267j478p571P573M326r921J983Q610o546l618R633q06o236M096
317A441L562l989j633L469J390m542j472O476j724p451N684L976r688L82Q486
332D367o016m632P684p74o587L229L536k404q63K048J714j759k222M194J633n584
348b436L024N621o424j308P691l727n061O123M58o421K471L563l734k203K466
363A03M68k784j360M347M71o489K695N604p090k146R861k166p079P117L014q006
$$ y = [2215, -1144, 3091, 5110, -1979, -1360, 5816, -257, -6250, 2953, 2237, -7272, -338, 4093, -6036, -4939, 2768, -1984, -4796, -28, 657, -2670, -3276, 405, 3013, -1399, -1438, 5952, 1964, -4397, 4197, 7062, -3293, 591, 7571, -532, -2852, 4763, 2636, -2406, -638, 1919, -525, -3765, -1365, 2357, -2995, -5871, 1396, -82, -7653, -80, 4246, -5675, -3692, 4918, -1628, -5246, 4387, 3581, -2655, 1441, 5003, 1014, -619, 2850, 4240, -302, -1774, 4702, 2978, -4473, 1211, 5187, -4501, -4119, 4367, -1649, -6281, 1403, 629, -5958, -2729, 807, -1597, -2460, -412, 1302, -457, -2679, 1515, 3148, -2436, 588, 6209, -215, -1523, 6168, 2441, -2620, 3503, 3961, -2460, 11, 3574, -160, -2363, 103, 571, -2213, -3573, 774, 1245, -5244, -2549, 3055, -4035, -6181, 3680, 1514, -5565, 1552, 4566, -3440]
379c440J913O597l977k809M110J042k832n07L094L05n520J661N147n333l271P020
395C200k023p114N416L332p013J296N545l945l069L421J433k339n02K940J647
410B225m222N23O115l339m517P324P89p897L853N326p095j159O080j975m460K760
426C31K351k955k378J922J725m450l45O110k439n557N838K348p266K715O029n939
442a960r72O663k270l650M093J681l364J0K591J31l356K00M372k770n015M909
458A293K294o970J752N614n776k934N912p95m622K910K404k766q45K112J077k157
474a497m2L767n82m220L441L332n216J52N876l935l481O110m3o116K777K974m204
491i07j210K766K65k603n76L520j418m537L490L939o103n70P004l728m606P337
$$ y = [-3440, -1527, 5070, 1093, -1716, 2394, 3436, 604, 97, 3191, 3496, -2024, -363, 4784, -549, -3820, 3200, 1177, -5937, -521, 2811, -4202, -2906, 2639, -1306, -4375, -954, 479, -1860, -2362, 578, 2225, -1997, -1474, 4641, 1302, -3215, 4109, 4898, -2999, 854, 6180, -915, -2074, 4006, 2031, -2429, 331, 2682, -273, -2651, -729, 996, -3454, -3799, 2311, -128, -5685, 153, 2501, -4765, -2050, 3979, -1960, -2932, 3731, 1461, -2189, 1904, 3585, 221, 231, 2822, 2953, -403, -203, 4169, 1399, -3616, 1293, 3587, -3383, -1631, 3983, -1793, -4727, 1185, 390, -4232, -1322, 1082, -1684, -2529, -417, 660, -1497, -1539, 2228, 1646, -2574, 867, 4199, -1017, -865, 5011, 1076, -2405, 3705, 3662, -2454, 323, 3297, -907, -2117, 649, 914, -1689, -2265, 1255, -163, -4700, -1210, 2729, -3374, -3944, 3060, -668, -5274, 2063]
507B063J258o731L035M308l850j444L555O44k468p24L421n07l875J667L476m562
523g34j963N312j802n122M665J858o189J225M504l269j798L432K41k383O7K944
539I88J63l358J287M634l421k737O113l03n933M145L590o379J65M856k412l298
555a900K902P67k812p94K390o8l095J80L638k938k579M956L1m852L390L493n411
572b702K59N576k685k265L885R00l265P17K529r15k100O39K976k837k778L889
588A823L58n171K114L644m813j428M973j521m436L211K031l153J7K377O48k323
604a649N15K885r85k747L521J957m792J329M434m320j995N617j379m188K885J630
620B718l600n78K730p94k643M89K595j479l072L157J824m889R31N538l725k811
$$ y = [2063, 3321, -3410, -375, 3933, 83, -1361, 2194, 2838, 370, -354, 3067, 2560, -1315, 352, 3828, -734, -2697, 2615, 813, -4309, 356, 2214, -3975, -2750, 1754, -1515, -3313, 119, 360, -2023, -1956, 988, 1151, -2207, -920, 3714, 293, -2444, 3669, 3366, -2567, 1578, 5168, -1211, -1046, 3810, 1398, -1900, 1002, 1769, -1043, -1837, 553, 485, -2610, -2430, 1208, -1730, -4309, 647, 678, -4174, -784, 2709, -2702, -2443, 3133, 448, -1817, 2068, 2968, -297, 420, 2949, 2034, -66, 573, 3549, 712, -2066, 1823, 2181, -2990, -876, 2768, -2045, -3473, 1500, -21, -4457, -1246, 785, -2368, -2351, 26, 674, -1649, -1134, 1751, 766, -1981, 1540, 3497, -1295, 34, 4468, 148, -1847, 3770, 2391, -1797, 1088, 2718, -882, -1460, 1270, 476, -2167, -1678, 917, -562, -3634, -477, 1347, -3542, -2611, 2927, -798, -3609]
636c609N280M87n104L207K969k841j191L323m44k220K75K180l78l115J541K645
652C005l920p59M257k490l845M315P42m653J765K945k924j067K666K2j836J82
668a595K319j44k416K077K377l462m23M619j547l909M068J652m919J317L532l244
684C02k003K997J05k758L92J505n78k333J213K207k654j438L977n95m196L855
700bK334m804R11M559k958j916L916L2k786J005K068p19k335J483J739k522j639
717a634L994o92m397K810K528m983l75M303k069k876L085J141k721o4K389l65
733G4j778Q10K567j576j564K804P61l496J463L520l747j039M237j499l347L020
749A210J306l626M69K034j017k009Q47J851j936j972K687Q64l762J456L713l040
$$ y = [-3609, 1671, 2158, -2946, 261, 3230, 389, -802, 2521, 2077, -143, 132, 2312, 1934, -1181, 360, 3005, -915, -1674, 2583, 93, -3752, 563, 1305, -3348, -1583, 1362, -1562, -2629, 37, 59, -1777, -1595, 724, 580, -1836, 241, 2618, -844, -1267, 3352, 1805, -2104, 1964, 3616, -1303, 14, 3546, 302, -1701, 1296, 1401, -1357, -965, 540, -38, -2371, -1158, 1049, -1605, -3043, 934, 339, -3857, -2, 2332, -2472, -1561, 2998, 40, -1876, 2040, 2072, -714, 291, 2359, 1640, -695, 788, 2527, 5, -1634, 2360, 1668, -2729, 81, 2609, -2374, -2749, 1554, -515, -3391, -306, 835, -1886, -1950, 439, 74, -1704, -894, 1673, 97, -1467, 1337, 2098, -1398, 65, 3585, -162, -1201, 3036, 1537, -1810, 1210, 2516, -1110, -641, 1393, 376, -1633, -786, 1065, -871, -2843, -156, 708, -3054, -1598, 2115, -925]
765i25k111M534o60l183K619K016k750r8K352l36j765N51K080j122j925J855J386
782B518l409L5K945k222k392L478P1l685J947J958l042l23K653r42j646J279J551
799G74j038j095J747J376k757K50L324j900k351L720M27l850J650K689l051j058
815a143K880o43k139O93Q16o06j706J152J359k458l03L061j514k398L202J035
831A288l520J038L467k614j075K961n3k200R75J847r51j638J505J501k663r72
847a104L518j220l031K368J316l931M8L812k278k320K967J53k435R81J883j097
863c70j347J340J565j689r02K610K01k764K289K143l224l26L188j380k320K456
879A470m2k465N33K311j578j482J130P85j585j115K368l1k879J665K262k948m16
$$ y = [-925, -3036, 1498, 838, -2345, 274, 2290, -460, -558, 1794, 1458, -307, 244, 2324, 1202, -723, 1132, 2518, -891, -856, 2089, -133, -2525, 953, 1024, -2661, -714, 1244, -1798, -2121, 532, -410, -2056, -777, 774, -264, -1359, 388, 1764, -993, -743, 2581, 681, -1670, 2050, 2477, -1373, 277, 2966, -85, -1143, 1737, 1094, -1045, -352, 464, -142, -1848, -696, 663, -1795, -2098, 963, -551, -2949, 253, 1288, -2232, -1194, 2273, -341, -1416, 1545, 1492, -708, 267, 2114, 1163, -475, 1030, 2531, -132, -1104, 2414, 1194, -1837, 531, 1847, -2084, -2036, 1776, -502, -2822, 145, 298, -2137, -1156, 727, -370, -1717, -377, 1188, -501, -1403, 1207, 1408, -1356, 933, 3076, -148, -474, 2714, 1334, -986, 1470, 1428, -1037, -504, 1807, 229, -1253, -123, 662, -923, -2038, 330, 299, -2580, -915, 1347, -1601, -2017]
896b017L301q28k464K573Q78k616O03K312p25j549J246J089j179q32J654L3k323
913h44P05J951k161j284K893o86k896J947J546l211M58K357j356j505J161J205
929B80r30n80J955L99j794M40K342j681j373K798j77l041K028J883k583p67K726
946A925j123j907J083P75j369r80J451M19k129N10K443j653j716K679L75l349
962b566J810K477k472n30L179q06k061J506J514j281j139J655K69j731k72K185
978A737r21k536K388J007l386L69K901k309j445K554k52k166J059J652j126j111
994a585J597O73j507o6J791k8k066J749J420k647N80K367j562j562K535j71k488
1011i70R60R32j114r53J237M28j508l90J430j08j927J187J772k588j37L050j494
$$ y = [-2017, 1284, 456, -2008, 565, 1443, -1173, -570, 1742, 1017, -532, 714, 1803, 624, -208, 1446, 1479, -844, -139, 1812, -349, -1633, 1260, 574, -2322, -375, 1171, -2040, -1582, 775, -581, -2086, -925, 280, -650, -1230, 725, 1124, -670, -230, 2112, 431, -942, 1856, 1679, -1362, 666, 2549, -34, -801, 1925, 802, -1105, -22, 753, -616, -1596, -145, 274, -1855, -1345, 1098, -555, -2271, 408, 783, -2566, -756, 1721, -751, -1281, 1898, 1092, -969, 537, 2051, 770, -369, 1286, 1555, -176, -448, 1737, 816, -1720, 668, 1675, -1711, -1342, 1559, -750, -2195, 359, 107, -2059, -1000, 652, -474, -1585, 12, 685, -822, -888, 903, 875, -1191, 558, 1978, -669, -89, 2278, 716, -846, 1689, 1518, -970, -10, 922, -192, -1145, 92, 520, -988, -1378, 52, -56, -1983, -796, 976, -1612, -1749, 1301, -193]
1028a93j564K386Q07k296P67J566j068p16J000J020j299o97J699N0k182J046J552
1045A878k655o29K605j190j922K290K62k497P90J671j272r14J496N38j458KJ549
1062E44J39j855J048K061k059p41K586m31k428K151J331k511m01K283j172j507
1078i62J072P41j338n18J328O7j893L35J835j533j102K955m62k505J564J626k284
1095a074K85J961o43j193J319J091j591o9J002K49j847P87J215j066j707J927
1111F46L65k453Q23J818k143o77K165m95j725R18R03j033k55J037N69j269L76
1128d30J514p55j361J860O99k190P49K096k054l74J874n88j772J190Q82j875k50
1145g85R58K09j305j0J546r45j371J422P82k395N83K232j105j078K051n2j826
$$ y = [-193, -1757, 629, 1436, -860, -93, 1473, 405, -311, 689, 1709, 410, -287, 1412, 1462, -720, 326, 1878, -777, -1406, 1199, 9, -1913, 377, 639, -1858, -1068, 603, -669, -1583, -87, 451, -1007, -1005, 544, 683, -1172, -124, 1937, -122, -863, 1723, 1292, -1136, 1015, 2346, -165, -566, 1717, 545, -962, 110, 851, -487, -1005, 323, 390, -1503, -1168, 667, -866, -1968, 987, 525, -1980, -416, 1210, -1074, -789, 1172, 529, -664, 655, 1746, 155, 86, 1088, 1337, -510, 277, 1492, 426, -1281, 646, 1011, -1442, -619, 1199, -944, -1621, 544, 49, -1676, -758, 145, -888, -1143, -106, 463, -806, -430, 1084, 329, -1032, 828, 1527, -663, 86, 2182, 128, -246, 1628, 1040, -732, 458, 1340, -535, -785, 173, 382, -923, -933, 613, -332, -1703, -281, 501, -1894, -1311, 921, -184, -1262, 789, 737, -1089]
1162a089J045J418r58p21J477O8j300N2J434n13j405J075R08k147j86K210j672
1179c04j494K351q4k224R00J712j718n93J423K97j062q2J369j72j213J058J334
1196A498j728j33K121p53j853J932L37j966L37J548j103r94J194M87j443j20J001
1213C62k02j627Q48J289j538m55J706l23k051J828J061k055M77J761j007r08J532
1230F98L95j259K14J051j64j199N87J069j063j095J548R7k346J239J194k032k70
1247a336J915r56j094Q20J030j384j83J439l08o78P80P62r78m00J633J23k064
1264h79J130J409j648n31K118q38j403J052L81j081o54J381l40j123M29J356j353
1281e94m73J150j32j333Q15J500j683n31K084j87j332J130R76j575k29J425l04
$$ y = [-1089, -44, 1374, 416, -305, 1172, 1240, -60, -8, 1426, 913, -492, 583, 1491, -656, -842, 1368, -304, -1798, 553, 469, -1755, -855, 857, -861, -1454, -31, 266, -796, -878, 491, 319, -894, 164, 1498, -230, -363, 1758, 1005, -848, 1084, 1421, -545, -208, 1340, 237, -757, 437, 924, -519, -639, 362, 160, -1467, -619, 670, -868, -1323, 383, 60, -1991, -163, 898, -1157, -680, 1081, 74, -834, 698, 1093, -166, 48, 1099, 935, -264, 323, 1392, 329, -766, 782, 879, -1467, -228, 966, -1066, -1336, 579, -377, -1471, -651, 379, -1005, -1188, 251, -57, -735, 45, 807, -171, -571, 1062, 1185, -879, 251, 1660, 12, -519, 1599, 761, -642, 410, 791, -290, -944, 437, 97, -1026, -597, 759, -594, -1067, 83, -49, -1382, -567, 933, -750, -1281, 803, 616, -716, 414, 1390, -185, -414, 1011, 707]
1298G07r49N03J022p44q99Q68N16j518J49J270j108j035J650o0j763O66J522j707
1316i10j61J426k00j279P62J108q54n32J071P88j596MJ657o48j356J689K74j839
1334e96P51J269j384n70J152k0r31n5P46k17j069N21O44j581K61J550p96r10J431
1353A96N22j834P98J202p74q43J512R6j256N61R79o87p07Q47O11j313k57J134
1371G87n04j181R72P40j777K45J490j331r40J374M82j520O23Q60k80o96N23N23
1389C90p16k73J487o5j368Q79Q51j278r0J598p95j249J306K21j072m1Q68o73q79
1408h99O40O03o67o91J220j67j389P18J353j736R0J270j79j003R72J014j391J31
1426a11J151l67r88Q24L40o12q65J372%q73n6J199j161q42J423n10j471J052Q80
$$ y = [707, -242, 261, 1283, 539, -360, 508, 1024, -494, -345, 925, -183, -1218, 432, 372, -1391, -725, 797, -910, -1071, 355, 155, -1124, -362, 746, -108, -640, 431, 1219, -377, -373, 1284, 636, -720, 969, 1243, -596, 155, 1424, 40, -530, 622, 602, -329, -384, 362, 145, -924, -403, 241, -1340, -1079, 471, -325, -1235, 196, 718, -1116, -318, 884, 110, -733, 779, 875, -381, 180, 1159, 472, -235, 612, 1223, -90, -347, 787, 283, -898, 74, 814, -963, -718, 772, -559, -1499, -125, 357, -1163, -540, 320, 40, -656, -133, 390, -326, -599, 888, 823, -545, 334, 1185, -93, -183, 1415, 620, -629, 677, 898, -174, -215, 653, -20, -899, -259, 344, -323, -1014, 206, 39, -1350, -632, 721, -1015, -925, 345, 166, -837, 135, 1149, -242, -111, 1040, 673, -315, 509, 849, 237, -628, 744, 744, -129, -185, 1014, -147, -989, 434, -76, -1547, -495, 385]
1445C85j037l27J233j96p03N22M85n91n92J247K11j176N42J239q84p74J218J1
1463H13j594J017R41j186l38J001l12r50N60N04q36n75J137q6j128j68J519o01
1481b82p41J358J17j302M89J307j501k30J198L14j246Q48N57p00n00R63M93j348
1499b06j39J381q42j103J322j5j195J17J416j086p25J161L2j254P11Q05o45n73
1517h38P90M51o61k04J278n02r29R71J000j703K84J395j057o10J264m7j160M69
1535A91M75o15p73N61O36j021k12R56k02j132O93O44j097K13J295n87q78R34P26
1554H07j279L28Q47l46n76P00K03o70k48R51Pj008L86Q62j318k43J268p01j149
1573a179J095M14j167L10O86n23l94P19L60p97J85P77m74o32Q00Q21r65l19J305
$$ y = [385, -652, -979, 254, 58, -645, -123, 362, -229, -821, 426, 637, -539, 3, 1242, 358, -416, 802, 813, -781, 236, 1177, -9, -347, 654, 342, -608, -48, 456, -380, -955, 182, 96, -1032, -1200, 319, -282, -1023, 335, 452, -850, -361, 946, -555, -785, 413, 727, -519, 329, 886, 186, -314, 649, 1142, -206, -345, 1036, 194, -909, 413, 398, -797, -680, 736, -350, -1075, 86, 118, -1136, -425, 380, -265, -838, -48, 403, -258, -462, 816, 314, -615, 356, 1356, -347, -63, 1332, 275, -335, 929, 882, -278, 191, 666, 51, -722, -161, 475, -546, -758, 198, -4, -1136, -443, 201, -896, -683, 612, 25, -853, 81, 807, -472, -144, 703, 357, -219, 481, 684, 14, -234, 717, 724, -284, 102, 964, -354, -597, 671, -30, -1179, -84, 330, -837, -527, 159, -364, -758, -39, 321, -476, -291, 486, 12, -620, 180, 1001, 36, -283, 1022]
1592A022l43r69P06O30j144k27R78n47n23Q11P5q90k63O53J17r92L23P05m29o95
1612a002J111J8j089Q78Q50j121o0J197l55r91P90P58q11l22O41L75j197K87J072
1631A029n61j173J357k67j353O81Q94r77o22J309k12j180P25M57o61k68Q65J24
1649A67o77K24P35n40l13J018N41j360L52J145j038n68J135k80r95N10Q02q45
1667A3m38N62J19j014L29N77m82p84J053M40j038J47J021r57m59J164P1p68K76
1686a68J021m63l34L69L42q24Q2O78l05p09P08J95j012Q1J185r04o58P99R5r10
1706g32K04P85q70k01Q14J54o86L83M51j15p02P69O99p52j97R10m82q80R53M88
1726I93j552J98J424q89m18M99O4p32P2N73k52o98K45M46q29K49J030l97n69N31
$$ y = [1022, 679, -290, 416, 1046, -98, -325, 653, 106, -417, 394, 469, -421, -684, -31, 86, -906, -583, 122, -307, -1002, 109, 127, -962, -84, 766, -355, -415, 782, 427, -564, 226, 984, 173, -149, 492, 867, -330, -43, 1029, 468, -705, 652, 385, -968, -287, 607, -370, -992, 317, 105, -1075, -350, 107, -554, -822, 43, 167, -510, -286, 449, -91, -404, 614, 1155, -205, 147, 1292, 254, -314, 821, 541, -454, 56, 858, 13, -425, 137, 256, -758, -429, 148, -334, -1118, -65, 375, -663, -516, 505, -452, -911, 253, 324, -444, -168, 853, 390, 56, 425, 767, -57, 25, 703, 398, -311, 397, 592, -420, -339, 846, -58, -716, 83, 178, -732, -528, 257, -613, -814, 0, 154, -532, -149, 302, 187, -515, 254, 953, 201, 4, 914, 432, -448, 505, 993, -559, -361, 1063, 174, -244, 255, 319, -413, -341, 232, -20, -718, -473, -27, -856, -607, 423, 26, -543, -12]
1746a2M67j094K52J100k23r48R45K91o66j73P64l20p17N13N98p02l22R47k67j400
1766i67O78O52j111N4Q72m62p65M40R88r09PO23j8n15L83K92l04j90R08k78o98
1787c20O81O69j049J26O53l75p83M81O56j010j35P71l24o58J11Q01q03j97M53
1806b52L10q53K43J162j211k04J068Q9q18O68M24n62k57O00j11j61j04M17J9p28
1826b61P79k7q65R7O77o45m58J093O5j153M48N02q02j7L79K66p08L07N08j12n07
1847d34O59M57p47k17J213o42o96J138J42r41pR45q56j62P04k43n29k21O80k90
1867d7r64O99L52n84j01R17n95o58J203J56r67L43O66k51o93R13K20o69P0O86
1887F96l87o34O88L09r77j05J101m60o06L67O14j270k4J306r99m20N74L47o91
$$ y = [-12, 455, -639, -387, 713, 490, -458, 487, 778, 112, -61, 703, 383, -334, 179, 777, 75, -247, 700, 433, -967, -289, 363, -748, -694, 178, -284, -1049, -609, 379, -530, -523, 100, 82, -433, -50, 242, -62, -252, 656, 378, -320, 361, 1030, -19, 107, 760, 385, -398, 83, 739, -271, -406, 365, 41, -617, -506, 295, -508, -705, -252, 58, -795, -552, 610, -601, -805, 263, 352, -466, 202, 626, 64, -193, 407, 296, 135, 31, 448, 467, -261, 518, 491, -374, -277, 400, -245, -703, 390, 455, -698, -250, 252, -550, -567, -188, 78, -630, -323, 185, 73, -434, 225, 682, -65, -282, 931, 289, -407, 731, 873, -68, -75, 870, 14, -148, 556, 313, -216, -437, 243, -47, -1011, -312, 40, -544, -645, 272, -323, -981, 222, 378, -589, -246, 420, 169, -524, 389, 609, -60, 10, 696, 309, -325, 363, 672, -305, -410, 691, 231, -375, -8, 606, -664, -688, 618, -381, -801, -227, 120, -571]
1906e71K14N09l39j69M61N49p08k09O58j10m62M62N41j022M5R26n75m87P58l3
1926D38o66J06N72l83n60K34N42p62j42P50p8r50M49Q68r58k04R58J12r83Q80
1946B23K69q05L94M53m1l96M7P98o10m23Q36k63q02K42Q19r06m58P21j25q26O80
1967a73M97p26k97P29k94k16M91K77j12o25N87M10q74L63N91m17k90P54l5q56
1987b16K75N12l26m04M95R2r83N80L02o74m05P66J80r07K74O09m83l63N66L54
2007B44o24J37O72o09k45N22P0k58O5O80m66MJ28K46n55k16O51j33p43L93M92
2028D55j149M35O50n99o87Q88j97n42L97N59k3o65N09M11p18j1R06k77o47O60
2048C55K38o06J12M36p4o49O05J50p55l35P46n9o94K55M67l45l39R51n82n06M38
$$ y = [-571, -357, 152, -187, -356, 105, 654, -54, -263, 395, 285, -177, 285, 826, -196, -151, 775, 200, -287, 471, 438, -228, -122, 450, 67, -493, -259, 283, -479, -621, 129, 51, -899, -450, 418, -540, -744, 214, 326, -657, 223, 492, -313, 81, 534, 493, 97, 144, 942, 332, -91, 745, 482, -320, -78, 741, -165, -623, 98, -27, -853, -173, 324, -402, -699, 30, -264, -480, 11, 288, 176, -449, 138, 548, -326, 37, 628, 211, -79, 675, 640, -216, 59, 571, 245, -159, 336, 428, -555, 25, 327, -347, -752, 14, 194, -713, -439, 170, -313, -676, -110, 244, -380, -243, 429, -180, -425, 97, 167, -91, -26, 654, 188, 192, 320, 566, 11, -205, 446, 313, -430, -37, 455, -694, -259, 391, -208, -895, -7, -204, -746, -349, 210, 187, -478, 31, 442, -276, -287, 619, 342, -305, 355, 593, -13, 99, 535, 461, -188, 417, 567, -188, -523, 223, 164, -530, -275, 192, -153, -492, 459, -123, -629, -191]
2069a91M85n72m22O86k3o19Q09K54k93j85N61k19l97L12L36l61k37O31j92n44
2089a81K48O56p71l16Q63n20n59M77L41p55J49L88o4o92M73N76n90m2N44k8p19
2110e22O67L07n27j56Q37l32o22N21L95p17j0M27k71m85L43N65m72p05Q53j71
2130g5n11M77J78j05q28J015J36r00M40O11n57L0L51j0n96L45M97l61k52N78J28
2151E91o79J63Q19n38q87O72J32q16R9P60m01m92N92J76q50K95O82n51m26M96
2171a63L26o03K56M40l22j75N25L89o83K02L28l04m68P57q5p48J15M72o68J53
2191b56L54j12l46l0N58l91m00L42N53q78L81M88l11l28O43k8l45Q0M38k09l38
2212a35M03J33j90m41P21j12n85M39J73n60k09O21m29o12P79L64q19p2P50k11
$$ y = [-191, 294, -278, -700, -14, -37, -656, 153, 407, 114, -71, 490, 271, -126, 186, 522, 161, -76, 555, 363, -181, 67, 723, -48, -364, 499, -21, -580, -103, 238, -517, -368, 20, -44, -736, -263, 313, -277, -319, 225, 197, -522, 145, 452, -75, -231, 606, 274, -348, 173, 568, -149, -159, 268, -3, -488, -145, 420, -52, -757, 96, -75, -586, -109, 69, -36, -864, 151, 287, -613, -173, 438, -119, -89, 262, 252, -344, 1, 498, 137, -115, 463, 591, -88, 75, 894, 356, -531, 141, 273, -543, -444, 316, -85, -577, 15, 191, -659, -364, 318, -233, -659, -163, 163, -440, -184, 256, -66, -241, 284, 673, -10, 192, 520, 216, -252, 505, 420, -328, -213, 259, -409, -256, 98, -14, -360, -390, 168, -223, -623, -281, 272, -606, -225, 263, -48, -376, 267, 239, -106, -26, 412, 203, -135, 268, 401, 211, -230, 491, 379, -206, 233, 406, -154, -363, 258, -171, -783, -4, 360, -459, -531, 219, 8]
2232Hn90O15Pj69n9N67o15o2K9P45l72k31Q54k45o21L18M64p20j97Q20n53l33
2254c40L72J45o43N9M37P6o99N47K69n34j29O46l02m57O21M24o81QM55j70m08
2275c04K60P22q11k51Q21k55l38M6P16n70j73P02l64m62k77Q42p82k32Q37m0n51
2296d64P6N36n43p5J39N33j55q6N44l63m35N36J94n40mQ09o42k25Q09k07p48K80
2318c1K35m70j95O32J6m80j94P73l71o09Q30k39k60K49M60m24l13N84q7n79M18
2339e5N92k83l82M67J29m04ooJ65n22N24J28n30Q2K51j98k24L21L02r27J22R65
2361E11n79k68M49p7l01J46M20j48l13Q6K96m98o0Q99o9q06M52L03o11K72K99
2382D03k63j24N33j77o44J08K50J10o55K34K78j23l99M15q3l43J64O26n09M9N96
$$ y = [8, -582, 33, 40, -129, -188, 379, -236, -298, -269, 476, 104, -127, 727, 482, -139, 179, 643, -77, -274, 546, -7, -340, 32, 177, -466, -407, 30, 106, -593, -46, 223, -311, -440, 206, -96, -553, 68, 492, -189, -181, 274, 104, -304, -44, 678, -133, -384, 437, 182, -156, -110, 606, 36, -137, 565, 201, -261, -538, 304, -478, -710, 127, 87, -464, -388, 148, -395, -470, -331, 202, 47, -39, 505, 142, -293, 243, 437, -103, -107, 702, 60, -165, 644, 437, -311, -31, 204, -266, -461, 171, 187, -293, -487, 286, -85, -694, 136, -103, -363, -114, 346, -78, -391, 193, 106, -473, -55, 537, 254, -128, 339, 468, 64, 58, 52, 217, -305, 219, 347, -183, -101, 150, -48, -272, 49, 351, -576, -454, 511, -68, -336, 113, 36, -265, -119, 301, 153, -160, -74, 222, -276, -336, 563, 494, -312, 140, 443, -168, 104, 403, 140, 16, 549, 372, -272, -164, 86, 196, -459, -225, 53, -70, -469, -54, -137, -480, -316, 310, -199, -150, 446]
2403D46l46l11K08N60n93lN78m13l63L14N86o70n22R79k62n01L30N1m53J76M05
2424A96k08n31L95M63m49l48L45p5rj11N75j14n17Q72l29l45L67K83l93l05Q28
2445E90m94m24K46O20p02k7L09J87n84k1N25k08o72O05L5m04j39P56m14j28O70
2466C26Pq49M20N51k41n25P11n0l46J51K19m22j10L92Q5m51RP03n09m18O51j98
2488A06p99M39L21k77k67L88K17m97K17M36m24k29N79q9k64J14M50k25l34N71
2508D33J06o29L52K68l67n78N00K35o01K60K62m04O0Q3J92m53j29M06l13j03M72
2529E2Rk21M7L35l23M5L43P8m78J33M55k68j27M9M73r51J6N84k92j07Q9M18o12
2552b53l14O19j65j23K58J94m04j82L61k25J78j75N27n47j22M98J47k84J04M55
$$ y = [446, 100, -211, -3, 557, -36, -39, 539, 126, -237, 77, 663, -7, -529, 450, 188, -313, 17, 68, -385, -209, 196, -12, -543, -148, 315, -134, -482, -137, -212, -221, -332, 243, 129, -388, 484, 155, -190, 177, 460, 67, -238, 590, 96, -328, -82, 538, -164, -191, 118, 305, -279, -300, 225, 17, -655, -50, -15, -419, -558, 198, -216, -344, 326, 333, -516, -96, 455, 214, -311, 400, 350, 4, 155, 374, -48, -158, 234, 319, -132, -123, 580, 71, -347, 304, 106, -693, -254, 67, -210, -477, -89, 128, -369, -152, 284, -140, -369, 210, 121, -143, -29, 421, 196, -138, 433, 539, -90, 262, 530, 163, -415, 85, 320, -281, -21, 241, -163, -103, -20, 172, -281, -410, -4, -317, -420, 52, 61, -160, -113, 222, -101, -56, 287, 365, -113, 20, 475, 207, 80, 129, 602, -349, -333, 251, -41, -148, -59, 359, -253, -567, 52, -113, -236, 22, 216, -188, -370, -9, -234, -56, -231, 296, -251, -373, 125, 272, -12, 92, 547]
2572E47o10R0K21k44k59M14L67o74j83O88n44j78M25J21l87l07L50M13p84M28
2592a06M21n75r5M66j96l30M48K14k87r7K99L31p61K54O25m24n09P77k72k62J2
2613f7N56n36j01K54J3n59M44Q6m69j37N71oj25m0L20l63K41O9j0n22N36M85n51
2636H9k87L42K12n50M65P3n34j37M39r4k81K42L76n37j3J89K10n82M4R77o78o86
2658g21P29J12l33J53N41l44l42M68N1k90L5K15j19l45M89P1l35p9M22k83n00
2679d05M58j23j13j51P19n93m14Q99m26p9k86O98k12q3oK35m20K56N66l84j83
2700d7L10L36o91J33O23k90o41M88K77m28J5k76R8j31J52L91o21j22L99K0p54
2721g59Q76k9o4k20J90K0l13K30K14j58k21O75k75j40K32J02j80j97L13k2m26
$$ y = [547, -63, 27, 248, 4, -255, 159, 526, -148, -331, 357, -187, -365, 60, 181, -206, -513, -163, 250, -534, -106, 315, -260, -355, 111, -85, -415, 33, 247, -40, -137, 162, 493, -268, -14, 611, 187, -322, 455, 183, -79, -67, 489, -47, -148, 106, 119, -440, 4, 90, -379, -516, 55, 49, -76, -116, 204, -159, 82, 151, 141, -381, 155, 640, 89, -198, 144, 356, -194, 271, 344, -190, -327, 112, 18, -263, -21, 355, -182, -195, -6, 204, -378, -334, 643, -35, -721, 8, 120, -213, -60, 481, 137, -205, 263, 314, 24, 59, 274, 155, -190, 299, 370, 35, -44, 378, 95, -405, 53, -70, -183, -334, 385, -208, -622, 277, -149, -228, -514, 184, -28, -111, -117, 118, -302, -46, 520, 136, -47, 263, 599, -92, 41, 664, 374, -267, 221, 498, 70, 85, -191, -93, -224, -72, 319, -302, -424, -25, -5, -759, 117, 88, 24, -196, -6, 14, -299, -69, 145, -13, -234, 441, 166, 26, 258, 360, 180, -17, 296, 274, -152]
2742a52K35M78p57j51O41m09m29L55M25k62n28M84Pm82L01J30n3K5J74Q1k42j16
2764b45P55l72j61L50j12m53N10K01n37k27P40j43n94J26M39n27j80O63j86k68
2784b21M9L74n40jM08l0m56M04L47l33j65K15K66m91N13K2m76rM09J18o41K64
2806B6M14k19r9q5J62m43K12K18k50k50J79M71p75K88K81k09k37J68K52l44q2
2827c22O59j53o43N51L69m15p4L37l77l51R91r8p45j04P67n00j07K35P5n6l40
2848c01P17n61m46P03Ql29j71O61k41l05L40J88p20N59M33l97k07K56K02p18L17
2869a2N30l36k95O1M96m34j2K87l40l03L40K21m58L7K08j54l39N07L20m76Q7L16
2891B51k98l06L06M28m16j70O32k27n31N85j8l47m4K14J06k54L29j18l91j0M68
$$ y = [-152, 83, 561, -196, -347, 294, -115, -544, -189, 236, -26, -554, -70, -63, -545, -244, -114, -167, -142, 32, 113, -129, -245, 510, 138, -23, 327, 215, -238, 272, 473, -64, -291, 449, 306, -288, -162, 277, -250, -430, 233, 47, -221, -172, 202, -338, -339, 69, 39, -417, -13, 334, 1, -164, 51, 317, -174, 339, 361, -115, -124, 285, 403, -238, 26, 440, 221, 122, 37, 199, -244, -32, 186, -64, -314, -135, 336, -439, -151, 130, -79, -316, -148, 104, -240, -322, 337, 184, -459, 92, 461, 46, -28, 309, -68, -419, 572, 474, -271, -375, 392, -108, -215, 20, 95, 39, -301, 416, -145, -591, 112, 120, -209, -380, 281, 40, -265, 75, 263, -457, 102, 535, 138, -69, 187, 389, -329, -12, 518, 182, -113, -52, 444, 10, -2, 285, -55, -358, -18, 203, -255, -218, -10, -164, -503, 4, 324, -152, -65, 251, -47, -353, -47, 381, -35, -205, 427, 200, -331, 254, 236, -111, -155, 59, 165, -89, 240, 122, -269, -279, 189]
2912A89l8m80K04J17p7oJ49j06l61L64M12m89l81O32r3q4L25K40o92J31M98n7
2934C97m60J28K01k53n03O36N4m29J11L54m59p4O11l30m22K90O2k8nj6L40n43
2956c38K11N63k94n48O94l1o70N80N8J40m77L12qn79M95m8k6m45N62k58k2p3L29
2979A27j86k77N62O8o87L61L22l90r1K66J04l73J05L99l62Rj26N84o41J72O94
3000F40k83l65K06K24n77K36K1p8j96N29k56o31K69K29pk78L94J37m28K05L45
3021C36n30k08N67K14l88p3P24o03m06N93P9l39P9O18m09l95M20Pl22j77M06k01
3043hk27J19j5k36J76K66n0l37O30k01k86k14N80k56j84L62L03n60R4K53o1P6
3065B24j18K96o50K60J27q9j94J65J17m27M0L66k89j60L40L0m06J59K58l7n43
$$ y = [189, 151, -329, -125, -8, -85, -91, 58, -48, -409, -45, 367, -122, -503, 129, 36, -48, 277, 517, -175, -44, 454, 397, -63, 65, 266, 13, -490, 146, 200, -229, -118, 236, -223, -297, 314, -16, -438, -148, -86, -114, -119, -135, 205, -338, -127, 436, 142, -406, 288, 257, -413, 167, 225, 365, -112, 200, 192, -387, 108, 60, 34, -411, 151, -107, -129, -202, 127, -59, -336, 226, 294, -393, -32, 290, -100, -191, 75, 179, -194, -89, 310, -52, -43, -169, 415, -226, -54, 640, 357, -8, 198, 422, -155, 81, 102, 24, -172, 357, 101, -530, -261, -32, -39, -317, 77, 214, -214, -9, 336, -194, -402, 165, 379, -9, -82, 642, 39, -367, 226, 305, -34, 45, 663, 254, -141, 279, 286, -36, -213, 193, -8, -235, -116, -131, -367, -191, 75, 25, -312, 318, 117, -169, -383, 197, -59, -243, 119, 422, -138, -44, 209, 148, 224, 106, 402, -248, 12, 139, 50, -144, 21, 138, -289, -249, 117, -172, -332, 8, 38, -368, -209, 49, 12, -531]
3086e31M02N12k23l85M60l15J51n5L81m04J9J68J27n19L30K53m57R7J88j69k01
3107a71j13N02j25l73M17Kl42k0K35M1l29J37K00j60J4N26m40l14N96j57j87K05
3129A44K46j87j47O5L1o23L67L11j57k24L75l07l05J04K53R7m25M50O2m32J30
3150a72L17l39L42l6j30k67J83O48m52oJ59K81o07J37K36l84J08K18J31m97K65
3171A35J43l87k21M33K2n15K98J72j85k58J96K67l27R6M65m67j86M60l7j7jK11
3193B97j0k72J0K47l82O0L66k32l23M16M8l59J32J34l79j50M53n0Lj40P3R9n47
3216e06N34J57p1l71N67j04m40M88K2n15J00M89j24l78K60o4j35J70K81m83m9
3237a72J61M0m48K22R5N8l93M01Q9j96j28M76j66l93O03L80o69l47O49j69k14
$$ y = [-531, -129, 383, 160, -225, 235, -80, 71, 16, 397, -7, 12, 180, 307, -212, 118, 371, -86, 11, 199, 30, -171, -284, 218, 93, -280, 137, 139, -203, -223, 12, 53, -276, -139, 61, -99, -85, 441, 1, -313, 283, 126, -61, 144, 390, 203, 56, 121, 152, -471, -104, 207, 50, -174, 201, -106, -411, -307, -54, 43, -382, 68, 130, -302, -172, 145, -194, 148, 112, -18, -285, -102, 546, 94, 88, 247, 528, -79, 58, 294, -90, 18, 236, 367, -130, 135, 278, -109, -330, 103, 125, -390, -92, 80, -105, -363, -167, 100, -227, -131, 334, -133, -319, 141, 104, 87, 86, 297, 287, 15, 25, 272, -110, -50, 316, 84, -239, 177, 225, -134, -2, 132, -247, -397, 56, 6, 9, -131, -58, 41, -506, 28, 185, 114, -257, 310, 206, -234, 254, 276, -239, -139, 350, 226, -152, 108, 44, -91, 79, 360, -123, -172, -11, 29, -419, -197, -102, -44, -437, -36, 53, -143, -271, 205, 39, -354, 249, 629, -40, -387, 262, 93, -121]
3258a21N0L72k18l68M90J5l45K8L18k31j78K82k53j10MN60n28O4L79k41l02L77
3280D4n9Q8p8J27N1m67L61L85m98j27N11q1k25j69L56k97Q2L79j67m08K67K34
3302C09m99j71N18J11n23J4L50j87k44M16N5n08M10M0Q4k18M94j3m28O3J64j5
3324B22j74M00n0o41K04J41j1l25K95L62p34K70Q3q9q5L05j58m47K00K03k28K53
3346dk3rj47j11N32j19l06N23j28n1p0Q7l70N9J81L25l16k05M00J2n73M52K75
3369D14l42m48N02k32k76L03M60l46l62O24k89l58M12J03m73M15r6J65j80K54
3389B50L60n88L1K72k25k11J53K22l29J80J52O4m95Q3K12n00Q6M03l06r3J74M94
3411C89k99l31K97K24n85M60k02M5o6k8K94o91N96K02k89n3N96m92j0j64L41l60
$$ y = [-121, -71, 301, 83, -285, 205, 220, -125, -97, 221, -10, -188, 94, -159, -269, -265, 295, -233, -169, 210, -31, -333, 44, -15, 73, -5, 122, 173, -294, 67, 452, -46, -173, 338, 257, 32, -137, 219, -78, 4, 383, 216, -192, 75, 309, -190, -361, 157, 268, -255, -241, 109, -78, -322, 94, 149, -359, 51, 91, 175, -43, 451, 438, 10, 73, 237, 222, 48, 448, 398, -243, -39, 102, 91, -234, 61, 423, -311, -41, 42, -47, -132, 173, 15, -432, -232, -29, -257, -4, -27, -36, -183, -294, 238, 119, -187, 336, 208, 157, 87, 174, -196, -137, 44, 369, 53, -152, 248, 260, -313, 139, 414, 72, -376, 126, -106, -382, -79, 381, 35, -327, 297, 8, -350, 62, 165, -308, 107, 11, 176, -4, 250, 610, 22, 53, 325, 100, -111, 42, 264, -65, 115, 267, 331, -164, -81, 131, -369, -283, 120, -186, -279, -105, 389, 90, -241, 56, 280, -305, 155, -47, -2, -68, -96, 198, -493, 103, 305, 16, -37, 559, 67, 57, -107, 234, -126]
3433a26k32N59k57l23Q8N67l62m65P64k22n08M12M09l75L1K88j41l10K18K04j79
3454D0j04M48j05m04l7M70j95k18J22M64q40L66L49n90M0K64j90J10k13J34j13
3475b02k4J31K03m96Q2M31kj91L82p0l92K8L23j3k84J83L6j90J05P3l03J6M8K43
3499A17k38p5J74n5k65M34j15l12L58N1m15j8L53R9Rj83K15J17j63O1J54m14J50
3522C9K73k25k72K23K36j59j89lJ86j15RK79l79k64O83k48k93K50k5l54L75K17
3544B44j61k38P11n63j66J74K89n7n21M03N07q99j8Q00n51L8k6R8l49J37K33k60
3566a75m4J59J28J6m29L07o0l94L56M69n74j55M60o2p7q0L76k46J73k6N0m38K76
3589A0M47p51J74L39K13n35K19n0l47L15R9l49J15k22N28m09K8J42J53m37M04
$$ y = [-126, -358, 201, -56, -379, -291, 276, -86, -551, 213, -9, -517, -105, 304, -71, -40, 248, 107, -203, 15, 219, 40, -64, 384, 279, -125, -162, 308, 113, -105, 17, 481, -359, 7, 356, -234, -194, 70, -120, -10, -223, -89, -202, -226, -95, 108, -388, -306, 125, 123, -68, 314, 244, -148, -120, 203, 190, -94, 89, 125, -65, 40, 113, -190, -174, -126, 117, -121, -196, -22, -77, -342, 92, -23, -335, 23, 74, -341, -359, -6, 93, 102, -81, 134, 251, 88, 149, 303, -111, 39, 312, 87, -185, 38, 274, 115, -74, -77, 109, -6, 3, 282, -97, -361, 322, 74, -219, 31, 6, -348, 27, 244, 83, -155, 556, -7, -173, 1, 290, 233, -288, 115, 622, -277, -295, 505, -46, -8, -34, 64, -285, -148, 85, -175, -219, -60, 68, 84, -345, -38, -98, -492, -136, 333, -241, -396, 64, 2, -75, -155, 221, -25, 148, 122, 172, -266, 10, 457, -294, -120, 219, 432, -103, 116, 66, -281, 34, 133, -216, -101, -323, 205, -204, -176, -34, 119, -318, 86]
3610H6J73k24k34L67N1k56n8L74j70j80O92j00p53M28L2j57k24N49j41n17k3N36
3632B51m32j63M04j26m45M84J97m50J77K74p6l25J01N58m61J08M0k9l53L41L34
3653D09k82k33J31O1Q4k00K2L6j68K19n2k56N13l25l68L2K65q0J38K49J90m21
3675c6j74J71K69j81j17M95k92j20k1J01k36O7L53l01l17N20j59k01J50K82k61
3696hk75K07M05m09p6M76j55n17M33J96l50j81N61l62q1K84j87M7R4J21j37j0
3718G6K16Q2m11J66k9P9j44m2K59m83J76J98k45j81M32k47j1j89M79j72m02K94
3740i9J52k0m61N68j36k00L15K66l15J1L02l08j80J43M62o97K3N42m95k5K96L22
3762D66o53j39M53k02l21J47K88k65k2L28k77j55J54M85l76N3P9No2J73R5n6k40
$$ y = [86, 259, 35, -199, 168, 219, -37, -95, 279, 109, -71, 621, 521, -232, 196, 228, 71, -153, 396, 255, -262, -285, 251, -181, -344, 60, -66, -511, -27, 170, -280, -103, 171, 95, -230, -129, 429, -32, 76, 116, 87, -266, 75, 409, 127, -106, 25, 86, 170, -30, -8, 28, -140, 79, 27, -229, 284, -41, -409, -377, -112, -192, -54, 195, 385, -36, -210, -39, 230, 49, -68, 427, 135, 15, -6, 95, -141, -74, 279, -22, -339, 181, 22, -179, -29, 253, -8, -283, -76, 329, -80, -156, 320, 165, -352, 81, 277, -73, -254, 307, -55, -136, 148, -39, 8, 102, 223, 86, 76, 292, 374, -37, 129, 100, 179, 35, -7, 252, -231, -55, 143, -102, -283, 149, -98, -109, -298, 181, 9, -393, -99, 53, 33, -428, 140, 4, -196, 119, 385, 70, 81, 383, 75, -105, 38, 500, -197, -174, 368, -127, -152, 144, 466, -187, -326, 127, -75, -396, -249, 39, -226, -248, 80, -197, -352, -198, 287, -89, -36, 43, 48, -14, 159, 254, 198, -42]
3785d2P4J92k57K82k96l45J30L76l26J96j23J49k64K44j21L6qk1J23l63K45K45
3807A26M1k5K7r2n3l10O74j29j63J18M6k69j34L01k70j23J75L68o81K50L52k75
3829d6j50J8N42l77j90K75M8o43L83L15j17k08K97M9k47J59K6j49j07Q5L66j31
3851A98j23J74j70j92J80N6l37j47P44m12k14o8L27j25j9m3K95k03L04J35o04
3872b44MM40N7o92N96R7k25R6p0m7j81L04Jk52L23m1L2m78M39j70j10o7J74M9
3896C5l47J63L90k40j50K29K39l93j3L05j81k79O70l51k64L69j73l9O2P8r9k50
3918b39J80J10m24K49O8j21k17L76L84n09k27M00j8k81K54L28m84o5L32m7n78
3939e29L66L93k10LL68l9o43J13L99k60J98nj19m5R1l9Mj48K27j44j37J17P7o1
$$ y = [-42, 32, 224, -33, 249, -47, -392, -262, 114, -212, -16, -139, 10, -254, -10, -131, -95, -103, -124, -1, -364, -119, 126, 167, 142, 169, 77, 24, -286, 388, 259, 96, 214, 260, -9, -143, 158, -112, -235, -60, 308, -373, -123, 229, -46, -196, -178, 364, -13, -203, 72, 120, -523, -140, 175, 58, -150, 147, 196, -51, 108, 134, -15, -122, -37, 329, 198, 75, 249, 79, -113, 67, 123, -214, -361, 383, -29, -243, -311, 16, -109, -128, -171, 124, -79, 225, 360, -244, -240, 200, 257, -435, 161, 258, 33, 129, 59, 12, -169, 135, 136, -116, 207, 166, 198, -280, 159, -11, -121, -188, -14, 35, -312, -149, 241, 1, -149, 80, 319, -74, -87, 218, 37, -242, 428, 77, -187, 182, 9, -30, 32, 110, 11, -239, -59, 51, -373, -124, -56, -177, -394, -18, 366, -143, -370, 30, 12, -269, -15, 313, -171, -236, 96, 49, -529, -163, 230, 20, 23, 391, 352, -291, -178, 221, -39, 159, 154, 35, -10, 81, 42, 46, -102, 125, -19, -156, -39, 38, -23]
3963b3j71MJ15k01L60L0j48k2O6N2m37N24j42k2K7K01o2l88K85J45O4l89P6K83
3987B27l41oL87l75k08K89k76J45J7M12l50m87M92J38l27J18J69p0k35N76r6l57
4009a58J2L15l1k82O41m38j96j32N58m36J02J59L0m92K90J87k37k36N09m5j76
4030e6K3J59n2l28M87l14J3P3L14m14k74L38L11m53J31L43r9l05N46j41l37p8
4052a13K22k45p7J84O5k72r3J46k26O4K08K49n7j99L07J00m05p9O22m53N9J3J5
4075C5j29K72K6m14K41M53o32J37j74L33m30J16K69j45j76J99O0j05j28J64LJ58
4097A33j91P8l4l27M05R7k20j37L69j61K01r2j86O2j71K51j49k04L22J97o44M61
4119F0J37m80O8M10m9m43K84j18p3L28j19O5l42K40K55j26m01K27K62k35K6J18
$$ y = [-23, -194, -190, -75, -276, 84, 114, -34, -56, 10, 62, -375, 149, 7, -15, 12, 213, 151, -237, 48, 193, 257, -132, -56, 227, -114, -120, 267, -108, -316, -27, -303, -158, -141, 271, -79, -566, -74, 64, -263, -145, 24, -46, -281, 295, 199, -158, -146, 169, 138, -144, 497, 59, -137, -269, 289, -147, -45, 114, 144, -348, -58, 129, -108, -344, 165, 120, -56, -33, 126, 74, -254, 233, -81, -68, 5, 319, -95, -369, -31, 280, -173, -42, 301, 202, -103, 443, 302, -35, -113, 109, -136, -213, -29, 36, -236, -329, -183, -409, -345, -137, 112, 55, -144, 163, 263, -142, -221, 401, -52, 7, 20, 35, -94, 178, 204, -210, 31, 484, -148, -11, -185, 148, -282, -166, 103, -42, -218, -19, 41, -64, -192, -28, -25, 133, -58, 20, -14, -341, 64, 161, -59, -196, 173, 12, 213, 121, -65, -3, -174, 77, -72, -276, 46, 243, -401, 60, 197, -283, -215, 195, 146, -297, -13, -131, -204, 124, 5, 70, -272, -32, 223, 97, -304, -77, 185, -50, -24, 94]
4141I4j28j37M52j83j73J55j97J67k53L44p6k05k21J00J59M8K15p2j98J80j02
4162c1J25k39OK30j05P2K67l80J21K57J31n13O8M70k57m67M57n6j92k1K60j78
4184B5m16N19N5n04L70p6n8p8L71j18o0l5kj65mM12l55k0J01K30k96K67k09j2
4208e8l1K36N5q1j30j79J94j17p6J74k70J50J0R7j47j63M28j1k25L94l40j43l0
4231b63K45K43k45L5L66l99J62J09j61q5K05j85oK5M23n22k3J83O3k03N4N8p1
4254Hj73J92o6o9J95j83J48q9J81Lm4l96N18j34k51J36J89J4q2r6L2J80k34K50
4278B29N8l58k7J17j94j5L35O2j78L61k96l57K05O4j71k02N91k09j11K36K99m31
4300Hr5R6K4j64PK82o3j92K4L2j38J81K57m22j56M53N8j98j53L80l70O4J15K59
$$ y = [94, -34, -171, 281, 98, -75, 80, -117, 50, -203, 141, 65, -140, -361, -261, -102, -54, 161, 89, -109, 71, -31, 94, -145, -139, 91, -14, 58, 325, -55, 66, 323, 454, -59, 9, 479, 222, -245, 212, 156, -36, -57, 203, 25, -391, 128, 183, -321, 49, -27, -85, -163, 208, 90, 30, -5, -7, -172, -176, 236, -119, -139, -38, 192, -104, 163, -46, -58, -89, 147, 202, 121, -9, -188, 6, -111, -187, -13, -283, -133, -123, -26, -173, -336, 92, 81, -144, 250, -90, -233, -263, -18, 225, -20, 15, 381, -18, 144, 253, 92, 7, 212, 27, 21, 46, 469, -53, -76, 107, 170, -33, 21, 79, 8, -165, 27, -39, -108, 87, -96, 52, -37, 144, 147, 103, -293, 225, 91, -160, -24, 165, 179, 97, 1, 33, 213, -21, 229, 287, -71, -98, 19, -175, -190, 145, 207, 29, 390, 94, -263, -58, 6, -165, -367, 224, 15, -96, 140, 439, 8, -87, 9, 33, -131, -124, 158, 95, -97, -73, -41, -179, 2, 259, -163, -319, 134, 192, -6, -159, 221, -149, -85, 30, 289]
4324B89o05P3L92j97n4J07j06k21M96o1k30J58r0K42k61J84rj46m1L40j74j54
4346f8m9K81l93N8K90j1k09L9j03K01j21j5L97m41J0K08m1j51K0K27r3O3k3pj31
4371f2J58j14j12J8J48J96n79K02L97l73O9K10o0m15K57J70j13J73J4k95n3K27
4393F3pM5r2L58k88k97L32L36l96J12J32l41M2O0L1l18J95K6K45l10k08N50k51
4416A9k6j34K59m22L78K12k71j76L92j55R9l0j33J07p0K74n71J37J53J25j20M6
4438I3k07J68k10L29m03M83n11L95ql38j63N31m3l22J36L03n44J02L16r5qK51
4460B55N0l51J15O1L4l11K89R2l10J65J55n40L42l9r1j86M34J64m18P6Q1k52r1
4483b76L59j52q0j01L58j90p9Q5RJ50k46K94j37l18L31M25m83P0K47j88n1k0L52
$$ y = [289, -316, -243, 149, -48, -102, 5, -101, -322, 174, 113, -117, 41, -49, 193, -68, 116, 107, -39, -80, 260, 86, -68, -117, 164, -229, -171, 119, 108, -101, -62, -165, 36, -85, -100, 297, -144, -134, 74, 33, -118, -98, 129, 36, 99, 76, 69, -62, 96, -18, -130, -112, 36, 232, -347, -145, 252, -121, -52, 158, 98, -317, -60, 110, -3, 170, 184, -111, -164, 63, 56, 101, 9, 367, 79, -218, 114, 450, 54, 166, 298, -43, -1, 59, 90, -228, -33, -7, 238, -72, -280, 270, 19, -7, -141, 118, -304, 74, 286, 15, -161, 231, 76, 175, 145, 12, 119, 49, 323, -248, -111, 42, 167, 47, 93, -114, 54, -156, 173, -230, 253, -258, 137, 129, -209, -372, 159, 116, -206, -70, 233, -311, -209, 107, 12, 4, 255, 305, -46, 69, 130, 164, -147, 142, 234, -76, 89, 244, -296, 46, 7, -84, -270, 164, 328, -90, -14, 67, -185, -276, 83, -69, -149, -250, 108, -82, -161, -76, -67, 83, -163, 131, -6, -324, 7, 432, -51, 19, 266, 78, 27, 7, 359]
4506C59k73m15K47J83m18L01N2%j42J72o3l83M71q3l5j75K62L01m03J34M65m30
4528A27n7K06j21n7q3J82j7k93K31J32l87J78Q2J80l23K32l45k9m1%K60k96J11
4551a28M39m94K85q7K00n48M92J11m08J08L05m6m77M63q6j15k4K24q8k84J23J64
4573A29j51k23K82o9k37N7M13l07R7K37j76q4k8P1j82m9L50r5P7K14m44J80J7
4596G9K08j21k05K49l71J61O8J87j82m13M98L1l41m7K00m3j55J60J43k64Q0p1
4618a49J65k42j12L66l5J07J70j65l08J89M80p02L73j1o0j51oM54j74k11R4j39
4640f7R8k43K57k22J01J83k55l9K29P1n6p7K76j65j58N5j55J30j92M72l96J71
4662A8P3P4j95r4K23k85K5M02j79J6m07M60J81l35k97L42j08k01L34J87j10k83
$$ y = [359, 86, -329, -82, 101, -317, -16, 36, 36, -106, 66, 3, -380, 91, 8, -27, -202, 60, 361, -42, 92, 557, 127, 70, 276, 155, 98, 15, 197, 180, -113, 118, 250, -137, 41, 123, 303, -20, 212, -133, -162, -203, -203, 57, -239, -128, 311, -183, 102, 15, 215, -333, 159, 270, -138, -30, 275, 229, -248, 215, 129, 14, -10, 214, 126, -158, -35, 129, -22, -245, 37, -32, -269, -212, 201, -106, -9, 228, 52, -32, -60, 11, -171, -220, 130, 35, 112, 326, -118, 62, 79, 287, 166, -39, 210, -161, 0, 68, 255, 73, -340, 158, 189, -152, -199, 1, -42, -197, -37, 106, -158, -78, -149, 16, -226, -338, 28, -7, 100, 270, 105, -203, -14, 466, -236, 137, 126, 66, -85, -91, 363, 189, -22, 72, -67, 31, -212, 45, -177, -76, 107, -148, -187, 42, 113, 57, -20, 256, 91, -67, -12, -167, -37, -229, 243, -153, 18, 91, 165, -30, -124, 99, -186, -161, 241, 62, 78, -329, 131, 312, -23, -320, 22, -86, -287, 47, 234, 124, -159]
4684a59N08l54R1k7k34K58P0K19l47k59M31r5q0jK92j51l03L3K29P9o0l11J48
4707b3J16n5nj84K11p2m0r9K42J00l87%L60o9q1J90o8m33K87J46k08j35J91L06
4731B90l88r5L28j07KK06q5O8j98n9L21m53J84m3r8J36Nn4O1J11j11k68L43m4
4755E2O8r2K14o5o6p4K3J28l84J47K38k92J18RM4q3j94J35K08l35J94m7o0Q9p1
4780i6J08m87N34R8l91J92L32n01J11L68j59j09OR3N0k40J17j38J52M0o5l7l9
4803f1N8l5J63j95J72k27j24R7J16j52r0M76l56k0L79j21q5J78j86J39m64N32
4825A94j24j61J5P5L6j8M9Pl15L06J52k85j13M7J47j80K00k52J50k3K11R3k47
4848c6R3j27J12k90L99q4j87M75j73M1n13M47l60O9J33K43k42p7L8L6J25j33J56
$$ y = [-159, 349, -5, 86, 59, -175, 83, 153, 372, 25, -234, 197, 102, 22, 21, 313, 162, -141, -108, 121, 200, 140, -171, -23, 93, 38, 33, -151, 60, -12, -52, -151, 91, 191, -196, -196, 164, 95, 14, 204, 136, -297, -10, 136, -72, -207, -16, 290, -98, -193, 135, 28, 30, 236, 151, 219, 21, -38, 283, -170, 14, -29, -127, 9, 14, -40, 21, 132, 21, -247, 96, 52, 120, 28, 242, 177, 111, 37, 60, 188, -196, -49, 189, -103, 15, 24, 68, -15, -209, -74, 134, -201, -7, -54, -114, -25, -96, 12, -475, 59, 157, -234, -42, 290, -211, -100, 268, 109, 0, 6, 99, 149, -91, 26, -112, 40, 80, 15, -22, -61, -3, -38, 125, -70, 102, -125, -249, -152, -36, -188, -278, 198, -158, -178, 201, 80, -5, 173, -13, 126, -338, 194, 70, -91, -76, -1, 35, 17, 66, 73, -242, 64, 216, -69, -182, -135, 12, -168, 32, -220, -70, -93, 118, 211, -36, 57, -70, 42, -248, 151, 67, -120, 355, 182, 223, -290, 157, -203, -134, -1, 242, 0, -77, -39, -3, 122, -11, 145]
4871A45m6r0j75J72k33K04K28k19o7J43ml23K22L56l17P6k78M94k42M2RQ5N4o
4895B30j12j33J60k4j41K6K03l33k14K3L42o8j12M30l89r4K00K04j94Qo6L28l80
4918a06J35K05p7l52K89N7j28o1K27j44q9J06O6p3l05M65j59j33j17l4K04j52
4940a76L53j56k13J97J58j91O9J72k21J45l56L47j06j8K78m29J28Q7k6J70j24
4961H8q3J69j57k7K54j38k16J50Q8l22K79k40k04L29K6R0k28J28Q2k81N9L21k18
4984e1j32P2J26M0k12L03L5k58R6qL9j15Q6J81l78M4K89j94j17J57j44P5O8K02
5008B04k82q0l7K5oj15L40K6l39J86L05k59k1J29M3j33J13lk2n7R9l51R9M73m02
5033f5O7J0L9m2m93O75j19j44n0K21O1k85J04L60o66K08L58l02n8L74J02n40J50
$$ y = [145, 99, 9, -166, 6, -227, -23, 205, -14, -81, 62, 58, -265, -43, 313, -4, 72, -206, 288, 46, 88, 97, 182, 236, 230, 118, -15, 145, 121, -20, 6, 209, -124, -338, -315, 27, -41, -153, 277, -112, -206, -6, 198, 4, 12, -54, 274, -106, 29, 234, 157, -195, 94, 151, 23, -38, 189, 45, -44, 62, 128, 55, -250, 215, 56, -77, -194, -228, -24, -176, 177, 21, -192, 5, 163, -28, 41, 213, -8, 137, -219, 128, 22, 4, 282, -147, -19, 68, 42, 212, 88, 5, 174, 17, -10, 244, 106, -110, 40, 128, -194, 85, -155, -359, -30, -4, 86, -142, -14, 68, -213, -154, 167, -51, -183, -111, 15, 55, -157, 146, 181, -77, 19, 11, 50, -65, 21, 202, -176, -132, 157, -37, -154, 3, -141, -66, 2, 204, -78, -158, -195, -170, -176, -291, 49, 75, -264, -78, 227, -32, -53, 76, 119, -14, 99, 96, 74, 17, 116, -235, -136, 337, -65, 2, 12, 51, 9, -484, 191, 72, -72, -122, 99, 160, -125, -21, 339, -327, -119, 239, -63, -121, 253, 355, -185, -35]
5056c5Q3QK08Q1k46k57r9M13k25j60J07J88k28j06K92r3j15J03K28l06P7P0O7
5079E5j2l1J89l87K58R4k31J40O3L3l49j18N88k46j19K63k04k54K27J97k42L34
5101B48m7k49r6K55k18L13k94Q9J9J7r7K54j04K71l08K61l80j49M27o1j76j61
5123a86R8m6Q2J92m8m6k62J98ok73L81M3m82L96O5n3l88K5L68k36J44N4k06LL36
5148A53j42J69k16J34j68j49N14n41J65K39l27R8J59l0J60l25M8P5N5r9K10m1
5170A41k43J31j59k03L44j7J09k87jJ34J08j9J00n3O5r5J12j78l7N77m58p5r7
5193a01M50k61m03M61j41R4p8k34J82j95K62J85k64M1Ko1k20L21N3n1r2q1Q3j94
5217b42J45K51k53J21L04l11j25m0K15j33Q%M3o1KK14k31m6PJ37j82K53k23M03
$$ y = [-35, 48, 56, 264, 345, 99, -158, -257, 156, -69, -229, -122, 66, -162, -268, 24, -69, -184, -81, 147, -159, -82, -12, 55, 43, 12, 201, -186, 72, 166, -65, 75, 138, 171, -178, -296, 292, 46, -73, 190, -14, -268, -41, 156, -86, 248, 201, -48, -144, 111, -107, 206, -88, 1, 20, 37, -60, 194, 90, 361, 53, 314, -66, -215, 212, 151, -25, -186, -88, -134, -52, 140, 92, 46, -216, -18, -24, -297, 84, 127, -355, 41, 106, 53, -335, -310, 58, -178, -34, 20, -186, -183, 153, 11, 180, -36, 98, -70, -219, 295, -246, -81, 158, -169, -71, 88, 58, 218, -107, -59, 16, 71, -28, 182, 141, -102, 29, -130, -333, 11, -6, 103, -184, -185, -51, 57, 38, 138, 85, 150, 55, 167, -11, -48, 529, 71, -4, -101, 349, 88, -315, 146, 5, 99, 21, -213, -31, -226, 36, 221, -43, -2, 0, -61, -281, 40, 93, 42, -50, -131, -48, -242, -97, 154, -99, 22, 326, 15, -110, -150, 65, -68, -60, -60, -17, -78, -76, 138, -93, -139, -132, 5, -177, 76, -147, 256]
5241B56m25M05k75j34L58r5j52M6lL4l3O6j10J80k63M38l90kK3K4O3k45K82j79
5265a31l9K28K03m22m2L43k82j59N6L67k74K25J48k87q9M83o8j73j94J70j0j82
5287a29J77k27K74M9J08k56k8J52j82L9k91M88k41J86k17J80L0p8m7o2l42L42
5309g5P8o0R3J8J05M2j17K25l54K12j07J19j47J39j25j39K09j1J5l20L48J42o63
5332c73K08J87j04m0J51J61p2j45M13k25l39K43M8Q0k48K99J28l81J00M8k63K07
5354H3J80k44j24K52j39Mk97M29N3l66n2K39j10j66L81lk61J06R5q8p9R0J4p9
5378h2L61q4j99J14J1o2Q3j62l5J05j14K3p4J02L4J74m55K00M5m0N2k1k4o3J44
5403C3N9j2Nj68L60m15p1K0K31j26j1P8J36j11J75j0m23K99N0J1k49o4L11l13
$$ y = [256, -169, 236, -39, -173, 185, 90, -62, -16, -19, 15, -18, 48, -62, 118, -145, 293, -97, -99, -76, -52, 11, -234, 48, -131, -170, 58, 261, -161, -203, 140, -142, -301, -245, 122, -152, 73, 221, -66, -155, 328, 260, 87, -107, 63, 53, -129, 48, -179, 95, 144, 252, -4, -32, 120, -62, -23, -314, 174, -67, 119, -98, 82, 112, 34, -13, -75, -417, -75, 3, -57, 36, 54, 159, 201, 84, 309, -45, 167, 60, 179, 32, 171, 46, -93, 116, 105, 120, -200, 148, 290, -373, -165, 22, -82, -122, 29, 190, 118, -27, 386, 161, -178, 65, 113, 193, -55, 244, 372, -9, 91, 139, -124, 83, 263, 19, -105, 147, 8, 12, -285, 144, 197, -169, -221, 18, -92, -258, 123, 120, -141, -35, 60, -28, -107, -17, -3, -82, 279, 195, -4, 110, 121, 59, 142, -20, -55, 50, -64, -41, -115, -13, 21, 195, -260, -60, -15, -55, -3, -24, -48, -111, 33, 92, 80, 85, -83, 277, -138, -209, -189, 42, -84, -95, -17, 119, 8, 183, 173, -250, 49, 99, 110, -139, -203, 108, -205]
5427b05J17K51j84j63K19j45K06j16L99o41L86j82Q0j10J70J97l23J00J20J9p5
5448A20J50R6l83j24J41K3l0Q1n3M2j33L71k04m14K53j01P1j14n7J87J70k25K80
5471A47O4l21j51M82j9j87l9J37n8J16k99K95r5r4L6k20K72l4j84J43J6L5P0N8
5495A70K56l34r0K09l86K46k61O3J20k15K31k94Q7K49K29k71q3L90k63k15P5J12
5517B5K47l91P3j25K69k13P4L3j22L57j17j38J3j14N9K07j24J92m98L04J26k44
5539a07K13J9kk08M0K12j46j0J70q6l44J24L20k59m7K80q8q8j75J87k4k31J57
5562i3L09k23K3j25m8P6J17L60l86O0Q3k34K3O3n4k3P9J21p7j65K19k68n4J02
5586a15p4L47l15N4L31l82J07J97k29J25j04K39j27k80L08j63N1j54K13n2K1L94
$$ y = [-205, -88, 163, -21, -184, 35, -110, 96, -20, 379, -262, 124, -58, 22, -88, 82, 279, -44, 56, 176, 195, 120, 270, 366, -17, -141, 0, 23, -7, 74, 21, 63, -70, 301, 97, -317, -64, -165, -94, -208, -265, -78, 92, -133, 147, 211, -110, -261, 221, 202, 15, -24, 113, 55, 171, -128, 167, 72, -22, 14, -206, 66, 32, -152, -9, 7, 42, 112, 170, 426, 92, 2, 211, -175, 71, -190, -127, -7, -222, 9, -285, -198, 51, 280, 9, -74, 316, 53, -162, -87, 25, 272, -119, -46, -171, 98, -115, -41, -8, -130, 227, 110, -28, -15, -129, -70, 137, 13, 205, -293, 11, 137, -107, 106, 125, 123, -85, -45, 167, 21, 11, 181, 95, -249, -125, 195, -64, -111, 169, 81, -7, -182, 5, -19, -250, -93, 216, -7, 16, -109, -157, -81, 36, 396, 10, 70, 153, -81, -58, 5, -49, -72, 7, 128, 51, -114, 105, -163, -217, -115, -189, 158, -157, -103, 228, -154, -47, 150, -79, 46, -58, 181, 54, -226, 82, -81, -30, -184, 29, -23, -2, 392]
5608C92m38K9L0J48j29O6m4L1j77J22n9J04J48j23j22j72K49l14K19J20j08m1
5630f9l57M52J16j37j8Ok03J69K03P2k08N2j52K7k91L85K53n05J93J84m37L59
5652I4j23p8R2l20L43j62K10l3J46l50M7K51k13K27L9n0j65J46J65m29QL82J3
5675B40O3l30J02j08Q3J48j03k86J41M6J26k74K2O7k23J64j30L46k39J44J35j80
5697d6k17L18J24k77K12J47k12O1j47M15m37J62oJ8l56J13J04j96J52j14K2k2
5719a82K17J20r9r8k36K61k38N11k99r3K09K06k42o2Q7j6j14q7M64p8k28R0q5
5742Hn7j70M29K9j29q3M6k37K53K33m34KJ93K1m52L75M5l20L22J50k54o9M0K20
5766A61j15O5k21K65j94k7L77j49K03l12M8k06K63j82K95k65k02Q2m3K14l67K58
$$ y = [392, -46, -17, 13, 161, 32, 98, 54, 85, -92, 30, -29, 75, 223, 100, -22, -194, 55, -259, -40, 80, -28, -69, -426, 26, 142, 5, -13, -7, -210, -41, 162, 234, 26, 78, -74, -47, -338, 47, 300, -205, -12, 172, -265, 94, -29, -107, -15, -335, 8, -154, 56, 23, 169, -181, -134, 117, -96, 131, 170, 120, -45, 101, 266, -163, -155, 227, 240, 303, -27, 75, -33, 50, 198, 95, -191, -50, -4, 122, -152, -130, -63, -286, -122, -252, 94, -145, -1, 134, -46, -263, 55, 179, -98, 114, 261, 49, 110, -37, 378, -59, 103, 97, 115, -241, -128, -24, -220, -68, -182, -160, -182, 35, 155, 56, -42, -278, -17, -255, 256, -43, -136, 73, 279, 37, -25, 62, 46, -68, -155, 309, 231, 3, 93, 8, -49, -219, 210, 239, 110, 27, 73, -164, 89, 322, -112, -110, 83, 104, -348, 27, 72, -248, 74, 224, -30, -99, -59, 161, 46, 111, -110, 155, -39, -66, 311, 162, 365, 53, 101, -105, 158, -24, 271, 6, -196, -114, -157, 57, -310, -52]
5788e2o1L7J43n2k11N5J75l52L21J15j96J72J3Q2j85OM1j44J04oj64m7K93j90
$$ y = [-52, -113, -76, 67, 15, -196, -141, 34, -318, 3, 118, -78, 94, 107, 189, 4, 10, 51, -93, 11, 5, -159, -206, 87, -103]
$$ [...]
8191F0
##END NTUPLES=NMR FID
##END=
