##TITLE=1H_SL62-I2-B-isomer
 CDCl3, 8 sc, 
 26.07.2021
##JCAMPDX= 6.0         $$ Bruker NMR JCAMP-DX V2.0
##DATA TYPE= NMR FID
##DATA CLASS= NTUPLES
##ORIGIN= UXNMR, Bruker Analytische Messtechnik GmbH
##OWNER= root
$$ XWIN-NMR		Version 3.5
$$ Mon Jul 26 08:40:47 2021 Russian Standard Time (UT+4h)  she@DPX200
##.OBSERVE FREQUENCY= 200.131506
##.OBSERVE NUCLEUS= ^1H
##.DELAY= (6, 6)
##.ACQUISITION MODE= SIMULTANEOUS
##.ACQUISITION SCHEME= undefined
##.AVERAGES= 8
##.DIGITISER RES= 18
##SPECTROMETER/DATA SYSTEM= spect
##.PULSE SEQUENCE= zg30
##.SOLVENT NAME= CDCl3
##.SHIFT REFERENCE= (INTERNAL, CDCl3, 0, 15.7039)
##AUDIT TRAIL= $$ (NUMBER, WHEN, WHO, WHERE, WHAT)
$$ ##TITLE= Audit trail, XWIN-NMR		Version 3.5
$$ ##JCAMPDX= 5.01
$$ ##ORIGIN= Bruker BioSpin GmbH
$$ ##OWNER= she
$$ F:/spectra/data/she/nmr/H-F/1/audita.txt
$$ ##AUDIT TRAIL=  $$ (NUMBER, WHEN, WHO, WHERE, WHAT)
(   1,<2021-07-26 08:39:32.18 +0400>,<she>,<DPX200>,
      <created by zg, POWCHK disabled, PULCHK disabled
       configuration hash MD5:
       00 E9 B6 7A A2 85 ED C7 34 08 36 98 17 FE 4E 26
       data hash MD5: 16K
       8F 0B FC 80 C8 A7 12 15 74 FB 5B 1D 6E D7 B2 D6>)
$$ ##END=
$$ 
$$ hash MD5
$$ 71 43 49 47 84 FB C4 41 30 E9 96 D4 C1 C1 14 93
##$RELAX= 
##$RELAX= 
##$RELAX= 
##$RELAX= 
##$RELAX= 
##$RELAX= 
$$ Bruker specific parameters
$$ --------------------------
##$DU= <F:/spectra>
##$EXPNO= 1
##$NAME= <H-F>
##$PROCNO= 1
##$TYPE= <nmr>
##$USER= <she>
##$AMP= (0..31)
100 100 100 100 100 100 100 100 100 100 100 100 100 100 100 100 100 100 
100 100 100 100 100 100 100 100 100 100 100 100 100 100 
##$AQSEQ= 0
##$AQ_mod= 1
##$AUNM= <au_zg>
##$AUTOPOS= <>
##$BF1= 200.13
##$BF2= 200.13
##$BF3= 200.13
##$BF4= 200.13
##$BF5= 200.13
##$BF6= 200.13
##$BF7= 200.13
##$BF8= 200.13
##$BYTORDA= 1
##$CFDGTYP= 0
##$CFRGTYP= 5
##$CHEMSTR= <none>
##$CNST= (0..31)
1 1 145 1 1 1 1 1 1 1 1 1 1 1 1 1 1 1 1 1 1 1 1 1 1 1 1 1 1 1 1 1 
##$CPDPRG= <>
##$CPDPRG1= <>
##$CPDPRG2= <>
##$CPDPRG3= <>
##$CPDPRG4= <mlev>
##$CPDPRG5= <mlev>
##$CPDPRG6= <mlev>
##$CPDPRG7= <mlev>
##$CPDPRG8= <mlev>
##$CPDPRGB= <>
##$CPDPRGT= <>
##$D= (0..31)
0 1.2 0 0 0 0 0 0 0 0.06 0 0.03 0 0 0 0 0.0002 0 0 0 0 0 0 0 0 0 0 0 0 
0 0 0 
##$DATE= 1627274371
##$DBL= (0..7)
120 120 120 120 120 120 120 120 
##$DBP= (0..7)
150 150 150 150 150 150 150 150 
##$DBP07= 0
##$DBPNAM0= <>
##$DBPNAM1= <>
##$DBPNAM2= <>
##$DBPNAM3= <>
##$DBPNAM4= <>
##$DBPNAM5= <>
##$DBPNAM6= <>
##$DBPNAM7= <>
##$DBPOAL= (0..7)
0.5 0.5 0.5 0.5 0.5 0.5 0.5 0.5 
##$DBPOFFS= (0..7)
0 0 0 0 0 0 0 0 
##$DE= 6
##$DECBNUC= <off>
##$DECIM= 32
##$DECNUC= <off>
##$DECSTAT= 4
##$DIGMOD= 1
##$DIGTYP= 9
##$DL= (0..7)
0 120 120 120 120 120 120 120 
##$DP= (0..7)
150 150 150 150 150 150 150 150 
##$DP07= 0
##$DPNAME0= <>
##$DPNAME1= <>
##$DPNAME2= <>
##$DPNAME3= <>
##$DPNAME4= <>
##$DPNAME5= <>
##$DPNAME6= <>
##$DPNAME7= <>
##$DPOAL= (0..7)
0.5 0.5 0.5 0.5 0.5 0.5 0.5 0.5 
##$DPOFFS= (0..7)
0 0 0 0 0 0 0 0 
##$DQDMODE= 0
##$DR= 18
##$DS= 0
$$ [...]
##$SUBNAM2= <"">
##$SUBNAM3= <"">
##$SUBNAM4= <"">
##$SUBNAM5= <"">
##$SUBNAM6= <"">
##$SUBNAM7= <"">
##$SUBNAM8= <"">
##$SUBNAM9= <"">
##$SW= 20.0188882624521
##$SWIBOX= (0..15)
0 0 2 0 0 0 0 0 0 0 0 0 0 0 0 0 
##$SW_h= 4006.41025641026
##$TD= 16384
##$TD0= 1
##$TE= 0
##$TE2= 300
##$TE3= 300
##$TEG= 300
##$TL= (0..7)
0 120 120 120 120 120 120 120 
##$TP= (0..7)
150 150 150 150 150 150 150 150 
##$TP07= 0
##$TPNAME0= <>
##$TPNAME1= <>
##$TPNAME2= <>
##$TPNAME3= <>
##$TPNAME4= <>
##$TPNAME5= <>
##$TPNAME6= <>
##$TPNAME7= <>
##$TPOAL= (0..7)
0.5 0.5 0.5 0.5 0.5 0.5 0.5 0.5 
##$TPOFFS= (0..7)
0 0 0 0 0 0 0 0 
##$TUNHIN= 0
##$TUNHOUT= 0
##$TUNXOUT= 0
##$USERA1= <user>
##$USERA2= <user>
##$USERA3= <user>
##$USERA4= <user>
##$USERA5= <user>
##$V9= 5
##$VALIST= <valist>
##$VCLIST= <CCCCCCCCCCCCCCC>
##$VD= 0
##$VDLIST= <DDDDDDDDDDDDDDD>
##$VPLIST= <PPPPPPPPPPPPPPP>
##$VTLIST= <TTTTTTTTTTTTTTT>
##$WBST= 1024
##$WBSW= 4
##$XGAIN= (0..3)
0 0 0 0 
##$XL= 0
##$YL= 0
##$YMAX_a= 67353
##$YMIN_a= -134969
##$ZGOPTNS= <>
##$ZL1= 120
##$ZL2= 120
##$ZL3= 120
##$ZL4= 120
##$ABSF1= 10
##$ABSF2= 0
##$ABSG= 5
##$ABSL= 3
##$ALPHA= 0
##$AQORDER= 0
##$ASSFAC= 0
##$ASSFACI= 0
##$ASSFACX= 0
##$ASSWID= 0
##$AUNMP= <proc_1d>
##$AZFE= 0.1
##$AZFW= 0.1
##$BCFW= 1
##$BC_mod= 2
##$BYTORDP= 1
##$COROFFS= 0
##$CY= 11.3945322036743
##$DATMOD= 1
##$DC= 2
##$DFILT= <>
##$DTYPP= 0
##$F1P= 17.5019972093344
##$F2P= -2.517084195857
##$FCOR= 0.5
##$FTSIZE= 0
##$FT_mod= 4
##$GAMMA= 1
##$GB= 0.15
##$INTBC= 1
##$INTSCL= 1
##$ISEN= 128
##$LB= 0.24
##$LEV0= 0
##$LPBIN= 0
##$MAXI= 10000
##$MC2= 0
##$MEAN= 0
##$ME_mod= 0
##$MI= 1.114404
##$NCOEF= 0
##$NC_proc= 0
##$NLEV= 6
##$NOISF1= 3.799351
##$NOISF2= 2.8
##$NSP= 1
##$NTH_PI= 0
##$NZP= 0
##$OFFSET= 15.70392
##$PC= 1
##$PHC0= -12274.31
##$PHC1= 10.80099
##$PH_mod= 1
##$PKNL= yes
##$PPARMOD= 0
##$PSCAL= 0
##$PSIGN= 0
##$REVERSE= no
##$SF= 200.130013532006
##$SI= 16384
##$SIGF1= 3
##$SIGF2= 2
##$SINO= 400
##$SIOLD= 16384
##$SREGLST= <1H.CDCl3>
##$SSB= 0
##$STSI= 0
##$STSR= 0
##$SW_p= 3612.71676300578
##$SYMM= 0
##$S_DEV= 0
##$TDeff= 0
##$TDoff= 0
##$TI= <>
##$TILT= no
##$TM1= 0
##$TM2= 0
##$TOPLEV= 0
##$USERP1= <user>
##$USERP2= <user>
##$USERP3= <user>
##$USERP4= <user>
##$USERP5= <user>
##$WDW= 1
##$XDIM= 8192
##$YMAX_p= 0
##$YMIN_p= 0
$$ End of Bruker specific parameters
$$ ---------------------------------
##NTUPLES= NMR FID
##VAR_NAME=  TIME,          FID/REAL,        FID/IMAG
##SYMBOL=    X,             R,               I
##VAR_TYPE=  INDEPENDENT,   DEPENDENT,       DEPENDENT
##VAR_FORM=  AFFN,          ASDF,            ASDF
##VAR_DIM=   8192,          8192,            8192
##UNITS=     SECONDS,       ARBITRARY UNITS, ARBITRARY UNITS
##FACTOR=    0.0002496,     1,               1
##FIRST=     0,             0,               0
##LAST=      2.0444736,     0,               0
##MIN=       0,             -134969,         0
##MAX=       2.0444736,     67353,           0
$$ Real data points
##PAGE= N=1
##DATA TABLE= (X++(R..R)), XYDATA
0@%%%%%%%%%%%%%%qJ6j6J6j7K5l2L3m1N0n8P2q6R5j06J25j48J69j91K15k42K74
36A45l09L48l90M36m85N40n99O64p35Q12q97R89j092J204j325J458j608J774j958
55a028K165k400K667k975L337l767M286m930N755o851Q393j0739J4774k3640Q2306
70F7353n9067r1007J28668o480q4471K1162Q2377l0498l2638J7438R222k0697
82A362P728J463q157N430J4396j5087j4239Q042J1552n093l672q716j8516o677
96c0184K3841K1521O24q55Q632j5576l5818m013K6681m168j9832K2790K9696k3661
110c22k6723J6525Q049j9467N901K6067m149k2295k445P486N125Q858n222k6582
124b9194l642K4277o226k2788L1969M3927k8244m0360K6400J7569m5378j8427
$$ y = [0, 0, 0, 0, 0, 0, 0, 0, 0, 0, 0, 0, 0, 0, 0, -8, 8, -8, 8, -9, 16, -16, 17, -24, 26, -32, 40, -46, 49, -57, 68, -80, 89, -102, 113, -129, 145, -164, 184, -206, 230, -255, 285, -314, 350, -385, 427, -470, 519, -573, 631, -694, 764, -844, 930, -1028, 1137, -1263, 1404, -1571, 1766, -2001, 2285, -2645, 3110, -3741, 4652, -6087, 8687, -14953, 67353, 8286, -82721, 45947, 39467, -45004, -23842, 58535, 28037, -4601, 12837, 22059, 1362, 9090, 10553, 2396, 7826, 22222, 7135, -7104, 938, 12490, 7397, 3725, -4991, -23507, -30184, -6343, 15178, 15802, 14947, 23579, 8003, -27815, -31828, -5147, -9315, -29147, -6357, 23339, -322, -27045, -10520, -2471, -21938, -16037, 10030, 5881, -16414, -18859, -11373, -6248, 2610, -2612, -29194, -32836, -8559, -14785, -37573, -5604, 38323, 10079, -30281, -3881, 13688, -31690, -50117]
136e0117M4087J9919k1224n51Q598k0151q518K5395N813j7413R993J7943k1271
149g497j6902K4998J1775k3333m585J3117j1128j0127J6660M000p673K1161J8140
162B8606k7754k3306J7195K651k0558J3695L1049j3940k6500J0946J0291j6725
174a4350M17K2071J534j2596L229O473p230n452N379M193l440l608l165o276P60
189a2061J5205J0791n129k287M465j0378j3854R459J4208n548k814Q947o847j5619
203a1462Q105J0557j0185K332K4127k733k6168L808J9644j0711j2244J8394O621
216B0085k3113m939J4943l143l774J8173M538j7764J548J0843j3965p557K1443
229A7318M964j9292J810J1249j7094j1109K3118J0091j6102M156J5818j5409j7253
$$ y = [-50117, -6030, 13889, -7335, -7886, 712, -19439, -27957, -2562, 3251, -14162, -4169, 13774, -7497, -24399, 599, 12374, -10959, -15544, -2427, -13555, -23682, -7022, -3022, -10695, 10466, 28606, 852, -22454, -5259, -2608, -23166, -9471, 21578, 7638, -18862, -7916, 2375, -14350, -13933, 8138, 9672, -2924, 305, 6778, -452, -5904, -525, 3668, 228, -3380, -6545, -12821, -12061, 3144, 13935, 8806, 6519, 10984, 606, -13248, -3789, 10419, 4871, 2057, 11004, 4157, -11462, -3357, 7200, -2985, -653, 23474, 20741, -5427, -1619, 18025, 7314, -4930, 13464, 20085, -3028, -7967, 6976, 3833, 59, 18232, 22770, 5006, 6554, 17397, 3432, -4125, 17318, 22282, 2990, 4800, 16049, -1045, -12154, 10964, 21055, 4953, 9109, 24927, 9518, -7735]
242g735J5609J0776j3419j809J2648q007j6215N408R646m294J137R774k734j0198
256E87J698M207m347J4O973l871j1501j329M252l321L55J1427M390r985m892M446
272h97l713o819Q672J0504p700q606M329k387j2764M192J4758k787p425R718K850
287A925j4420K52J4482m331j2511P632L890j6439j058J8235J19j0385J0091O362
301C844j7363n883J5406O07q120J1056P758j5471p899Q612k905p995J1361J1626
315D634q553l948R879j178r504N159P766p852o976O180J238o096M469R306j886
330B638n281K216r25o775K485J0330K430k995J577k573r192k395N560Q57j092
345c135O940N318o443l240O531O25q645J415Q913n053j0170M781R212n209k602
$$ y = [-7735, 7874, 18650, 5231, 3422, 16070, 8063, -8152, -2744, 6902, 2608, 3745, 13519, 10785, 587, 2285, 6492, 2145, 2159, 9132, 5261, -6240, -7569, -3317, -6638, -6283, 5144, 9534, -451, -5343, -897, -4610, -11429, -2757, 7747, 47, -8559, -4230, -6617, -19381, -15189, -431, -3218, -10643, -925, 1925, -12495, -12243, 2239, -2092, -14603, -6971, -3081, -19520, -20578, -2343, -2224, -12609, -2518, 3844, -13519, -19402, -3996, -3389, -11509, -453, 7305, -8166, -16065, -7453, -10358, -18353, -6992, 4634, -3919, -7867, 2012, 834, -8670, -3511, 4255, -3597, -10573, -4393, -3155, -9251, -4782, 4524, 2638, -2643, -427, -1352, -8127, -5642, 4688, 7118, 4123, 5700, 3127, -6065, -8460, -2900, -2043, -3135, 3805, 9123, 2680, -560, 5971, 6596, -2049, -634, 8279, 3226, -6944, -2163, 7049, 1840, -762]
360g62R856j307j2952Q04R667l172j214J2565m09j3771J557O379j1650o188J4909
375D312N201r489M441R403j0599p463J1574K564r691K640N627r184l399J3157
389I094K364j0913J310O334o862m760Q549L365l402L659L955o171m735Q37m266
404a642k809R407O320n697l196M450o44n066K394M225k846m291J297K916k12j697
420B909k89k21q37k31Q55k871k278N624O790k880m261J105m131q381L038R411
436C352j564n746L477K680n171o40M096l789l627O422K100o954L02M919n218m619
452i980Q011K688j0678k496P642R84j470O061J66r613o99N121l636l759O736J353
468c569n909L076O854n817p001M933L881k500K495K738n379l353M966K271l347
$$ y = [-762, 9094, 7787, -5165, -4361, 5306, 2134, 920, 13485, 13076, -695, 862, 7241, -4409, -10597, 4312, 9513, 24, 4465, 13868, 3269, -4194, 7380, 9944, 253, 2893, 8520, -664, -4063, 9094, 11458, 545, 1855, 8189, 1327, -3433, 5116, 8481, 5079, 8738, 12693, 6522, 1787, 2624, -1642, -4451, 4956, 11276, 5579, 2383, 6833, 6189, 1123, 3517, 7742, 4896, 605, 1902, 4818, 4606, 2909, 2620, 2399, 1562, 1331, 2186, -685, -2963, 2661, 9451, 6571, 2310, 3415, -716, -9097, -6059, 3352, 1788, -3958, -481, 2199, -2972, -3612, 484, -3305, -6932, -510, 1590, -5364, -5062, -143, -5361, -9980, -1969, 719, -9959, -12455, -4813, -3829, -5299, 762, 928, -8685, -9384, -4263, -7899, -11658, -4922, -3569, -9478, -6402, 452, -5365, -12366, -7433, -3552, -6052, -3557, -819, -6198, -9551, -4585, -2314, -5661]
483e661M84L92l178N0O394K546l510j975L649J466l524k127J867Q43j204K275
499a213L835j194m545o40K503J109K337K282l286l238L944K808m120j427L805
514B960r97m480L801M945l887k561M499J117k419K100k68o302K37Q075M45o387
530H78J800K723n025m40O585o68m894L147K624m128k8M304m079m891N429L845
546G182n162j483L935j818k144M937J946n828j912M163P3k127J921N74k995l98
562H64J895q30o52J591q98p97K393K139l103k504M60J459R52J89k013n77J592
579B160k88r76J132R26j888r6Q46m96N71J057k576j957L737J354l989j424K842
596I35J35r54J698r3l139O39K540l038j925M829J70n405R38M647k710l335K967
$$ y = [-5661, -5177, -4785, -7963, -7913, -1519, 1027, -2483, -4458, -809, 657, -2867, -4994, -3127, -2284, -3488, -1213, 2622, 1428, -3117, -3757, -1254, -145, 2192, 4474, 1188, -2050, 1894, 4702, 582, -845, 2960, 1963, -2517, 1284, 6229, 2342, -219, 4280, 5397, 2978, 5078, 4810, -1492, -1255, 6820, 7265, 878, 2678, 5401, 376, -64, 6521, 5853, 959, 4106, 6730, 2602, 2574, 6878, 2799, -2092, 3337, 7182, 2020, 537, 4472, 2654, 510, 5447, 7393, 1565, -347, 3816, 3889, 1762, 3683, 4257, 1262, 864, 2759, 1929, 1277, 2868, 1970, 1173, 3566, 5705, 2602, 98, 558, 2017, 2969, 3158, 1145, 568, 2160, 1872, 896, 2028, 2954, 1066, 970, 1816, 1320, 1891, 2948, 372, -1585, 2152, 3506, -483, -1907, 935, 1070, 116, 1814, 1721, -1418, -779, 1761, -1277, -3202, 1627, 1797, -3608, -2670, 1977, -733, -4068, -1101]
613a101K72l191J912K786l433j997L546L80l399NK052j652r62K269k07j585J029
630c276N14k769J01K382n35k017O96J582n96j73m95q65R41J117j106j264K173
647c590J190k101N0J117m95p33J431j67q96J461J147j429m73J280K80j58l08l72
665b766J038J715j061j625K204K261k675o98K451j29j398J173J557j304q4K354
681C013j585j854K637J436k296J48K699r19k209K088Q12k702J133L202j968l304
697C31L171J792k480m38K803k81k181O95M67q83P86K93j369N8J968j910j652K513
715C683J028k466M36K369k015j955J608Q90j808rJ357q73r63J88oQ91M66j010
733A811n21J174j3k791m0L172j359k537J893J244k950k32K826m72j516J321O07
$$ y = [-1101, -829, -4020, -2108, 678, -2755, -4752, -1206, -826, -4225, -4220, -2168, -3820, -4782, -2513, -2720, -4305, -3276, -2762, -5531, -5430, -3048, -3583, -5600, -4904, -3322, -3918, -4091, -4586, -5451, -4510, -3393, -4499, -5763, -3590, -2400, -4501, -4451, -3334, -3829, -4562, -3131, -3298, -4194, -2733, -1586, -3015, -3488, -2208, -1928, -2086, -2394, -2766, -1728, -13, -1074, -2699, -495, 1766, -909, -1607, 844, 715, -683, 490, 2047, 743, 659, 3013, 1428, -426, 2211, 3647, 1351, 1499, 4198, 3279, 1070, 3158, 3970, 1268, 2401, 5603, 3635, 331, 3502, 5294, 2814, 2376, 5179, 4898, 2717, 3412, 3879, 2996, 3782, 4075, 2706, 2764, 4732, 2822, 1170, 3683, 4711, 2245, 2681, 5050, 3035, 1080, 2688, 3578, 1770, 1761, 3118, 2245, 1282, 1470, 1464, 2355, 2821, 1811, 1290, 2464, 2451, -340, -380, 2792, 1433, -1104, 789, 2033, -917, -1149, 1677, 1205, -311, 1010, 1617]
750A617k022m2J177j220J87J237j768j264J607M07k152J691K416j843j702K503
766H29o68k517J542J397k613L64K222k317j642K687O87k905J725L013l129k460
782c785L176Q69k909P33J321j972j164R89N04q5R00l29K34O78r62k103J056J344
800a505j471k18J894o61k778L33K612p77o12J360j23j141N11R29p38k25J97p30
818c143p36J266q3j005P10J873j49m36O19p30j726Q74K616m83q26L54m79q98J125
837a257P88p29J56J401k64O04J215r64j910J336J667j561q12Q01J54j082K371
854A914K333j615j344P69j79k13J766P70j826JJ005r22o86N95m60n33K133J854
872E362j410k57K22j169p4J972m9k813j27R95k38K22J150l66j822O10J234r01
$$ y = [1617, -405, -447, 730, -490, -303, 934, -834, -2098, -491, -84, -2236, -545, 1871, 28, -1674, 829, 161, -2356, -814, 583, -2030, -1666, 556, -1761, -3403, -716, -29, -2934, -1209, 1804, -1325, -3785, -609, 260, -2649, -1916, -595, -2567, -3731, -2742, -2238, -2323, -1423, -1752, -1518, -840, -1802, -3905, -2849, -1505, -2976, -3194, -1300, -1961, -4739, -4406, -1794, -2571, -3183, -1823, -1946, -3087, -2576, -1647, -2385, -2610, -2413, -3143, -3879, -2613, -2696, -3701, -2991, -1118, -1267, -1703, -1084, -1814, -3540, -2666, -50, -533, -1359, -1005, -1484, -2382, -1257, -469, -1198, -1042, 359, 95, 699, 1914, 950, -960, 376, 2043, 482, -330, 471, 625, -457, 1914, 4247, 2632, 1288, 2057, 1878, 1665, 3431, 4201, 2375, 2376, 3381, 2459, 1773, 2368, 1908, 1375, 3508, 5362, 3952, 3695, 3917, 2748, 2674, 4646, 4597, 1784, 1657, 2652, 2414, 2636, 3786, 3420, 1598, 2208, 3442, 2541]
890B541j76L67j33P1R34j205k019k91k4J27J566J311j271j829J013J101j406M39
908A116L26j581j108J325P00j795m20J475n66o53J150M33k055L36K003L89p72
925C03n24j811j746R18J223J47L33J84p72O09Q57r57q57J191K05j513P24J671
943A85k659j687K327J567j796k80R44m39o13K141J039j197r46j72r84l28O08m76
961b766M84J341J34q67J055N17k162p16K762O87j993n35M65o02j90N16r5m97N57
980a905J56J23J348J006j469l05Q87j109j562Q47L19j190J242K295o83k198J059
997a139P58q05Q33J702j287m84O39l34j102J46P10j066Q7J902m9k35R03P92q49
1016A122M14k64j514k80J175l38M14J979p20k384J522J457j992q2L216N92k422
$$ y = [2541, 2365, 2732, 2599, 2670, 3604, 2399, 380, 89, 65, 192, 1758, 3069, 1798, -31, 982, 2083, 677, 1116, 1442, -139, -1247, 78, 778, -1017, -1437, 38, -528, -1181, -31, 402, -1653, -1317, 686, 1075, 303, -221, -2032, -3778, -2860, -1637, -1490, -1157, -973, -1745, -1136, -279, -1236, -2093, -902, -697, -2210, -1486, 185, -2474, -4161, -1834, -267, -2063, -2343, -1399, -1838, -2451, -310, 729, -468, -1414, -1586, -2570, -2898, -2290, -2766, -2282, -941, -807, -1674, -619, -102, -2264, -2980, -218, 469, -1524, -2059, -1594, -2196, -2386, -1870, -1965, -2462, -1905, -1749, -1626, -278, 728, -741, -1046, -159, -1268, -2830, -1983, -1664, -2854, -1612, 683, 0, -2198, -1139, -381, -1186, -353, 1349, 62, -422, 217, -117, -1219, -1073, -363, -1429, -1342, 560, 511, 276, 1179, 1971, 1122, 1536, 1272, -242, -522, 653, 315, 729, 2708, 1988, -396, 1126, 2583, 591, 509, 3725, 4317, 1895]
1033A895K41J731j299k502R33O19L93j58j03R16Q08j23n54p7J086j081j497J287
1051B515M4p28N26O76j176r87R14K92j117J028J825n71r27L07k16j849m80P04
1069G80l85M1O43k05j24K55Pm17q6N05o84j193Q01J65o30J70j91j251l85P74l66
1090a776K72J613J010j625n49J123j131k194P11P25m46r6O18Rn10L19J16k71J238
1109h44k79j319M13J489j001r14O74m94j217P55N30k78N20J810k16o04P22n55
1127h08k084N62J351o75k39R25m33o83O46N55p21O68P47j44l4O78k94p70k36K03
1147g86p94j24K83N7K98J363J132j051k07O77j079j148J081O76q57j45J259q32
1165a97r84P37K48m43R47Q93n50M16N54j141o37Q07n36j289M94P68k67M03J640
$$ y = [1895, 2136, 3867, 2568, 66, 999, 1618, 2011, 1853, 1750, 2666, 3474, 3351, 2797, 2720, 3806, 2725, 1228, 2515, 2559, 1831, 2357, 3033, 1857, 870, 1784, 2076, 959, 1987, 3812, 3241, 2314, 2621, 2405, 556, 76, 780, 395, 436, 1079, 874, 750, 1005, 1012, 595, 509, 1014, 330, -863, -62, 103, -527, -357, -548, -1799, -2184, -1410, -1776, -1504, 109, 1119, -506, -1055, 68, -1063, -3257, -2546, -1821, -2267, -2363, -1745, -1736, -2246, -1927, -1811, -2082, -844, -1123, -2442, -2029, -540, -1541, -2455, -1781, -2275, -3492, -2737, -2207, -2485, -1965, -155, -371, -975, -253, -808, -2892, -2330, -979, -1654, -1893, -968, -1401, -2084, -1438, -883, -1604, -936, -189, -333, -367, 311, 17, -753, -989, -786, -1580, -1704, -1421, -1364, -1066, 297, 1429, 378, 171, 848, -231, -1379, -298, 378, -479, -624, 635, -197, -1181, -444, -196, -639, 308, 1201, 651, 1067, 1621, 480, -157, 650, 114, -1175, -681, 87, -180, 223, 1863]
1184A863Qj031M25J98j278M93Q23k39j61N12m81j123L63M85o88P55J198M56m66
1203B112L47J83r89n91J84l77k94O62J49j10N96O05l11n64Q31p15r16J379M51
1222B632q16p5J99j030q78K88M99l38P94J310n84M4L18q39q71l11M59q71K4M89
1242D43k97J67N53k98p97J12M88k49k13P78k35q74n0M3j416l84M39J83O5R76O49
1263H3p38k79K38o11o93N05k30p79L69P26n78K21J22o40j03O52M56q14O04P30
1283g59l22j50J69j093j353N05J035k76P28Q15m00o37J146k42q91L72L42k61K74
1302i98N39n65o40K83J23k5N89N24m60M14J083K54j199L29l91j481K75J178L68
1321B00p42P60P65l27j55J28l59m39Q13L08o1k17m5n65l29N77j98l53M10M43L91
$$ y = [1863, 1871, 840, 1265, 1463, 185, 678, 1501, 1262, 1101, 1613, 1132, 9, 372, 857, 169, 924, 2122, 2578, 2112, 2459, 2642, 1653, 1062, 1246, 869, 575, 1237, 1386, 1276, 1872, 2477, 2166, 1602, 2433, 1718, 802, 2181, 2632, 1816, 1741, 1940, 910, 32, 320, 819, 481, 1275, 2585, 2001, 2045, 2363, 1524, 653, 342, 801, -70, -46, 443, 146, 313, 866, 568, -229, -117, 371, 122, -91, 687, 452, -422, -472, -429, -1845, -2229, -1790, -1607, -1542, -566, 83, -655, -934, -696, -1307, -2000, -1495, -1725, -2504, -2135, -1409, -1987, -1766, -1644, -2284, -2387, -1735, -1279, -2093, -1489, -759, -1081, -1231, -1062, -2155, -3508, -3003, -1968, -2244, -1516, -701, -1101, -1738, -592, -834, -1725, -1353, -1011, -1272, -998, -459, -1024, -1664, -1381, -1258, -1283, -694, -170, -630, -216, 867, 1121, -78, 251, -140, -1621, -1346, -168, 200, -542, 218, 983, 656, 501, 629, 270, -169, 644, 952, 891, 674, 629, 64, -265, 312, 114, -239, 171, 614, 1005]
1342A005P86L90p56q33K57m08m20M07L5l29N33R86j47j190K27K29m94K38J409
1361A925r5p77j6K07r66o8L20k85l28J083P20l63jK71m71K27j69q54j69P45l80
1382E56j82R22O01j482n35R87K39o04R85M73r09%Q00q40j393N96R4n48P14J009
1402A483q24k28Q12k27o26J58k84l67K41M85p15k27P87n05j130M71M97p87R73
1421a3R44m95o80P65p84j456J82P40p05j06J209M8o66K17K56o43j46L09n1j65
1441a240M11n16k27N69n49m59m71N85J40J88J095P6l72k11k43m96o06O18KQ4L66
1462a256M80k75n53O79Q8m84K42L52L42j12r5M7j82J13n09n95P04P12j16O92P6
1483C50K41k90NK49r47J76M93N7k10P48m6p57JR51n42k43R40l7k25L61K16m73
$$ y = [1005, 1791, 2181, 1425, 592, 849, 441, 21, 428, 463, 134, 667, 1653, 1506, 316, 543, 772, 278, 516, 1925, 1830, 1053, 1037, 1244, 278, 210, 530, 245, -83, 1000, 1720, 1357, 1356, 1627, 1156, 1383, 1214, 360, 191, 936, 556, 374, 1296, 1897, 415, -120, 867, 1106, 502, 1487, 1960, 1051, 1051, 1851, 1011, -382, 214, 308, -240, 474, 1483, 659, 431, 1243, 1016, 390, 548, 264, -103, 138, 623, -92, -319, 468, -37, -1167, -696, -199, -986, -13, 931, 436, -244, 521, -263, -1719, -1537, -797, -1502, -1608, -399, -351, -1017, -800, -544, -1187, -1333, -1024, -1075, -1240, -829, -1345, -1572, -1003, -1552, -2011, -2482, -1897, -1757, -1569, -474, -398, -770, -981, -1224, -1720, -2326, -1708, -1706, -1622, -1256, -776, -1051, -1604, -925, -837, -1321, -1079, -727, -385, -497, -592, -545, -727, -614, -1123, -1718, -1014, -302, -418, 274, 350, 591, 301, 306, 555, -392, -216, 277, 334, 124, 872, 826, 69, 70, 1021, 479, 236, 1176, 1139, 914, 1275, 1491, 1018]
1505A018o87N97k80m00O35J65o03P58M47k7m92L00o69n60P90L94l33j43R0k10
1525G90m52O06J13j022N85J181m46m27N01l99q13L67K56o45j04K29N41j34M65
1544A192J88r55m3Q8j14rN6j96K47L07l02o80J39M76o16J39J182j93k10j85K44
1565G55p39k10N19n73l65O64L34k16J05m6l16k66N64p4n59M13M96p39K08N68q32
1586c09r26M24L44p0K76M51j32l15J68j62n28J92k69q0K33K3q6r1N54n7p16J53
1608i23M18m24m11J027L1o54K27k29k81m36K86K36j1K78M37k34k72N4k63r4j34
1629a372M69l08L14Q6m29o8O10q0m73K74M54k12M92P6j91k16M75n03l22M60M5
1650d19j0M16P20l91n34L14K38p75K45P62j4l32M95J08m90k24J44M77K6K94l28
$$ y = [1018, 331, 928, 648, 248, 883, 1048, 445, 1203, 1650, 1623, 1131, 1431, 762, 202, 992, 1386, 1053, 910, 1000, 790, 338, 944, 1057, 35, 620, 1801, 1355, 928, 1429, 1030, 217, 584, 840, 195, 91, 320, 861, 727, 1192, 1380, 425, 382, 470, 356, 347, 403, 207, 454, 761, 459, -221, -82, 394, -222, -83, 1099, 906, 696, 511, 755, 16, -194, 325, -248, -613, 51, 385, 169, 274, 228, -88, -354, 210, 136, -423, -10, 486, -253, -45, 523, -309, -1235, -811, -467, -537, -261, 190, 58, -257, -89, -251, -779, -587, -856, -936, -703, -680, -766, -857, -303, -360, -1076, -923, -505, -929, -1340, -313, -282, -936, -709, -938, -1219, -1655, -1369, -1133, -1144, -866, -429, -663, -935, -881, -1144, -1238, -1372, -903, -1211, -897, -811, -1240, -1308, -698, -778, -1251, -977, -523, -735, -243, -167, -358, -574, -99, -602, -924, -464, -419, -429, -13, 707, 316, -218, 96, 334, -441, -196, 566, 552, 220, 715, 823, 333, 109, 253, 730, 756, 1050, 722]
1671G22o0N82k46j03N1L02p40n77R41O42o02j79Q90m75l76L65k1l03j8R7L83K96
1693A571k89p73j50O44n9n65K46O90p53j4Q46n74l34n2L09p9n60K98K2k2O2k96
1715A68Q1P5m38j96N35O14o44j29K92l24o96L49R05q29j14P58K8o07J92k20Ol14
1737e08N86l45k90J53mj48N24K95p08l57L86J44l38N41q1j9l18J8J17l91O1j58
1759h40L36M2J38k54L4J72q5n91O07M9l92R1K60L78o41K08n8J00n94L99J38l27
1781h30J44J24n8K30k54k48j46K41R9M6N08m15l54K21L28k82m4M99j61j84O2M08
1803f6n00j06J07J65j78K30L50m10j57Q74q19p2N52l02l88P37J90l57J59K95j99
1824A05m00M38K47n03J06P01m22J2M52k62j84J43K41m19Q3N35l03K0K88j70j17
$$ y = [722, 662, 1244, 998, 895, 946, 1248, 508, -69, 872, 1514, 912, 733, 1623, 1148, 772, 1137, 1116, 813, 795, 892, 1275, 1571, 1282, 509, 359, 1003, 944, 379, 625, 1315, 562, 548, 1394, 820, 486, 434, 743, 664, 104, 402, 424, 402, 464, 168, 249, 324, -114, -310, 225, 839, 195, 66, 358, 34, -662, -313, 592, -237, -351, 407, 435, -172, 20, -200, -194, -508, 78, -267, -557, -404, -408, -556, -32, 263, -445, -802, -416, -272, -610, -69, -150, -169, -487, -469, -352, -743, -682, -840, -504, -462, -324, -578, -544, -372, -457, -1048, -441, -392, -784, -693, -433, -55, -696, -488, -546, -446, -1040, -641, -503, -830, -686, -562, -620, -390, -644, -892, -1038, -797, -698, -652, -144, -559, -913, -692, -364, -646, -690, -191, -352, -536, -474, -66, -566, -672, -565, -400, -578, -348, 2, -408, -565, 309, -510, -582, -30, -332, -720, 17, 207, -150, 9, 304, 105, -295, 143, 390, -113, -7, 694, 272, 284, 736, 474, 290, 433, 674, 255, 338, 873, 570, 590, 878, 708, 591]
1845E91J29K6j05M8P8K40J98l3k9m71K37l96K50R0J76k2k51O5K85m35j75O02k98
1868H00OJ05q3k36j00J75j28l13K71j40k82L44o9Q7J45K27m26m89O42p5o51Q6
1890a04M66k22m24N82k65l24O1M59k31m18M42j03m45L16J18l39l14K64p3j75O88
1911d1k60k92m5K14k0j63j06o2K28J1J39k96J15K36l71Q1N23k02k79m7L39N4k70
1934e14M96m44m96L89J76j22m9l2J31K5M75K35j003L43M6m15L44J14k48K8N81
1955F0k60l29K90K76m13q5L74O9l01o3M47j39k40q7K27q08O87J7L19J6pj46l18
1978d14M37n1k86L99l6o02O05J76m46R1N44q6l20L33R1n30j4N95k79K27k02%m09
2001a77P0N72j89j88K52R3j68K39M7L35n84L23l12J74OR4j44j70O03j58k78L98
$$ y = [591, 720, 746, 641, 689, 767, 1007, 1205, 1172, 1143, 672, 909, 513, 763, 853, 1029, 1007, 756, 821, 1106, 671, 496, 1098, 800, 806, 911, 828, 592, 492, 667, 539, 226, 497, 357, 75, 419, 350, 437, 582, 809, 383, -106, 536, 461, -190, -104, 362, 140, -284, 298, 33, -291, -230, 229, -2, -420, 22, -81, -526, -210, -92, -431, -745, -481, -554, -729, -41, -301, -593, -638, -424, -444, -607, -713, -775, -547, -536, -397, -693, -578, -342, -713, -632, -109, -311, -590, -637, -298, -244, -514, -18, -462, -958, -569, -393, -515, -564, -596, -465, -440, 35, 270, -733, -390, -344, -759, -415, -301, -549, -521, 60, -200, -529, -239, 37, -376, -461, -87, -18, -319, -382, 65, -74, -314, -401, -174, -982, -295, -278, 41, 57, 50, -96, -414, 23, -28, -314, 85, 49, -553, 52, 228, -218, -127, 417, 331, 11, 344, 435, -95, -109, 486, 207, 434, 232, 232, -177, -107, 465, 276, 88, 340, 433, 265, 504, 551, 886, 302, 625, 313, 487, 493, 587, 443, 273, 876, 718, 440, 838]
2023H38j24n3m1K66j1o63O56m27l08L13N88m00j02L23j3j26l83K23j20k1L03j30
2045E88r6l79L21k96P9L7M2k23L36Q4m66L22k3j42m42O66m55n24M15kk87K42M34
2068B31k81k4j35L6r4M5m6l88M46j83k48K05j87K7m4R0J56k77J22K13Lk50O3K2
2092d98n73K07K62k78K37L91J34l80J0L70n38J36J87J39n69K97R6l79k0K05n3
2113f17J26J40M8J02Q7K56l83j0J40k52j9M55l88k00L20K74j84j41O02l43L8j02
2135e1M04j48j03j37K88l35p4j68L17O4K72k14p8M93o29k3M51Q0q10K61L17lj77
2158cL85N4n20K41M99m76k24M73j38l10J60J65l14K98n49M15K9M25p0l42L18K7
2180E43l21J43J34k03l57K58L85m36J22L17k66n9K74j7j82N1L80k94Oql0m7k07
$$ y = [838, 714, 661, 620, 886, 875, 212, 868, 441, 133, 446, 1034, 634, 532, 855, 842, 716, 333, 556, 436, 415, 718, 588, 492, 113, 434, 138, 217, 254, 296, 73, 409, 493, 27, 349, 326, 184, -258, 408, -47, -571, -156, -158, -445, -203, 231, -50, -74, -209, -173, -267, -222, -268, -656, -210, -393, -641, -436, -623, -596, -640, -550, -394, -671, -549, -336, -333, -583, -520, -498, -1071, -864, -602, -880, -643, -252, -118, -498, -488, -118, -656, -520, -333, -194, -763, -466, -370, -749, -769, -564, -617, -491, -351, -303, -201, -114, 142, -241, -251, -111, -363, -382, 73, -315, -515, -195, 79, -105, -246, 356, 13, 51, -51, 353, 205, 102, -35, 253, -82, -156, -324, -7, 57, 329, 115, 37, 530, -99, -122, 329, 409, -401, -140, 177, 174, -3, 382, 436, -84, 157, 656, 180, -44, 429, 291, -19, 141, 306, -8, 290, -259, 156, 185, 610, 540, 198, 516, 543, 222, 365, 499, 296, -61, 197, 582, 146, 268, 585, 319, 260, 534, 517, 335, 386, 766, 472, 478, 470, 440, 393, 186]
2203A86K41k00J10J40k11j1J93j47J32jm8J13N1k49o7k62J04J66l77K99P9Nl85
2226a39K23N16n38n7J46k75l15J54O9k20K86J15k07J03j1k07L05K55l21j20j28
2247c66J31n00J84J35n33K99J56K90k86J47L70l02j0k48L1L9j64j47L05p2R5k10
2269f56Q4J75J58O2j91k30M05m2j1k6j32k97L54Rj12J45J44J6k76M26l6l2l2p
2293a02l95N22k58j6J61o3J03J4J83k64J92L39l8n2p4j02n6k22Q5J97k81K89k7
2316A35L72j9m27J25r9L83k0k05j93J72j91j83O93k07k01J05k13J18m9L08k74
2337A30L84k26r8K68m92J18j4q3K66l7k7p6K35k49J69J6J92j3l27L5m9j27p6J43
2361F2J6j33L20k60j65P40k88J11j05j59n5pJ99j66K35n5k00k04L80k16j60K32
$$ y = [186, 427, 227, 337, 477, 266, 255, 448, 301, 433, 432, 384, 497, 548, 299, 232, -30, 74, 240, -137, 162, 241, 246, -139, 84, 600, 62, 5, 151, -124, -439, -285, -216, -436, -150, -35, -242, -139, -150, -357, -52, 203, -118, -238, -366, -235, -735, -551, -416, -949, -650, -494, -204, -490, -343, 27, -275, -285, -533, -502, -463, -627, -774, -469, -541, -446, -656, -572, -397, -239, -177, -368, -598, -193, -235, -246, -272, -404, -701, -347, -338, -450, -305, -161, -145, -421, 5, -31, -63, -95, -102, -497, 25, -233, -249, -88, -151, -48, -34, 149, -115, 77, 416, 378, 326, 252, 150, 94, -128, -43, 154, -127, 162, 135, 507, 488, 61, 186, 87, 470, 450, 245, 52, 224, 33, -150, 543, 336, 135, 240, 27, 145, 96, 404, 130, 514, 288, 190, 458, -34, 84, 70, -13, 253, 216, 189, 113, 348, 99, 268, 284, 476, 463, 136, 171, 122, -5, -81, 62, 78, -55, 265, 5, -160, 580, 292, 403, 298, 139, 84, 77, 276, 110, 345, 290, 90, -114, 266, 50, -110, 122]
2383A22j32K17o6J36j07j94K51k83k28O0M36m86M78r3M46n72P3J07m09K19J89
2404A64k34M2K3q0k56p5L25k66l16M92J78l10O0K84j88l48K54j7l21L82k66L63
2426a10k35K24L0k30N0j52r2J74M5o5j57L35l19p2K54j59J28M4L28N1l93K15k10
2449c16j74K48j35Ro3rK94K02k3p6lK5Q2N4l41K35l03Q1M26Lj92j44K40k90J08
2474f2L52j96K42j63K55j14m03J49j94J2L45l5j40K50R2j25n9J29n5j35j19M04
2496D30n1o8O9j40k73L44k33JkqJ17K6L85l23p9j04L5J87r7j29k07L77l04K33
2520A86K2k68K22k6l2K06j07qj3p4Nk67L38k08k07K81N4j11J43k4j4J4r2j70L49
2545A99j90r1L3j40K61k36R6K93k46k34K41K62k24j38J46q3m4o9P0J6N8R6J34
$$ y = [122, -10, 207, 141, 277, 170, -24, 227, -56, -284, -224, 212, -274, 204, 111, 557, -15, 58, 165, -244, -25, 164, -70, -28, -5, -85, -341, -416, -91, -357, -673, -181, -3, -313, -253, 31, -157, -505, -251, -268, -589, -207, -473, -110, -345, -121, -91, -321, -271, -423, -515, -341, -296, -361, -518, -183, -502, -574, -320, -479, -351, -307, 21, 72, -321, -106, -316, -490, -242, -377, -368, -431, -440, -146, 56, 33, -43, -46, -21, 61, 115, -226, 9, -294, -213, 213, 216, 24, -120, 120, -170, -62, 290, 94, 336, 173, 428, 314, -89, 60, -134, -122, 223, 188, 48, 298, 390, 265, 206, 335, 280, 145, 26, 430, 379, 311, 380, 240, -33, 311, 78, 79, 77, 69, 186, 212, 597, 274, 195, 91, 126, 313, 216, 87, -120, 257, -47, 186, 208, -60, 162, 136, 104, 310, 203, 195, 182, 108, 113, -154, 184, -24, -231, 50, 104, -7, 136, 112, 98, 112, 20, -150, 199, 9, -82, -49, -189, 72, -164, -68, 225, -21, -255, -14, 248, 24, -114, 32, -51, -95, -164, -94, -78, -20, 76, 210]
2568B10r2kJ63l95r1Q8j40L4J73j22r9J74k09k09J60J58j00J67j08J25Lj45J84
2591g3l01q0J73J17j01J67j94o8K55l6j81J42P5N1k73L93k12O3j12j4j79K25j61
2614c24P4M0k08L72k11J58k77K39k21K94J7K17m03K96k22l8K40j01J03n7j39M36
2636B85k54m0K25m7m24J43O3L18k36Q3L8k49J01K21o3l6j11J93M4l6K05j47k89
2659a3L3j06M04j17K7J94k04J67Q2l24J67j84J03N1q3n0L4J69k61J96j35r9L30
2682C81j62j29J8Q5R5m77O53m32LJ7k05K61k1L57k87j55o9L87m48j19J14J97m2
2705B2R7q2P7l29M05m6j10K3J85m17K92k32Q7K23r1j82j93K10LJ06k45K07k36
2728b26N1J42N5k72J60j77l9J48J21jNj16n7LJ31J70l03J14K84j64j14j89R6J2
$$ y = [210, 118, 116, 279, -116, -207, -119, -259, -225, -52, -174, -273, -99, -308, -517, -357, -199, -299, -132, -240, -115, -112, -257, -73, -374, -454, -281, -164, -265, -98, -292, -360, -105, -141, -322, -180, -105, -54, -327, 66, -146, -83, -195, -209, -388, -163, -324, -250, -210, -418, -46, -257, -99, -376, -137, -358, -64, -47, 170, -233, 63, -159, -197, 43, -58, 45, -12, -151, 285, 31, -9, 216, 169, -255, -112, -49, 269, 33, 116, 154, -95, 6, 227, 164, 128, 17, 210, 254, 218, 423, 276, -13, 20, -86, 318, 201, 228, 422, 218, 385, 467, 143, 310, 126, 229, 280, 197, 147, 181, 350, 89, 285, 150, 51, 381, 219, 90, 108, 193, 288, -189, 464, 32, 35, 52, -153, 108, 87, 444, 157, 2, -67, 320, -128, -247, -133, 64, 22, 119, 37, 114, -215, 190, 144, 34, 57, 242, -175, 117, -115, -28, 195, 104, -78, -271, -61, -58, 48, -197, 10, -226, -175, -33, 22, -250, -90, -267, -306, -158, -37, -38, -33, -149, -206, -203, -72, 98, -205, -91, 193, 29, -85, -274, -178, -166]
2752a66J2p5J75k96N45j56j97J33k1k73K64J9k90J47K48l15K17l82N40k05l5L2
2774g9m1k29N22n4Q5k57j66K80o5n6k35O45m4k92k65L70j90J11j3j39M8m3j35
2797b42Q4K57j95J39l12L57l42J81J70L4J18j62o7k57K35NJ03M4P5j17K19j33
2819A94m67K69J80r7J80p4n1j75R3K63j18j88N2J06j98K91K2l00o4L74K01k70
2841B23j47Oj99K44j93K86r1j1J5k24P5P5J1Q0j20K22J13k49Q5k52nJ4K11j79
2865a0J24K04l9j00O9k99j4j30j9M03k61r9J0P1J88nk40L19j65k05J82K84k80
2888a2j10k61p5R3M6K92n0k4L3r2J05n6M8j84L52k06P9J8k54N3j69K8J96Q0L2
2913c8k44Q6L52r5l62L50j6J09m13K66R0o7l2j34q3K6N7k9j55MJ62O9N5j8j05
$$ y = [-166, -154, -229, -54, -350, 195, 39, -158, -25, -46, -319, -55, -36, -326, -179, 69, -246, -29, -411, 129, -76, -111, -79, -120, -349, 173, 119, 204, -53, -219, 61, -4, -60, -295, 350, 306, 14, -251, 119, -71, 40, 27, -112, -64, -107, -242, -158, 99, -96, 43, -269, 88, -254, -73, 97, 131, 249, 87, 20, -237, -2, 3, 106, 150, 225, 108, 327, 194, -273, -4, 176, 79, 259, 185, 134, -41, 52, 315, 197, 9, 61, 167, -31, 260, 282, -18, -82, 292, 493, 223, 76, 82, -117, 127, -66, 220, 129, 118, 133, -91, -16, 59, 70, 150, 30, 252, 365, 116, 201, -51, -56, -42, 169, -10, 114, 318, 279, 179, 248, -51, -65, -195, -214, 189, -72, -171, -161, -90, 98, 93, -147, 172, 7, -198, -16, 268, -12, -122, -383, -458, -365, -319, -27, -77, -101, -68, -160, -55, -111, -63, -247, 105, -101, -22, -4, -258, -205, -374, -346, -150, -70, -38, -282, -196, 156, 61, -301, 49, 33, 142, -271, -5, 85, 18, -14, -148, -231, -205, -148, -177, -332, -328, -166, -97, -42, -60, -165]
2938a65K64j86J94Q6k25M9j77P5n3J95l36K94M4j28J10Nj9k75L28J42q5k27K42
2961A52l30J17J57j20L00r7o6J25n25M45k25k68L56p8M0O4K73m95L44J57l28J73
2983A71k64K36m7J60o6j27j91J87R0L2K91m95j55K26j23J25j93J78O5k19J79Q0
3005A40k07K63Q1O0l87K55R9j45qJ62j61k9K09q3k00j59n4M30l04K64P1k80k58
3028b41M58J56m99L5L25j71J49k75K65M8m70nM29j94K9j25J4J59n4j20O1j19L
3051a42OR2l9J64l3k9p3j99K4K92j47P3Oj0j46P7Q6j31k33K19J08j53j3oP8J95
3077F6l39l6K07m7k86M02Q2m19K67j58J91j3o7n3k39L73L8J1r4r2K17m34L44K36
3101A57l12m4r4M40j18l7J03M3j99K19k04J41J19l52OK34j13q3J3m0L7J3jj14
$$ y = [-165, 99, -87, 107, 193, -32, 17, -160, -85, -138, 57, -279, 15, 59, -69, 41, 46, 27, -248, 80, 222, 137, -90, 152, -178, -61, 96, -24, 276, 179, 113, 238, -287, 158, -67, -335, 21, -57, -17, 47, 320, -175, 169, 326, -2, 171, -93, 143, 96, 256, 190, 63, -128, 59, 149, 181, 472, -23, -178, 48, -75, 50, -143, 35, 100, -119, 60, 140, -67, 196, 277, 337, -50, 205, 304, 159, 151, 313, 152, 123, 332, 249, 49, -110, -164, 266, -38, 226, 297, 17, -241, 217, 373, -126, -91, 234, 63, 212, -63, 202, 250, -220, -225, 204, 10, 39, -86, -72, 87, 33, -87, -26, -145, -142, -136, -44, -83, 81, 48, 19, -54, -253, -229, 63, -84, -11, -5, -15, -161, -84, 2, -129, -362, -143, -35, -188, -201, -207, -129, 66, -273, -309, -102, -149, -435, -33, 49, -370, -103, -261, -70, -83, -150, -203, -442, -69, -31, -20, -114, -206, 11, -423, -79, 157, -155, -199, -293, 147, 29, -8, 95, 138, -61, 158, -46, 95, 214, -138, -132, 102, -11, -94, -81, -121, -84, -71, -72, -186]
3125a86L65j21L9M5l89R7K0J45j04J75o9j50K08N9n1J36J53l38J88k2j93R4k8
3148G3m4r2o6j30L68J40k65J87j44J98j00k81J62K04l31J93l62L68Q5j07p7K15
3170A94j23n4r5j21M41k54r6K40j82oK10M0j18O7K23j98k49L78j47N9j51J89k36
3193A1k27J96K14j71J45R4j53j80l5J95j42K8Q6K10l9j86l8m8l43K46J06J4J46
3216A29l04K55J21l54J41r7O5k28K58j00Q8j72l2j5J26R5m7nq9J13j38N8J23l69
3240c78K47J94j50j77J01M1P1k0j31J3J97k04j96L75k91j81P44o79L97JJ9k51
3262b58J94L03m24r4K90J03R0o8j62j04k12M77k98J18J97K4o8m07K19L1j05l9
3284a93K96k11J08OJ68k68K11j57m3J54K03l4k81K73l02j18K74j50p2j51J97L41
$$ y = [-186, 179, 58, 97, 142, -247, -150, -130, 15, -89, 86, 17, -133, 75, 134, 83, 219, 372, 34, 222, 200, 7, 101, 73, 29, -63, -129, -259, 109, 249, -16, 171, 27, 225, 125, -156, 6, 210, -121, 72, -290, 78, 163, 56, -21, 194, 71, 17, -78, -199, 242, -12, -108, 132, -50, -56, 154, 194, 76, 143, 366, 168, -81, 297, 150, 209, 58, 247, 11, -216, -20, 194, 23, 168, 262, 109, -71, -106, 89, -53, -25, 61, 271, 232, 46, 8, -40, -383, -137, -31, -17, 129, -175, 80, 201, -153, -12, -109, -44, -272, -14, -114, -26, -198, -230, -245, -119, -24, -71, -76, -165, -52, -190, -132, -9, -378, -131, 63, -87, -264, -163, -122, -51, -71, -202, -189, 8, -196, -392, -17, -308, -489, 255, -424, -27, -26, -7, -258, -64, 239, -185, -279, 11, 114, 204, 136, -26, -130, -342, 135, -163, -45, 152, 176, 108, -299, -80, -49, -154, -193, 103, -108, 0, 6, 174, -94, 117, -40, -83, 71, 274, 240, -41, 232, -70, -188, 86, -64, -136, -287, -90, 251]
3306B51l94J90r9j95L66j76K24m41J95M4J80l2O7kl77J05q5K31n0J62k72J90M
3329H6o9P1k45M56ql30J22j94L72j20j44J72J33k34j10K10j60L06m21K07p3p6
3351d9R1J4l56R4j09N51k15N0R5l83K32J36k6q2O0q8J81j14m1N4P9l24K27K40
3375C17m74K76k49J59j05K41j67J53q6j68K15k79L42l4m25L62N7l18K79p7r0J02
3397C1l14J72O0O9l3j47J75j63R7l6j47K6J54P3k16L06k80K07m06L62k15R5K42
3420A12m20K52Mm6J51j86J13k61M14o0k96p7Q9J75j21J24J12k59L94k73K79j66
3442E4k79K39p4R0o5k2j64L0L12r0KJ76K1l18J23j76J4J84J09l05J68J31k09O
3466d3K82Pk8j59j35R6M2N4o0j04M7J9j75P4K28m4j10J47Oj20J04n4O3P7j72j82
$$ y = [251, -143, 47, -52, -247, 119, -57, 167, -274, -79, -35, 145, 113, 180, 178, -199, -94, -179, 52, 2, 164, -108, 82, 86, 17, 88, -157, 299, 291, -39, 83, -111, 261, 141, -3, 169, 302, 68, -42, 168, 8, 314, -107, 100, 27, -49, 42, 56, -300, -206, -315, 236, 21, 71, 166, -217, 15, 151, 125, 43, 103, 15, 196, 82, 41, 95, 174, -150, 77, 317, -157, 119, -130, 29, -76, 165, -2, 151, 65, -103, 112, -167, 175, 141, -284, 78, 135, -183, 96, 19, -71, 31, -283, -111, -51, 18, -15, -162, 13, -150, -53, -89, -236, -210, -56, 17, -199, 107, -173, 34, -372, -10, -225, -130, 112, -308, -56, -52, -98, 53, -133, -20, -281, 133, 73, -223, -300, -211, -36, -157, -33, 79, -180, 214, -59, 220, 54, -225, 14, -60, 30, -35, -57, -221, -191, 121, 31, 33, 209, 230, -88, 35, -141, -127, 57, 166, -139, 29, 160, -49, -43, 239, 246, 218, 59, -76, 20, 62, 116, 56, -48, -1, 18, -157, -83, 145, 101, -9, 138, 144, 24, 128, 74, 137, 214, 42, -140]
3492a40L3K54J1j08l2J8j63L56p3R8j43M2j37p0K73m77L72n6JJ30m04K87M9k60
3516a39L65oJ0j79l7J65k26k2m8r8J54rL8Q1O3k11K7J47j22J08K8k69l9K02m9
3541f6J04j02O5p6J43l6j32J66p2n1J63r1k46L65j28j98K72ol13L98L14m59k75
3564b61M66n1l51K07K4R4l7j13M4l28P6J14J39l29K8j6L09n37K51o2K18j14L23
3587I4N9l92J56n1Q7J19j85jR7Qj74K51k15J83K6k52J04j93L07K3j32k46M82k13
3611e8M0j4K43m86J53J06j5Q7j84K93j40lP3j35j51M19l1k10j55K46k30J97N8
3634A03J83j99k65K53j14J03k99L96r0j40J38o4J3J69m6j01Jk98L89j4o5P1j24
3657@Q2j97J22L8L19k22j75q0J09J15j12K15j70l1N8q2Q9R5j5j0lJ4o7L9q7j43
$$ y = [-140, -107, 147, 158, 50, 18, 36, -127, 229, 156, 254, 111, 153, 16, -54, 219, -258, 114, 58, 59, 189, -215, 72, 121, -139, 226, 220, 230, 51, 14, 179, -47, -69, -117, -215, -61, -70, -32, 49, 112, -99, -72, 75, -47, 61, 89, -180, -219, -17, -66, 38, -64, 1, -75, 68, 32, -100, 66, -6, -57, 106, 15, -231, 134, 6, -192, 80, 74, -239, 159, 473, 14, -261, 205, 154, -197, 10, 34, 128, 91, -22, 22, -306, -230, -116, 23, -306, -278, -294, 15, -522, -271, -333, -115, -229, 94, 153, -239, -83, -134, -47, 72, -113, -114, -17, -9, -183, 68, -147, 36, 62, -190, -86, -279, 28, 51, -81, -327, 155, -58, -18, -32, 211, -275, -122, -16, -31, 56, -128, 165, 25, 22, 95, -40, -191, 228, 197, -13, -168, 78, -152, 45, 103, 286, 87, -178, 75, -39, 64, -235, 161, 71, -69, 69, 5, 18, 187, 141, 40, 41, -257, 132, 118, 53, 124, 0, 82, -115, 7, 45, 364, 142, -33, -113, -4, 111, -1, 214, 44, 13, 71, -11, 78, 173, 158, 148, 145, 159, 92, 131, 44, -99]
3683i9K14l0l41J48m3K49N0P8J90m02J75j37j62M58k39nNk99J71k13R4Q3J81q6
3707D0M6j95J2K82j96n5L8N9O7L3n29L16R2O0k92O22l20l41L17k95R3J32P4j04
3731d4j67J36J59l12K16k6j80K51k02J7K68N9q6k58J59P4O9k47J44j54QK18j02
3754@K8O4K11m46J48J9l48J66L37k90k2J08K69j08j39k74J33K2J19q8k9j97J07
3777b10j71M13k6j61R6M5p0o7L01r1n2k33K31J15q8L3q8K23j98k00K65J6q4Oj38
3802a33P2Q0k53K71K8nJ11k91j42K58J89l91L60M9k10K83k3k49K08j76J52l04
3824a16K46n5j21j21K20K0N1K08m74J68k39K18K49j21r4K22k01J02K5k50P3RM09
3847D28k20O3k59p6K20o7k18j7J71k43m9K63k3J49K5m25Q4K74k13j69P4p2K18
$$ y = [-99, 115, 85, -256, -108, -151, 98, 148, 226, 416, 14, 189, 52, -110, 348, 109, 104, 109, -190, -19, -232, -138, -55, 126, 40, 86, -109, -97, 185, -11, -66, -28, 31, 98, 131, -398, -82, 10, 70, -222, 400, 80, -261, 56, -239, -146, -14, 60, -44, -211, -75, 84, -228, -12, -38, -218, 33, -169, -152, 116, 175, 89, -169, -10, 64, 133, -114, 30, -124, -116, 102, 0, 28, 92, 303, -143, 5, 24, -324, -158, 179, -111, -133, -25, 244, 136, -3, -277, -144, -122, -3, -91, -120, -317, -210, -381, 32, 6, -155, -59, -14, -84, -151, 150, 59, 7, -226, 5, 120, 32, 65, -23, 200, 2, -198, 67, 83, -1, 5, -133, -61, 19, -234, 37, 65, 60, 171, -120, -262, -4, 185, -206, 154, 203, -7, 276, 253, 4, 212, 36, 188, -116, 130, 75, -46, -167, 53, 73, 124, 332, -142, 26, -213, 5, 254, 133, 39, 261, 60, 162, 187, -63, 10, 19, 428, 208, 271, 12, -64, 156, 89, -129, -146, 25, -218, -267, -4, -27, 122, 147, -278, -194, 80, -133, -302, -228, -300, -82]
3870h2J91k69Q6o9P8j12l9K63j90kJ91j36K81k91K87p6j95J93j48LK33q18K91
3893c30J38J97N8k57J28o0j94K62J96k52K43p7P8j3N7l66K74j16Q1j76K6K06r1
3916A2l13J98m1K9J44N0n6j36r6L06k01Q5K97k00l15L76k44Q7j44J83r3J10J90
3939B28l78J82l6p4J05P9k86K10j15K8J18p6j05p0L36L5r9l49M20J42l02jq7Q
3963h7K27o1J85j84r7J00o0J52o8L6j07j03J49k53L05j59N1K25l23K15p3m2j0
3986A8N9n5%J10or0J03n6KO7l73J97Kp1L74j47j63L00j00k54L5K33k74J69p9O0
4012F1R6j87P9Q9j68J28k76K53N4j95Q7J71o8P8j40J43l72L4L06l39m0J00K53
4035A47O6k57q9K25l4j07p7l4J13M3p9J37o1l97M82k5l69L73r9J20k48K37n9p8
$$ y = [-82, 109, -160, -74, -143, -65, -177, -216, 47, -143, -145, 46, -90, 191, -100, 187, 111, -84, 109, -39, -36, 197, -621, -330, -192, 5, 63, -194, -66, -126, -320, -58, 138, -114, 129, 52, 130, 117, 174, -192, 82, -34, 47, -129, -103, 103, 12, -301, -103, -144, -115, 29, 79, 23, -113, -209, 97, -104, -19, 278, 78, -237, 139, -105, -18, -162, 21, -72, 38, 228, -150, 32, -4, -78, 27, 106, -180, 30, -85, -57, 61, -15, -120, -190, 146, 181, 82, -267, 153, 295, -7, -8, -95, -87, 140, 79, 264, 80, -17, 83, 23, 175, 107, 143, 36, -67, 82, -171, 134, -25, 26, 251, -72, 143, 70, 28, 18, 77, 22, 22, 132, 126, 36, 139, 83, 85, 152, -221, -24, -22, -93, 281, 134, -29, 271, 171, -83, -48, 185, -89, 80, 1, 61, 157, -30, 49, 138, -30, 98, -178, 75, 129, -66, 21, 192, 124, 202, 62, 205, -167, -133, 173, -166, -206, -106, 147, 213, -44, -133, 92, 58, -49, -126, -160, -47, -4, -83, 54, -7, -404, 78, 53, -316, 57, -42, 78, -170, 67, 8, -70]
4059g0j14J05K2K19l11K72l40r7J43J82k10jN0J62j17j51J56Ll8r3J31N6j76Q4
4083a33K38r0j45L24l05n9J97j17j56M61l23Q7J54k22K67j75k48J92K3J0R6J61
4105B37j89NR9k80L33k45J15n0l8PJ55j13n6M1j12j07K03k7k2K61j66J50J83m23
4129c9N4J1J94n64M88j43J69j48O0n1J39k5k41M12m82L26n40M55R2m08K81K86
4151C26j06L0k70j07K17J1l0L24l83Q5N6k63K18J15j90J69j34J26k13J57j71R
4173b4J18L6l75J25K33j05K64j77rJ59l61J60n1p2L47k46L2j13K4j39J07p6J3
4196a30J86N6k32K49q1j16J22O6j28m4J66q0J38l08J63j05L8%Q7n3K41k43o6J77
4220A03k08L0R5l29j67J69K87l33M28J2K4Qj87m6j37J64k86K39L41l95J64n5K10
$$ y = [-70, -184, -79, -57, 162, -149, 123, -217, -314, -171, 11, -199, -200, -150, 12, -105, -256, -100, -97, -135, -228, -97, -41, -217, -133, 105, 15, -130, 194, -111, -170, 27, -90, -246, 215, -108, -21, 133, -89, 178, 3, -245, -53, -30, -20, 76, 237, 48, 53, 152, -128, 205, -40, 75, 25, -13, -6, 149, 36, -20, 21, -91, -198, 5, -22, -44, 217, 51, 201, 384, -39, 15, 26, 220, -344, 144, 1, 170, 22, 82, 31, 170, 145, -96, 316, -166, 160, -380, 75, 167, -241, 40, 326, 220, 250, -20, -127, 90, 101, 71, 395, 12, 97, 153, -110, 108, 223, 33, 202, 68, 194, -19, 138, -33, -24, 94, 130, -245, -120, 113, 8, 272, 95, 86, 245, -116, 44, -7, -79, 268, 22, 54, -59, -35, -174, -67, -143, -130, 56, 112, -120, 129, 48, -68, 54, 120, -8, -52, 114, 34, 172, -136, 27, -78, -40, -40, 47, -6, 235, -8, -74, 103, -105, -75, 20, -309, -476, -307, -20, -353, 75, 87, 111, 119, -68, -114, -251, -87, -373, -134, 207, -188, -24, -79, 131]
4243A31m50L56j85J20Q0j6j0N0o1Mk54K01l6l3Q7L0K9n6L14l75l5J53m1j35K40
4268A08m1oL9n4j28Q0J00K2j94n6k74L97rJ32p0M1j63J11K61J77n01N0p5K39k28
4293d2j41K57j4q1m6J63Kk7j12J11n3J05O9J93m33J29R4k30L41l69J76k32M38
4316B98k44p4J51k38j7M09l19j35J62K13l27L79k08N9j8m9n2l48N56l02M6p5L04
4339A71j77M1R2Rk36K49r8l13L14K0o1J0q4r6M8J72j68J85K24n03J24l1J74r1
4363b5L43l89j72n7L70q3j87R0K44q8m3J22m26J31J72KL4o2j30j08J99J19k98
4386b42M93P7k55j72k8lk92L78m1r5l4L10j22Q6k98J92L6J73j82j26jJ34j52J80
4410A6l8Q4l20K10L15l84o3J44j18N5L52m28K27m45M23o7J39j48k06K31p5o2M10
$$ y = [131, -319, 37, -148, -28, 52, 36, 26, 76, 15, 19, -235, -34, -70, -103, -16, 14, 43, -13, 301, -74, -109, 44, 3, -132, 108, 67, 61, 100, 46, -82, -2, 98, 120, -74, -130, -404, -7, -16, 116, 46, 87, -76, 35, 296, 473, -28, 22, -53, 186, -42, -183, 74, 60, -21, -67, 96, 98, 71, -41, 70, 17, 122, 191, 384, -49, 80, 174, -56, 285, -84, 92, -140, 298, 54, -20, 131, -107, -124, 285, -34, -169, -7, 206, -121, 258, 50, 109, 91, 42, -10, -358, 198, -104, -58, -133, 171, -6, 35, 127, 136, -100, 149, 51, -262, 52, 72, 11, 21, -63, -159, -111, 61, -107, 78, 302, -201, -77, -108, 66, -25, 318, -71, -243, -300, 70, -13, -200, -110, 134, 46, 3, 125, -301, -170, 2, 4, 38, -24, -154, -262, -63, 56, -242, 251, 328, 73, -99, -127, -130, -422, -44, -85, -180, -214, 96, -26, 60, -238, -46, -10, 163, -19, -145, -146, -12, -164, 16, -22, 62, -258, -48, 267, -117, -180, -36, -154, -99, 253, -175, 52, -393, 30, -37, 102, -46, -252, -21, -96, -158, 252]
4433B52j44J77l74M6j0K4O7J3J4m7mj15K66j66K98l84o6J96P9N3r7j45j30K97
4457A00k79K63q3J13p7q8j01J27O2K73k79J65j84L5K08j03J0m65K65J68j22J22
4479A30j63Q9k01O7j1J42k38J24K64j09R3k79J05N4P8k80L0N9j92J24j35L90k4
4502A17K3j45k08L05p8N1q1j54J93k9km6J22J2o1N4j96O8K10j87k32K25N0l4Q1
4527E8j49j80J46M0P0r4L2P8j66L5M55m18K92l6k81P0J89q7O6j15n6K06j16j67
4551a28j70J76J30krN9J30k99J49L4o3J89m18K09n8q4K04k25J18J64j57M0o9o3
4575a43J84k06O2j22Q6J83N9j96q5J15q8J94r2J72o9j15J81j43n8J06Q5l8q6M1
4599B7J1J65k63k5j71M7M08j25j18L1n2j33K65nP0j21J55j43j41J8M81k07k09
$$ y = [252, 108, 285, -89, -43, -53, -29, 38, 51, 65, 18, 14, -101, 165, -1, 297, -87, -153, 43, 122, 175, 78, -67, -197, 100, -179, 84, 1, 114, 37, -51, -152, -25, 37, 310, 31, 196, 12, 47, 255, 152, 162, -303, -38, 130, 8, 130, -33, 56, -145, -78, -89, 53, -185, -61, 203, 94, 187, -92, 13, 67, 145, -135, -105, -46, -238, -114, -249, 141, 117, 140, -5, -213, 92, 14, 65, -16, -170, 23, -6, -8, -54, 68, 80, 19, 73, -123, -55, 155, -32, -264, -39, 11, -23, 58, -91, -271, -125, -85, -15, -109, -77, 1, -165, -130, 325, -93, 199, 163, -118, -48, 141, 54, 120, 5, -51, 155, 39, -128, -298, -122, 8, 6, -3, 56, 186, -113, 36, 70, 7, 196, -222, -13, -71, -155, 49, -176, -58, 106, -51, -11, -80, -143, 41, -165, -103, -225, -139, 44, 103, -93, -178, -63, -151, 43, -49, 123, 54, -61, 120, -23, -81, 25, 110, 72, -14, 27, 38, 203, -60, -85, -256, -209, 199, 74, -44, -13, -65, -198, 67, 62, 132, 11, 166, 23, -118, -100, 381, 174, -35]
4622c5l3L14m00J52J59l11J41K39N8j10n6k14KnJ43J65j01P8j51M8j95L32j91
4645B9k50M14j91k8j17Oj13J86J15R0k44j24J81J88o2k30L6J57p8N7k64K29L15
4668C02l60K19j09j37l1o7J68J03M6n0k72L51l16j11J38P0K1K8l19M74k61NJ0
4691i8k13K13M0R0L2R6j84k28P3K94k36J91k85J19j05J30o6j90J32L71j01O1j67
4714c1j18J17J8k51K66M1j73K28k44R7lk29K78j56J9M9jQ2P0q3Q2k50J71M2k16
4739a95J25m44M44K04J13p0l00j68L14j65N3K68q6L8j85M5l39K40J42mj11J39
4761E8K41m82N6K60J01j63k5lr9M6j47L31l71R9K44J8k88J36j61J34J15J47j83
4784F4K87n3k12J0rN1k73J24r6R6Qj7R8k09M78m36J46O7Ok02L93k93K01o7pj78
$$ y = [-35, -68, 246, -154, -2, 157, -154, -13, 226, 284, 174, 118, -96, -94, -99, 44, 209, 108, 186, 35, 83, -112, 220, 29, -221, 193, 2, -26, -143, -137, -250, -64, 51, 141, -103, -227, -46, 142, 80, -150, -114, 43, -35, 22, -242, -13, 302, -58, 161, 52, -85, -116, -183, -15, 88, 134, 84, -188, 163, -153, -264, -126, -56, -35, -7, -326, 148, -113, -108, -98, -311, -98, -58, 32, 64, 160, -24, -252, -179, 115, -121, 70, -215, -96, -201, -71, -137, -327, -195, 176, 75, 136, -31, -149, -32, -14, -265, 1, 42, -131, 97, -147, -50, -53, -282, -4, -160, -141, -92, -93, -11, 59, -24, 58, -192, -21, 21, -195, -70, -514, -70, 134, 247, 177, -123, -291, 23, -142, -89, 179, 93, 131, -54, -9, -348, -108, 34, 30, -81, 58, 299, -183, -127, 133, 234, 71, 46, 43, -56, -10, -157, 174, -197, -98, 146, 164, -124, 12, -149, -15, 100, 247, 64, 351, 298, 86, 96, 87, 138, -135, -11, -107, -11, -3, -20, 78, -131, 347, -89, 57, 124, 130, -72, 321, 28, 229, 162, 155, -23]
4810b3p0K09O6k25J71K4p6K1k5j62k5K13k41L63j28O6l35M8J77q1R2j17M1J19
4834A02l51K30m1J21n15N41j9k12K04K3M5m21K50Q3j70jJ41l00J6L95m18J25Q4
4857h8J33j57j40L17l77K44P0l4n6rJ10j91J28k45K17j15J13J57j80J00k00J71
4879c2Lk01J63j85j45L89k04M50n43L14k50K89k98J65Q1l08L67k65O0N1j3L04
4901A92k35m0J16K9M1M9J0o7j70R7k3K41k93N00n76J69j25N1rJ07q3L9j40K54
4925A34J5j41J31k13K59k54J15l40J89J85j02J20P6l0K5j89j6K54k24J60q5j09
4947d0o0%K24l08L89j77J81m7K1j27oJ47K4k59J99j50o7P2j33J39k04L0J83p6
4971d5Q2r4MK53j91j28L98r5k67j03L34j11Kk20L60j23P9j28Q5j92j54L40o9J38
$$ y = [-23, -93, 116, 182, -43, 128, 152, 76, 97, 72, -90, -115, 98, -143, 220, 92, 158, -177, -129, 48, -33, 59, -58, -17, 102, -249, -19, -60, 61, -454, 87, 68, -144, 60, 83, 128, -293, -43, 40, -130, -131, 10, -290, -274, 121, -297, -172, -88, 45, -112, -252, 65, -312, -68, 2, -32, -88, -97, 13, -178, -50, -295, -78, -193, -80, 77, -103, -3, -203, -32, -29, -230, -67, -252, -397, -8, -212, 238, -305, 9, -241, 48, -250, -85, -4, -312, 55, -210, -150, -99, -112, 192, -43, -83, 33, 62, 103, 152, 162, 95, -75, 22, -1, 240, -53, 447, -129, 40, -85, -34, -43, 64, -19, 20, -120, 134, 149, 8, 139, -74, 185, -69, 46, -294, -105, 80, -22, 98, 174, 144, 169, -20, -36, 218, -6, 154, 69, -40, -100, -100, 124, -184, 205, 28, 209, 162, 183, 56, 50, 197, 221, -38, 161, 11, -56, 16, -117, 22, -182, -152, 31, -45, 37, -57, -53, 200, 9, -119, 279, 184, -83, -186, 148, 37, 39, -181, 179, 56, 135, 7, 92, -100, -254, 86, 17, 155]
4995A55l30J24K81j66r7j99K77L7J24l63L5r7K05k4o0K07j19k1k16K22j34J53
5017fk9J04k85K85l79L51k51K09Q3l52J82j57J95lm1J05L6k37o5j08j44L76m6
5040a77K18J5j47K1J24j77R7n8J45j70JM3k2j02J63n7L75l06j43R3K69m10K3J57
5064b5J60J87l50R4l29l2J85L71l52R3p4J71J17m18l9K76N3J15j71k07K98J03
5086B26k98L3J35M5l1m2K70l09j9M7k74J86qN0K44k77K2K3J19j38J14N5k54M5
5110c6P6l32N10j23OP0J00j33q0M2N8k56r6J47p1K60M6j04Q8k33K35m20M22k34
5134e8J13j09j08J53L2J67L1k82L38k41o6J66q4j13L79l55j06K82j18R1j67K13
5156A58j04j08J20P6k68K4J41L7J9n6l93K45j28J92nj83K26L66m37k31K20O9k46
$$ y = [155, -175, -51, 230, 64, -33, -232, 45, 82, 206, -157, -122, -219, -14, -38, -98, 109, -10, -31, -247, -25, -159, -6, -35, 69, -216, 69, -310, 41, -210, -1, 82, -270, -88, -245, -50, -53, -94, 11, 47, -190, -255, -363, -507, -131, -177, 41, 56, -91, -70, 54, -123, -26, -84, 61, -109, -108, -65, -87, -189, -26, -83, 292, -14, -157, -64, 205, -205, -182, -25, 135, 322, -28, 66, -263, -295, -110, 261, -91, 2, -72, 99, 216, -202, -241, 35, 88, 203, 32, -175, 123, 226, -72, -39, 96, 141, 110, 68, 338, 29, 10, 57, -217, -31, -39, 11, 255, -22, 0, 23, 142, 4, 118, 173, -81, -36, 40, -292, 218, 95, 101, 171, 271, 138, 58, 100, 158, -98, -194, -47, -118, 142, 188, 84, 172, -61, 174, -246, 176, -58, 55, -54, -162, -9, 23, 190, 221, -61, 277, 36, -30, 136, 52, -61, 318, -37, -143, 139, 21, 112, -55, 158, 54, -54, 66, 142, -126, -102, 39, 76, 95, 39, -354, -109, -237, -45, -50, -233, -7, 359, -78, -309, -89, -20, -266]
5179b66R2j32K90r0K1j52j09R8K96k09j13K30j6N4K7j51j68K95n5o9j05L04j20
5202d8P9j26j79K62j61L0L9J08j86M06l18L38k84j7k49K01j81K90K21l08J59j38
5224f2J06K20l29J06j69j60K60l39J62J53J99j1J5p0k36N3J79q4K71k93O6K7j21
5247e7N2q3K46Q7K2k79K87j74k06R7K01j51q9L84M7l14j1J35L5l55K69M9k96L60
5271B56k2j17j67L9M77m87J78j9j12K29j95K84o5j10n7P7k09J60l79L64L2j10
5293D7q0j93J33M13k20j5j37j07K21j6l16M02k89N9J34k22J69j12K69k56J98m4
5315C8k1j75j13L34j2k87P6K73l44K67j3K2j74O4QJ92l26K3K76m20K01j3M02k42
5339C6j79L10l87K48k84K31O9j16J62m35J41L37l48J13P9l10J49j79M70j42j63
$$ y = [-266, -174, -306, -16, -106, -85, -237, -346, -248, 48, -161, -274, -44, -60, -6, 21, -130, -298, -3, -58, -127, -232, 72, -48, 31, -95, -274, -12, -173, -143, -104, 4, -182, 224, -94, 244, -40, -57, -306, -105, -286, 4, 225, -83, 76, -62, 44, 264, -65, 41, -128, -288, -28, -367, -205, -52, 147, 136, 151, 81, -155, -102, 77, -7, 264, -29, 37, 64, -57, -5, -88, 158, 245, 267, -12, 275, 101, -105, -8, 193, 42, -47, 337, 384, 70, 59, 194, 229, -126, 143, 192, -104, 256, 234, 117, -50, -11, 466, -21, 157, 138, 26, 255, 60, 344, 279, 169, 112, 189, -20, 140, -239, 125, 157, 47, -33, -226, -93, 320, 100, 85, -52, -159, 62, 46, -270, 132, -157, -98, 36, -186, -17, -129, 140, -116, 82, 38, 17, -158, -271, 63, 51, -236, -160, 113, -231, 36, 23, 45, -129, -65, -57, 135, -191, -168, 108, -312, -111, -124, 278, 36, -143, 167, -220, 28, -256, -25, 44, -72, 90, -345, -204, 133, -215, -102, -23, -333, -184, -363, 107, -35, -198]
5360a98K33j46M6j22L27j22N0k46m9J67j55J27R2j4q3O0O5m18L09p8r5K33k08
5383b25M87k33j6pQN4k83M69l15oq9M1o2K60k03J01J18l86Q7K90j57j09P4K9j
5408g4J72j08L26l85L7oq4J09L08q0j93K99l65Q0J18k05J72K22m72O8K61j89o6
5431e5M26j09k3l65N6L28r8P3P1k29o4j16L77q6j46K10k7k49k46N17l02mO1K9
5455B9j26M9J93j60P0R3j94j05k9J69j0k20L46l1l66p4L94o6J64j25j04J64k60
5478a99J49J02k29J79K9m89K69J66J47j39N6o3r4j83J05M7q1J06m2J5O6R7j70
5501a56j3L4M1m8O4J9J2j55m7J77J07k74L11r3j45K25k72J93K72l32K3K57l11
5524a11q3J06j0r5Q1K9j11K19K09m14J56J68k94J36L5k24k04L52J42k86J04m11
$$ y = [-198, 35, -111, -65, -187, 140, 18, 68, -178, -227, -60, -215, -88, 4, -10, -93, -33, 32, -386, -77, -155, -250, -17, -225, 262, 29, 13, 6, 14, 68, -215, 254, -61, -67, -156, -115, -177, 83, -120, -19, 99, -287, -200, 90, -67, -176, -102, -73, -74, 98, -10, 316, -69, -32, -38, -122, -13, 295, 215, 22, 321, -44, 36, 154, -51, 121, 343, -129, -61, 200, 11, -55, 371, 262, 239, -126, -70, 258, 160, 233, 304, 75, 11, -105, 272, 186, 40, 250, 223, -26, -272, 245, -57, -61, 0, 29, -97, -48, 145, -15, 55, 148, -46, -151, -180, -11, -21, -241, 105, 74, -292, -366, 28, -38, 126, 1, -103, 61, -199, -50, 52, -177, 2, 31, -458, -189, -23, 124, -15, 41, -22, -116, -299, -194, -147, -228, -122, -164, -149, -83, 14, -156, -169, -135, -94, -142, -78, -59, -47, -202, -249, -72, 35, -239, 72, -21, -166, 59, -213, -20, 252, -80, -57, 200, -111, -194, -88, -98, -193, -112, -83, -194, 25, 234, -180, -24, 144, -150, -14, 21, -203, -407, -55, 87, -199, -95, -506]
5546e06O82l38l1LK06l49J78K24n9r8K96l97j06M88j17j83k52N62m4j27l3j11
5568a12lK54l34N78m14J48l89K74J63k59O4q7J8J81O7k90K23O0k10MK63q7J80
5591B92k90L22k70K34p2j81J78L0K0j82M8Q6R3r5j9j22Q0k40P7J66q0m7K36l83
5615a19M47l49jj03K23j1k5m9k12J61K21j39l63N87q2q2M8m66K26K84j99J1R9
5638A07r7R2J26l58j16K38J8J90n01L69j19J99l51p1L78j61j91J53j09r5J53k6
5660a72K05j97o1N4J08k63J41M6K6oK4o6J54k19L03j54j01L5j25N4K27j41N4Q0
5684Fm18M32j20J23n5l0j91j16K57j62K79j4j03o1R5K49n4l16K70o1j25k1K14
5707G8J35l24r6mL11k17L9lN4o9r3K89R7k03j57K28j48j8rm3N94m60K73k47J55
$$ y = [-506, 176, -162, -193, -190, 16, -333, -155, 69, 10, -88, 208, -189, -295, 193, 76, -107, -359, 203, 159, 32, -1, -112, -115, 139, -195, 383, -31, 117, -272, 2, 165, -94, -30, -117, -99, 82, 149, -141, 82, 142, -68, -64, 199, 112, 292, 2, 324, 54, 288, 216, 35, 213, 243, 263, 81, 129, 215, 308, 213, 194, 72, 152, -88, -11, 155, 75, 28, 264, -119, 328, -21, -22, -125, 98, 87, 62, 13, -199, -38, 183, 44, -319, 268, 186, 104, 152, -314, -88, 196, -3, 8, 107, 10, 102, 228, -130, -246, -8, 10, 200, -301, 68, -51, 148, -203, -274, 104, -57, -248, -95, -204, -299, -146, -172, 33, -164, -225, -171, -63, -326, -185, -139, -113, -119, -95, -161, -7, -226, 77, -77, -178, -143, -268, -214, 13, -128, -74, 6, -412, 20, -100, 23, -32, -62, -253, -369, -112, -274, 5, -9, -112, -173, -78, 171, 117, -199, 71, 10, -115, -136, 78, 213, -111, -207, -211, 100, -117, -78, -81, -27, -96, -189, 100, 197, -6, -163, 65, -83, -101, -110, -153, 441, -19, 254, 7, 162]
5732A62Ml22K99ql6J4q1m4j24N9L09k45R2j19L1K05Qj39k6k1N0J84k58J02Q8n4
5758A30J46k79j9J29j5j8Q7r2J98k27J08Qj06J13J9n4J00m2o9kn23K74J18j2j84
5783b12K67k78L64K44k53k5k14J82K67j2l23K31m03j20M36l11K9K80l43M39k59
5804a4m7p1J28k27K4J74l6J9J46j03o7k15L54k1r9j52J14N3k27L85l69L16k6m03
5828c64M44l34j2L40l82J43%J53j54K80l15J4M8K01K2O9k2p7j9k47p8K64k5l04
5852c55K25K1p9N8J30l4j43J87j88J27R1L6j78M24m34j51M9J15p9J42j5K34K97
5875D80o54M15k31J25l7j31O3K17l26K97l95J07J37J86p1k18J61p7k4J32m5K48
5897C59k06k17O4J17o6%O0j22J23M1J7l58L58j58M4mk35L52l22K15R2j29j08J6
$$ y = [162, 166, -156, 143, 135, 99, 113, 32, -12, -136, -77, 232, -13, 79, -40, -9, 196, 204, 65, 39, 18, 68, 252, -6, 96, 184, 130, 276, -3, -22, 107, 92, 74, 161, 69, 267, 40, 148, 156, 50, 163, 182, 128, 228, 186, 117, 115, -408, -134, -16, -28, -212, 55, -223, 141, 385, 132, 107, -107, 75, 342, 330, 7, 238, -165, -285, 151, -160, -131, 149, -194, 245, -14, -61, -132, -4, -231, -207, -33, -69, -50, 96, -7, -74, -289, 65, 44, -55, -207, -93, -40, -267, 118, -251, 65, 39, -364, 80, -254, -266, 74, -308, -165, -165, -12, -166, 114, -201, -187, -139, 62, 84, 153, 131, 54, 35, -212, -290, -26, -51, -355, -130, -109, -188, -130, 0, -34, -177, 10, -178, -51, 40, 76, -102, 322, -112, -263, -214, -99, -178, -36, -51, 183, 480, -174, 241, 10, 135, 98, -33, 30, 247, -79, 218, -177, -70, 67, 253, 182, -36, 125, 48, 24, 156, 111, 359, 153, -64, 0, 117, 51, 51, 111, -11, 112, 153, 170, -188, 170, 12, 56, 52, -183, 169, -153, 62, 154, 25, -83, -67]
5921f7J45K7R2j99K0K61Q9j14m00J67M1p8m7Q4K05j91K33j72p4J0L3J77k90L31
5945B83O9p5k20m8m7K15k04q1k1J24r0r5K7K49r1J09j87l8K79k06J37j97K2M01
5969C15m39L60m36K93L5k51k5J29j08K12j1k13J21j64J50Q6r0N8j55Q7J53n5j97
5992a45Q8m2K46l14j4P3o0J9k20L94k42J41pk9q9K01J5pj23j72J08k17J66L5Q3
6017a12J74k27J09m9J49p7j56K32k82J05P8j05J37r6K69j85K66m11K91k1l47K91
6039C3J41k46L4J78j04j93K33J63k68kL8J38j46j46m6J12q8K44k5K50m67M63j90
6062A06k27L4L70K3j58k52K62J94l14K95%k97M1J07o0j10N7J65j66l5J45O8l95
6085a47J49LL43K20m32k15J32K00l16L30k75M48m07o9k70L38Kk37K2K83k14J85
$$ y = [-67, 78, 105, 197, -2, 18, 279, 368, 254, -146, 21, 62, -16, -63, 21, 226, 35, 268, 96, 22, 32, 65, 242, -48, 283, 352, 277, 57, 9, -38, 177, -27, -108, -129, -5, -95, -190, -163, 86, -5, 104, -83, -121, 158, -48, 89, -108, -86, 315, -124, 236, -200, 93, 128, -123, -148, -19, -127, 85, 74, -139, -18, -182, -32, 54, -36, 22, -133, -46, 107, 52, -145, -57, -99, 147, -167, -181, -108, -168, -149, -369, 25, -217, -76, -83, -112, -201, 0, 15, 8, -115, -287, -179, -396, -230, -195, -112, 62, -165, -56, -105, 44, -33, -189, 43, -239, -134, -56, -161, -24, -120, 149, -36, 230, -181, 110, 89, -258, 33, 174, -72, -38, 140, 36, -157, 76, 239, -29, -31, 7, 145, -1, -147, -193, -81, -169, 75, 50, 300, -167, 296, 106, -121, -87, 283, 306, 148, -104, 158, 352, 38, 333, 333, 36, 77, 184, 124, 14, 71, 236, 70, 35, 180, 248, -147, 2, 5, 348, 568, 136, -79, 53, 253, -63, 267, -8, 440, 33, -36, -306, 32, 34, -203, -181, 102, -112, 73]
6107G3L6m4om10L47l4J77j59K09j16J57k79J26k21L54j15k56L60j97j22j8J61
6129B3L8j08k47K24rN1kj49L55j5m99J68PP3r7J28J50j99J43k8n3J86o0j34K20
6154A66l01K47r3k15k82K54N7P6j94N3j14L85j90K06j95K84l43j54M35j52QNJ55
6177I8m05K53q3k18J60J35k67K27j38L56j70M2k16J85l20J66J09Q5q8j27R5J05
6199a6K4j43J03j18J9j7K88j51r8M27k95k20J2q3L50l9J6K22l37j2K67nj64q1
6223e1K24j92K26k18j04J83J49j57J10R0k56j52K50N8j67M79l51j48O0j20J63
6244G6J7j27J11K46m07M02n00J13K34J02j28KJ06j91R9k36k0L64j9n20L86J42
6266B52j39l8j13R9M8l9k54Q0K95j64j09N2J36n9l5k6J06p3M5J25l1m34N0M60
$$ y = [73, 109, 65, 59, -351, -4, -38, 139, -20, 189, 73, 230, -49, 77, -144, 210, 95, -161, 199, 2, -120, -138, 23, 61, -47, -294, -70, -79, -28, -30, -179, 176, 161, -338, -170, -163, -90, -187, -59, 91, -108, 35, 7, -46, 140, 80, -54, 166, -135, 112, 19, -196, -478, -224, -167, -91, -285, -232, -346, 39, -151, 55, -140, 144, -199, -353, 82, -70, -62, -57, 98, -307, -54, -137, -355, -195, -60, -327, -100, -238, 118, -52, -10, -226, -41, -361, -195, -86, -1, -89, -216, -121, -16, 8, -135, -32, -150, -131, -148, 140, -11, -109, 318, 23, -197, -185, -268, 82, 43, 59, 281, -56, -68, 199, 194, 30, -51, 173, -19, 207, -11, -115, 68, 217, 60, 170, 260, 4, -148, 102, 160, -7, 472, 121, -27, 33, -87, 76, 93, -34, 77, 323, -84, 318, -182, -69, 165, 267, 139, 141, 247, 56, 155, -81, -101, 263, 244, -276, 110, 252, 113, 75, -38, 61, 109, 70, -184, -104, 191, 27, -82, -30, 106, 47, 12, -14, 92, 19, 64, 189, 158, -276, -226, 234]
6290B34n72K22q5Ok0M88l74q3J11J80l8j53p2n1M3K60j5J38k48M9j70j35Q0J91
6314a4K00m18O7J73P8j78J95k53J12j13o1j8L58k99J69m0n3o8O6k47K05lo6k8
6338b36K78l1J9k2j49J83l82K35k6n2K59l8l40L40l67K73l2L42l34L49k91k28
6360b50l0K07M6K18L8l24j48L81J39j71k61NL38Kk88J86q7l49L89J73Kj43Ll2
6384D4J95R5k62K2l73K31M9P8O9k04M2K09n8J04k40J41K4j81J27j46K3K9J73j25
6408F6RNj47K80j13j7J7J68j72R0%l23K43L2l58J31O5O3K03m09J19P7J93j96m9
6433b3K19l13K39qo8K27q6j17N5j79M1J17l96j01J10J41J78m2m9M5j04K95j74
6456Gj13j9O9J11k58J11r9j2M8J94j62K8j7k47K42N1j51r4M00l20p1N34m17K88
$$ y = [234, -338, -116, -201, -195, -215, 273, -101, -184, -73, 107, 69, -84, -156, -207, -164, 96, 81, 219, -29, 20, -150, -285, -205, -14, 186, -232, -165, 8, 86, -92, 103, -150, -38, -151, -212, -230, 128, -171, -2, -42, -95, -163, -97, -344, -139, -142, -208, -236, 42, 11, 30, 8, -141, 42, -340, -105, -131, -183, 76, 38, -302, 38, -329, -56, -88, 254, -80, 269, -22, -250, -280, -73, -27, 191, 229, -95, -243, 138, 277, 106, -155, -150, 188, 190, -98, 88, 1, -348, 41, 214, 216, 73, 76, 44, 239, 334, 72, 94, -279, -48, 1, 79, 148, -56, -14, 195, 137, 241, 1, 142, 166, -15, 112, -34, -11, 18, 191, 66, 75, 80, -67, 213, 100, 83, 100, 268, 96, 186, 186, -137, 106, 138, -220, -89, -24, 39, 242, -167, -48, 29, 222, 26, -23, 196, -117, 122, 114, 46, 273, 187, 70, 125, -54, -13, 104, -292, -393, -283, -142, 36, -6, -55, -10, -114, 181, 7, -106, -125, -56, 55, -203, -92, -191, -203, -155, 39, -123, -95, -112, -359, -117, -66, -217, -311, 89, -231, -302, 232, -185, 103]
6480A03m38J83Q2r5L4j12P1%J88k53J82j77L17l03P8n7J50J33k41L33j01j77p4
6503a74J26J9m6N0K75l07l8O3j59K36k39R5q4r5K53j9k84M11m2j8m2p9n9L17k60
6528a00J94J5q3o5j21K49l33K84j25L93k77rJ36l9o0r4J66j0K3k22L2K64k08J00
6552A10m07L07K36j45L8J75j22j64L3J05l59K95l10M61K9n5K1J16k61j15Q6j4
6574F0K48m39M77n46K65N9K36n06K72J05o8m9J03k44L67k47n5M2N1K65k58O3Q
6597B09j05j79K8M31k35j96K45k35R6J02L3l05L8j11J70L5M1Q2k06K18l03K04
6619E7Oj6r1j57L16j23j67P6j1l46M70J32j16k97J46N9j82%Q6K29k31K00l3j76
6643a69k24K25J11J65k75J17j07J85l33L02k48N01n56L44j46k34L27k55J19q9
$$ y = [103, -335, -152, -70, -165, -131, -243, -172, -172, 16, -237, -55, -232, 85, -218, -140, -197, -47, 86, -155, 178, 77, -100, -174, -48, -29, -75, -25, 250, -57, -95, -32, -191, 45, -194, -99, -183, -278, -25, -44, -328, 83, 41, 23, -19, -98, -157, 160, -100, 94, 109, 26, -39, -160, 89, -244, 40, -85, 308, 31, 22, 158, 119, 59, -35, 131, 121, 144, -78, -46, 218, 10, 110, -297, 10, 246, 101, 139, 314, 192, 28, 61, 166, -193, 102, -208, 253, 282, 227, 248, 364, 103, -12, 74, 60, 308, -131, 346, -200, 65, 124, 360, -146, 126, 231, 163, 114, 217, -27, 340, 93, 38, 80, 131, 396, 138, 201, 209, 104, -75, -47, 384, 149, -47, 198, -37, 59, 161, 194, -111, -73, -184, -14, 21, 62, 144, -62, 156, -147, 57, 63, 47, -44, -201, 115, -8, -175, -99, -110, -456, 14, 146, 30, -267, -121, -62, -244, -244, -158, 71, -160, 40, 7, -169, -393, -168, -57, 108, -167, -50, -157, 28, -305, -3, -251, 250, -306, 38, -108, -342, -15, -270, -151, -240]
6663b40L9j97J34J42K2j30K04K8j18K05l62K4K95k6j6MJ23k62K34k15JK0J83K4
6687A16N3k20k51L64nj1k10J93J1j16L72L2k67k92O3n2N14l19J6K46l1k18K23
6710B11n7L3l57J61K92k13R9r6O7q5m9N0J99k26l3J78K20o48O07j27L7l8l35K05
6734I5j94L35k05R1j01j24K58p0J17m6K1O9j33kj99N4Q3o8J20M16m91P9R5k29
6758b9j90K24r2L66l34R0p7L67m55j26O93m33J21k19Q3N4q3J52K9k15M02k35k99
6781b06J63O6k39K08l29K82l4N3J36k03r8K49j77p4K3j1K85k93R5j84J25K85m28
6804c06J82j80M49l45J5K01n5j61K5p2J00K30k29J24k70J64O6j56j03O31j72k03
6826f5K07l59K56k21P8q8K61q7k0J24j81J53N2Q0j94k8K9m9J07r0Q8j6k92n9M86
$$ y = [-240, -201, -398, -264, -122, -100, -230, -26, 2, -116, 89, -273, -249, 46, 20, 4, 8, 131, -131, 103, -112, -111, -91, 92, 116, 169, -51, -302, 62, 57, 46, -164, 29, 40, -76, 296, 328, 61, -231, -168, -220, 294, -25, -9, 237, 206, -12, 211, 154, 187, -170, -9, 283, 70, 169, 73, 140, 55, 6, 56, 255, 29, -4, 174, 394, -254, 353, 226, 263, 225, -110, 95, -99, 236, 31, 122, 21, -103, 155, 85, 202, 156, 177, 246, 113, 111, -88, -34, 49, -19, 101, 517, 26, 105, 200, -29, -219, 5, -87, 279, -55, 35, -42, 325, -130, -256, 437, 4, 125, -94, -11, 43, -40, 112, 141, -74, 328, 93, -206, -43, 23, -216, -8, -337, -55, -89, -36, 100, -103, -201, 48, -129, -203, -180, -191, 94, -199, -104, -288, -163, 122, -306, -124, -304, 145, -200, -185, 16, -39, -200, -175, -247, -147, 83, -146, -22, -292, -128, -62, -218, -321, 310, 138, -65, 142, -217, 39, -182, -104, -192, 69, -18, -38, 86, -95, 58, 110, 190, -4, -32, -3, -52, 55, -35, 53, 37, -255, -314, 172]
6851A72m9Q8q9K80m02l5o1K59k17j27N3J83j26m0M35k99J52o1KJ0j51J05m9j03
6875g0K65k00J51l0O4j89K33q5j20j59O93m99j37K28M6l56L29j72L65l47k48K69
6897C1J47M0j67J9J09l35L93j33r9o1p7L72j23K18k98j3L49n22J10k9P6K4r0k8
6921h7J22j89J06k6j31L20l6j14p5Q1j72L26R1j77M2M7k90K85k62Q0N5O4K6m34
6945c48M43P5j60K22o3k93N6rJ81l25j54K76P2j43J67J68k28O0q4j78J61j03k3
6968b30j07L45k86K69P1j25l07J75J28J71k93K74j70J3Q4j52p9L20J6k40Mj4L02
6991A69l10j7J21j71N0J78j48N8l43L78J14K32l65j39J13M5j87J78NK9P8q8J21
7014A01k40L44k44k1r8J91l00L68k08R8P2J34pp3J13j10k54L89l6j46j9K5l0J19
$$ y = [172, 123, 211, 122, 402, 0, -35, -96, 163, -54, -181, -128, 55, -71, -111, 324, 25, 177, 116, 118, 128, -23, 82, 33, -70, 195, -5, 146, 116, 180, -9, 224, 139, 19, -140, 553, 54, -83, 145, 191, -165, 164, -8, 357, 10, -238, 31, 178, 218, 51, 70, 179, -156, 237, 104, 5, -56, -133, 239, 116, 334, 36, 23, 372, -150, -40, -69, 7, 31, -59, -87, 35, -154, -48, -74, -205, 115, 79, -35, -110, -29, -201, 125, 216, 39, 81, 128, -162, 123, -139, -59, -4, 60, 86, -348, 95, 170, 10, 232, 169, -124, -68, -77, 104, -221, -375, -99, -27, -170, -3, 165, -63, -3, -87, -265, -104, -207, -230, -337, 8, -278, -9, 62, -63, -370, -195, -67, 104, -189, 85, -85, -72, 12, -140, -219, 101, 117, -123, -119, -133, 169, -141, -158, -37, -208, -158, 20, -128, -70, -413, -35, 79, 311, -54, -193, -80, -35, -222, -44, -39, -10, 68, -20, 101, -139, 205, -39, -60, -158, 33, -267, 101, -107, -9, 63, 197, 190, 117, 230, 120, -134, 255, 219, 73, 54, 79, 49, 168]
7038A68n8j60P3n4K09k74j6L66L2Jj14p9M5j26J43J6k65P1J78J74j99j43J22j92
7062h2J03P4j64K19k65j9L48M2j59j09J26m9K2PO3j59K72Km16p9N3L8L37j42k02
7087a39j95K71R7L0k57K84j62J7J37o7rJ4p6j4J00j13J56J2Kk76J6P8p6K00m8
7112a8l11L98l34J97Q0l0j42Q3j58L9l0J55R6j71K83k54K86r6n6k36L39k85J92
7135B7j93K03j98l1O7j75K25J02mj0L1j23K0k72L87l43L97m68L83j77O4J76l34
7158b46J85q8J26R7k58j1J14K09j56K5J8j8o8K38l31M6J0r4K66j8k41K07j21r1
7182b00J76p2K58l65kL92j00NJ60j96j11J23K44k22k1j69K88l28K81N4j17L44
7204D22k16J39o2j27Mk73N58k76l20L64k35k5J07K17%m62L28j7J91l0M3j64r5
$$ y = [168, 110, -50, 23, -31, 178, -96, -112, 254, 286, 287, 173, 94, 139, 13, 156, 172, -93, -22, 156, 330, 131, -12, 110, -82, 21, 95, -69, 150, -115, -134, 214, 256, 97, -12, 114, 65, 87, 94, 157, -2, 270, 272, -144, -223, -170, -132, 205, 63, -139, -334, -63, 34, 64, -193, 91, -71, -54, 83, 16, 7, 21, -55, -69, 31, -82, 74, 86, 88, -188, -172, -94, -170, 30, -18, -329, 69, -265, -68, 12, -18, -160, -77, -235, -196, -226, -71, 25, -146, 137, -117, 169, 73, 17, -219, 120, -165, 27, -166, 37, -161, -192, -125, -300, -75, 27, 23, 13, 44, -79, -59, -331, 56, -287, 110, -358, 25, -152, -88, 88, -246, -61, -149, -23, 74, -184, -195, -81, 128, -28, -3, 15, -3, -71, 167, -164, -118, -108, -202, 64, 46, -195, 12, -109, -200, -24, -96, 162, -203, -205, 187, 87, 92, 252, 56, -55, 68, 312, 90, 69, -100, 188, -140, 141, 195, 78, 422, 206, 345, 283, 156, 160, -113, 445, 169, -151, 213, -22, -47, 60, 277, 277, -185, 143, 126, 317, 287, 330, 166, 71]
7227G1O3j55j6J44KK14j36j18j12k8M50L0l87j24J75j44J70P0l19N1j25J81J23
7250H0k2K9Km4m4J56l22j17M27j40n3J6J3R2j28J10k64J70j19J76N0p7Q0o0j58
7275a47J04%m20M27J36k91j1K83j59L4l2O5j64pJ93JK9Q8k14l1RK3J63k08MJ49
7301B4j66J67j92K1j18M29l24k6K8O3N3M7Q9k15j46L2L94j08k07N9J6N6K4MJ72
7326A76l7%N1Kn4j75j53J84r5K43j97l3K13p4j32o4K70j14j34j25Q0J30m1J53
7350G4j80R8o1j19J11J38p4K8j39J06J14q7J76Q4n13M68l13l1J50N2J26p3j94
7373e9K2K04k63l8J9J00J8O0K00j25j65O6J34k10J81J22k35l0O4J62l9l55L44
7396A77j57P0N8l30N27l07j59J83K36k36j32j6J45j09K74q1j36J15p1P8k24K90
$$ y = [71, 134, -21, -37, 107, 109, 323, 187, 69, -43, -71, 379, 409, 22, -102, 73, -71, 99, 169, -150, -99, -224, -43, 80, 58, 87, 89, 45, 1, 157, -165, -282, 145, 5, -48, -32, -19, 73, -55, 55, -209, -39, -158, 18, 68, -9, 71, 11, -147, -43, -43, -463, -36, 100, -191, -202, 81, -78, -44, -76, -11, -175, -182, 11, 12, 41, 129, -85, -116, -107, -84, 79, -129, -125, 24, -142, 25, -167, -146, -264, 165, -159, -185, -157, -94, -41, 6, 95, -120, -266, -234, 160, 52, -155, -96, -80, -24, 0, 4, 176, 139, 139, 190, 192, 138, -37, -190, -6, -101, 142, -55, -88, 125, 51, -81, -145, 125, 11, -123, -248, -168, -38, -79, 74, -106, -8, -69, -188, -77, 61, -13, 15, -124, -18, 96, 9, 185, 269, -244, 224, -89, -120, 30, 82, 208, 135, -59, -37, 167, -96, -134, -115, -15, 3, 63, 263, 138, -27, 39, 173, -37, 144, 266, 31, 1, 65, 227, 188, -167, 177, 20, 90, 148, -182, 345, 38, -121, 62, 298, 62, -70, -86, 59, -50, 224, 143, 7, 122, 51, 129, -95, 195]
7418A95n3l86J50l7N01m78M75k57j21Q7j78K46r5k98J2J13J62j54J57m64K08J52
7440f3j77L39j40n4j71K80l4j51K40r6j26J73q9P3k27r6n6M30l7r8m5kP0J59l28
7465b26J17nL2q7N1j58K89o7KK60l31R5o1J96j38p9J48l3L2J90o5j36J35j32n2
7490b3j38jp1J06J59j08J9Q6j10K53j40N0l6n1O1k4r0n7j56L39NJ22r8P9k9j08
7516C9K1j61K9J11%J12j4j43J88j48j64Q2L29m28j83M63Qo1j64pK21N5k55J6J6
7541c8K8j82P1J01M4k2l7J30J60k01m2J34j8J66O7j64l81K43P3r8J18l48L48m3
7565A09K28m28K31L0o6O1k53K45j67J15l09M6L43k78J10K0l66L42p8l5M9J53K9
7588A31j35j12m7L79k91L22l72j20PK8R6R1o1K36pk13J8o9K10k86j9K17j43j70
$$ y = [195, 142, -244, -94, -131, 370, -108, 367, 110, -11, 76, -102, 144, 49, -249, -237, -124, 38, -116, 41, -423, -215, -63, -240, 99, -41, -95, -266, 14, -20, -171, 69, -27, -153, 20, -69, 4, -223, -319, -375, 55, 18, -80, -125, -127, -57, 102, -226, -109, -114, -82, -169, -118, -276, 13, -54, -52, 208, -123, -28, -89, 107, -31, -110, 38, 5, 37, 227, 162, 26, 161, 29, -23, -161, -162, -233, -127, 32, -76, -57, 29, -81, 172, 32, 82, 46, -5, 56, 32, -58, -115, -271, 68, 73, 195, 97, 176, 147, 39, 60, -101, -72, 39, 39, 151, 137, -6, 182, 34, -130, -48, 281, -147, -330, 133, 141, 80, -84, -91, 130, 185, -70, -54, -38, -10, -192, -121, -20, 24, 2, -35, 95, 255, 54, 12, 146, 128, 294, 361, 197, -184, 59, 132, 34, 152, -196, 152, 109, 337, -91, 140, 170, 104, 165, -88, 157, -10, 105, -204, -158, 185, -93, 17, 37, -329, 13, -65, -100, -51, 102, 131, -4, -116, -163, 216, -75, 247, -125, -245, -238, -210, -114, -23, -84, 152, 145, -68, -50, -119, 91, -195, -214, 3, -140, -310]
7612c10L42j3j06k1L4l2k06J22R1n0m3K00P3k11J90k12j85M7M22n3l15R8J05l9
7636g2j44K37m4M0J08j08j52M1P5J08k02O1L58l00J64j12q4j05m2M59j10p6j16
7659a6p8J49j04P8O6J25k99J68P1j90m9J81m0N1k01K28n0M6k60R4o1J36j5K9j15
7684e6J51j69R4J52r4j72L80j61J70k04p4j4n5K64j18j33k1J80j72N4R4j64R9
7707C1Q9K4k22P0l2J57o7K8M1O9j05j99K51J31J5k77j7P8n9J35j83n4J38r9M51
7732C94o24J98l6K66j67j50J60k09Q8j1K25k2k5j37J94j50l1K74l31J44J58k61
7754e3J89k06J54%L5j33L28l52K02j84j19J17Qk88L8J09K1N2p7M9R8J19m92L98
7778A3n60K52L30l8J83j98k72K27k97L11k64K70L08m66L14l21P0K80m92J67L97
$$ y = [-310, 32, 19, -87, -108, -74, -106, -312, -190, -99, -149, -192, 8, 81, -130, 60, -152, -337, -290, 132, 79, -236, -138, -33, -72, -216, 21, -23, 17, 125, 17, -135, -94, -19, 89, -113, -52, 306, 6, 170, 58, -26, -131, -173, 286, 176, 100, -16, -94, 55, -49, 29, 95, 220, -79, 89, 160, -30, -79, 102, 62, 113, -88, 140, 90, 136, -124, -30, -91, 45, 30, 59, -56, 95, -74, 20, 172, 78, -94, 286, 125, 295, 91, 17, 3, -52, 212, 94, -39, -60, 120, -52, 2, 96, -68, 31, 120, 144, -78, -8, -40, 117, 50, 78, 119, 188, 83, -116, 135, 266, 281, 4, -13, 65, 6, 141, -42, -96, 42, -57, 394, -230, -32, -68, 198, 31, -119, 41, -168, -80, -91, 134, 112, 87, -50, 144, -6, -37, 237, -94, 50, 208, -53, 136, -70, 84, 84, 119, -14, 314, -38, 164, -20, -139, -22, -14, -302, -264, -155, -134, -82, -159, -110, -12, 107, -385, 13, -547, -295, 35, -3, 180, -18, -290, -63, -360, -49, -313, -43, 265, -201, 113, -208, -138, 142, -350, -183, 214]
7799B14o95P72m28K13j27Qj63P3K32O6j40k87K52n5M1k6j0J65j28L5k58L10j18
7822e4j91L25j96K40k45K77k32o5K18j49L52l44R6Q0o5k4N5j9j81J26Q8N2j79
7845c5N5K41j87J40j19r0J18k23L20N5%j85j12l6N7m2N6kj76K88K04k98P3l00
7869a98L18j45J65n9j15p5N58o82K45j82L61j33j91J28m7L3J98q3j56J12j56N4
7891e0o3R6n1J19Q5Nm37K57M5O1k47j43L24Q1j15K11l81J77L8J33k11P8k45N7
7915a76J73j09j17O9K19n2m5K21l0j25J01j60L8o8M8j44K23l17J30M6J32qk40
7938a91J10J90k59K11pk93K95j40l9q1R6J00j07j4J10l5J47k19K69l67J82j24
7960a66j41K78l16K19K47k24J38l9J2n81N16jk03J51J04j6l6k8K83l93L15O4k94
$$ y = [214, -481, 291, -137, 76, -51, -43, -206, -133, 99, 165, 25, -262, -10, -65, -24, -50, -60, 105, -23, 12, -246, 64, -54, -245, 80, -116, 124, -121, 156, -76, -141, 77, -72, 280, -64, 32, 112, 47, 23, 78, 59, -122, 4, 92, 144, -35, 20, 261, 74, 214, 95, 5, 123, -100, 220, 275, 275, 90, -22, -58, -1, -43, 13, 11, -165, 123, 327, 29, 102, -198, 120, -25, 140, 81, -34, -109, 449, -233, 12, -170, 191, 58, -133, -5, -52, -19, 179, 96, -60, 52, -104, -50, -113, -17, -68, 51, 136, 141, -296, -39, 6, 67, -180, -323, 1, 82, -33, 178, -203, -26, 12, 145, -66, 12, -233, -176, -3, -112, -229, -160, 59, 7, -38, 183, 153, 28, 129, -31, 7, -61, -13, -157, 66, -251, -121, -75, 57, 49, -191, -81, 109, -150, 61, 54, -239, 56, -84, -123, -204, -108, -8, -115, -129, -19, -54, 93, -126, 143, -224, -42, -166, -307, -29, -345, -126, 121, -103, 35, -4, 8, -573, -57, -58, -261, -110, -6, -22, -58, -86, 197, -196, 119, 183, -111]
7983a11N0L1K3j69K77j40J54k20K78Mj15l2R9j08j43J18Q2j52J72mP6l8p4O5m91
8008c68L42K1R9K99n91J66J21M3j94j24K92J61j67J6J33M8k13O3j48M0J75o7l3
8031A14j30K23j41O5rQ3nj70o0K5m8o8j88J59O9J89p8n9k0o9J98j09K79r7p6J19
8057A96j53k1j42R2j85J36K57j37k41L54J05l12mJ70j69J16k23M29j53p6j47R2
8079a6K10l97l5J21P6j97L54k78J23J26M3k39J25m6r9M03l07j50K77l7L8l7P5
8102A33l36p2J58J8o6J72J61k34K30j28m7R4j32L5J38k49J74k03K23m5k64L72
8124A32j83k34K20P4l29K68J04j4k24J50j79J79J37j99l8k4K66o5k29K68oj9k72
8147b17J05k40L10P6l4Kk3K7K12k42l4L59l74jM2K6J7l48K72K16j08K40l10K19
$$ y = [-111, -61, -30, -7, -176, 101, -39, 115, -105, 173, 177, 62, 30, 129, 21, -122, -4, 78, -74, 98, 94, 170, 132, 58, 123, -368, -26, -5, 94, 393, -198, -32, 89, 132, -62, -186, 106, 267, 100, 116, 249, 297, 84, 147, -1, 39, 214, 147, 114, -16, 207, 66, 131, 122, 205, 200, 30, -30, -5, -53, -121, -309, -150, -81, 108, 30, -29, -49, -118, 80, -29, 250, 153, 77, 196, 43, 22, -120, -28, -213, -77, 180, 43, -198, 156, 261, -51, -55, 115, -54, 62, -161, 268, 115, 39, -108, -16, 194, -203, -238, -117, -41, -238, 116, -162, -39, 87, 130, -109, 16, -30, -129, 274, -33, -183, 94, 57, 95, 58, 133, -203, -275, -117, -99, -165, 7, 168, -66, 164, 36, -11, 83, -49, -14, 124, -125, 49, -154, 69, 24, -240, 132, -51, -285, -65, 9, -320, -52, 52, 38, -186, -36, -215, -36, 101, -98, -136, -160, 106, 41, -188, 80, 74, 55, -217, -112, -352, -42, 34, 0, 2, -21, 6, 218, -24, -58, 301, -73, -74, -32, -6, 11, -337, -65, 151, 43, 283, -27, 192]
8171A92j37k9R5k33K77p6J28j67J39k07qr9K12K0r8K80k16j02J96j38
$$ y = [192, 55, 26, 121, -112, 165, 89, 217, 50, 189, -18, -26, -125, 87, 107, 9, 289, 73, -29, 167, 29]
8191B9
$$ Imaginary data points
##PAGE= N=2
##DATA TABLE= (X++(I..I)), XYDATA
0@%%%%%%%%%%%%%%%%%qJ6j6J6j6J6k4L2l2L9m7N1n9O7p5Q7r8J09j24J40j57J74
39I1j94K18k42K67k95L26l60L99m41M85n35N89o46P13p88Q71r66J073j197J340
59G08j510J716j969K290k711L291m142N513q072J4398n5800q8681J41655L2300
73C8986r5059J5383Q9882l1245n6645K0579J9955k2243J678R951p576J083J1774
86c497j2407j4545J1058J3667q250q183l443n738M791K7366J7672j1151j5552
99h212j922j3363k4509O140L5657M723j9279J5241K5234k5050l0368J9820J8299
112B411j6099J284K3530o753k5702R57J5343M142J131o187j8276J157K8646L623
126I207j9865K0856L3282l3305m6948K3959K8217l5544j4868M9452K2093l2749
$$ y = [0, 0, 0, 0, 0, 0, 0, 0, 0, 0, 0, 0, 0, 0, 0, 0, 0, 0, -8, 8, -8, 8, -8, 8, -16, 16, -16, 23, -24, 27, -32, 35, -40, 47, -51, 58, -66, 74, -83, 91, -103, 115, -127, 140, -155, 171, -189, 210, -231, 254, -281, 308, -338, 375, -413, 458, -508, 565, -632, 708, -802, 914, -1055, 1235, -1476, 1815, -2327, 3186, -4886, 9512, -46288, -134969, 6686, 38986, -56073, -40690, 49192, 17947, -38698, -18119, 1836, -20407, -18729, -8778, -16354, -15271, -3497, -15904, -30449, -19391, -5724, -13974, -22157, -25600, -31338, -26547, 819, 18491, 7340, -8212, -10134, -23497, -48006, -41866, -6209, -1486, -20765, -5524, 19710, -5340, -35708, -15888, 2411, -13688, -12404, 11126, 4373, -21329, -20372, -5029, -887, 244, -5943, -24219, -23062, 5584, 9207, -10658, 10198, 43480, 10175, -36773, -12814, 15403, -20141, -35009, 14443, 36536, 3787]
138C787j1622J3083j0591p436K5285R141k1352J372J6932j7036j8458K3839J4469
151B1413k5573r069J9114k460j0133J7108R739j1061Q038J0483k8498k3799K1889
164b809J5075j6650P826K6650j5177l0892J2166J9088j2355k919K0648L23j8351
177B623k16Q099n920o446O749M811n356m363J060M83M101J2878N807j1048q619
192D643K039n924r260J1133J6012o821r630O474l370j2449Q363J5101p108l708
206E495J6970m182k7255J665K3030p375j6148J4716Q339k1753n466K0132K310
219A0478p787J1069K993k0157l462J3625q347r103J8209O526k2521k892J4828
232C459r494j0735K2697J2019k0626m077J4081j1591j7530J5925J4318j5119p025
$$ y = [3787, -7835, 5248, -5343, -12779, 12506, 21647, 295, 1667, 18599, 1563, -16895, 6944, 21413, -4160, -13229, 5885, 3425, -6708, 10400, 20139, 9078, 17116, 27599, -899, -24698, -2809, 12266, -4384, 3442, 30092, 14915, -15977, -3811, 15277, 2922, 3, 20651, 20974, 2623, 2407, 10506, 4586, -1860, 4889, 9700, 4344, -19, 1041, 1524, 5625, 18503, 24310, 13262, 4643, 6682, 758, -8502, 2631, 18643, 11822, 2192, 8666, 5296, -7153, 1210, 16311, 9203, 5495, 22465, 18283, -8972, -7307, 15723, 8348, -7800, 6916, 15255, -6498, -11964, 8168, 10478, 2691, 13760, 16753, -3404, -6866, 6759, -1588, -10691, 7518, 14044, -8477, -11369, 3459, -6035, -16770, 5927, 17946, -2680, -6757, 7324, -4267, -21797, -5872, 8446, -6673, -13698]
245a3698J1883m114j4508P513J4398m100l520O941l283j1786J410P042k861k369
259a1052M888k875r919J489R553j28k85Q613J456j2059n920O926N48m480O935
274f310Q786q905j0760N379L314p299N544J5696k577j1039N901M928j2539j646
288a1527J5021k481j4423O254Q788j1525p95J9421J444j3920M788P767j4754n980
302a1922J7971M133j1057N279O678j4772q620J2760L988o703R375J1231j0139
315H202q533Q473O47j0281L358Q368o977p420P231M677m896K964Q244l831q295
330A931J433J824l967K483R582j35p450j936j717n939J56Q700L550k336L707K843
346A2729p567m980N804R36p539J87Q157l331r623N720J0483m777n661O816p6j2186
$$ y = [-13698, -1815, -5929, -20437, -12924, 1474, -2626, -6146, 795, -2488, -14274, -12864, -5822, -8683, -11052, -6164, -9039, -18958, -17469, -7916, -8044, -8329, 284, 1740, -10319, -16239, -9313, -8765, -13245, -6310, 2476, -6429, -17189, -11810, -8496, -15795, -10251, 5445, 2868, -8171, -2270, 2658, -9881, -11527, 3494, 1013, -13410, -7156, 1632, -9893, -10688, 8733, 10177, -3743, 1045, 8812, -5942, -11922, 6049, 10182, -875, 4404, 11082, -3690, -12310, 450, 4438, -2265, 7110, 18341, 8202, -331, 8142, 8789, -1492, 1866, 10234, 3257, -4163, 3068, 7745, 2849, 5813, 14057, 10226, 1931, 3364, 5188, 1221, 3704, 13286, 13151, 5701, 3765, 2048, -3891, -3735, 4965, 8515, 6179, 9886, 12729, 5162, 182, 5986, 6922, -617, -430, 7727, 4396, -5227, 493, 10976, 6199, 538, 7354, 7278, -4908]
362d908J369J2287j175m860P122r21j5209j82J0259o254n231J4957O844j1981
376B117q47Q479q541r157J1319N217j1379k99Q380o358m812J1947L071j2763q14
391d440Q270m086n152Q371M534o414m88K682o772n431L252Q32n23Q023N034p844
407a52n699M511O68n018J297M370k894m377J872L617o18k702l27M55r51K78J166
424d504r32j198M699M338n071o356L14q89m395M802J0212j914p546K485L973m900
440f882j700M778j361l883N399L253o983j699O224k338m696O817M166r361k302
455a0568J0754K660m452K325L21q750r77P771q96l737O370L337o436J079O587
470E388m918o552O199N983l159q06K579m509k919N901K934m145q74K151j282N35
$$ y = [-4908, -3539, 8748, 7573, 2713, 9835, 8914, -6295, -6477, 3782, -2472, -7703, 7254, 14098, 2117, 1270, 9749, 1208, -7949, 3370, 8587, -2792, -3091, 5289, -1069, -5881, 6066, 9137, -3626, -4440, 3830, -256, -5408, 2963, 7497, 1083, 595, 3277, -3495, -8926, -5674, -4842, -5365, 2658, 7692, -152, -5851, -1340, -672, -5690, -4393, -23, -2917, -7294, -5422, -1805, -2423, -5125, -5452, -4997, -5948, -5670, -4504, -5436, -6634, -1935, 2403, -2668, -9024, -8710, -9599, -13994, -9192, 1020, -894, -8440, -5955, -1982, -6882, -8582, -3804, -5165, -9048, -3649, -396, -7379, -9078, -2854, -5192, -9888, -3071, 1095, -8266, -10568, 186, 2846, -1606, 719, 1040, -7710, -8687, -916, -1812, -5549, 821, 4158, -2278, -1199, 5388, 470, -6082, 117, 6100, 2941, 2135, 4714, 205, -2714, 3187, 6121, 1976, 1102, 3253, 1971, 2506]
486B506N606J800n246k422K931J151l419j782K538K264o14M90K590k028m927K66
502A704M023J560J42N4l140l082L595K801m190k406L920K42m014K519M921m149
518D500l508L947J787m033m76O82m220K68P821J55p772m1M253l150j153N929m55
535D534n886J893L728m818j047L696k276m430N201M288n497l021M919j91l197
550b104L460K150o063k239M787J028l160R55J572k956n23K493j36o57N91J6j144
567a930J581J329l384k688K099K021J95o22j106j058J768M48j271M60J025j597
583b730o04J266l33k2L15j665j412K671J706l387j616L564J193k125O31K91k924
600e181N04K881j791k254L861J244n063J41N381k032m004K619K139k620O25K950
$$ y = [2506, 8112, 9912, 4666, 2244, 5175, 6326, 2907, 1125, 3663, 5927, 5313, 5803, 8393, 6365, 1438, 1704, 5727, 7287, 7429, 7483, 4343, 1261, 4856, 7657, 3467, 1061, 4981, 5223, 1209, 3728, 8649, 4500, 992, 4939, 6726, 2693, 2217, 2899, -1321, -1053, 6768, 6923, -849, -890, 3363, 213, -940, 4989, 4534, -1352, 541, 4269, -549, -1596, 2100, -176, -4606, 595, 4883, -614, -3635, 1284, 1093, -2104, 1356, 3506, -2557, -4796, -9, 1019, -2141, -1186, 386, -2570, -3093, -600, -736, -1393, -802, -786, -1930, -349, 980, -2404, -5092, -2993, -972, -777, -1399, -2505, -3563, -1795, -1347, -2618, -2158, -1133, -2730, -3334, -2068, -2401, -2423, -2108, -3773, -5185, -2514, -808, -4195, -5811, -2247, -1054, -3179, -2548, -2257, -5181, -4677, -1796, -3587, -5841, -1980, -736, -5799, -5658, -277, -2309, -6313, -3694, -1555, -4175, -3550, -600]
616f00l007k284L683J594m157N7L519j004j447K069P78j933R31J253k104OK898
633B52j49k537J519J753n01o07j76N08M19J164n52j047K062Q86j984k30J618Q8
651B486q05J056P17j080P18J442j124j176J525R02j086L17l03O34J005q32j513
668B883J578J826k102j727K415L96j974Q74J436j655r46K056r29k095J872J973
684E881k536j241K566l53l056J342J493k666L9L318k002l257K378K207k966j271
700a24K942o05k652M92Q03o34O7N61j514m29J835j242j543J991J332k449p08K208
718C31j504k661K089J697k116o18J688n51r76K44Q52J30M00q47j068J075R4j978
736c719m4L148p41k775J420J884k248o23L015K16k715J038J095k243N8J728n85
$$ y = [-600, -3607, -5891, -2208, -614, -4771, -4714, -1195, -2199, -3646, -1577, -799, -2732, -1801, -548, -2652, -2646, 252, 103, -2434, -915, 838, 337, -270, -446, 62, 481, 1645, 1093, 46, 2108, 2994, 1010, 780, 2398, 2486, 1681, 2737, 3454, 2374, 3092, 4534, 3410, 2234, 3759, 4661, 3575, 3892, 3589, 4223, 5228, 4396, 2883, 4461, 6287, 4185, 2458, 4873, 5269, 3295, 4169, 5605, 3950, 3004, 5060, 4131, 2036, 3908, 5881, 3345, 2104, 4670, 4317, 1261, 2603, 4096, 1430, 1469, 4787, 2785, -472, 1906, 4113, 1147, -124, 2818, 2213, -439, 53, 856, 222, 289, 850, -664, -1093, 742, -500, -2043, -52, 1280, -1169, -1877, 331, -1173, -3834, -1745, -48, -2164, -2782, -1094, -1645, -2621, -2377, -1525, -1395, -995, -1842, -2910, -1835, -1741, -3719, -3763, -615, -1356, -4131, -2711, -827, -3075, -3698, -683, -467, -3182, -2144, -1049, -3292, -3234, -1506, -2091]
753b091o91J381n97j892J694J103j785R99K764k268k335K108N15k564J095J911
769f53j764n09K732j807j700K841J360l113P01K864k883k537L467J013k697j73
785b858K159j114j353J785J211m20M8J06k14M49r91j148M63K265j018o29J627
802C68J6k660J080K798l98j072O29P70j554K67J324o39m26K26j60k52J004P61
820B082n23K11K007l34j610L66r7q63P11K409q62j386j16L72n03J110J232q70
838C336k85J141k22l15L61m85k003J201J527j283j626J228N31m17J431J706k407
855C419k249J196K04o28J023L59j929n50J002n04r84O40M09QR44J081j799j803
873a61N44m06o00J617m26k846j30K307J54o86Q18o61j725O21J651j416n86N90
$$ y = [-2091, -2782, -1401, -1998, -3890, -2196, -1093, -2878, -1879, 885, -1383, -3718, -1610, -1095, -3659, -2564, -653, -2417, -2926, -194, -2001, -3701, -860, 500, -2613, -1912, 952, -1931, -4468, -1001, 12, -2685, -2858, -699, -1813, -3166, -1381, -170, -590, -542, -436, -650, -201, -1192, -2340, -1877, 388, -630, -1259, 368, 384, -2276, -1196, 1602, 1204, 132, 761, 1531, -23, 244, 1568, 929, 503, 729, 569, 317, 1321, 2082, 1559, 1770, 3777, 3443, 1833, 2199, 2102, 1239, 1950, 4359, 3497, 2111, 1995, 2367, 1864, 2974, 4206, 3336, 3051, 4192, 3970, 3655, 4016, 3531, 1528, 2729, 4256, 2973, 1347, 2575, 3106, 2689, 4120, 5826, 3419, 1170, 2366, 2570, 1942, 2965, 3324, 1395, 845, 1847, 1343, 359, 999, 1408, 1416, 2360, 3441, 1642, -161, 383, -23, -623, 994, 568, -2278, -2408, -101, 53, -633, 185, -476, -2201, -1580, 71, -1345, -1931, -1341]
891a341k50m67L12r77j717O06J339M25Q54J224j819j800P67J165r89m41Q10j100
909c399r64J816R86j542n04J967l15q17J373M34k042L40J856m9j271r12o88n38
927d269J772J751J12l36K4l51M75J76n83r46R19Q59j491K91J664j753j496K580
945f02K109j825q08J465k29p28J496O24j969j146K58k97O65P77p9M36J141J14
963A402j244M61N22j849k99K764M70k775n14R59j1k47J298o5p67J098O44m43N90
982A994M76j653q92R42l85r97R31J051m53P14J644j005k114Q96J516j064J99J404
1000C204q17j889J054N7j297O79J397p65J24J397L81r91M59K23j234j03j58j019
1018G02m4J477J07n32J349n45k021O92K022j740o01K638L7k979m5J485j045k452
$$ y = [-1341, -1591, -2058, -1746, -2723, -4440, -3834, -2495, -2070, -1216, 8, -1811, -3611, -2844, -1679, -2668, -3109, -2299, -3399, -4363, -2547, -1561, -3103, -3607, -1640, -1955, -2772, -1399, -965, -3007, -2667, -811, -860, -2131, -3043, -3731, -4269, -2497, -746, -634, -970, -946, -1297, -822, -646, -1229, -2175, -1256, -397, -1888, -1597, 67, -1686, -3182, -602, 1507, -318, -1126, 339, 110, -618, 878, 1502, -467, -1613, -1355, -1652, -987, -210, -289, 147, 1288, 1402, 158, 619, 1141, -708, -1007, 1757, 2227, -548, -1062, -103, -114, -361, 937, 872, 105, 1203, 1847, 1404, 1994, 2470, 817, -75, 867, 482, -515, 416, 1467, 1014, 1728, 3372, 2367, 253, 1149, 2665, 1601, 1800, 3204, 2387, 498, 1552, 1609, 312, 991, 2388, 1623, 1747, 3144, 3525, 2534, 2993, 3216, 1982, 1879, 1721, 702, 658, 2135, 2242, 1710, 3059, 2514, 493, 1185, 3207, 1467, 866, 3504, 3541, 562, 517, 2002, 957, -1495]
1036a495J338J750Qp09J72L50K89l03j573j85O91j252r94J259O14p60r6O65j201
1055a432p90J202K52n86M19J771j351k260k75N85j287j37J578L27j97O52O5l55
1073a819m56Q36j065j95M77j70j226Q75P44p78K70M5q85J8J541K79o1J361Q8j834
1093a955o36J225j161j488J605J641k44n35J126k86n39N06L16j61L32L02j322
1110a274J89J421p30j088P77K93p93J207J020O1K06Q44n45j568L49j92j388O35
1128e76J687k9o96O75L41j131O64R95q36mR99p80k71M47n6j446j31N10J70k4R72
1149A480N1K42P03N47j490p36L68n88p39J246O83j074j9P33k35q78M94Q61l31
1168A318M64Q54q95o34M86o07j191O89M30j008O52J561k04j65O98q9j281J03q
$$ y = [-1495, -157, 1593, 1601, 892, 1064, 1414, 1703, 1400, -173, -358, 333, -919, -1913, -654, -40, -800, -896, -231, -1432, -2222, -1020, -768, -1354, -935, 836, -515, -2775, -3050, -2465, -3752, -3889, -2311, -1984, -2181, -1529, -1464, -1819, -2275, -1439, -2504, -2699, -2222, -2392, -3618, -2743, -1999, -2777, -2507, -2462, -3347, -3329, -1788, -1509, -1570, -209, -121, -1955, -2591, -1366, -2527, -4015, -2410, -769, -1013, -1548, -422, -708, -1247, -741, -425, -586, -254, 48, -1274, -1085, 336, -394, -1482, -705, -412, -1205, 2, 1022, 1083, 1289, 2133, 1588, 20, 369, 177, -1211, -576, 1111, 1082, 386, 1061, 1402, 271, 935, 1930, 1094, 1090, 2089, 1309, 1038, 1485, 1429, -17, -148, 362, 532, 508, 1480, 1531, 1773, 2476, 3023, 1533, 797, 1165, 577, -162, 1084, 1767, 693, 674, 1407, 1172, 294, 788, 1649, 1318, 1782, 2636, 1741, 1107, 1593, 986, -205, 484, 914, -94, 558, 2119, 1915, 1750, 2448, 2359, 1078, 1181, 1173]
1187A173q91P5J303n72q90M73J02j136N69R37p6K6J068Q6j404m22J99q21o52M97
1207c56P5J07M11L83m3R1M35q94p28K83j66r02J028M95r87p52M90m35q29R01Q70
1228e23l31N25Q63r49j026J93p87r45P24K49j83k88J006r0j40R08p27q70L36J018
1248a037m11o51Q25l24r19j42K40o63J91J157M01L28Q79J94j569m84Q03n53m17
1267b152P30J63p33O65J123m68m25N13j86j41R28M51n00J35L44k77o94J47n53
1286i30q43J678J392p7K33P11p80j073R45l1j074l3R97J78l64P42o92n77L32P59
1306A493jP5M02Oj15N05n98r51k29M7n99K06J680J47p18J68Q00o47p59J68p9l71
1328F30Q06N65o89n38j68n41P0Q71M7m43M15N39j29M2N7r75q71L00J96k27K46
$$ y = [1173, 282, 357, 1660, 1088, 198, 671, 773, -363, 206, 1143, 1067, 1093, 2161, 2247, 843, 421, 620, -201, -853, -356, -281, -174, 237, 620, 577, 668, 1103, 209, -519, -236, -402, -1304, -276, 219, -768, -1520, -1030, -1465, -2294, -1393, -523, -854, -329, 534, -415, -1441, -1248, -2035, -2980, -2256, -2007, -2190, -2478, -1472, -1562, -1702, -794, -1521, -2391, -2055, -1037, -1448, -2099, -1274, -1598, -2517, -2659, -2419, -3082, -2891, -1734, -1333, -1005, -126, 68, -1501, -1985, -1182, -1735, -2152, -1422, -1259, -1992, -1327, -204, -672, -1097, -584, -770, -911, 17, 468, -32, 103, 447, 170, -524, -377, -930, -1773, -95, 1297, 1220, 1453, 2164, 1384, 311, 1256, 1225, 151, 118, 1115, 1293, 929, 1671, 979, 402, 734, 1493, 1492, 1567, 1969, 1975, 1860, 2365, 1767, 816, 587, 634, 35, 241, 1921, 2068, 1350, 1518, 2318, 1671, 912, 1080, 1001, 630, 1436, 2001, 1312, 774, 606, 65, 135, 1006, 1053, 610, 1025, 1564, 1435, 1477, 1534, 559, -312, -12, 184, -43, 203]
1349B03N89j97j29Q95l24j208J92M89o4J11N81l20j241M8J88m45k36Q82J98j68
1369D4O64M34n37l81j97k51l75O7j36k06O82J49l60J23Q86j173q83J429N08j127
1389f40L16Q50j627r8M70p00q67J053Q45p91N90J150p82o93K34Q8j293J88M45
1408a262m22J39O25k73l98M38k01p62Q73M99n57K46R38q14r14N63m06j078O89
1427b077J155j47l08R08J67n39j98M63n18k93N13R3k82L20P8l07R3K15m62L59
1447g67P14L76j60R65m72m79m29J36n06Q3Q29Q5Q7N72M49m66p51O88M22n95J22
1468I03N18L4n33K4J71N8k88l21K80O35O75l29l49O03l69p43K47k07n18NR80L66
1490A842p24O41j25j076J32Q90K6n99K45K24n38J65J53q00m76P04n7j76M4O05
$$ y = [203, 792, 595, 466, 1361, 1037, -171, 21, 510, 446, 557, 1138, 818, -423, -375, -187, -632, -868, 14, 212, 44, 708, 1142, 605, 224, 27, -224, -599, -532, -668, -874, -192, -43, -403, -280, 606, -567, -1450, -21, 487, -640, -324, 526, -1101, -1199, -729, -1429, -2296, -1243, -398, -1189, -599, 551, -231, -924, -690, -602, -1895, -1707, -1262, -1684, -1545, -920, -1193, -1591, -1153, -1354, -2116, -1243, -744, -1301, -1055, -117, -931, -1845, -1282, -1688, -2766, -2077, -922, -1069, -1377, -469, -302, -841, -1039, -576, -1094, -1387, -874, -781, -1063, -743, -665, -972, -879, -664, -1126, -767, -53, 323, 163, 1128, 656, 177, -252, -116, -622, -539, 290, 375, 462, 1034, 1483, 1017, 266, 954, 1376, 781, 903, 1421, 1455, 922, 946, 1117, 1175, 887, 566, 846, 1481, 2156, 1827, 1478, 2081, 1712, 969, 1216, 1009, 491, 496, 1476, 1842, 1118, 1759, 1634, 558, 690, 1580, 1606, 1007, 1252, 1476, 938, 1103, 1256, 456, -20, 684, 627, 451, 495, 1100]
1510A100j76k64M80o69n47J39l02n60R60O38p06k84K92k83k09K81K67n69L86P25
1530F99n54p57K56k46m05K44N15k41j81M66J56j20M48%r91m38L45M0L97M5m09
1551g31L4M0K96p15K01L15N2K9J013k59p75l29J54k64k06M40j49l07N97N57m46
1572d53p3N0m73J68L34k29k64P3M18m49m6Q7J44j236P91R23k49l0M14j82o65k85
1594a232K46k4LJ08M75j92K36m4k07K70J08l08MM74l17k40R02r1o28k74M27j46
1616d50k38P20N07k91J27M21m64j57R8k30m5M05J55j51K44K23l71j29M89N1k66
1637F48N1L75K15n59M72J8n02J46l07J15M14L00k39Q6O63l62r31N21N30q74j17
1658F63Q00J08o44rK62k39k52J99M7m6M5J17l15L31j08m06j79M38m70l94Q15K40
$$ y = [1100, 924, 660, 1140, 471, -76, 63, -239, -799, 161, 799, 93, -191, 101, -182, -391, -110, 157, -412, -26, 699, 145, -612, -356, -602, -1007, -763, -248, -489, -670, -204, -48, -168, 280, 280, -711, -1149, -804, -764, -367, -322, -731, -697, -657, -361, -1076, -875, -560, -508, -479, 534, 275, -500, -829, -675, -939, -1145, -705, -854, -1161, -564, -7, -453, -526, -476, -949, -781, -447, -676, -940, -867, -449, -898, -944, -857, -713, -1949, -1158, -235, -484, -514, -100, -282, -947, -1232, -986, -1010, -1007, -899, -424, -616, -380, -424, -631, -361, -253, -561, -557, -83, -400, -640, 262, 171, -457, -731, -304, -450, -688, 32, 539, 248, 375, 796, 332, 175, 273, 43, -2, 403, 558, 407, 651, 874, 503, 374, 863, 914, 648, 699, 1074, 1289, 730, 1202, 1220, 718, 864, 557, 672, 1086, 1386, 1147, 1233, 1896, 1534, 603, 1124, 1654, 780, 663, 1463, 1571, 927, 918, 1180, 941, 689, 888, 935, 889, 934, 1051, 736, 1067, 959, 553, 374, 812, 342, -52, 763, 1003]
1680A003n63l67P41l40o94K92N22o27j44K37k1j96k72l07j1N03N0k84J6O65p82
1701e79q7O08l03r96K21Q65l12n70M82L71l08K15p5m51J21k75m09Q83K48m88j0
1722h49J53L30j322Q94O36o64m21R71Mn34l1K91k88J72K32m9n8o6N19m16N5K61
1744a80n63l58Q89K16m37L08J21l56l96N82m03j95N7K70j2M63P7l27j88L08j83
1765c07J83q3J36m32n8N61J14n24K06k9Rk19M94J80p9j40K26l33j40K70K37m66
1787a94K02L00J34K13l02l64K43L65m65k60N12L37l78K65J20j48l80L91P0k38
1807D23M61j27j20j13O67m40m79O04k92k22M37M62l90k70M14l79l04K93L50k73
1827G02J50L45j64p4q7k0j87K40k54k14m2M24k69o5J53J56n82K70O4j44j83L83
$$ y = [1003, 440, 73, 814, 474, -220, 72, 594, -33, -177, 60, 39, -157, -429, -736, -747, -244, -194, -478, -462, 203, -579, -666, -58, -361, -1357, -1136, -271, -583, -1153, -671, -300, -608, -393, -468, -919, -798, -1073, -1482, -599, -351, -839, -849, -696, -366, -1688, -794, -158, -822, -1243, -272, -268, -802, -833, -542, -830, -658, -426, -475, -533, -599, -80, -496, -441, -180, -743, -1101, -212, 4, -433, -125, -4, -360, -756, -174, -577, -772, -715, -445, -457, 6, 83, -244, -432, -124, -307, -124, -207, -71, -503, -561, 0, 114, -410, -204, -233, -224, -443, 51, 231, 152, 12, 238, -95, -235, 35, 272, -194, 8, 308, 442, 655, 353, -11, 232, 597, 132, -128, 384, 721, 343, 608, 728, 580, 200, 591, 661, 423, 884, 757, 637, 524, 1191, 751, 272, 876, 584, 362, 799, 1261, 871, 601, 1015, 636, 332, 625, 975, 702, 852, 1197, 1033, 959, 872, 852, 665, 905, 651, 437, 395, 819, 550, 485, 638, 794, 212, 482, 546, 402, 219, 602]
1849F02J46k72l21J25l27j23J0j1K04J71j15l06M02o1m20j45K16J58m84J05K18
1870b28n49n4L58Oj82K19k42J24LJ07l81K01o3j18m65L38L20o15J11P16m17m0
1892h51J74j1k01K0N59k92l98K12K18p7k9J56l09r4L21K7q5N59j28n12J02M38
1914b01j27j71L00k63j51K10L84j18j16J71j60L17J16j15o51L31M87m04q0L6J97
1935hl96M98K18k17l52M32J66j92K35k22j43k5L16k14j47K06J30k95L74L49k36
1956D77l11M20k48k48L72L5l95J21J45j45J14R0l25m6M9M34j32j17J46r4k97M58
1978E03j05j36J00L5j73J06O15m69j65n7M35j84k30N63k02l90K27J55k87l7l8
1999B66K5J5K36Q1k59mM63m58n9K29l92mk78M81o8J97n0n30N74M0L4k65k74L42
$$ y = [602, 748, 476, 155, 280, -47, -170, -160, -171, 33, 204, 89, -217, 185, 124, -296, -441, -225, -67, -551, -446, -228, -777, -831, -473, -467, -649, -430, -672, -548, -545, -438, -819, -618, -681, -799, -1264, -926, -606, -1221, -1110, -394, -811, -851, -677, -688, -889, -869, -310, -602, -1000, -788, -570, -647, -676, -520, -829, -923, -602, -575, -660, -101, -229, -741, -639, -201, -328, -499, -199, -462, -613, -403, -19, -137, -253, -82, -242, 75, 191, 76, -575, -244, 243, -161, -241, -205, -8, -404, 94, 312, 95, -257, 175, 341, 149, 384, 162, 19, -6, 310, 96, -51, 155, 285, -10, 364, 713, 477, 166, 586, 338, 90, 462, 497, 102, 223, 368, 223, 337, 427, 102, 56, 105, 539, 407, 290, 436, 342, 45, 503, 398, 262, 362, 397, 224, 330, 945, 476, 311, 254, 689, 505, 275, 838, 636, 246, 473, 628, 341, 304, 266, 291, 306, 542, 623, 364, 360, 823, 365, 306, 535, 143, 139, -139, 342, 274, 471, 421, -109, 465, 505, 539, 274, 0, 342]
2023C42k19j33K50m45J28M3j25p3l00N87l33J18K59j27m02k71K97j91r1L86Qk64
2045e56K22j68j86K78k79N0k00O68j36l09j22J20l00o6J70O5k66L55L15k50P2
2066e23L41k65j2n3K01m94K4L33k54R2J15j6l4R7L51n3K5o2K10j44n1o0pJ62k21
2091b98k21K85M01l03J84L47L5l97J5M34m34P6O4Q3k29J71nq7J70J88kl21M61
2114F17J96l59Qj05k27J12j66K68l47O83q2m23K65J03j3j64M9L8m09L73J19k19
2136C17J0J21r6j14J2J29N8J65k8l07J81Q6o18L5N96j34l53L72r1r4m11N41L35
2159G12k32l83K28Rj69K56m1j06J63k34k57K94%M5p9L67k65P4j82J51l58O5K55
2182C13k81L4j55J55o6q2L93l64K03l06L62l49j05N64k18l42lK2k43K90k70K73
$$ y = [342, 123, -10, 240, -205, -77, -34, -159, -232, -532, 55, -278, -160, 99, -28, -430, -701, -404, -595, -686, -300, -292, -556, -334, -502, -688, -410, -689, -639, -839, -171, -307, -616, -738, -618, -918, -984, -814, -749, -1015, -660, -345, -595, -523, -182, -447, -459, -512, -311, -805, -781, -448, -702, -610, -495, -511, -545, -448, -97, -150, -125, -187, 23, -121, -172, -232, -239, -77, -298, -519, -234, 167, -136, 48, 395, 430, 33, 48, 482, 48, 124, 188, 271, 42, 213, 208, 121, 291, 479, 477, 156, 617, 813, 454, 462, 357, 130, 242, 76, 344, -3, 680, 598, 175, 440, 543, 530, 366, 415, 453, 44, 417, 536, 317, 327, 448, 352, 238, 250, 379, 437, 602, 574, 267, 448, 534, -84, -49, 547, 413, 60, 432, 341, 247, -164, 377, 712, 480, 97, 325, 334, 165, 421, 380, 274, 437, 203, -54, 240, 240, 285, 206, 573, 308, 382, 200, 351, -7, 58, 313, 32, 66, -89, 66, 0, -82, 311, -53, 150, -156, 206, -143, -248, 316, 98, -244, -247, -225, -468, -178, -448, -175]
2204a75Q7J35j14k56L6j58J26J69n22R8L7J71n2q2K1J55n81M94L82k67l02J56
2226d42K40l46o5J47k60R4K98j22O6k27K73j68rJ86m21K22J78J1l78L00K36l10
2248d97j47K64M41m32R6j20L49j81J50k6K1P6k82K99k83L12L7k31K95o2k1J54
2270B12L49k56k28K02J41l73K49j08k2r7K11l6K43l86M02J19j37p5j4o6r0K87
2292E27l02K30m02J65L67j27r0n5N7N7l9J68K79m18l92J79j77j33N96j79r1K16
2314D36J70l25j55O00m36l06L84n5l24q3M62j84l22J63J61j55K0J33kL41j42l98
2336a7l16K13J56j72j47K43J2o9K55k4j40m8n8R5j43jK28j10K4K62m68J34o7j19
2360b77R9K54M4j25K32l81J40j21j44Q9n22L14J28J71m1n1O6PkJ09k13j72M58
$$ y = [-175, -88, 47, -67, -323, -287, -445, -319, -150, -672, -574, -537, -366, -418, -500, -479, -324, -905, -411, -29, -296, -598, -442, -202, -548, -613, -466, -726, -632, -334, -456, -390, -617, -344, -512, -521, -335, -756, -534, -356, -345, -723, -423, -187, -497, -644, -380, 61, -371, -275, -395, -46, -227, -77, -103, -82, -6, -288, 11, -272, 40, 77, -154, 141, 79, 58, 212, 561, 305, 77, 279, 420, 47, 296, 188, 166, 69, 280, 244, 487, 101, 503, 622, 485, 410, 396, 330, 240, 527, 225, 455, 53, 218, 585, 458, 368, 313, 370, 427, 388, 556, 835, 417, 25, 204, 27, -106, 490, 311, 220, 436, 606, 281, 126, 726, 290, -16, 368, 313, -11, -94, 368, 184, -138, 25, 186, 31, 51, 184, 182, 523, 381, -17, -333, -120, 36, -136, -283, -40, -28, -97, 158, 134, -6, -54, -112, -17, -160, -161, 67, -43, -19, 243, -225, -91, -158, -277, -178, 76, 120, -5, 227, -154, -14, -135, -279, -190, -712, -398, -270, -99, -140, -191, -125, -118, -120, -11, -224, -396, 62]
2383F2n76M16m06k7K77k06l4N0J60K35k14j66L88J05l02n2j07k11Q5L93q0k67
2405d77K92o3j81k2J85j4O9Q7Pk17L45L4o95M30k32JL51Rj19K80J38k67J25l63
2429b97J80o8j53L12j37J74k41N9M07k88J75J16k52L66J45L6m15J34L2k24L38
2450C99m92L81q1K01k1L20n51K29L4K8k32N6q1L42j76j65N6K24j62q4L04j62k67
2473A00L72Oo2j39Q1l96J54KJ61k98N02k11p5l47N99o0m53J49K37k59j97M01J13
2496C80k71j87j3K4r5K20M9P6J54j49l40J42o1j34n2J66J5m45O15j64L6k43L57
2519H0m56J38j19L03M1n6l08J97R7k47K0r0K38P3J70o5J13m73L39k45q8QJ22L5
2543a73q8Q1j02K30l51M12M9k15L8o9k3J55J48j43j08k88K69L9o7L65p9k11K47
$$ y = [62, -514, -98, -504, -531, -254, -460, -494, -444, -284, -49, -263, -429, -41, 64, -238, -290, -397, -608, -523, -130, -210, -477, -185, -248, -429, -451, -266, -280, -211, -124, -117, -334, 11, 45, -650, -220, -452, -451, -100, -91, -210, 70, 208, -59, 66, -297, -117, -185, -338, -26, -163, 11, -230, -171, 236, -52, 123, 239, -13, 353, 498, 534, 119, 253, 285, 61, 399, -93, 288, 207, 408, 387, 707, 156, 385, 419, 447, 215, 271, 190, 532, 356, 191, 247, 471, 309, 225, 529, 367, 100, 472, 478, 416, 277, 358, -38, 116, 118, 279, -19, 483, 272, 197, -150, 449, 389, -64, 85, 322, 63, -134, 267, 380, 109, -78, -91, -67, -162, 58, 107, 183, 337, 188, -152, -10, -71, -205, -257, -91, -76, -521, 94, -70, -34, -277, 80, -376, -238, -357, -54, -13, -69, -377, -180, -83, -330, -310, -400, -162, -89, 81, 16, 129, -344, -5, -250, -338, -330, -208, -173, -261, -180, -282, -52, -403, 9, 58, -157, -119, -188, -211, -56, 92, -51, -159, -447, -178, -139, -206, 159, 80, -131, 116]
2566A16J70m89p3L65k99J11k9J26q9Q7j5m6j38J93k45K4L86j03o5JN0k62N3k50
2590d21K50K04p1J16j90J15k0oL6l36l8J10J92O6j3l7J20k08L9J35J78J14j71
2613A64M3M7k53J90N7j88J14p1M1J52r2K52j66n4K25k44q5R4k7R1J38Q0j37r4
2637B77k18J11M5J3k76L70q4J99l43L14l44J37K1q7M4l49K00mOJ89p9k4l12J78
2661a6n3L49j81J12n5k22L00j06k15R1m4K03k52L38j83o9M23n29k64J60K66k90
2683b37L5j6J28k08J50k51J65j49J97l99L54M1K28l24K69lm65L57l7%J24K8j78
2706a91k22J42K10l04M14l6J49n25L49k40n1J61J41k75j0M23j16n3k18K63k25
2727b14J47j09N0qj8j29Q4L10j16Jjk47K15M6K72j64m24J17K8J93k6m11L71j67
$$ y = [116, 286, -203, -276, 89, -210, -99, -128, -2, -91, -4, -19, -65, -203, -10, -255, -231, 155, 52, -13, -12, 38, -224, -171, -421, -171, 33, -38, 78, -112, 3, -17, -23, 13, -323, -361, -251, -59, 7, -6, -43, 77, -131, -92, 43, 221, 335, 164, 207, 254, 1, 191, 248, 60, 174, 103, 144, 296, 204, 456, 290, 236, 461, 217, 132, 226, 199, 290, 428, 508, 371, 277, 59, 170, 215, 228, -48, 322, 238, 437, 94, 408, 64, 201, 222, 135, 179, -170, 30, 26, 32, 221, 142, 118, -194, -16, -69, 280, 99, 211, 156, -66, 234, 128, -87, 4, -40, 163, -89, 249, 66, -3, 420, -109, -373, -213, 53, -237, -202, -218, -90, -298, -148, -399, -234, -383, -186, -585, -231, -190, 38, -286, -17, -20, -485, -128, -165, -165, -41, -13, -191, -413, -271, -61, -365, 49, 13, 162, -363, -14, -254, -305, -144, -3, -278, -288, 135, 19, -34, -252, 11, -214, -67, -176, -126, -134, -152, -281, -197, 113, -3, -2, -3, -250, -35, 11, 283, 119, -305, -188, -160, 33, 7, -404, -33, -200]
2751b00J25j5Q4p8K21o5l23K34l8J24l2K9K08r2l21J9N7k12K46k2P7P1o5JK3j3
2777D3o5p7Q1l2J22J67P0j73j45K42l25K41j77J41j3p6J52J68oj15j00r8M10k56
2801A79J58k23J81k4j5k67J37k98L61O5k7j1M6K90n38r0K10K4Nk02J36P0o5J52
2825B54j31j90J43J02J03l11J27l20M77L9l11N1J9J22l33K33J47n32R1L62k24
2846h2l7M6K39k00L11l06rJ04J06j89j33k9k75J84L4K27j56p4K58M8n9j6r6j87
2870b91K99l4k05R8K32j14l20J64K25m11J71L1J59j37j08L5o1KJ31k20J29K35
2892A0J2r8nk7n4n4M71k37j20K33j58lN0j26J39j83L41j32l38J03L86k06j29J70
2916D5k69O8K46k08N3j75N37p4l13j62L49l69L14q9p3J74K03k34p4K26j18Q5j19
$$ y = [-200, -75, -90, -6, -84, 137, 72, -251, -17, -55, 69, 37, 66, 274, 182, -139, -120, -63, -275, -29, -51, 26, 97, 32, 33, 56, 43, -22, -99, -18, -50, 72, 239, 309, 136, -9, 233, -92, 149, -28, 113, 100, 24, 176, 344, 338, 223, 123, 25, 435, 179, 337, 114, 295, 271, 256, -11, 126, -172, 189, 254, 227, 216, 262, 552, 14, -76, 134, 158, 163, -39, 97, 167, 102, 254, 123, -67, 76, 178, 281, -30, 97, -223, 254, 293, -18, 33, 52, 174, -159, 74, 221, -311, -220, 142, -82, -119, -73, 166, -34, 277, -29, -38, 66, 172, -17, -150, -179, -454, -270, -236, -9, -165, -239, 19, 67, 8, -8, -104, -291, 8, -26, -231, -133, 99, -15, -335, -171, 54, -357, -186, -155, 4, -133, -241, -206, -267, -265, -134, -354, -225, 10, 22, -76, -81, -108, -162, -216, 255, 18, -102, 131, -27, -30, 20, -106, 33, -150, 191, 59, -279, -176, 210, 4, -125, 45, -224, -156, 90, -118, -65, -240, 297, 223, -90, -252, 97, -272, 42, -47, -120, 54, 257, 23, -51, 175, 57, 142, 23]
2939B3J30k24K89j93Q4R2j43R3J56l47O7N5j63J27K41j4k12p3j5l3R7J49L0l41
2963a25L04P3l49J46p4N3R7Q8o9r4J24l09L34l1k00J69r6J66j36J63L57n52J67
2986B06K04l27o6J75Q2m20J60j08J30j92L33k92o5J71K81l22k23M22j67M4K65
3007B91k45r7L85n82N73n70L67k07j68J92L39k82j74o1M14k10k73P6k84L86J14
3028a6j03J6j42L06j47j78J54p0J92j09q5J47n3K20k87L89k42k38J64j13J12m71
3050e54K90J94J89q8l74L10r6p7J7Q8j96m9K95j17J07L1lk1j82J7R5L6J02J14
3074A28k88R0Nl7J18j72j88L34p9M9QM6Qj24L33J0k10Q7L7l1O8j71L28m82N1j3
3100i5K7j51J47K48k66M35j95Q4l70J81J67Lm62M00o1l1M55j80l69L3P1K53l43
$$ y = [23, 153, -71, 218, 25, 109, 201, 58, 151, 307, -40, 27, 82, -81, 46, 287, 273, 61, -12, -27, -60, 37, 186, 216, -125, 179, 252, -97, 49, -25, 28, 125, 213, 144, 50, 174, -135, 199, 168, -32, 137, 41, 207, 71, 234, 591, 39, 206, 410, 83, 17, 192, 274, -146, 14, -94, 36, -156, 177, -115, -180, -9, 272, -50, -273, 149, -18, 26, 291, 46, -51, 334, -248, 325, -245, 122, -85, -253, -61, 278, -4, -178, -239, 175, -35, -308, -232, -516, -130, -16, -119, -103, -245, 61, -86, -264, -110, -180, 12, -97, -182, -35, -88, 132, -155, 234, -8, -246, -82, -195, -83, -554, -264, -70, 119, 31, -343, -33, -129, -206, -189, -101, -297, -346, -51, -168, -61, -30, -33, -54, -236, -219, -124, -88, 14, 128, -160, -70, -65, -102, 16, -156, -344, -10, -89, -40, -32, 14, 22, -102, 231, 241, 31, 118, 155, 124, 192, 21, 349, -133, -82, -95, -68, -219, -72, 176, -90, 345, 150, 234, -136, 45, 212, 215, -247, 153, 92, 61, 516, 336, -33, 0, 71, 324, -19]
3123a9K72p5Oj00O3r1k3P2j38k2p0J31J00m4MK9J70k88J0j83J83J64l58N56k33
3148A16k92O6J26Q1J85k46L41k95j27K1o4K12j9m2M7M4l38K17J79j76Nq9L40l91
3172i9l4J61K94n45K68l56K18P1L5O3j19j03k23N45j94j42J16J57j13j06K76j60
3194A0q3o8R4m5l43L74j10N1k1QJ18r4J26k87J00O1J16j72K51j61j25P8n8K8P8
3219g4pk36K65j1n5J67m0Jl15L65p3K4j16k92N59j89J21k96K71k28L80m65M2L08
3243A06j05J16Q2m28P1K97j37J08l1J64l11J96r7N2J58k89J61q0j15N42m89o1
3265i0K27j22j5j09j90J59P8J47k13J45k5J19o1L7j27Q5J36m7n1j41K46j8k87
3288a17J90N2K9m6j2K44k79P8K14k11J94j47m1r4k26L14J4j38J07J2n7oj55J75
$$ y = [-19, 253, 178, 184, 84, 147, 56, 33, 105, -33, -55, -125, 6, 106, 62, 66, 95, 265, -23, -13, -196, -13, 151, -207, 349, 116, -176, -110, 16, 97, 282, 36, 377, 82, -45, -24, -88, 124, 105, 63, 110, 154, -184, 33, 212, 36, 41, -48, 292, -99, -133, 28, 322, -223, 45, -311, -93, -22, 13, 76, -43, -146, -369, 176, -18, -160, -44, 113, 0, -106, 170, 10, -73, -141, -47, -92, -435, -61, -171, -120, -141, -133, -15, -109, 17, -270, -170, -109, 7, -165, 86, -75, -200, -122, -180, -152, -74, -81, -317, -52, -63, -118, 49, 9, 10, -305, 60, -13, 11, -105, -397, 162, -27, 94, -202, 69, -159, 221, -244, -202, 106, 1, 117, 199, -229, -158, 139, 2, 110, 79, 243, -68, 128, 31, 83, 241, -48, 113, 33, -82, 460, -29, -90, 137, 15, 0, -109, -299, -140, -62, 85, -128, 17, -8, 111, 50, 87, -40, 45, 181, 134, 83, -58, 188, 170, -117, 73, 125, 154, 108, 96, 340, 61, 139, 353, 142, 336, 189, 148, 54, -172, 142, 156, 18, 125, 137, 80, 74, -81, 94]
3312I4j48k4r1L54j05r1j24J29K80k94j21J44K04K9K6l04l7P5N5j0n8m4Q4k26
3336b03L22l90L56j69o3K19k37J5J05pj39M20j57k5J60j41j7K1k13J34r7M0oq0
3360a52J93j53m3k22K40M8Q8n9k55K96j41J04J20J40j89%J2Nl2l0Q3k00K02k23
3384a68P2J37m3r2J2J97l7j69j73K6L36l07L3J66n4J4j52J16r1N30o61J76J03
3407b9J02k28K05J28l50L30l24J14M21m25j5j02L98n0k09K42j21J51m4k15Q2j08
3429d7J66k71K04j54j28Q4J88N0J29p8m5mj2J07k50L2L70j96l39J52jk0J59j39
3453d3J83j25q9K27J03q9R5M6n26K02J93j1l6m7K77l23q9J94j78L2j93J26K08
3476A37j81K46l13R6j58J04R9J0k14K13j0J96l18K72k08J7q0L35m68J82K32k02
$$ y = [94, -54, -78, -169, 185, 80, -11, -135, -6, 274, -20, -141, 3, 207, 236, 262, -42, -79, -4, 51, 41, -17, -61, 23, -203, 119, -271, 85, -84, -147, 72, -165, -150, -45, -52, -191, 229, 72, 47, 207, 66, 49, 70, -143, -9, -106, -66, -72, -152, 41, -112, -155, -377, -137, -89, -1, -60, -315, -19, -160, -56, 64, 204, 15, 15, 27, 32, 0, -30, 53, -147, 55, -168, -96, 41, -2, -94, -82, 115, 78, -91, -264, -238, 98, -209, -176, -10, -64, -50, -202, -86, -177, 353, -308, -132, -29, 73, -155, 50, 178, -172, 158, -166, -52, 369, -56, -71, -173, 225, 175, -34, 208, 87, 238, 194, -21, 61, -47, 119, -152, 52, -102, -230, -146, 42, 92, 221, 143, 98, 94, 82, 189, -61, -29, 341, 145, -194, -42, -43, -63, 96, -43, 140, 15, -74, 153, 256, 167, 262, 308, -218, -16, 177, 166, 130, 83, 360, 37, -52, 142, -36, -4, -197, -71, 137, -44, 202, -111, -15, -173, -69, 30, 40, -174, 39, 29, 225, -93, 179, -29, -12, -92, 243, -225, -43, 189, -13]
3498a3j47K6m3L14J89l67N3j35j09j9J66R3k08K08K4p8K33l77K73j36J34l01P6
$$ y = [-13, -160, -134, -177, 137, 326, -41, 12, -123, -232, -251, -85, 8, -200, 8, 32, -46, 187, -190, 83, -53, 81, -220, -144]
$$ [...]
8191b9
##END NTUPLES=NMR FID
##END=
