##TITLE=1H_SL62-I2-A-isomer
 CDCl3, 8 sc, 
 26.07.2021
##JCAMPDX= 6.0         $$ Bruker NMR JCAMP-DX V2.0
##DATA TYPE= NMR FID
##DATA CLASS= NTUPLES
##ORIGIN= UXNMR, Bruker Analytische Messtechnik GmbH
##OWNER= root
$$ XWIN-NMR		Version 3.5
$$ Mon Jul 26 08:34:13 2021 Russian Standard Time (UT+4h)  she@DPX200
##.OBSERVE FREQUENCY= 200.131506
##.OBSERVE NUCLEUS= ^1H
##.DELAY= (6, 6)
##.ACQUISITION MODE= SIMULTANEOUS
##.ACQUISITION SCHEME= undefined
##.AVERAGES= 8
##.DIGITISER RES= 18
##SPECTROMETER/DATA SYSTEM= spect
##.PULSE SEQUENCE= zg30
##.SOLVENT NAME= CDCl3
##.SHIFT REFERENCE= (INTERNAL, CDCl3, 0, 15.7039)
##AUDIT TRAIL= $$ (NUMBER, WHEN, WHO, WHERE, WHAT)
$$ ##TITLE= Audit trail, XWIN-NMR		Version 3.5
$$ ##JCAMPDX= 5.01
$$ ##ORIGIN= Bruker BioSpin GmbH
$$ ##OWNER= she
$$ F:/spectra/data/she/nmr/H-F/1/audita.txt
$$ ##AUDIT TRAIL=  $$ (NUMBER, WHEN, WHO, WHERE, WHAT)
(   1,<2021-07-26 08:32:49.56 +0400>,<she>,<DPX200>,
      <created by zg, POWCHK disabled, PULCHK disabled
       configuration hash MD5:
       00 E9 B6 7A A2 85 ED C7 34 08 36 98 17 FE 4E 26
       data hash MD5: 16K
       7D 4C B7 20 55 63 F4 92 4C C6 9A BF BA DC 41 CC>)
$$ ##END=
$$ 
$$ hash MD5
$$ 5E D9 98 28 00 70 9F 63 42 78 3D 49 A4 D4 9D 84
##$RELAX= 
##$RELAX= 
##$RELAX= 
##$RELAX= 
##$RELAX= 
##$RELAX= 
$$ Bruker specific parameters
$$ --------------------------
##$DU= <F:/spectra>
##$EXPNO= 1
##$NAME= <H-F>
##$PROCNO= 1
##$TYPE= <nmr>
##$USER= <she>
##$AMP= (0..31)
100 100 100 100 100 100 100 100 100 100 100 100 100 100 100 100 100 100 
100 100 100 100 100 100 100 100 100 100 100 100 100 100 
##$AQSEQ= 0
##$AQ_mod= 1
##$AUNM= <au_zg>
##$AUTOPOS= <>
##$BF1= 200.13
##$BF2= 200.13
##$BF3= 200.13
##$BF4= 200.13
##$BF5= 200.13
##$BF6= 200.13
##$BF7= 200.13
##$BF8= 200.13
##$BYTORDA= 1
##$CFDGTYP= 0
##$CFRGTYP= 5
##$CHEMSTR= <none>
##$CNST= (0..31)
1 1 145 1 1 1 1 1 1 1 1 1 1 1 1 1 1 1 1 1 1 1 1 1 1 1 1 1 1 1 1 1 
##$CPDPRG= <>
##$CPDPRG1= <>
##$CPDPRG2= <>
##$CPDPRG3= <>
##$CPDPRG4= <mlev>
##$CPDPRG5= <mlev>
##$CPDPRG6= <mlev>
##$CPDPRG7= <mlev>
##$CPDPRG8= <mlev>
##$CPDPRGB= <>
##$CPDPRGT= <>
##$D= (0..31)
0 1.2 0 0 0 0 0 0 0 0.06 0 0.03 0 0 0 0 0.0002 0 0 0 0 0 0 0 0 0 0 0 0 
0 0 0 
##$DATE= 1627273968
##$DBL= (0..7)
120 120 120 120 120 120 120 120 
##$DBP= (0..7)
150 150 150 150 150 150 150 150 
##$DBP07= 0
##$DBPNAM0= <>
##$DBPNAM1= <>
##$DBPNAM2= <>
##$DBPNAM3= <>
##$DBPNAM4= <>
##$DBPNAM5= <>
##$DBPNAM6= <>
##$DBPNAM7= <>
##$DBPOAL= (0..7)
0.5 0.5 0.5 0.5 0.5 0.5 0.5 0.5 
##$DBPOFFS= (0..7)
0 0 0 0 0 0 0 0 
##$DE= 6
##$DECBNUC= <off>
##$DECIM= 32
##$DECNUC= <off>
##$DECSTAT= 4
##$DIGMOD= 1
##$DIGTYP= 9
##$DL= (0..7)
0 120 120 120 120 120 120 120 
##$DP= (0..7)
150 150 150 150 150 150 150 150 
##$DP07= 0
##$DPNAME0= <>
##$DPNAME1= <>
##$DPNAME2= <>
##$DPNAME3= <>
##$DPNAME4= <>
##$DPNAME5= <>
##$DPNAME6= <>
##$DPNAME7= <>
##$DPOAL= (0..7)
0.5 0.5 0.5 0.5 0.5 0.5 0.5 0.5 
##$DPOFFS= (0..7)
0 0 0 0 0 0 0 0 
##$DQDMODE= 0
##$DR= 18
##$DS= 0
$$ [...]
##$SUBNAM2= <"">
##$SUBNAM3= <"">
##$SUBNAM4= <"">
##$SUBNAM5= <"">
##$SUBNAM6= <"">
##$SUBNAM7= <"">
##$SUBNAM8= <"">
##$SUBNAM9= <"">
##$SW= 20.0188882624521
##$SWIBOX= (0..15)
0 0 2 0 0 0 0 0 0 0 0 0 0 0 0 0 
##$SW_h= 4006.41025641026
##$TD= 16384
##$TD0= 1
##$TE= 0
##$TE2= 300
##$TE3= 300
##$TEG= 300
##$TL= (0..7)
0 120 120 120 120 120 120 120 
##$TP= (0..7)
150 150 150 150 150 150 150 150 
##$TP07= 0
##$TPNAME0= <>
##$TPNAME1= <>
##$TPNAME2= <>
##$TPNAME3= <>
##$TPNAME4= <>
##$TPNAME5= <>
##$TPNAME6= <>
##$TPNAME7= <>
##$TPOAL= (0..7)
0.5 0.5 0.5 0.5 0.5 0.5 0.5 0.5 
##$TPOFFS= (0..7)
0 0 0 0 0 0 0 0 
##$TUNHIN= 0
##$TUNHOUT= 0
##$TUNXOUT= 0
##$USERA1= <user>
##$USERA2= <user>
##$USERA3= <user>
##$USERA4= <user>
##$USERA5= <user>
##$V9= 5
##$VALIST= <valist>
##$VCLIST= <CCCCCCCCCCCCCCC>
##$VD= 0
##$VDLIST= <DDDDDDDDDDDDDDD>
##$VPLIST= <PPPPPPPPPPPPPPP>
##$VTLIST= <TTTTTTTTTTTTTTT>
##$WBST= 1024
##$WBSW= 4
##$XGAIN= (0..3)
0 0 0 0 
##$XL= 0
##$YL= 0
##$YMAX_a= 155249
##$YMIN_a= -330666
##$ZGOPTNS= <>
##$ZL1= 120
##$ZL2= 120
##$ZL3= 120
##$ZL4= 120
##$ABSF1= 10
##$ABSF2= 0
##$ABSG= 5
##$ABSL= 3
##$ALPHA= 0
##$AQORDER= 0
##$ASSFAC= 0
##$ASSFACI= 0
##$ASSFACX= 0
##$ASSWID= 0
##$AUNMP= <proc_1d>
##$AZFE= 0.1
##$AZFW= 0.1
##$BCFW= 1
##$BC_mod= 2
##$BYTORDP= 1
##$COROFFS= 0
##$CY= 11.3945322036743
##$DATMOD= 1
##$DC= 2
##$DFILT= <>
##$DTYPP= 0
##$F1P= 17.5019972093344
##$F2P= -2.517084195857
##$FCOR= 0.5
##$FTSIZE= 0
##$FT_mod= 4
##$GAMMA= 1
##$GB= 0.15
##$INTBC= 1
##$INTSCL= 1
##$ISEN= 128
##$LB= 0.24
##$LEV0= 0
##$LPBIN= 0
##$MAXI= 10000
##$MC2= 0
##$MEAN= 0
##$ME_mod= 0
##$MI= 1.114404
##$NCOEF= 0
##$NC_proc= 0
##$NLEV= 6
##$NOISF1= 3.799351
##$NOISF2= 2.8
##$NSP= 1
##$NTH_PI= 0
##$NZP= 0
##$OFFSET= 15.70392
##$PC= 1
##$PHC0= -12279.89
##$PHC1= 20.80099
##$PH_mod= 1
##$PKNL= yes
##$PPARMOD= 0
##$PSCAL= 0
##$PSIGN= 0
##$REVERSE= no
##$SF= 200.130013532006
##$SI= 16384
##$SIGF1= 3
##$SIGF2= 2
##$SINO= 400
##$SIOLD= 16384
##$SREGLST= <1H.CDCl3>
##$SSB= 0
##$STSI= 0
##$STSR= 0
##$SW_p= 3612.71676300578
##$SYMM= 0
##$S_DEV= 0
##$TDeff= 0
##$TDoff= 0
##$TI= <>
##$TILT= no
##$TM1= 0
##$TM2= 0
##$TOPLEV= 0
##$USERP1= <user>
##$USERP2= <user>
##$USERP3= <user>
##$USERP4= <user>
##$USERP5= <user>
##$WDW= 1
##$XDIM= 8192
##$YMAX_p= 0
##$YMIN_p= 0
$$ End of Bruker specific parameters
$$ ---------------------------------
##NTUPLES= NMR FID
##VAR_NAME=  TIME,          FID/REAL,        FID/IMAG
##SYMBOL=    X,             R,               I
##VAR_TYPE=  INDEPENDENT,   DEPENDENT,       DEPENDENT
##VAR_FORM=  AFFN,          ASDF,            ASDF
##VAR_DIM=   8192,          8192,            8192
##UNITS=     SECONDS,       ARBITRARY UNITS, ARBITRARY UNITS
##FACTOR=    0.0002496,     1,               1
##FIRST=     0,             0,               0
##LAST=      2.0444736,     0,               0
##MIN=       0,             -330666,         0
##MAX=       2.0444736,     155249,          0
$$ Real data points
##PAGE= N=1
##DATA TABLE= (X++(R..R)), XYDATA
$$ [...]
$$ plain form
1949 -598 86 -78 -228 -12 181 49 -451 -175 -38 -422 44 567 -417 -539 102 298 -739 -478 9 -451
1969 -451 -548 99 128 -651 -518 551 -22 -969 -300 -280 -685 -458 26 -257 -439 -74 196 -111 -659 -303 -3
1990 -3 -332 -241 -415 -289 -450 10 -171 -514 -568 -187 354 -22 7 98 -209 -101 57 -576 -727 -390 199 10
2012 10 202 89 -266 254 961 352 -224 -100 349 12 299 340 -427 -37 799 595 -1 -186 457 786 1077
2033 1077 468 185 291 176 431 -567 -157 190 455 630 1182 539 141 540 971 141 -344 -95 147 -226
2053 -226 442 649 -221 -567 823 842 -303 -159 1173 832 265 724 -87 -928 -504 637 51 -522 -42
2072 -42 692 813 366 423 -158 -472 406 327 13 -505 -463 -63 292 -200 -543 -518 422 628 -122 -433 -120 -290
2094 -290 -378 -43 -647 -1071 -265 106 138 -324 -102 584 -147 270 268 -618 -766 -6 448 -827 -736 -377 227
$$ packed form
1949e98O84j64j50K16J93j32n00K76J37l84M66N23r84j22O41J96j037K61M87m60
1969d51r7O47K9p79J33J069n73r47O69K0m05K27M84k83j82L65K70l07n48L56L00
1990cl29R1j74J26j61M60j81l43n4L81N41l76K9R1l07J08J58o33j51L37N89j89
2012A0J92j13l55N20P07o09n76J24M49l37K87M1p67L90Q36k04n96j85O43L29K91
2033A077o09k83J06j15K55r98M10L47K65J75N52o43l98L99M31q30m85K49K42l73
2053b26O68K07q70l46J390J9j145J44J332l41n67M59q11q41M24J141n86n73M80
2072d2P34J21m47N7n81l14Q78p9l14n18M2M00L55m92l43K5R40K06p50l11L13j70
2094b90q8L35o04m24Q06L71L2m62K22O86p31M17kq86j48P60M54j275R1L59O04
$$ plain form
2115 227 -130 162 69 -27 6 446 251 -640 -485 -286 32 39 -337 -708 50 423 38 -66 -122 357 264 258 209
2138 209 -360 -739 -209 -145 -692 -360 313 338 493 795 147 -358 -451 292 -449 -858 -316 430 -15 -50 39 -108
2160 -108 -343 11 475 -191 -84 -71 653 -441 -674 -535 -896 -420 168 246 -36 497 805 309 -25 306
2180 306 -790 -658 257 -53 -594 224 599 213 -96 414 202 -486 266 882 58 218 352 -295 -587 -120
2200 -120 -1 -285 247 750 866 593 479 631 213 240 -92 -185 -329 62 685 134 243 405 459 315 464
2221 464 353 168 65 387 -115 -621 -149 24 -333 -127 416 350 479 885 724 -64 333 122 -230 -531
2241 -531 -78 -335 -530 124 423 -239 -70 316 330 -27 176 635 -502 -503 -391 -816 -943 -121 54 -214 265
2262 265 530 50 -463 184 -46 -831 -516 118 -548 -931 -240 -294 -532 -228 461 -55 32 745 363 -259 -491
$$ packed form
2115B27l57K92r3r6L3M40j95q91J55J99L18Pl76l71P58L73l85j04n6M79r3om9
2138B09n69l79N30O4n47L32O73K5J55L02o48n05r3P43p41m09N42P46m45l5Q9j47
2160a08k35L54M64o66J07J3P24j094k33J39l61M76N88P8k82N33L08m96l34L31
2180C06j096J32R15l10n41Q18L75l86l09N10k12o88P52O16q24J60J34o47k92M67
2200a20J19k84N32N03J16k73j14J52m18K7l32r3j44L91O23n51J09J62N4j44J49
2221D64j11j85j03L22n02n06M72J73l57K06N43o6J29M06j61p88L97k11l52l01
2241e31M53k57j95O54K99o62J69L86J4l57K03M59j137jJ12m25j27Q22J75k68M79
2262B65K65m80n13O47k30p85L15O34o66l83O91n4k38L04O89n16Q7P13l82o22k32
$$ plain form
2283 -491 -314 -820 -968 -576 -207 -282 -1 426 147 207 156 -21 -193 55 54 -49 -52 312 -179 -678 -261 410
2305 410 -127 -106 1081 887 266 274 112 -523 -880 -206 -19 -281 104 761 297 470 573 33 -35 251 198
2326 198 147 250 180 180 -109 -168 -470 20 177 357 498 912 588 347 -462 -241 -322 -590 -271 -14 -3 24 396
2349 396 699 112 -114 143 215 -12 221 431 -436 -604 118 -143 -597 -78 526 312 650 831 363 -177
2369 -177 -160 -122 -399 -456 -335 -87 152 365 14 -28 -72 418 253 387 111 520 -11 173 -106 -718 -406 68
2391 68 425 358 619 687 255 256 -25 -426 -626 -215 119 123 -332 85 392 159 13 283 6 -175 265 626
2413 626 88 -208 -404 -324 -744 -120 -337 -216 399 860 246 -133 -162 -221 -526 -316 -171 -864 -169 254 -9
2434 -9 -245 -137 -133 -455 219 460 -204 -221 358 -90 -663 -758 -959 -952 -220 369 87 81 591 663 -198 -275 -796 -745
$$ packed form
2283d91J77n06j48L92L69p5K81M27k79O0n1j77j72K48jj03lL64m91m99M17O71
2305D10n37K1J187j94o21Qj62o35l57O74J87k62L85O57m64J73J03n40o8K86n3
2326A98n1J03p0%k89n9l02M90J57J80J41M14l24k41q09K21q1k68L19K57J1K7L72
2349C96L03n87k26K57P2k27K33K10q67j68P22k61m54N19O04k14L38J81m68n40
2369a77J7L8k77n7J21K48K39K13l51m2m4M90j65J34k76M09n31J84k79o12L12M74
2391F8L57o7K61O8m32Jk81m01k00M11L34Mm55M17L07k33j46K70k77j81M40L61
2413F26n38k96j96Q0m20O24k17J21O15M61o14l79k9n9l05K10J45o93O95M23k63
2434ik36J08Ml22O74K41o64j7N79m48n73r5k01PP32N89k82oN10P2q61p7n21N1
$$ plain form
2458 -745 -559 48 42 -415 -314 240 405 -62 -165 113 460 699 383 -303 -448 30 -232 -784 -981 -105 457
2479 457 734 1053 765 141 241 243 32 -53 -67 102 123 395 207 -229 -303 401 622 220 167 794 415 321 -179
2502 -179 -476 -909 -259 274 298 271 314 576 506 407 373 -136 -247 28 303 61 -155 -287 -16 77 137 -142 201
2525 201 609 791 444 -151 57 -362 -490 -291 -692 -155 -51 374 461 125 129 -137 118 115 103 11 -210 139
2547 139 58 -507 -535 -88 -93 -369 627 482 9 117 656 121 -776 -462 -654 -578 -25 354 -60 -55 246 420
2569 420 -194 -117 240 255 -7 -89 166 -520 -142 -353 -332 -386 203 130 397 496 34 -322 -514 -55 -495 -606
2591 -606 -177 183 100 -18 263 -91 -181 -205 196 -183 -247 261 -228 -245 -401 -514 -694 -605 -62 101 -262 134
2613 134 434 233 93 -512 -549 -247 -399 -250 188 -176 321 -117 107 -143 -349 -295 124 290 152 200 242
$$ packed form
2458g45J86O07om57J01N54J65m67j03K78L47K39l16o86j45M78k62n52j97Q76N62
2479D57K77L19k88o24J00Kk11q5j4J69K1K72j88m36p4P04K21m02n3O27l79r4n00
2502a79k97m33O50N33K4k7M3K62p0r9l4n09j11K75K75k42k16j32K71R3O0k79L43
2525B01M08J82l47n95K08m19j28J99m01N37J04M25Q7l36Mk66K55lj2r2k21L49
2547A39q1n65k8M47nk76R96j45m73J08N39n35q97L14j92P6N53L79m14NL01J74
2569D20o14P7L57J5k62q2K55o86L78k11K1n4N89p3K67R9m62l56j92M59m40j11
2591f06M29L60q3j18K81l54r0k4M01l79o4N08m89j7j56j13j80Q9N43J63l63L96
2613A34L00k01j40o05l7L02j52J49M38l64M97m38K24k50k06N4M19J66j38M8M2
$$ plain form
2634 242 -428 -521 -130 -382 -490 580 678 184 158 305 -15 -239 -86 -103 -228 -88 626 206 249 72 47 201
2656 201 106 352 493 65 390 522 -44 -52 -163 -101 27 155 508 539 571 502 454 110 -189 -126 24 -114 234
2679 234 209 30 324 93 37 104 368 436 77 219 137 245 -236 -453 -330 109 19 78 207 413 507 69 8
2702 8 -148 -308 126 -207 124 -120 -120 -405 -305 -245 58 -29 52 96 257 -71 -14 70 -814 -327 -352 -73 -334 103
2726 103 119 448 120 18 226 70 -344 -285 102 203 -251 219 -373 -566 -255 -141 -96 179 403 429 210
2747 210 -11 -29 -482 -484 -260 -240 -9 436 362 413 29 101 42 14 -96 156 43 65 81 59 -403 -317 -159 -144 73
2772 73 431 301 204 510 275 -95 -162 -330 110 -226 -276 491 96 208 55 136 118 -122 -207 -30 197 -48
2794 -48 -54 -29 -406 -279 -1 -65 79 185 338 250 -44 -127 -89 -169 -231 -154 -104 34 236 409 38 -1 -51 214 -124
$$ packed form
2634B42o70r3L91k52j08J070R8m94k6J47l20k24J53j7j25J40P14m20M3j77k5J54
2656B01r5K46J41m28L25J32n66qj11O2J28J28L53L1L2o9m8l44k99O3J50j38L48
2679B34k5j79K94k31n6O7K64O8l59J42q2J08m81k17J23M39r0N9J29K06R4m38o1
2702Hj56j60M34l33L31k44%k85J00O0L03q7Q1M4J61l28N7Q4q84M87k5K79k61M37
2726A03J6L29l28j02K08j56m14N9L87J01m54M70n92j93L11J14M5K75K24K6k19
2747B10k21j8m53kK24K0K31M45p4N1l84P2n9k8j10K52j13K2J6k2m62Q6J58J5K17
2772G3L58j30r7L06k35l70o7j68M40l36n0P67l95J12j53Q1j8k40q5J77K27k45
2794d8oK5l77J27K78o4J44J06J53q8k94q3L8q0o2P7N0J38K02J73l71l9n0K65l38
$$ plain form
2819 -124 97 -23 6 18 240 165 -250 -277 -188 198 303 520 230 169 45 -73 -119 -217 138 145 193 -9 242 111
2843 111 180 43 26 -83 -186 279 495 360 273 -144 -21 -83 -107 -233 -36 86 246 228 -17 -107 60 -196
2865 -196 -405 83 -45 -143 -25 524 81 -348 -256 252 286 -129 220 52 -185 -272 -125 -40 -463 -702 44 154
2887 154 -201 71 297 -26 -387 -312 -483 -614 -19 143 -242 -51 135 -1 -281 -137 -112 -344 12 271 146
2908 146 -32 -153 -293 -142 -167 -53 152 -151 364 293 277 0 -30 164 -215 -244 -117 -129 194 174 39 -149
2930 -149 -596 46 139 198 102 257 -265 -14 250 -5 -343 -187 103 341 39 403 149 -77 -58 285 130
2951 130 136 175 313 227 -278 -38 361 119 -135 154 -2 -63 172 453 128 24 -158 249 -146 -206 205 341
2973 341 103 335 260 34 -146 -62 0 66 -23 265 464 56 225 -5 -128 112 -40 94 72 56 77 124 14
$$ packed form
2819a24K21j20K9J2K22p5m15k7Q9L86J05K17k90o1j24j18m6r8L55PM8k02K51j31
2843A11O9j37j7j09j03M65K16j35q7m17J23o2k4j26J97J22J60j8k45r0J67k56
2865a96k09M88j28r8J18N49m43m29R2N08L4m15L49j68k37q7J47Q5m23k39P46J10
2887A54l55K72K26l23l61P5j71j31N95J62l85J91J86j36k80J44K5k32L56K59j25
2908A46j78j21j40J51k5J14K05l03N15p1j6k77l0J94l79k9J27j2L23k0j35j88
2930a49m47O42R3N9r6J55n22K51K64k55l38J56K90K38l02L64k54k26J9L43j55
2951A30OL9J38q6n05K40L99k42k54K89j56o1K35K81l25j04j82M07l95o0M11J36
2973C41k38K32p5k26j80Q4O2O6q9K88J99m08J69k30j23K40j52J34k2j6K1M7j10
$$ plain form
2996 14 52 -153 -39 -47 103 256 5 -27 366 320 -347 -393 25 -250 276 321 -93 -241 8 139 -118 -114 174
3019 174 68 70 351 277 -71 -134 167 139 -79 -207 115 84 261 22 62 -298 -14 -316 29 -284 12 455
3041 455 -334 -129 -188 143 -196 -182 125 283 -65 -45 397 -122 -119 -25 -70 -459 -33 351 -258 44 -96 174
3063 174 -176 -200 70 151 -298 -116 80 -7 -159 -38 -228 -77 -241 -18 -130 -200 -151 -46 -219 -115 206 -12
3085 -12 -309 -252 218 3 -388 -2 -204 146 -171 67 62 -150 194 13 -80 -199 112 118 3 -53 345 -21 -295
3108 -295 171 277 -194 -168 246 193 -84 354 468 95 21 264 36 -158 198 58 -106 -209 542 296 -104
3129 -104 100 47 282 -77 248 328 -172 -142 508 204 -427 -67 89 288 -106 90 258 -127 -418 0 155
3150 155 -440 172 33 117 9 -8 68 -158 -120 192 109 -266 -67 334 -11 -173 165 252 -139 8 67 -255
$$ packed form
2996A4L8k05J14qJ50J53k51l2L93m6o67m6M18k75N26M5m14j48K49J31k57MK88
3019A74j06KK81p4l48o3L01k8k18j28L22l1J77k39M0l60K84l02L45l13K96M43
3041D55p89K05n9L31l39J4L07J58l48K0M42n19LR4m5l89M26L84o09L02j40K70
3063A74l50k4K70Q1m49J82J96q7j52J21j90J51j64K23j12p0M9J05j73J04L21k18
3085a2k97N7M70k15l91L86k02L50l17K38nk12L44j81r3j19L11Oj15n6L98l66k74
3108b95M66J06m71K6M14n3k77M38J14l73p4K43k28j94L56j40j64j03P51k46m00
3129a04K04n3K35l59L25Q0n00L0O50l04o31L60J56J99l94J96J68l85k91M18J55
3150A55n95O12j39Q4j08j7P6k26L8L12q3l75J99M01l45j62L38Q7l91J47N9l22
$$ plain form
3172 -255 -108 -3 124 88 -455 72 -217 -231 85 190 125 -148 202 74 -173 119 113 28 -216 -173 83 -154
3194 -154 29 -91 -287 -370 140 -165 -194 -48 41 -24 -193 -86 238 -252 -238 71 -18 -207 -41 166 -93 -137
3216 -137 -37 92 -64 -126 210 -138 -303 20 359 70 -164 -89 4 72 81 230 84 -302 -36 266 -375 -269
3238 -269 20 -46 -434 -13 110 101 -266 220 518 -148 -230 46 77 -134 -22 14 -353 -74 248 41 -202 120
3260 120 164 299 -75 115 69 74 -327 -36 -288 -280 -164 66 -26 -114 54 196 -10 355 95 59 -107 136 159
3283 159 -271 -366 274 197 -124 259 112 264 -76 430 94 -49 99 400 188 30 24 69 -103 -132 425 313
3305 313 -82 114 256 128 -202 77 -23 -126 79 242 -106 7 91 214 106 -128 46 24 -345 -170 -340
3326 -340 -315 -218 114 371 11 -56 179 33 -333 -121 69 -271 -225 203 -225 -345 -299 166 -82 -2 145 -184
$$ packed form
3172b55J47J05J27l6n43N27k89j4L16J05o5k73L50j28k47K92oq5k44M3K56k37
3194a54J83j20j96q3N10l05k9J46Q9o5j69J07L24m90J4L09q9j89J66K07k59m4
3216a37J00J29j56o2L36l48j65L23L39k89k34P5R3O8RJ49j46l86K66L02o41J06
3238b69K89o6l88M21J23rl67M86K98o66q2K76L1k11J12L6l67K79L22k07k43L22
3260A20M4J35l74J90m6Nm01K91k52QJ16K30r2q8J68J42k06L65k60l6j66K43K3
3283A59m30r5O40p7l21L83j47J52l40N06l36j43J48L01k12j58oM5j72k9N57j12
3305C13l95J96J42j28l30K79j00j03K05J63l48J13Q4J23j08k34J74k2l69J75j70
3326c40K5R7L32K57l60o7K35j46l66K12J90l40M6M28m28j20M6M65k48Q0J47l29
$$ plain form
3348 -184 -224 284 255 -74 -99 -173 -258 -406 -398 -72 -79 -153 159 122 -202 -183 -13 183 -341 -212 -80 7 -406 -364 -76
3373 -76 -285 -147 298 258 165 -73 260 71 -267 -40 18 -291 -70 332 46 -292 295 197 237 -43 -52 154 -356
3396 -356 -113 24 -68 -133 -228 357 -86 -421 379 316 145 200 346 99 -248 -117 40 -119 -80 225 113 -66
3418 -66 129 403 53 -27 179 -323 -86 -49 166 -18 -92 -54 -97 -275 124 177 255 -163 341 393 -34 -161 92
3441 92 -187 -381 91 72 -10 35 265 -46 166 -210 191 -66 -32 336 226 -103 -276 -169 127 185 142 90 29
3464 29 29 155 143 -53 -114 22 17 -237 107 188 95 -194 84 234 -203 173 355 375 -39 -98 -44 -156 -37 -137
3488 -137 383 -104 -122 47 180 -47 194 283 -402 -127 -66 -88 -131 36 -16 -47 -104 276 -72 87 -123 167 -61
3511 -61 40 37 -131 -281 -435 -187 17 -262 -39 92 67 -182 147 40 -161 -86 -98 57 -99 -126 -28 -281 24
$$ packed form
3348a84m0N08k9l29k5p4q5j48QL26pp4L12l7l24J9J70J96n24J29J32Q7m13M2K88
3373g6k09J38M45m0r3k38L33j89l38K27N8l09K21M02k86l38N87r8M0k80rK06n10
3396c56K43J37r2o5r5N85m43l35Q00o3j71N5J46k47l47J31J57j59L9L05j12j79
3418f6J95K74l50q0K06n02K37L7K15j84p4L8m3j78L99N3P8m18N04N2m27j27K53
3441I2k79j94M72j9q2M5K30l11K12l76M01k57L4L68j10l29j73J07K96N8m3n2o1
3464B9%J26j2j96o1J36nk54L44Q1r3k89K78J50m37L76J82K0m14n9N4j12J19j00
3488a37N20m87j8J69J33k27K41Q9o85K75O1k2m3J67n2l1n7L80l48J59k10K90k28
3511f1J01lj68j50j54K48K04k79K23J31k5k49L29j07k01P5j2J55j56k7R8k53L05
$$ plain form
3534 24 -23 -263 22 203 50 -14 123 -63 -3 -313 -370 -145 -163 -35 89 228 68 -136 254 62 -44 -270
3556 -270 46 -278 -14 -94 -16 -141 -114 207 42 29 55 401 322 -62 256 51 -307 46 378 -182 -354 214
3578 214 509 97 111 150 17 -152 -135 320 124 19 103 -12 -255 51 90 202 62 500 385 258 -147 -36
3600 -36 -145 -184 -43 -40 -171 260 126 165 167 -8 33 119 -133 91 149 172 103 -106 -127 -298 -215 69 130 -67 300
3625 300 161 140 -22 -176 -161 -249 17 -86 -128 50 149 -18 -179 -9 86 -7 44 324 32 -123 -206 131 -248
3648 -248 -375 -98 5 86 -53 191 399 -113 -95 -203 -101 -322 8 95 -187 -289 -204 -29 -269 -229 -52 -8
3670 -8 128 -44 268 -182 -82 -164 -608 -405 59 103 -226 9 361 229 -6 -228 -70 -49 -242 134 5 -253
3692 -253 -76 -65 -107 193 -428 54 101 -157 185 -215 18 -154 -118 -90 -475 -254 323 224 37 128 -102 -52 -228
$$ packed form
3534B4m7k40K85J81j53o4J37j86O0l10n7K25j8J28J24J39j60k04L90j92j06k26
3556b70L16l24K64q0P8j25K7L21j65j3K6L46p9l84L18k05l58L53L32n60j72N68
3578B14K95m12J4L9j33j69J7M55j96j05Q4j15k43L06L9J12j40M38j15j27m05J11
3600c6j09l9J41Lj31M31j34L9Kj75M1Q6k52K24N8K3o9k09k1j71Q3K84O1j97L67
3625C00j39k1j62j54J5q8K66j03m2J78R9j67j61J70R5r3N1K80k92j55q3L37l79
3648b48j27K77J03Q1j39K44K08n12J8j08J02k21L30Q7k82j02Q5J75k40M0J77M4
3670hJ36j72L12m50J00q2m44K03M64M4l29K35L52j32k35k22J58K1j93L76j29k58
3692b53J77J1m2L00o21M82M7k58L42m00K33j72L6K8l85K21N77r9j87R1k30N0j76
$$ plain form
3715 -228 -84 -293 -207 -224 11 132 88 35 -47 49 236 96 54 139 171 250 -125 -243 -151 -204 -191 75 500 -15
3739 -15 380 252 168 -124 307 75 -40 266 123 12 132 -41 -133 -9 130 503 388 232 329 176 8
3760 8 -13 63 82 -196 -87 147 56 281 124 -45 302 -116 -33 74 29 33 138 -30 -49 -158 -138 -97 -171 364 -117
3785 -117 166 146 202 -49 -25 -455 -302 -187 -64 30 -34 -54 -132 146 -109 12 29 163 271 -34 -192 -65 -326
3808 -326 81 -350 -633 -315 42 -17 96 -10 277 79 -375 -275 -308 -288 -143 133 226 -72 -7 209 -160 -173
3830 -173 135 25 68 -30 -5 -103 -146 -324 -255 26 -51 144 200 271 252 42 -10 -97 -289 231 -26 129 143 86 -4
3855 -4 -22 210 210 104 261 134 9 -54 -22 -218 -177 142 65 145 -1 148 86 142 261 50 -111 329 74 88
3879 88 -57 17 48 -209 -7 -215 85 -89 216 356 209 220 255 -159 55 -103 -53 -196 125 35 146 271
$$ packed form
3715b28J44k09Q6j7K35J21m4n3q2R6J87j40m2Q5L2P9l75j18R2n3J3K66M25n15
3739a5L95j28q4k92M31k32j15L06j43j11J20j73r2J24J39L73j15j56R7j53j68
3760Hk1P6J9k78J09K34r1K25j57j69L47m18Q3J07m5MJ05j68j9j09K0M1p4N35m81
3785a17K83k0N6k51K4m30J53J15J23R4o4k0p8K78k55J21J7J34J08l05j58J27k61
3808c26M07m31k83L18L57n9J13j06K87j98m54J00l3K0J45K76R3k98O5K16l69j3
3830a73L08j10M3r8K5r8m3j78O9K81p7J95N6P1j9k10n2q7j92N20k57J55J4n7r0
3855dj8K32%j06J57j27j25o3L2j96M1L19p7Q0j46J49o2N6J19k11j61M40k55J4
3879H8j45P4L1k57K02k08L00j74L05J40j47J1L5m14K14j58N0j43L21r0J11J25
$$ plain form
3901 271 -189 100 -148 -62 -143 193 -222 190 -40 -173 10 7 169 -161 378 78 114 183 128 258 -134 -105 -80
3924 -80 -125 101 283 246 153 315 92 157 -16 -63 -169 -92 174 241 90 95 -93 -347 -21 -107 253 -29 152 93
3948 93 147 87 -421 -75 -313 -88 -8 253 -20 323 235 -248 38 -94 -120 193 160 -70 3 -7 -212 -297 1
3971 1 60 -53 250 66 33 -248 203 -211 -85 -551 -273 -342 -12 -128 93 -2 195 111 -167 -34 -218 -270 -238
3994 -238 154 -87 102 129 -410 -308 105 -137 -15 356 -41 -77 5 -146 -88 -93 -66 -36 -421 84 222 274 94
4017 94 406 -1 112 65 0 96 128 -83 -269 224 182 -199 -122 137 327 363 128 216 36 249 -75 -94 -325
4040 -325 28 31 105 120 29 80 -241 -261 140 124 -18 85 136 105 -23 -169 -80 -142 104 177 -20 381 100 195 -215
4065 -215 -19 178 139 -268 -22 -37 67 142 184 259 -139 27 -15 1 -85 111 -202 -139 50 -166 -311 -366 69
$$ packed form
3901B71m60K89k48Q6q1L36m15M12k30j33J83lJ62l30N39l00L6O9n5J30l92K9K5
3924h0m5K26J82l7r3J62k23O5j73m7j06P7K66O7j51Nj88k54L26q6L60k82J81n9
3948I3N4o0n08L46k38K25Q0K61k73L43q8m83K86j32k6L13l3k30P3j0k05q5K98
3971AN9j13L03j84l3k81M51m14J26m66K78o9L30j16K21r5J97q4k78J33j84n2L2
3994b38L92k41J89K7n39J02M13k42J22L71l97l6Q2j51N8nK7L0l85N05J38N2j80
4017I4L12m07J13m7o5R6L2k11j86M93m2l81P7K59J90L6k35Q8j80K13l24j9k31
4040c25L53LP4J5r1N1l21k0M01j6j42J03N1l1j28j46Q9o2K46P3j97M01k81R5m10
4065b15J96J97l9m07K46j5J04P5M2P5l98J66m2J6q6J96l13O3J89k16j45n5M35
$$ plain form
4088 69 153 62 147 213 -227 -219 -78 -108 -162 -62 -114 257 196 -132 15 -135 287 -42 -107 -89 8 132 -188 -123 -244
4113 -244 -219 -203 188 65 121 -163 -40 231 71 -80 -212 -27 -4 73 83 32 -77 -72 -184 -88 27 4 -128 7
4137 7 -140 -565 -46 -7 -323 72 -31 -356 5 147 96 3 102 -73 6 -196 20 -301 -173 101 72 95 46
4160 46 70 -298 -85 -263 138 76 63 155 -172 -63 -243 53 84 -90 -272 52 58 -104 16 -15 -102 -211 7
4183 7 135 -203 78 -140 91 -71 9 -357 155 -170 74 192 115 310 -75 223 -167 -22 96 199 -132
4204 -132 6 37 63 -40 144 -5 121 77 210 217 -9 46 62 -178 226 -83 -98 301 342 117 50 105 -81 -228
4228 -228 -190 102 -20 185 145 30 256 -144 42 19 69 86 -11 -35 240 -131 -46 63 -137 304 -21 62 79
4251 79 -43 269 -58 -144 16 -22 -306 73 -70 196 -98 -235 -205 -178 -53 -239 -78 -7 -73 -209 144 -280
$$ packed form
4088F9Q4r1Q5O6m40QJ41l0n4J00n2L71o1l28J47j50M22l29o5J8R7J24l20O5j21
4113b44K5J6L91j23N6k84J23K71j60j51j32J85K3P7J0n1j09Nj12R6J15k3j32J35
4137Gj47m25N19L9l16L95j03l25L61J42n1r3R9j75P9k02K16l21J28K74k9K3m9
4160D6K4l68K13j78M01o2j3R2l27J09j80K96L1j74j82L24Oj62J20l1q7j09K18
4183GJ28l38K81k18K31j62Q0l66N12l25K44J18p7J95l85K98l90J45J18J03l31
4204a32J38L1K6j03J84j49J26m4J33Pk26N5J6k40M04l09j5L99M1k25o7N5j86j47
4228b28L8K92j22K05m0j15K26m00J86k3N0J7r7k4K75l71Q5J09k00M41l25Q3J7
4251G9j22L12l27q6J60l8k84L79j43K66k94j37L0K7J25j86J61P1o6j36L53m24
$$ plain form
4273 -280 -69 48 -305 103 57 -217 -103 66 -56 60 -302 -283 -105 -420 -110 -171 -80 191 -10 -89 -125 182
4295 182 102 25 161 241 -123 13 196 -150 -39 -229 281 98 -345 309 16 32 -272 33 -355 54 84 104
4317 104 40 194 21 -76 -319 -53 -63 -299 164 133 205 -63 -68 -101 -73 94 88 -118 -166 34 -20 -191 -106 -25 -196
4342 -196 -56 178 260 8 19 -83 17 -2 -209 -16 -121 -139 35 -126 -46 148 271 -79 104 -44 142 127
4364 127 258 372 108 264 -1 -74 129 56 198 220 -38 71 123 51 -78 13 93 296 28 1 277 171 -4
4387 -4 130 -64 50 -22 -32 -57 316 263 169 55 161 88 150 15 301 311 77 32 206 177 -84 -203 -88 -312
4411 -312 -14 -16 46 -4 6 119 -37 106 154 58 59 -370 -5 -89 -79 -347 -137 -161 -239 64 -138 -44 -121 174 -316
4436 -316 -160 276 -184 -2 -243 -230 -92 121 57 8 -203 -224 -25 -14 -46 -56 -8 -134 -160 74 91 -85 -69 241
$$ packed form
4273b80K11J17l53M08m6k74J14J69j22J16l62J9J78l15L10o1R1K71k01p9l6L07
4295A82q0p7J36Q0l64J36J83l46J11j90N10j83m43O54k93J6l04L05l88M09L0K0
4317A04o4J54j73r7k43K66j0k36M63l1P2k68nl3K8J67ok06m8K00n4j71Q5Q1j71
4342a96J40K34Q2k52J1j02J00j9k07J93j05j8J74j61Q0J94J23l50J83j48J86j5
4364A27J31J14k64J56k65p3K03p3J42K2k58J09N2p2j29R1Q0K03k68k7K76j06j75
4387dJ34j94J14p2j0k5L73n3r4j14J06p3O2j35K86J0k34m5J74k9k61j19J15k24
4411c12K98kO2n0J0J13j56J43M8r6Jm29L65q4J0k68K10k4p8L03k02R4p7K95m90
4436c16J56M36m60J82k41J3J38K13o4m9k11k1J99J1l2j0M8j26k6K34J7j76J6L10
$$ plain form
4460 241 68 -210 -114 -113 -73 159 -232 1 -101 -85 246 -138 47 -148 168 -23 122 153 142 153 -143 60 -253
4483 -253 -11 47 224 128 34 -201 105 333 -98 175 -240 -321 178 -11 -45 3 41 364 -193 124 142 -318 174
4506 174 228 355 -177 193 124 -92 74 -164 -201 -20 149 150 237 -138 254 8 -278 394 -88 -99 -46 110 97
4529 97 -88 32 295 -14 58 31 100 215 -12 181 -338 -136 58 267 -70 131 52 208 32 -9 53 34 89
4552 89 -83 -58 112 -65 -123 -89 28 -55 -100 180 110 152 170 96 53 190 79 125 -121 -172 -14 91 -95 73
4576 73 94 -194 404 171 -250 -32 -62 -79 -303 -212 -40 -130 -205 139 -118 -502 -41 111 -232 138 19 74 -204
4599 -204 -112 -146 -170 -170 275 280 -276 138 -102 -214 -157 -233 -204 -80 -75 -52 -202 -305 -176 -195 -107 -90 137 -158 -176 -26
4625 -26 188 -301 -14 150 -157 -215 -96 -157 43 -84 28 170 -118 -15 143 -155 -254 -186 209 -62 -376 34
$$ packed form
4460B41j73k78R6JM0K32l91K33j02J6L31l84J85j95L16j91J45L1j1J1k96K03l13
4483b53K42N8J77r6r4k35L06K28m31K73m15q1M99j89l4M8L8L23n57L17J8m60M92
4506A74N4J27n32L70o9k16J66k38l7J81J69JQ7l75L92k46k86O72m82j1N3J56j3
4529I7j85J20K63l09P2k7O9J15k27J93n19K02J94K09l37K01p9J56j76m1O2j9N5
4552H9j72K5J70j77n8L4J17q3m5K80p0M2J8p4m3J37j11M6k46n1J58J05j86J68
4576G3K1k88N98k33m21K18l0j7k24R1J72r0p5L44k57l84M61J52l43L70j19N5k78
4599b04R2l4k4%M45Nn56M14k40j12N7p6K9J24NK3j50j03J29j9Q8J7K27k95j8J50
4625b6K14m89K87J64l07n8J19o1K00j27J12J42k88J03J58k98r9O8L95k71l14M10
$$ plain form
4647 34 194 128 158 -48 53 67 287 81 -124 -51 -225 139 104 -12 75 190 73 -110 351 245 20 -44 96
4670 96 28 -207 224 418 -6 364 189 -186 -111 15 365 161 145 325 177 -150 376 61 -306 37 114 259
4692 259 -56 370 127 -48 -71 160 -458 -412 -26 -185 101 -184 249 17 173 227 108 48 94 302 -88 -112
4714 -112 50 75 -234 -235 -109 188 71 15 53 393 -252 84 -239 84 -283 -221 -53 -135 74 186 -143 -385
4736 -385 44 -15 268 -120 -103 -81 -282 -35 -122 -51 49 -99 41 -226 3 253 457 -238 -152 11 190 -304
4758 -304 53 -148 -227 -139 150 -9 215 34 142 109 -148 216 7 -301 -259 -18 -289 -73 123 54 -76 188
4780 188 19 -106 165 54 10 -395 -174 172 -96 -233 3 179 -392 -174 280 -113 -27 -4 202 366 -301
4801 -301 -111 68 -530 -225 242 60 30 102 354 -167 -74 169 -131 -59 164 -54 -113 -177 105 108 -105 96 131
$$ packed form
4647C4J60o6L0k06J01J4K20k06k05P3j74L64l5j16Q7J15j17j83M61j06k25o4J40
4670I6o8k35M31J94m24L70j75l75P5J26L50k04j6J80j48l27N26l15l67L43P7J45
4692B59l15M26k43j75k3K31o18M6L86j59K86k85M33k32J56N4j19o0M6K08l90k4
4714a12J62K5l09jJ26K97j17n6L8L40o45L36l23L23l67O2J68q2K09J12l29k42
4736c85M29n9K83l88J7K2k01K47q7P1J00j48J40k67K29K50K04o95Q6J63J79m94
4758c04L57k01p9Q8K89j59K24j81J08l3k57L64k09l08M2K41k71K16J96o9j30K64
4780A88j69j25K71j11m4m05K21L46k68j37K36J76n71K18M54l93Q6K3K06J64o67
4801c01J90J79n98L05M67j82l0P2K52n21R3K43l00P2K23k18n9o4K82Lk13K01L5
$$ plain form
4824 131 83 -14 -152 256 -7 -18 -155 -25 68 17 185 323 -204 63 337 440 -152 -171 273 2 -104 340
4846 340 146 4 -219 333 72 -448 165 182 362 178 182 -21 -235 187 -30 -109 -44 69 297 -102 216 339
4868 339 -429 -483 319 101 -428 57 226 -326 -262 -30 -82 -250 -3 284 88 -216 -22 26 -838 -32 284
4889 284 -375 -193 -159 147 -400 -31 292 -45 -156 128 145 -143 153 -34 -171 -293 -493 163 73 -53 211
4910 211 207 82 16 229 151 17 -158 -13 47 -150 72 -104 -9 43 179 184 46 -34 278 -72 38 -4 39 -28
4934 -28 -173 -103 228 -163 -121 249 124 -142 279 6 -222 -215 106 18 162 233 174 -4 -379 377 204 -31 278
4957 278 242 -151 -80 5 104 -430 -165 362 51 -132 334 251 -56 -1 57 -160 -638 476 175 157 -199 340
4979 340 -119 -434 17 264 -148 150 541 73 -206 70 496 -33 -39 150 96 169 169 346 247 18 163 103 -266
$$ packed form
4824A31m8r7j38M08k63j1j37J30R3n1J68J38n27K67K74J03n92j9M44k71j06M44
4846C40j94j42k23N52k61n20O13J7J80j84Mk03k14M22k17p9O5J13K28l99L18J23
4868C39p68n4Q02k18n29M85J69n52O4K32n2j68K47K87j96l04J94M8q64Q06L16
4889B84o59J82L4L06n47L69L23l37j11K84J7k88K96j87j37j22k00O56r0j26K64
4910B11mj25o6K13p8j34j75J45O0j97K22j76R5N2J36Nj38q0L12l50J10m2M3o7
4934b8j45P0L31l91M2L70j25k66M21k73k28PL21q8J44P1n9j78l75P56j73k35L09
4957B78l6l93P1Q5R9n34K65N27l11j83M66q3l07N5N8k17m78J114l01j8l56N39
4979C40m59l15M51K47m12K98L91m68k79K76M26n29oJ89n4P3%J77r9k29J45o0l69
$$ plain form
5002 -266 -25 84 107 110 -55 -117 -77 390 -77 -199 19 -115 173 368 32 68 -123 75 -167 -29 326 -113
5024 -113 129 31 350 158 117 170 -29 -353 -188 220 -284 -576 315 197 -125 32 81 63 -260 335 282 -337
5046 -337 -156 98 -373 -448 132 -96 -362 73 259 213 -316 47 312 -198 -281 113 -277 -357 -211 205 -257
5067 -257 -306 -127 213 -189 -59 314 -69 -202 -113 -21 -187 11 29 -121 -335 208 368 -29 -103 121 152 98
5089 98 -42 -51 -6 -151 -142 34 -17 -24 10 321 264 155 230 125 -286 -118 23 -74 -188 353 97 157 67 36 226
5114 226 -140 238 131 40 73 210 271 -158 -307 -24 -215 -99 381 248 188 191 444 -119 -28 70 77 -322 -179
5137 -179 178 305 -184 346 504 -248 -68 -68 37 -244 -96 -92 -319 -135 146 38 -190 -338 348 -159 -40
5158 -40 262 297 9 89 79 -254 -144 78 334 -167 16 44 162 -157 -20 117 -122 -86 -191 141 -112 -56
$$ packed form
5002b66K41J09K3Lj65o2M0M67m67j22K18j34K88J95l36L6j91J98k42J38L55m39
5024a13K42r8L19j92m1N3j99l24J65M08n04k92Q91j18l22J57M9j8l23N95n3o19
5046c37J81K54m71p5N80k28k66M35J86m6n29L63K65n10q3L94l90q0J46M16m62
5067b57m9J79L40m02J30L73l83j33Q9R2j66J98J8j50k14N43J60l97p4K24L1n4
5089I8j40rM5j45RJ76n1pL4L11n7j09P5j05m11J68J41r7j14N41k56O0r0l1J90
5114B26l66L78j07r1L3J37O1m29j49K83j91J16M80j33o0LK53n63R1R8Pl99J43
5137a79L57J27m89N30J58p52J80%J05k81J48Mk27J84K81j08k28j48O86n07J19
5158d0L02L5k88Q0j0l33J10K22K56n01J83K8J18l19J37J37k39L6j05L32k53N6
$$ plain form
5180 -56 -245 -98 -49 154 208 18 -28 -27 141 -2 260 -119 132 -203 -169 81 192 -43 -86 74 -166 154 62
5203 62 259 -117 -88 127 -220 50 -61 135 57 -220 180 368 -20 188 213 23 -258 276 -141 -360 245
5224 245 415 -103 -166 241 -179 -121 48 403 -284 -65 297 101 -396 -14 193 -557 -105 460 88 -447 168
5245 168 306 46 -120 56 -132 148 -59 265 393 -232 -33 -166 -86 -129 -187 -43 240 147 103 -250 -267 -55
5267 -55 -148 -194 -86 18 -161 139 200 156 35 193 256 54 46 10 149 25 -62 -95 91 6 341 128 3 64
5291 64 85 141 209 -271 -147 164 -36 39 35 307 -94 147 366 21 -125 89 347 -229 -222 213 284 -106 -60 244
5315 244 -154 -250 22 176 -30 25 167 138 -300 -114 -83 -425 51 300 -138 -402 165 48 -287 -361 -30 100
5337 100 -187 322 157 -220 -152 -84 182 -295 48 140 -302 197 45 -48 -287 -127 72 13 -73 -7 -118 -111 -112 35
$$ packed form
5180e6j89J47M9K03N4j90m6JJ68j43K62l79K51l35L4K50J11k35m3J60k40L20r2
5203F2J97l76K9K15l47K70j11J96p8k77M00J88l88K08K5j90k81N34m17k19O05
5224B45J70n18o3M07m20N8J69L55o87K19L62j96m97L82K07p50M52N65l72n35O15
5245A68J38k60j66J76j88K80k07L24J28o25J99j33Q0m3n8J44K83r3m4l53j7K12
5267e5r3m6J08J04j79L00O1m4j21J58O3k02ql6J39j24q7l3J86q5L35k13j25O1
5291F4K1N6O8m80J24L11k00P5mK72m01K41K19l45j46K14K58n76PM35P1l90M6L04
5315B44l98r6K72J54k06N5J42k9m38J86L1l42M76K49m38k64N67j17l35p4L31J30
5337A00k87N09j65l77O8O8K66m77L43R2m42M99j52r3k39J60J99n9q6O6j11PjJ47
$$ plain form
5361 35 4 -162 -114 63 293 -58 17 72 -157 -209 -220 64 -169 -25 377 188 -93 85 -92 -50 46 -17 241
5384 241 -87 53 95 102 -2 16 -107 14 -3 76 49 146 253 108 4 -233 180 206 -69 219 117 93 -130
5407 -130 21 -61 -45 -270 91 202 -19 -96 110 -38 -152 -36 -85 -438 401 296 -34 29 100 100 -256 46 94
5430 94 -8 19 84 281 49 60 351 51 39 -12 -3 127 228 164 -14 221 316 34 177 -77 -110 213 319 109
5454 109 151 18 228 289 122 177 -63 298 -5 40 64 -20 -164 1 -90 120 17 -145 125 70 74 12 -193 55
5478 55 -130 109 117 141 58 -30 316 -285 99 86 24 -273 -316 -103 -36 -129 128 62 5 -179 -45 5 -220 -57 -68
5503 -68 -243 -73 20 -105 99 -14 260 -159 -224 49 -250 -47 -126 -295 -130 -194 6 -8 -91 -67 3 -52 -116 -84
5527 -84 128 52 -210 266 -88 -424 321 -128 14 -96 157 -103 -33 42 77 -180 210 217 143 263 43 127 150
$$ packed form
5361C5l1j66M8J77K30l51P5N5k29n2j1K84k33J44M02j89k81J78j77M2R6o3K58
5384B41l28J40M2Pj04J8j23J21j7P9k7R7J07j45j04k37M13K6k75K88j02k4k23
5407a30J51q2J6k25L61J11k21p7K06j48j14J16m9l53Q39j05l30O3P1%l56L02M8
5430I4j02K7O5J97k32J1K91l00j2n1RJ30J01o4j78K35R5k82J43k54l3L23J06k10
5454A09M2j33K10O1j67N5k40L61l03M5K4q4j44J65r1K10j03j62K70n5Mo2k05K48
5478E5j85K39QK4q3q8L46o01L84j3o2k97m3K13O7r3K57o6n7j84J34N0k25J63j1
5503f8j75J70R3j25K04j13K74m19o5K73k99K03p9j69J65o4K00j4q3K4P0n5o4L2
5527h4K12p6k62M76l54l36P45m49J42j10K53k60P0P5L5k57L90Pp4J20k20Q4K3
$$ plain form
5550 150 -32 18 29 -59 85 98 -107 -48 250 277 -79 18 -18 21 116 148 145 210 -204 223 -147 -89 31 272 19
5575 19 85 59 50 68 -114 79 -124 222 -290 200 347 -3 -17 220 -115 -119 -131 293 -131 -110 29 -60 -54 31 -30
5600 -30 -303 -22 -87 -44 403 -59 -43 -68 142 -127 -62 -23 -184 210 -89 -100 178 -83 0 215 -64 189 29
5623 29 -204 -199 -93 83 -40 311 222 158 281 7 63 194 -226 -79 216 -146 -102 109 42 47 -84 92 -26
5646 -26 -137 136 -25 173 85 198 178 -56 -225 221 174 69 153 38 -17 -267 -269 -107 123 111 -37 -51 433
5669 433 -254 72 220 91 -65 -81 -39 -392 126 -66 61 -110 19 -25 -361 -220 -52 -15 -324 24 -110
5690 -110 62 -15 -97 -336 52 0 -48 82 -160 -21 -34 -50 -256 228 115 199 -63 -257 -33 -66 113 -384 -97
5713 -97 -24 -4 111 267 224 -10 -27 41 134 93 44 45 52 -92 19 235 -20 88 160 105 83 -84 87 -95 -253
$$ packed form
5550A50j82N0J1q8J44J3k05N9K98K7l56R7l6L9R5L2lO5m14M27l70N8J20K41k53
5575A9O6k6rJ8j82J93k03L46n12M90J47l50j4K37l35mj2M24m24K1J39q9OQ5o1
5600c0k73K81o5M3M47m62J6k5K10k69O5L9j61L94k99j1K78k61Q3K15k79K53j60
5623B9k33NJ06J76j23L51q9o4J23k74N6J31m20J47K95l62M4K11o7Nj31J76j18
5646b6j11K73j61J98q8J13k0k34j69M46m7j05Q4j15n5k50kJ62K30j2j48j4M84
5669D33o87L26J48j29j56j6M2l53N18j92J27j71J29m4l36J41J68L7l09L48j34
5690a10J72p7q2k39L88n2m8J30k42J39j3j6k06M84j13Q4k62j94K24l3J79m97K87
5713i7P3K0J15J56m3k34j7O8R3m1m9JPj44J11K16k55J08P2n5k2j67J71j82j58
$$ plain form
5738 -253 80 333 -71 9 22 -173 54 222 203 388 -245 8 6 -11 -108 127 -48 43 -165 -29 148 -148 332
5761 332 -218 66 35 131 139 174 -104 -308 -119 -52 -82 -7 50 90 160 220 -48 -12 -163 -69 -164 -245 41 -122 13
5786 13 -60 120 7 -36 -14 -171 -135 -130 -93 72 29 -47 238 171 -147 1 -64 75 25 -141 -248 78 -87 -22 89
5811 89 -17 -225 28 -56 -179 -418 364 139 0 -121 129 -19 -75 -137 -15 18 -39 65 69 -55 -86 100 95 9
5835 9 -142 84 39 206 -185 25 -25 -50 -158 184 26 118 11 411 254 -258 40 76 -71 81 13 -166 49
5858 49 -88 -34 -50 7 165 164 167 -45 -88 269 -16 -139 -72 -119 29 -128 166 -90 -167 246 -267 -231 -237 0 -27
5883 -27 -10 -35 56 139 141 -138 -32 126 151 47 47 -34 -123 131 5 -203 167 223 429 227 87 198 70 -74
5907 -74 -20 266 123 296 -184 274 133 113 13 -2 -4 -9 136 -15 144 45 118 -63 -103 -74 -190 -11 -92 -149 72
$$ packed form
5738b53L33K53m04Q0J3j95K27J68j9J85o33K53kj7r7K35j75R1k08J36J77k96M80
5761C32n50K84l1R6QL5k78k04J89O7l0P5N7M0P0O0k68L6j51R4r5q1K86j63J35
5786A3p3J80j13m3K2j57L6NL7J65m3p6K85o7l18J48o5J39n0j66j07L26j65O5J11
5811H9j06k08K53q4j23k39P82k25j39j21K50j48n6o2J22L3n7J04Mj24l1J86nq6
5835Ij51K26m5J67l91K10n0k5j08L42j58R2j07M00j57n12K98L6j47J52o8j79K15
5858D9j37N4j6N7J58jLk12m3L57k85j23O7m7J48j57K94k56p7M13n13L6oK37k7
5883b7J7k5R1Q3Kk79J06J58K5j04%q1q9K54j26k08L70N6K06k02j40J11j28j44
5907g4N4K86j43J73m80M58j41k0j00j5knJ45j51J59r9P3j81m0K9j16J79q1n7K21
$$ plain form
5932 72 -292 1 101 -16 -98 -27 143 -123 95 -81 -57 -304 -125 -31 -97 53 156 -30 66 -109 -225 -299 36
5955 36 138 -205 -55 -28 -72 73 57 57 -83 171 20 -176 30 -192 122 27 51 53 53 28 16 -18 -146 130 -222
5980 -222 49 -178 -208 -31 38 -50 229 -193 -58 -150 -475 106 -66 121 -13 176 -28 127 -135 17 99 -306
6002 -306 -97 199 -215 -135 -81 -19 195 223 97 -481 141 -3 127 -348 -30 9 -55 44 66 241 196 168 244 238
6026 238 -171 1 -176 297 110 154 -137 194 136 162 160 129 42 -169 98 -43 -145 -32 -112 -50 -64 122 111 -109
6050 -109 -135 94 109 -209 113 422 273 -266 -10 -233 53 -89 -47 214 -19 12 225 -28 129 171 -129 -91
6072 -91 -183 -115 95 -290 -12 9 129 -177 99 59 155 226 108 302 210 -266 13 35 -96 -23 -27 111 235 114
6096 114 129 246 87 37 -81 62 -193 96 -313 75 -121 51 -244 17 -89 80 61 56 -125 -191 -242 74
$$ packed form
5932G2l64K93J00j17q2P1J70k66K18j76K4k47J79R4o6J50J03j86R6j75j16p4L35
5955C6J02l43J50K7m4J45j6%j40K54j51j96K06k22L14r5K4K%k5j2l4j28K76l52
5980b22K71k27l0J77O9q8K79m22J35r2l25N81j72J87j34J89k04J55k62J52Q2m05
6002c06K09K96m14Q0N4O2K14K8j26n78O22j44J30m75L18L9o4R9K2J75m5k8P6o
6026B38m09J72j77M73j87M4k91L31n8K6kl1q7k11K67j41j02J13q0O2j4J86j1k20
6050a09k6K29J5l18L22L09j49n39K56k23K86j42M2K61k33L1K13k53J57M2l00L8
6072i1r2O8K10l85K78K1J20l06K76m0R6P1j18J94r2m76K79K2j31P3mJ38J24j21
6096A14J5J17j59n0j18J43k55K89m09L88j96J72k95K61j06J69j9nj81o6n1L16
$$ plain form
6118 74 -14 -174 289 -272 -61 -335 38 55 169 -99 54 -304 -85 103 -276 -20 -45 -178 -125 145 197 86
6140 86 -15 -314 -298 19 -212 -181 -1 319 8 -13 39 92 18 102 -111 -58 -36 -78 -242 -99 -226 31 223 81
6164 81 9 64 61 39 280 14 -77 203 96 224 -89 -102 146 214 -46 5 -89 119 135 146 99 113 361 51 16
6189 16 -64 -17 45 136 -87 -5 -197 223 144 28 -61 -207 -272 120 -101 232 -202 206 185 145 366 259 153 -41
6213 -41 367 -23 71 -47 -8 -11 -358 -92 69 53 81 357 117 36 68 -19 -90 111 269 -151 256 -55 -176 -192
6237 -192 -107 176 -40 -80 -15 180 -189 -54 -13 -58 -173 81 -64 295 76 95 52 234 157 -134 -4 138 24
6260 24 -36 -65 7 121 -190 -152 72 -99 -137 150 -20 -97 -88 82 -127 -153 67 -12 -102 -104 0 98 -124 80 77 -52
6286 -52 14 -81 -181 292 -111 24 105 45 71 -192 -132 -1 127 5 -74 -137 -160 -295 -201 -204 -49 -59 -22 -223 -122
$$ packed form
6118G4q8j60M63n61K11k74L73J7J14k68J53l58K19J88l79K56k5j33N3K70N2j11
6140H6j01k99J6L17k31L1J80L20l11k1N2N3p4Q4k13N3K2m2j64J43j27K57J92j42
6164H1p2N5lk2K41k66r1K80j07J28l13j3K48O8k60N1r4K08J6J1m7J4K48l10l5
6189A6q0M7O2R1k23Q2j92M20p9j16q9j46o5L92k21L33m34M08k1m0K21j07j06j94
6213d1M08l90R4j18L9ll47K66J61j6K8K76k40q1L2q7p1K01J58m20M07l11j21j6
6237a92Q5K83k16m0O5J95l69J35M1m5j15K54j45L59k19J9m3J82p7k91J30J42j14
6260B4o0k9P2J14l11L8K24j71l8K87j70p7RJ70k09k6K20p9r0kJ04R8k22K04lj29
6286e2O6r5j00M73m03J35Q1o0K6k63O0J31J28j22p9o3k3j35R4lJ55j0L7k01J01
$$ plain form
6311 -122 70 -41 16 183 -54 216 18 126 -90 94 -106 -103 115 -167 -99 10 330 96 -45 -20 172 -23
6333 -23 70 66 201 68 -107 -175 136 -192 164 71 86 23 -158 38 -217 115 227 -2 15 104 188 28 -36 88
6357 88 440 172 11 305 -92 128 91 53 -51 -111 175 157 1 67 -93 235 68 -282 1 242 256 33
6379 33 96 -144 -97 105 195 -158 84 -49 312 222 -36 -101 -205 82 -83 74 159 64 75 -15 122 -88 -131 214
6403 214 -215 -284 -48 -52 -25 -306 -24 -261 -47 261 160 31 206 86 -50 -352 66 69 -247 -38 159 -159
6425 -159 137 -13 63 -23 -136 -45 11 20 74 -73 -28 -62 -128 -347 96 -19 -240 266 40 -78 108 -35 -182
6448 -182 145 -82 29 225 -127 -163 71 -30 -28 -1 41 -106 -60 17 -122 -206 -80 33 -36 -74 -59 -83 -1 364
6472 364 75 -133 -77 -152 -161 14 -150 113 -154 -74 88 -51 -216 -79 -125 114 275 -9 220 143 -39 -214
$$ packed form
6311a22J92j11N7J67k37K70j98J08k16J84k00LK18k82O8J09L20k34j41K5J92j95
6333b3R3mJ35j33j75o8L11l28L56r3J5o3j81J96k55L32J12k29J7Q9Q4j60o4J24
6357H8L52k68j61K94l97K20l7l8j04o0K86j8j56O6j60L28j67l50K83K41J4k23
6379C3O3k40M7K02R0l53K42j33L61r0k58o5j04K87j65J57Q5r5J1r0J37k10m3L45
6403B14m29o9K36mK7k81K82k37K14L08j01j29J75j20j36l02M18Ll16K09J97l18
6425a59K96j50P6q6j13R1N6RN4j47M5l4o6k19M43j15k21N06k26j18J86j43j47
6448a82L27k27J11J96l52l6K34j01KK7M2j47M6P7j39q4J26J13o9l8J5k4Q2L65
6472C64k89k08N6p5rJ75j64K63k67Q0J62j39j65J37m6K39J61k84K29p7j82j75
$$ plain form
6494 -214 55 149 204 -345 11 -60 -51 -89 75 -71 -147 -28 164 -18 182 -43 -29 -96 -108 131 278 225 213 -16
6518 -16 -19 172 77 77 64 58 122 -45 -122 -57 -31 231 45 257 106 151 106 -96 75 76 31 -280 -95 117 -43 -138
6544 -138 346 410 -16 -76 -120 276 102 100 433 103 -77 -120 -15 25 119 261 93 -8 -198 -254 118 -135 -145
6567 -145 -91 12 219 -33 190 -66 -147 -84 -167 -295 -92 69 -384 29 -238 39 -138 86 -60 -15 43 -114
6589 -114 16 -206 135 -119 -93 -150 -49 112 23 -134 71 -174 -111 -33 -30 -168 -25 -67 29 86 -182 70 -48
6612 -48 207 -183 35 229 -249 -31 257 39 -73 30 -19 -44 151 -234 -90 206 -15 110 133 97 -273 80
6634 80 23 -28 45 -120 39 181 -30 -282 -35 160 -7 -158 100 123 -102 -209 147 5 2 315 60 125 -39
6657 -39 -168 225 229 -12 -7 162 -223 -57 -21 -46 172 44 -117 144 477 -7 21 508 19 68 197 -2 -249
$$ packed form
6494b14K69R4N5n49L56p1Rl8J64j46p6J19J92j82K00k25J4o7j2K39J47n3j2k29
6518a6lJ91r5%j3oO4j67p7O5K6K62j86K12j51M5m5k02J71Jm5l11J85K12j60r5
6544a38M84O4m26o0m4L96j74kL33l30j80m3J05M0R4J42j68j01j90n6L72k53j0
6567a45N4J03K07k52K23k56q1O3q3j28K03J61m53M13k67K77j77K24j46M5N8j57
6589a14J30k22L41k54K6n7J01J61q9j57K05k45O3P8Lj38J43m2R6N7k68K52j18
6612d8K55l90K18J94m78K18K88k18j12J03m9k5J95l85J44K96k21J25K3l6l70L53
6634H0n7n1P3j65J59J42k11k52K47J95j67j51K58K3k25j07L56j42lL13k55O5j64
6657c9j29L93Mk41NJ69l85J66L6k5K18j28j61K61L33m84K8M87m89M9J29j99k47
$$ plain form
6680 -249 57 -16 183 21 -81 124 -41 -153 179 -98 75 156 -164 -175 -57 11 -181 -15 -20 65 -9 -21 64
6703 64 81 -4 -115 4 136 -84 181 -301 -109 67 -8 -128 181 -206 -19 -38 158 -32 67 37 -65 -150 -231
6726 -231 -46 4 80 64 -119 -23 -147 -182 -234 -12 -4 -246 -182 83 118 3 65 -141 -37 4 -40 265 -62 51
6750 51 -99 -58 46 108 5 127 -29 -13 315 349 -92 -96 -305 -288 -169 9 109 -77 75 -3 -194 141 -178
6773 -178 5 -6 27 -138 57 -234 -198 -10 -102 53 -183 133 33 32 193 -179 58 264 -10 205 -92 -111
6795 -111 -4 87 -144 35 336 58 70 58 182 264 -57 7 -240 -50 81 -153 50 119 178 102 236 -17 -48
6818 -48 -8 40 -63 344 100 251 296 -98 7 -121 1 209 -40 236 -214 -21 59 104 -201 -49 35 -185
6840 -185 -113 -36 128 -50 -54 -6 -20 -120 -92 27 -65 120 -1 5 -171 -68 32 94 67 -51 1 -144 89 -81
$$ packed form
6680b49L06p3J99j62j02K05j65j12L32k77J73Q1l20j1J18O8j92J66nQ5p4j2Q5
6703F4J7q5j11J19J32k20K65m82J92J76p5j20L09l87J87j9J96j90R9l0j02q5q1
6726b31J85N0P6j6j83R6j24l5n2K22Qk42O4K65L5j15O2k06J04M1m4L05l27J13
6750E1j50M1J04O2j03J22j56J6L28L4m41mk09J7J19J78J00j86J52p8j91L35l19
6773a78J83j1L3j65J95k91L6J88r2J55k36L16j00jJ61l72K37K06k74K15k97j9
6795a11J07R1k31J79L01k78J2j2J24Q2l21O4k47J90J31k34K03O9N9p6J34k53l1
6818d8M0M8j03M07k44J51M5l94J05j28J22K08k49K76m50J93Q0M5l05J52Q4k20
6840a85P2P7J64j78mM8j4j00K8J19r2J85j21Oj76J03J00O2k7j18N2j45K33j70
$$ plain form
6864 -81 -81 -155 -109 122 -99 124 7 -89 26 -100 139 244 -31 -151 -95 84 206 -147 -39 -53 38 36 -16 138
6888 138 6 14 -93 79 -236 20 120 -244 4 219 -234 -91 -187 49 -97 -177 96 -35 -255 191 -219
6909 -219 -54 -326 60 -95 30 56 177 -63 312 -211 -241 -8 -146 -204 -6 85 -42 -9 -133 65 -200 61
6931 61 42 26 -62 111 90 263 -174 -239 156 160 168 6 -171 -129 11 -118 -144 100 146 -57 -114 -24 -127 384 172
6956 172 74 -240 126 204 -140 -31 -87 134 53 12 -85 45 32 -178 -47 -59 222 121 -47 296 189 47 -88
6979 -88 290 -26 156 190 -19 132 50 -83 65 -18 1 -34 -144 77 -13 214 254 -128 127 312 60 -6 80
7002 80 97 22 -66 48 -67 -24 107 -153 -99 -54 86 -126 -83 146 101 -43 -53 81 163 62 83 83 -324 -246 10
7027 10 82 -154 -22 65 170 116 172 123 -66 -70 -274 -177 -46 -42 -9 -160 -237 217 -13 -28 -192 -100 37 -279 -336
$$ packed form
6864h1%p4M6K31k21K23j17r6J15j26K39J05k75j20N6J79J22l53J08j4R1kn2J54
6888A38j32Qj07J72l15K56J00l64K48K15m53J43r6K36j46q0K73j31k20M46m10
6909b19J65k72L86j55J25K6J21k40L75n23l0K33j38n8J98R1j27L3j24J98k65K61
6931F1j9j6q8J73k1J73m37o5L95MQj62j77M2J40j29k6K44M6k03n7R0j03N11k12
6956A72r8l14L66P8l44J09n6K21q1m1r7J30j3k10J31j2K81j01j68L43j07j42j35
6979h8L78l16J82L4k09J51q2j33J48q3J9l5j10K21r0K27M0l82K55J85k52o6Q6
7002H0J7p5q8J14j15M3J31k60N4M5J40k12M3K29m5j44j0J34Q2j01K1%m07P8K56
7027A0P2k36J32Q7J05n4N6m9j89mk04R7J31ML3j51p7M54k30j5j64R2J37l16n7
$$ plain form
7052 -336 -67 -21 -78 -171 20 100 7 103 -135 90 30 -110 -32 33 -133 235 48 -48 -93 -231 -6 -28 -194 160
7076 160 -145 -215 -44 22 13 -153 -166 -145 162 -41 202 -2 -90 -68 -48 382 -126 -23 -76 71 -57 -98 -70 77
7100 77 112 49 62 117 73 58 21 9 20 -53 180 49 320 180 44 -62 59 50 104 -70 -166 -77 108 -174 -13
7125 -13 58 -2 -289 -271 32 195 18 -127 -140 -85 -132 -381 15 21 30 48 47 -172 -154 323 -2 -27 2 3 -40 177 287
7152 287 -128 28 98 -122 -273 -131 -5 113 -71 12 265 59 9 29 97 260 -19 195 -107 -74 98 22
7174 22 -9 28 177 -10 9 -150 17 26 68 -4 -173 181 21 9 59 186 -30 -7 -288 -462 -336 -88 133 -8
7198 -8 113 -151 -115 44 177 67 -5 -230 163 -195 -31 241 -223 119 107 -342 -254 32 114 230 112 14 160
7221 160 200 -51 -89 -98 96 -6 0 -112 -34 -18 69 -86 -164 215 -108 -86 131 -80 -78 -15 34 94 4 -79 -87 23 40
$$ packed form
7052c36K69M6n7r3J91Q0r3R6k38K25o0j40P8O5j66L68j87r6m5j38K25k2j66L54
7076A60l05p0J71O6rj66j3K1L07k03K43k04q8K2K0M30n08J03n3J47j28m1K8J47
7100G7L5o3J3N5m4j5l7j2J1p3K33j31K71j40j36j06J21rN4j74r6Q9J85k82J61
7125a3P1o0k87J8L03J63j77j45j3N5m7k49L96ORJ8jk19J8M77l25k5K9Jm3K17J10
7152B87m15J56P0k20j51J42J26J18j84Q3K53k06n0K0O8J63k79K14l02L3J72p6
7174B2l1L7J49j87J9j59J67RM2p2j69L54j60j2N0J27k16K3k81j74J26K48K21j41
7198hJ21k64L6J59J33j10p2k25L93l58J64K72m64L42j2m49Q8K86Q2J16j18r8J46
7221A60M0k51l8rJ94j02Oj12P8J6Q7j55p8L79l23K2K17k11KO3M9O0r0q3qJ10J7
$$ plain form
7248 40 258 72 -25 54 175 -7 -22 105 16 -8 -128 -105 94 -36 133 -121 -47 -19 -43 -111 35 187 36 186
7272 186 89 38 175 -79 -212 175 -96 -68 -45 -277 -67 0 -122 140 -5 -72 -64 -5 -41 -80 111 8 166 7
7296 7 110 31 -40 13 14 37 184 -62 90 -3 -69 51 -91 88 -16 161 -49 -62 -107 8 -73 -209 -163 -70 111
7321 111 -112 -121 121 -50 -5 -21 -157 -60 56 208 -92 -57 -7 138 130 -224 -206 174 8 34 -153 109 -79 -19
7345 -19 -204 -236 73 -81 190 210 205 -121 -19 -95 118 -80 -143 223 187 -162 -133 92 -3 72 -255 -122 22 159
7369 159 243 -103 -21 -325 -87 -7 22 100 -221 401 -109 -20 17 75 261 -39 69 26 -30 172 111 -136 -1 -140
7393 -140 366 65 48 -33 41 -123 -236 -222 -24 -27 29 -136 313 72 -213 -266 78 -26 12 91 150 174 -313 -204
7417 -204 217 -72 -48 -217 107 -136 18 268 225 12 -47 -69 -18 -3 44 182 146 -41 77 -56 256 -84 -285
$$ packed form
7248D0K18j86r7P9J21j82j5J27q9k4j20K3J99j30J69k54P4K8k4o8J46J52j51J50
7272A86r7n1J37k54j33L87k71K8K3k32K10O7j22K62j45o7QN9l6l9J91j03J58j59
7296GJ03p9p1N3JK3J47k46J52r3o6J20j42J79j04J77k10j3m5J15q1j36M6R3J81
7321A11k23rK42j71M5j6j36R7J16J52l00L5N0J45ql54J8L80j66K6j87K62j88O0
7345a9j85l2L09j54K71K0nl26J02p6K13j98o3L66l6l49K9K25r5P5l27J33J44J37
7369A59Q4l46Q2l04K38Q0K9P8l21O22n10Q9L7N8J86l00J08m3n6K02o1k47J35j39
7393a40N06l01j7q1P4j64j13J4J98lN6j65M49k41k85n3L44j04L8P9N9K4m87J09
7417b04M21k89K4j69L24k43J54K50m3k13n9k2N1J5M7J38l6j87J18j33L12l40k01
$$ plain form
7440 -285 1 116 162 -129 33 12 165 -56 293 -37 24 96 32 51 -60 243 -88 -87 -57 -24 -8 130 222 -57
7464 -57 12 48 109 -203 -264 169 57 187 -51 -145 -120 -228 146 -211 -3 -143 -120 -295 -151 -94 240 211 220 276
7488 276 -151 170 -77 171 185 12 66 80 -71 -209 -317 -120 49 37 -172 45 38 -119 91 105 26 51 -249
7511 -249 159 -126 -164 -65 24 79 -72 60 -12 -45 9 82 -43 45 55 -155 180 46 -174 0 55 46 62 -160 250
7536 250 -52 -298 146 38 -149 -80 53 -8 20 -107 -213 -59 133 267 -41 214 250 20 4 163 142 93
7558 93 -6 75 -12 15 82 25 -61 -99 206 55 21 147 -54 41 150 198 -91 202 101 124 -9 130 -175 92
7582 92 7 160 -156 -109 345 52 44 -56 24 185 -207 193 -207 -47 -15 59 -143 -144 182 -149 -95 -268 -115 164
7606 164 -204 10 -7 113 -126 127 76 329 57 55 -248 -166 -12 -150 7 -163 95 -101 74 241 -92 -196
$$ packed form
7440b85K86J15M6k91J62k1J53k21L49l30O1P2o4J9j11L03l31JL0L3J6J38R2k79
7464e7O9L6O1l12o1M33j12J30k38r4K5j08L74l57K08j40K3j75J44N7L34k9RN6
7488B76m27L21k47K48J4j73N4J4j51j38j08J97J69j2k09K17pj57K10J4p9K5l00
7511b49M08k85l8R9Q9N5j51J32p2l3N4P3j25Q8J0k10L35j34k20J74N5rJ6k22M10
7536B50l02k46M44j08j87O9J33o1K8j27j06J54J92J34l08K55L6k30j6J59k1m9
7558I3r9Q1q7K7O7n7q6l8L05j51l4J26k01R5J09M8k89K93j01K3j33J39l05K67
7582I2q5J53l16M7M54k93qj00Q0J61l92M00m00J60L2P4k02jL26l31N4j73J53K79
7606A64l68K14j7J20k39K53n1K53k72kl03Q2J54j38J57j70K58j96J75J67l33j04
$$ plain form
7628 -196 -137 8 132 40 91 -91 11 -306 43 -328 343 65 -135 14 21 -93 -135 58 -114 -15 82 30 -25
7651 -25 108 33 -229 100 -196 88 55 -111 108 -4 -62 -109 -1 -161 90 188 -269 242 -156 -305 105 -269
7673 -269 42 283 -194 -6 173 -111 -142 -35 189 -18 -252 -83 -248 145 121 -244 106 93 69 26 -86 125
7695 125 -121 128 149 -42 -54 41 153 63 -143 79 -12 74 186 61 190 284 269 81 -215 34 -150 67 98
7718 98 -61 245 27 -19 20 277 -134 -14 158 -138 -83 47 -162 15 -313 366 -111 79 276 63 73 -84
7740 -84 127 155 -123 -77 -40 190 155 -29 11 124 56 15 -103 93 -53 -437 -4 186 -98 -69 -54 124 97 -180
7764 -180 45 113 -42 -36 191 255 39 94 -149 221 -41 77 -42 -148 -171 138 -146 -46 222 -60 -101 -224
7786 -224 -5 -112 322 24 -132 -107 -116 98 40 -76 -223 -162 -53 9 -307 178 -27 -189 -26 -51 155 -121
$$ packed form
7628a96N9J45J24r2N1j82J02l17L49l71O71k78k00J49Pj14m2J93j72R9R7n2n5
7651b5J33p5k62L29k96K84l3j66K19j12n8m7J08j60K51R8m57N11l98j49M10l74
7673b69L11K41m77J88J79k84l1J07K24k07k34J69j65L93k4l65L50j3k4m3j12K11
7695A25k46K49K1j91j2R5J12r0k06K22r1Q6J12j25J29R4j5j88k96K49j84K17L1
7718I8j59L06k18m6L9K57m11J20J72k96N5J30k09J77l28O79m77J90J97k13J0j57
7740h4K11K8k78M6L7K30l5j84M0J13o8m1j18J96j46l84M33J90k84K9J5J78k7k77
7764a80K25O8j55OK27O4k16N5k43L70k62J18j19j06k3L09k84J00K68k82m1j23
7786b24K19j07M34k98j56K5rK14n8j16j47O1J09O2l16M85k05j62J63k5K06k76
$$ plain form
7808 -121 -58 -125 -165 -30 44 167 46 90 -43 104 35 -91 -104 -43 12 97 -157 -293 -374 155 -56 48 305 -242
7832 -242 218 84 -29 134 -237 -81 7 344 -21 -83 -19 83 41 -249 33 179 127 -153 22 -48 30 -96
7854 -96 89 -8 -49 -40 -32 69 141 97 67 90 -30 217 46 48 20 -95 52 -96 14 28 97 -19 330 19 136
7879 136 56 238 -150 179 274 146 -129 -100 -118 129 71 324 387 -78 -138 -174 141 -35 -155 -140 -85 -86 87 40
7903 40 150 -92 -71 106 -76 -196 -45 11 -155 -24 285 -175 -49 77 8 -78 89 123 102 -56 -64 42 15
7926 15 -125 -224 -8 127 122 -175 -155 -55 -222 -59 -109 -231 51 116 -36 -283 -212 113 -36 -98 -303 -39 -119
7949 -119 247 -97 179 17 -120 136 -400 52 -38 -3 -165 20 28 16 31 -296 91 -259 220 -452 332 1
7971 1 -134 -6 68 277 -262 236 -238 -43 78 -12 132 -147 -24 -62 102 79 47 -164 -171 -101 -195 -54 59 -61
$$ packed form
7808a21O3o7m0J35P4J23j21M4j33J47o9j26j3O1N5Q5k54j36q1N29k11J04K57n47
7832b42M60j34j13J63l71J56Q8L37l65o2O4J02m2k90K82J46n2k80J75p0P8j26
7854i6J85r7m1RQJ01P2m4l0K3j20K47j71Kk8j15J47j48J10J4O9j16L49l11J17
7879A36q0J82l88L29R5j28k75K9j8K47n8K53O3m65o0l6L15j76j20J5N5jJ73m7
7903D0J10k42K1J77j82j20J51N6j66J31L09m60J26J26o9q6J67L4k1j58qJ06k7
7926A5j40r9K16J35nk97K0J00j67J63n0j22K82O5j52k47P1L25j49o2k05K64q0
7949a19L66l44K76j62j37K56n36M52r0L5j62J85Qj2J5l27L87l50M79o72P84l31
7971Aj35J28P4K09n39M98m74J95J21r0J44k79J23l8J64k3l2k11pP0r4J41J13j20
$$ plain form
7995 -61 235 41 -27 110 -124 41 370 216 5 6 -25 -173 -134 67 -26 -94 3 -221 -26 -74 -75 33 -76 -122
8019 -122 89 2 258 -28 -97 81 -125 120 49 -101 -185 -11 -270 89 174 -91 -40 190 313 149 -27 -172
8041 -172 -168 -18 -221 169 153 -166 213 -94 202 9 -44 -342 150 239 97 60 148 275 -146 69 238 -26
8063 -26 -118 70 -343 -11 -30 280 45 61 218 -181 113 352 173 175 114 75 99 42 161 51 4 -240 -67 98
8087 98 -179 -425 -129 186 -49 -42 72 87 58 -122 -235 30 18 -120 -104 -38 35 114 112 -257 -114 227 -92 -101 -109
8112 -109 105 42 75 79 -130 -113 81 41 242 108 0 -92 129 -102 25 104 72 -159 39 -234 -245 -34 -177
8135 -177 222 21 58 -114 55 38 -120 47 -216 101 150 -129 24 -276 117 8 -324 -122 -43 -35 122 93
8157 93 -12 -82 -54 83 -150 -178 -149 125 19 286 237 82 -82 158 -218 133 16 -33 -172 151 237 -38 -125
$$ packed form
7995f1K96j94o8J37k34J65L29j54k11Jl1j48L9K01r3o8R7k24J95m8jJ08j09m6
8019a22K11q7K56k86o9J78k06K45p1j50q4J74k59L59Q5k65N1K30J23j64j76j45
8041a72MJ50k03L90j6l19L79l07K96j93n3k98M92Q9j42l7Q8J27m21K15J69k64
8063b6r2J88m13L32j9L10k35J6J57l99K94K39j79Ko1l9K4n7J19j10m7k44J73J65
8087I8k77k46K96L15k35PJ14J5k9j80j13K65j2j38J6O6P3P9kl69J43L41l19rq
8112a09K14o3L3Mk09J7J94m0K01j34j08r2K21k31J27P9l2k31J98k73j1K11j43
8135a77L99k01L7j72J69j7j58J67k63L17M9k79J53l00L93j09l32K02P9QJ57k9
8157I3j05p0K8J37k33k8K9K74j06K67m9j55j64K40l76L51j17m9j39L23Q6k75q7
$$ plain form
8180 -125 8 154 -270 -30 177 141 14 -201 32 -205 16
$$ packed form
8180a25J33J46m24K40K07l6j27k15K33k37K21
8191A6
$$ Imaginary data points
##PAGE= N=2
##DATA TABLE= (X++(I..I)), XYDATA
$$ plain form
0 0 0 0 0 0 0 0 0 0 0 0 0 0 0 -8 8 -8 8 -8 16 -16 18 -24 24 -32 39 -42 48 -56 65 -76 87 -98 111 -126 142
35 142 -158 177 -199 222 -246 273 -303 335 -371 410 -452 499 -549 604 -666 736 -811 893 -987
54 -987 1093 -1213 1350 -1509 1696 -1921 2194 -2537 2978 -3573 4412 -5695 7856 -12172 23965
69 23965 -120517 -330666 97261 138547 -178061 -86079 153352 20945 -56135 74992 42623
80 42623 -95878 -33113 55779 -11555 -59797 27598 58578 -31709 -58687 16423 4399 -69544
92 -69544 -35833 54202 48772 -1094 841 27477 15639 -23479 -55891 -59398 -19159 26409 6017
105 6017 -23612 25712 55070 -7581 -28293 9131 -10110 -23124 16274 -1110 -26668 22944
117 22944 18157 -48005 -25497 21867 -590 -6009 10945 1746 26769 49397 -14742 -52123 8824
$$ packed form
0@%%%%%%%%%%%%%qJ6j6J6j6K4l2L4m2M8n6P1q1R0j04J21j41J63j85K09k37K68
35A42l00L35l76M21m68N19n76O38p06P81q62R51j048J153j270J402j547J704j880
54i87K080k306K563k859L205l617M115m731N515o551P985j0107J3551k0028L6137
69B3965j44482k10149M27927M1286l16608R1982K39431j32407p7080J31127l2369
80D2623j38501O2765Q8892o7334m8242Q7395L0980r0287k6978P5110j2024p3943
92f9544L3711R0035n430m9866J935K6636j1838l9118l2412l507M0239M5568k0392
105F017k9629M9324K9358o2651k0712L7424j9241j3014L9398j7384k5558M9612
117B2944m787o6162K2508M7364k2457n419J6954r199K5023K2628o4139l7381O0947
$$ plain form
130 8824 24670 -35358 -37499 14758 16118 -2887 22822 30140 -13910 -8529 43041 8936 -48133
143 -48133 4798 39736 -37278 -41861 48022 24097 -55898 675 73574 5985 -47665 14310
155 14310 34042 -19534 -5085 27252 -27062 -32481 54034 26013 -80971 -25120 81792 15672
167 15672 -56501 21864 59929 -12242 -24770 16592 -10487 -40506 1061 17207 -20386 -987
179 -987 53081 17650 -35957 9966 39837 -31022 -49489 24709 31266 -20175 -4243 26194 925
192 925 -12670 523 -11489 -11930 23093 27015 -4796 -1209 25422 8301 -31641 -30993 -1087 9931
206 9931 -984 -2675 19502 38477 18129 -15422 -10354 5480 -9904 -18630 264 3308 1965
219 1965 22496 13227 -25665 -12865 26442 580 -33338 11727 48778 -1448 -30508 15623
$$ packed form
130H824J5846o0028k141N2257J360j9005K5709P318m4050N381N1570l4105n7069
143d8133N2931L4938p7014m583Q9883k3925p9995N6573P2899o7589n3650O1975
155A4310J9732n3576J4449L2337n4314n419Q6515k8021j06984N5851J06912o6120
167A5672p2173P8365L8065p2171j2528M1362k7079l0019M1567J6146l7593J9399
179i87N4068l5431n3607M5923K9871p0859j8467P4198O557n1441J5932L0437k5269
192I25j3595J3193j2012m41L5023L922l1811L587K6631j7121l9942O48K9906J1018
206I931j0915j691K2177J8975k0348l3551N068J5834j5384q726J8894L044j343
219A965K0531r269l8892J2800L9307k5862l3918M5065L7051n0226k9060M6131
$$ plain form
231 15623 15002 -44090 -30716 22078 -1999 -22046 31148 32601 -25163 -2641 39842 -21640 -58580
244 -58580 15448 33321 -38654 -29835 37391 14310 -33618 -1745 18996 -16932 -8949 27784
256 27784 -679 -27904 15156 21936 -37950 -35410 21788 6637 -34899 674 35680 432
268 432 -14691 16304 7744 -21788 -2060 11942 -20751 -19815 18522 2410 -33637 -3088 30844
281 30844 386 -18813 14177 24359 -3116 -10963 -1363 -4284 -8223 -5436 -6793 -4384 6263
294 6263 10338 4035 -740 903 7462 8098 -2938 -6180 9713 14071 -8945 -17260 3405 7194
308 7194 -15293 -8390 23372 19706 -2479 11998 23394 -6016 -16996 6413 -2372 -22136 7844
321 7844 25732 -10953 -10204 34785 14805 -34171 -2454 33791 -3916 -18141 22656 14793 -20338
$$ packed form
231A5623o21n9092J3374N2794k4077k0047N3194J453n7764K2522M2483o1482l6940
244e8580P4028J7873p1975Q819O7226k3081m7928L1873K0741l5928P983L6733
256B7784k8463k7225M3060O780n9886K540N7198j5151m1536L5573L5006l5248
268D32j5123L0995q560k9532J9728J4002l2693R36L8337j6112l6047L0549L3932
281C0844l0458j9199L2990J0182k7475p847R600k921l939K787j357K409J0647
294F263M075o303m775J643O559O36j1036l242J5893M358k3016q315K0665L789
308G194k2487O903L1762l666k2185J4477J1396k9410j0980K3409q785j9764K9980
321G844J7888l6685P49M4989j9980m8976L1717L6245l7707j4225M0797p863l5131
$$ plain form
334 -20338 2285 15596 -26769 -25061 25500 16760 -19068 8988 36178 1244 -17739 5250
346 5250 -482 -25678 -8574 14914 -2087 -10312 13903 14349 -12410 -6346 13350 -5486 -17389
359 -17389 14982 20607 -16310 -12673 16559 -3773 -25945 430 6729 -15233 6063 30211 -2971
372 -2971 -17626 18043 12509 -28813 -17107 13936 -1910 -15996 6308 12962 -3111 -3621 2026
385 2026 -2601 -593 5391 -859 -3267 3099 1814 -3120 -4899 -9322 -6506 7943 6755 -8473 -61
400 -61 17649 3464 -14753 121 9030 -11669 -14154 11681 8620 -18006 -6846 18946 3550
413 3550 -16195 1800 10405 -7388 489 15462 -10427 -27050 7698 18955 -18777 -20302 15270
426 15270 11995 -9016 4700 9247 -15961 -8805 17203 -598 -21752 1843 13739 -9268 -7550
$$ packed form
334b0338K2623J3311m2365J708N0561q740l5828K8056K7190l4934j8983K2989
346E250n732k5196J7104K3488j7001q225K4215M46k6759O064J9696j8836j1903
359a7389L2371N625l6917L637K9232k0332k2172K6375O299k1962K1296K4148l3182
372b971j4655L5669n534m1322J1706L1043j5846j4086K2304O654j6073n10N647
385B026m627K008N984o250k408O366j285m934j779m423K816J4449j188j5228Q412
400f1J7710j4185j8217J4874Q909k0699k485K5835l061k6626J1160K5792j5396
413C550j9745J7995Q605j7793P877J4973k5889j6623L4748J1257l7732j525L5572
426A5270l275k1011J3716M547k5208P156K6008j7801k1154K3595J1896k3007J718
$$ plain form
439 -7550 10042 -6547 -15889 12093 16476 -11165 -6355 15724 3313 -12586 -1462 -801 -13878
452 -13878 -2260 14178 1479 -7602 7921 12050 -3440 -5993 1021 -3299 -4822 6305 6516 -4786
466 -4786 -2669 5175 -270 -5572 1390 3313 -1393 4566 12461 5972 -3960 -4175 -2218 -1331 877 -1643
482 -1643 -3547 6113 14318 6624 -22 1933 -969 -2749 5691 3687 -8612 173 15837 2361
496 2361 -9477 4673 5555 -9690 3600 18217 -2992 -10569 16184 15424 -14085 -11248 6930
509 6930 -2916 -8477 9912 8115 -11951 6 21477 2722 -19178 -1495 11639 -5262 -7410
522 -7410 8367 -454 -12868 3359 10853 -9484 -11591 7274 5986 -5548 1593 5820 -7525
535 -7525 -7451 5250 -1189 -13961 -3369 7163 -2605 -4545 5403 -496 -7674 2753 4832 -7977
$$ packed form
439g550J7592j6589r342K7982M383k7641M810K2079j2411j5899J1124O61j3077
452a3878J1618J6438j2699r081J5523M129j5490k553P014m320j523J1127K11j1302
466d786K117P844n445n302O962J923m706N959P895o489r932k15J957Q87K208k520
482a643j904R660Q205p694o646J955k902j780Q440k004j2299Q785J5664j3476
496B361j1838J4150Q82j5245J3290J4617k1209p577K6753p60k9509K837J8178
509F930r846n561J8389j797k0066J1957K1471j8755k1900J7683J3134j6901k148
522g410J5777q821j2414J6227P494k0337k107J8865j288j1534P141M227j3345
535g525P4J2701o439j2772J0592J0532r768j940R948n899p178J0427K079j2809
$$ plain form
549 -7977 -6051 5064 -618 -8011 -821 1581 -6359 -3555 5255 1642 -4582 325 3517 -1786 -2125
564 -2125 456 -4559 -4957 3687 1925 -4702 -445 2352 -2312 1351 4290 -4374 -3564 7770 3671
579 3671 -5947 -1056 2589 -4350 -2978 4626 668 -5615 2505 9231 -730 -5710 2986 2181 -6157
594 -6157 48 6110 -4139 -4659 7836 3446 -8062 -1052 6112 -2324 -2851 6179 1811 -4765 3265
609 3265 5690 -6026 -6989 4525 2072 -6133 2181 8036 -2664 -3436 7686 1917 -9088 190
623 190 7077 -3633 -4160 6968 3927 -5810 629 6161 -3022 -5290 5150 4975 -4531 -388 6586
638 6586 -1472 -5138 3561 2206 -4614 964 5795 516 -254 3003 588 -1370 716 201 -431 1675
654 1675 1112 -261 1813 1979 -963 -294 1722 536 -1170 1888 3763 102 -995 2861 1929 -2464
$$ packed form
549g977J926J1115n682p393P190K402p940K804Q810l613o224M907L192n303l39
564b125K581n015l98Q644j762o627M257K797m664L663K939q664Q10J1334m099
579C671r618M891L645o939J372P604l958o283Q120O726r961m980Q696q05q338
594f157O205O062j0249n20J2495m390j1508P010P164q436n27R030m368o576Q030
609C265K425j1716r63J1514k453q205Q314N855j0700p72J1122n769j1005R278
623A90O887j0710n27J1128l041r737O439N532r183k268J0440j75r506M143O974
638F586q058l666Q699j355o820N578M831n279p70L257k415j958K086n15o32K106
654A675n63j373K074J66k942O69K016j186j706L058J875l661j097L856r32m393
$$ plain form
670 -2464 -317 3464 -339 -2362 2351 3011 -1529 -1145 2767 578 -2395 626 2742 -593 -1806 1735
686 1735 1048 -2644 -423 1369 -1977 -1827 1278 -527 -2211 369 -126 -2565 -401 704 -2755 -2599
702 -2599 825 -812 -3459 -1293 576 -2401 -3271 813 256 -4924 -1981 2226 -2022 -4962 520 579
718 579 -4926 -2814 2414 -2084 -4985 474 2168 -2852 -2584 2721 491 -3770 -368 1594 -3787 -3323
734 -3323 1995 126 -3854 -128 2133 -1522 -443 1992 -455 -1354 1588 1243 -1272 -464 327 -1238
750 -1238 600 2248 -611 -783 3890 2906 -1346 1423 3052 -1664 -1017 4161 94 -4092 1874 5057
766 5057 -913 -1232 3298 1264 -385 3529 3572 -1146 -743 3095 1889 -1523 -1857 179 791 1165 2399
783 2399 1785 -455 526 3580 1608 -2771 -1302 1687 654 79 553 -1781 -1756 3055 2549 -2114 249
$$ packed form
670b464K147L781l803k023M713O60m540L84L912k189k973L021K116l335j213L541
686A735o87l692K221J792l346J50L105j805j684K580m95k439K164J105l459J56
702b599L424j637k647K166J869k977q70M084n57n180K943M207m248k940N482N9
718E79n505K112N228m498k901N459J694n020K68N305k230m261L402J962n381M64
734c323N318j869l980L726K261l655J079K435k447q99K942l45k515Q08P91j565
750a238J838J648k859j72M673r84m252K769J629m716O47N178m067m186N966L183
766E057n970l19M530k034j649L914M3m718M03L838j206l412l34K036O12L74J234
783B399o14k240R81L054j972m379J469K989j033n75M74k334K5M811n06m663K363
$$ plain form
800 249 2736 196 878 3144 -2396 -4998 2159 2342 -3981 -1691 3174 417 379 3930 140 -4609
816 -4609 226 3687 -836 -3045 -198 195 -106 1236 468 -2773 -1805 2382 3638 1039 -927 -420
832 -420 866 678 -1231 -2418 -2883 -1309 1673 2348 -154 -784 1040 2038 610 -1281 -2060 -1002 1687
849 1687 1766 -1396 -2382 -849 40 568 389 -1557 -1069 3182 4378 -589 -3516 -1928 -1431 -1838 -707
866 -707 -752 -3370 -218 4987 2400 -3647 -1354 1200 -999 -326 637 -3560 -4054 1423 1508 -3753 -3995
883 -3995 -1008 -71 1528 2242 -314 -1896 746 1004 -2490 -3965 -3933 -2587 429 2226 146 -1613
899 -1613 636 3012 491 -1861 -1121 -462 -209 1008 -96 -3153 -3159 277 1739 -599 -772 2007 3182
916 3182 3197 2813 288 -3193 -1663 1896 6 -3030 -741 1989 2567 3324 2165 -731 -247 3261 3402
$$ packed form
800B49K487k540O82K266n540k602P157J83o323K290M865k757l8L551l790m749
816d609M835L461m523k209K847L93l01J342p68l241R68M187J256k599j966N07
832d20J286j88j909j187m65J574K982O75k502o30J824R98j428j891p79J058K689
849A687P9l162r86J533Q89N28j79j946M88M251J196m967k927J588M97m07J131
866g07m5k618L152N205k587o047K293K554k199O73R63m197m94N477Q5n261k42
883c995K987R37J599P14k556j582K642K58l494j475L2J346L016J797k080j759
899a613K249K376k521k352P40O59K53J217j104l057oL436J462k338j73K779J175
916C182J5l84k525l481J530L559j890l036K289K730N78P57j159k896M84L508J41
$$ plain form
933 3402 289 355 894 201 581 345 -2116 -1747 2041 4097 3103 2579 2822 2156 1890 515 -1577 -3001
951 -3001 -491 1897 1062 -238 488 1074 1214 1510 1245 -59 153 2709 2158 -482 -2425 -2181 -2334 -1413
969 -1413 119 -293 -317 3244 4319 1397 -841 -717 -1823 -2437 -1180 -1072 -2430 -1431 1045 319 -1673
986 -1673 -1137 39 268 1107 1578 491 -1075 -923 -1153 -2967 -4003 -3393 -1102 1245 1559 1194 1730 1395
1004 1395 -136 -1419 -2150 -2422 -2232 -581 358 -782 -1107 -415 -533 -1072 -471 962 1234 976 2123 1304
1022 1304 -1761 -3210 -1962 -2219 -2734 -1268 1482 2519 2057 1752 1271 -25 -1418 -1521 -375 -819 -1512
1039 -1512 398 835 -434 -1377 -849 -165 -388 1152 2734 1715 1101 724 -640 -2883 -3558 -2135 -1134
1056 -1134 -155 1129 2549 2891 1645 215 -201 -235 -2066 -1323 853 129 -1605 402 284 -1942 -1171
$$ packed form
933C402l113O6N39o93L80k36k461L69L788K056r94n24K43o66k66j375k092j424
951c001K510K388q35j300P26N86J40K96k65j304K12K556n51k640j943K44j53R21
969a413J532m12k4L561J075k922k238J24j106o14J257J08j358R99K476p26j992
986a673N36J176K29Q39M71j087j566J52k30j814j036O10K291K347L14l65N36l35
1004A395j531j283p31k72J90J651R39j140l25O92j18n39O01J433K72k58J147q19
1022A304l065j449J248k57n15J466K750J037m62l05m81j296j393j03J146m44o93
1039a512J910M37j269r43N28O84k23J540J582j019o14l77j364k243o75J423J001
1056a134R79J284J420L42j246j430m16l4j831P43K176p24j734K007j18k226P71
$$ plain form
1073 -1171 909 543 1152 2666 2189 1010 83 -1609 -1827 -2163 -3028 -1301 1965 2046 1113 3521 2799 -496
1091 -496 -469 1190 -450 -1508 1033 1398 -714 -962 600 90 -1011 1024 2792 2766 2318 2378 1801 -181
1109 -181 -1445 -2055 -1752 -1052 -509 1379 3102 2495 1533 2071 1247 -165 274 647 43 -275 553 -436 -1525
1128 -1525 -1179 -67 398 564 2223 3365 2559 1439 493 -1101 -2962 -3084 -2532 -984 -402 -234 644
1145 644 2194 1478 -814 -433 568 -894 -182 261 -1878 -2786 -1613 -2317 -3664 -1877 -281 443 2357
1162 2357 2640 1370 53 -1420 -2196 -2040 -2893 -4161 -1698 1481 -268 -1187 -162 606 -391 160 946
1179 946 -316 -354 959 205 -2206 -3287 -3284 -2590 -953 739 1425 1789 2468 2734 1499 -1155 -3822 -1997
1197 -1997 180 -1234 -1871 388 1332 293 716 369 -842 100 2033 2769 1795 819 -886 -901 -1284 -2412
$$ packed form
1073a171K080l66O09J514m77j179r27j692k18l36q65J727L266Q1r33K408p22l295
1091d96K7J659j640j058K541L65k112k48J562n10j101K035J768k6m48O0n77j982
1109a81j264o10L03P00N43J888J723o07r62N38q24j412M39L73o04l18Q28r89j089
1128a525L46J112M65J66J659J142q06j120r46j594j861j22N52J548N82J68Q78
1145F44J550p16k292L81J001j462P12M43k139r08J173p04j347J787J596P24J914
1162B357K83j270j317j473p76J56q53j268K463L179j749r19J025P68r97N51P86
1179I46j262l8J313p54k411j081LO94J637J692O86L64O79K66j235k654k667J825
1197a997K177j414o37K259R44j039M23l47j211R42J933P36r74r76j705j5l83j128
$$ plain form
1215 -2412 -2622 -839 1396 3586 4272 2683 409 1436 1198 -1058 -2548 -1110 290 751 1110 819
1231 819 -259 -948 162 1482 1635 625 817 2607 2759 -287 -2904 -3176 -1983 -731 -111 134 1088
1248 1088 3302 3676 1587 -470 -1453 -1899 -226 130 -314 -325 334 216 641 214 -1800 -1629 2291 4053
1266 4053 1406 131 452 -211 -1485 -2019 -3045 -2501 -242 2933 3146 1469 735 576 310 -446 -976
1283 -976 -1784 -1289 1079 2094 17 -1927 -1484 278 1062 515 538 852 2410 2350 125 -1969 -2808 -2579
1301 -2579 -1330 176 150 -192 2167 3103 1420 -184 -1108 -1875 -788 850 -459 -2002 -885 248
1317 248 -307 -1090 -1551 -1490 835 2796 1495 -262 -324 -912 -1590 -2377 -3291 -2962 -974 740 1653 900 -408
1336 -408 -275 416 -218 -1402 -1417 -1327 -509 229 -785 -2735 -2537 -524 613 138 430 1366 2112 1870 -27
$$ packed form
1215b412k10J783K235K190O86j589k274J027k38k256j490J438J400M61L59k91
1231H19j078o89J110J320J53j010J92J790J52l046k617k72J193J252O20K45R54
1248A088K214L74k089k057r83m46J673L56m44j1O59j18M25m27k014J71L920J762
1266D053k647j275L21o63j274n34j026N44K259L175K13j677p34j59k66p56n30
1283i76q08M95K368J015k077j944M43J762P84n47K3L14J558o0k225k094q39K29
1301b579J249J506k6l42K359R36j683j604r24p67J087J638j309j543J117J133
1317B48n55p83m61O1K325J961j301j757o2n88o78p87r14L29J988J714R13p53j308
1336d08J33O91o34j184j5R0Q18P38j014j950J98K013J137m75K92R36P46k42j897
$$ plain form
1355 -27 -1459 -2139 -2421 -2085 -189 563 -104 361 2524 2480 -209 -509 522 272 711 1156 -197 -1382
1373 -1382 -253 24 -1628 -1371 568 2062 2433 2549 2571 1635 -177 -1123 -705 -734 -1981 -696 1532 2200
1391 2200 624 601 1397 1597 318 599 1603 908 397 1428 145 -1858 -1854 -816 -738 -69 2227 2974
1409 2974 2472 1991 1791 584 -2016 -2186 -559 220 -685 -436 1605 1259 -406 -401 373 287 154 1118 1272
1428 1272 394 -374 -874 -1353 -2640 -2490 -938 238 879 2074 2264 743 -536 -207 -1030 -2530 -2086
1445 -2086 -457 629 -13 -558 506 114 -1168 -937 403 887 390 897 1209 85 -1886 -1811 -1759 -2085
1463 -2085 -1402 556 1702 1397 1242 1362 85 -1333 -1166 -593 -1023 -1206 379 1096 -355 -1067 367
1480 367 1 -853 -95 1477 853 521 526 67 -1095 -2072 -1693 -850 -327 -73 1168 2118 956 -106 82
$$ packed form
1355b7j432o80k82L36J896P52o67M65K163m4k689l00J031k50M39M45j353j185
1373a382J129K77j652K57J939J494L71J16K2r36j812r46M18k9j247J285K228O68
1391B200j576k3P96K00j279K81J004o95n11J031j283k003MJ038P8O69K296P47
1409B974n02m81k00j207k600j70J627P79r05K49K041l46j665NP74q6j33R64J54
1428A272q78p68n00m79j287J50J552J176O41J195J90j521j279L29q23j500M44
1445b086J629J086o42n45J064l92j282K31J340M84m97N07L12j124j971P5N2l26
1463b085O83J958J146l05j55J20j277j418J67N73m30j83J585P17j451p12J434
1480C67l66q54P58J572o24l32Nm59j162r77L79Q43N23K54J241R50j162j062J88
$$ plain form
1499 82 -44 -1751 -1756 291 123 -1165 -23 372 -888 -1413 -77 481 381 760 951 770 97 -1167 -1526
1518 -1526 -1434 -1632 -1296 717 1279 438 954 1798 219 -1310 -186 547 -750 -932 641 760 -1213 -820
1536 -820 622 162 -675 510 2139 1932 800 612 770 -747 -1466 -414 231 -633 582 2231 2043
1553 2043 508 1115 1018 180 -380 672 1016 -256 -254 888 512 -1167 -951 961 1603 152 1482 2521
1571 2521 1136 -249 341 -378 -1743 -1458 183 835 -8 625 1565 651 3 399 -11 -724 66 1258
1589 1258 171 -1086 -850 -249 -844 -1316 -718 215 834 1334 1513 417 -954 -1180 -1065 -1259 -1568 -1288
1607 -1288 -531 497 1010 117 -935 -481 -276 -203 -243 -244 -358 -107 -37 -923 -2020 -2294 -1109 9 369 375
1627 375 603 712 486 175 -1051 -2228 -1840 -448 466 -13 -841 186 936 75 -561 -570 -375 230 1105
$$ packed form
1499H2j26j707nK047j68j288J142L95j260n25J336N58j00L79J91j81o73j264l59
1518a526R2j98L36K013N62q41N16Q44j579j529J124P33j297j82J573J19j973L93
1536h20J442m60q37J185J629k07j132j88J58j517p19J052O45q64J215J649j88
1553B043j535O07r7q38n60J052L44j272KJ142l76j679K16J912O42j451J330J039
1571B521j385j385N90p19j365K85J641O52q43O33R40r14o48L96m10p13P90J192
1589A258j087j257K36O01n95m72N98R33O19N00J79j096j371k26J15j94l09K80
1607a288P57J028N13q93j052M54K05P3m0jj14K51P0q86j097k74J185J118L60O
1627C75K28J09k26l11j226j177L88J392R14m79q28J027P50q61o36rJ95O05Q75
$$ plain form
1646 1105 930 -514 -1052 -564 -333 -795 -951 -414 559 1571 1866 833 61 -619 -51 1 -810 -1061 -361
1665 -361 915 1125 243 -480 -158 233 436 839 210 38 580 1396 317 -1205 -1689 -624 272 551 312
1684 312 722 1187 569 559 195 -1307 -1655 337 1279 -173 -887 347 929 -20 -249 184 -590 -365 1525
1703 1525 1693 -695 -958 392 409 -1163 -1213 34 205 419 1385 1414 -183 -1060 706 994 -980 -740
1721 -740 670 363 -308 783 565 -1050 -401 1259 1033 -409 247 1035 1018 78 -454 -766 -734 -140 876
1740 876 770 41 159 917 887 -266 -937 -61 380 -42 405 169 -456 -117 366 347 -590 -757 226 902
1760 902 373 -391 -284 -699 -563 -223 -531 -887 -54 659 436 13 -426 -665 -472 -128 -371 -770 -364 112
1780 112 -600 -337 -312 -1225 -1077 83 405 -658 -407 452 -2 -929 -753 -511 -793 -826 -41 387 -207 -729
$$ packed form
1646A105j75j444n38M88K31m62j56N37R73J012K95j033p72o80N68N2q11k51P00
1665c61J276K10q82p23L22L91K03M03o29j72N42Q16j079j522m84J065Q96K79k39
1684C12M10M65o18j0l64j502l48J992R42j452p14J234N82r49k29M33p74K25J890
1703A525J68k388k63J350J7j572n0J247J71K14R66K9j597q77J766K88j974K40
1721g40J410l07o71J091k18j615O49J660k26j442O56P88j7r40n32l12L2N94J016
1740H76j06p29J18P58l0j153o71Q76M41m22M47k36o25L39M83j9r37j67R83O76
1760I02n29p64J07m15J36L40l08l56Q33P13k23m23m39k39J93L44k43l99M06M76
1780A12p12K63K5r13J48J160L22j063K51Q59m54r27J76K42k82l3P85M28n94n22
$$ plain form
1800 -729 376 210 -948 -623 254 -194 -411 231 384 -608 -722 441 -418 -1082 103 736 69 375 879
1819 879 -22 -805 -40 68 -97 70 108 515 868 367 -95 540 129 -231 222 385 201 688 861 355
1839 355 -22 210 -44 35 525 486 624 575 589 395 341 -258 -18 385 464 458 346 674 451 273 354 1 -198
1862 -198 186 262 -56 409 583 31 -150 265 -111 -772 251 86 -185 -191 711 -116 -789 -253 245 -396 -63
1883 -63 779 363 -584 -23 586 -481 -662 154 173 -804 155 531 -130 -417 361 1 -480 -36 221 190 -248
1904 -248 49 -81 -390 135 71 -157 -96 193 118 -126 -217 -62 -303 -13 -35 -409 -4 -167 206 -188 14 195
1926 195 -203 -137 558 -221 -155 164 235 -856 -431 -140 -364 -476 245 236 -486 296 233 23 -517 -641 -26 -155
1948 -155 -17 262 -269 -314 46 -34 -559 -159 -228 -118 -102 152 -196 -472 -365 203 -711 -594 195 -92 -257
$$ packed form
1800g29J105j66j158L25Q77m48k17O42J53r92j14J163q59o64J185O33o67L06N04
1819H79r01p83P65J08j65J67L8M07L53n01m62O35m11l60M53J63j84M87J73n06
1839C55l77K32k54P9M90l9J38m9J4j94n4n99K40M03P9oj12L28k23j78Q1l53j99
1862a98L84P6l18M65J74n52j81M15l76o61J023j65k71oR02q27o73N36M98o41L33
1883f3Q42m16r47N61O09j067j81Q16J9r77R59L76o61k87P78l60m81M44K57l1m38
1904b48K97j30l09N25o4k28O1K89p5k44r1J55k41K90k2l74M05j63L73l94K02J81
1926A95l98O6O95p79O6L19P1j091M25K91k24j12P21rp22P82o3k10n40j24O15j29
1948a55J38K79n31m5L60q0n25M00o9J10J6K54l48k76J07N68r14J17P89k87j65
$$ plain form
1969 -257 284 460 -353 -497 428 -78 -949 -266 166 -248 -89 364 37 -615 24 728 35 -503 -185 561
1989 561 256 -355 22 142 -73 34 305 194 -121 344 937 446 336 -64 -66 -7 174 23 59 526 476 457
2011 457 530 683 281 504 876 82 -525 -64 385 202 -94 513 87 -65 788 838 -36 129 665 484 289
2032 289 -102 -449 -455 95 119 -122 -240 -21 736 603 563 -34 -469 137 239 -474 -1017 -91 205 -254 157
2053 157 260 -520 -753 684 670 -527 -658 425 46 -436 -445 -278 -993 -509 466 172 -739 134 955 553
2073 553 -430 -241 -725 -462 -349 -132 -188 -755 -419 226 335 44 -332 -237 657 261 -389 -269 -155 -69 -102
2094 -102 -153 -306 -799 235 607 212 -338 444 453 -21 62 46 -722 -873 426 306 -822 -621 308 603 338
2115 338 163 298 60 -79 288 -288 -940 -335 208 284 -83 -5 112 95 604 279 -245 210 211 102 30 -228
$$ packed form
1969b57N41J76q13j44R25n06q71O83M32m14J59M53l27o52O39P04o93n38L18P46
1989E61l05o11L77J20k15J07K71j11l15M65N93m91j10m00kN9J81j51L6M67n0j9
2011D57P3J53m02K23L72p94o07M61M49j83k96O07m26j52Q53N0q74J65N36j81j95
2032B89l91l47oN50K4k41j18K19P57j33m0n97m35O06J02p13n43R26K96m59M11
2053A57J03p80k33J437j4j197j31J083l79m82rJ67p15M84R75k94r11Q73Q21m02
2073E53r83J89m84K63J13K17n6n67L36O45J09k91l76R5Q94l96o50J20J14Q6l3
2094a02n1j53m93J034L72l95n50P82Rm74Q3j6p68j51J299j20j128K01R29K95k65
2115C38j75J35k38j39L67n76o52O05N43P6l67P8J17j7N09l25n24M55Jj09p2k58
$$ plain form
2137 -228 -605 -765 308 395 -448 49 552 350 517 418 -200 -761 -590 395 139 -593 -173 618 649 -431
2157 -431 7 110 -102 160 334 396 -516 269 467 -313 -380 -86 -62 353 632 730 138 667 599 -127 -446 -71
2179 -71 -691 -57 512 650 -290 459 895 191 141 439 76 -220 636 939 -59 -336 144 14 -559 6 229
2200 229 187 374 1043 478 -145 87 -290 -331 -321 -221 -71 104 417 487 48 -25 164 -96 -384 -278 -114 -387
2222 -387 -178 22 -687 -845 -833 40 -126 94 501 240 -66 -124 -294 -946 -880 -519 -548 -660 -52 101 -417
2243 -417 75 271 -74 -285 206 -26 -222 -449 -368 -764 -765 -215 -289 -349 342 460 177 60 551 -92 -411 -358
2265 -358 -151 -434 -355 157 -161 -302 87 151 -97 299 584 334 216 425 183 -707 -412 -38 -590 -113 299
2286 299 545 559 817 801 427 -32 17 115 -204 459 300 73 60 296 -93 6 244 636 620 278 1007 486
$$ packed form
2137b28l77j60J073Q7q43M97N03k02J67r9o18n61J71R85k56p32M20P91L1j080
2157d31M38J03k12K62J74O2r12P85J98p80o7K94K4M15K79R8n92N29o8p26l19L75
2179g1o20O34N69J38r40P49M36p04n0K98l63k96Q56L03r98k77M80j30n73N65K23
2200B29m2J87O69n65o23K32l77m1J0J00J50J75L13P0m39p3J89k60k88J06J64k73
2222c87K09K00p09j58J2Q73j66K20M07k61l06n8j70o52O6L61k9j12O08J53n18
2243d17M92J96l45k11M91k32j96k27Q1l96jN50p4o0O91J18k83j17M91o43l19N3
2265c58K07k83P9N12l18j41L89O4k48L96K85k50j18K09k42q90K95L74n52M77M12
2286B99K46J4K58j6l74m59M9R8l19O63j59k27j3K36l89R9K38L92j6l42P29n21
$$ plain form
2308 486 -349 -198 -388 -534 -779 81 505 197 721 843 234 -210 -30 -223 -312 -134 40 163 -186 -179 -281
2329 -281 -347 -37 56 324 531 836 431 91 -63 -334 -846 -585 -15 -194 55 331 330 -103 224 414 -80
2350 -80 -419 118 91 -8 -217 97 -278 -332 353 179 -17 568 578 229 240 431 -127 -922 -677 -365 -406 -16
2372 -16 322 421 286 410 134 -262 -199 379 167 -222 -49 -124 -527 -532 -373 -430 -276 212 685 453 74 302
2394 302 -41 -588 -764 -558 -766 -74 244 -23 33 88 -39 -59 -69 -256 -144 -186 23 237 -684 -597 -564 -522 -466
2417 -466 74 186 351 590 669 88 -588 -530 -708 -853 -347 353 -8 63 559 240 -371 -58 34 -271 281
2438 281 517 -347 -269 201 188 -672 -349 -110 385 592 1317 700 485 300 60 -444 -575 -97 -227 298 342
2459 342 594 105 248 649 673 52 194 367 417 308 328 -277 -785 -275 89 -131 237 725 821 646 500
$$ packed form
2308D86q35J51j90j46k45Q60M24l08N24J22o09m44J80j93q9J78J74J23l49Pj02
2329b81o6L10R3K68K07L05m05l40j54k71n12K61N70j79K49K76jm33L27J90m94
2350h0l39N37k7r9k09L14l75n4O85j74j96N85J0l49J1J91n58p95K45L12m1L90
2372a6L38R9j35J24k76l96O3N78k12l89J73p5m03nJ59n7J54M88M73k32l79K28
2394C02l43n47j76K06k08O92L18k67N6N5j27k0j0j87J12m2K09K14r21Q7L3M2N6
2417d66N40J12J65K39P9n81o76N8j78j45N06P00l61P1M96l19o11L13R2l05N52
2438B81K36q64P8M70j3q60L23K39M95K07P25o17k15j85k40n04j31M78j30N25M4
2459C42K52m89J43M01K4o21J42J73N0j09K0o05n08N10L64k20L68M88R6j75j46
$$ plain form
2480 500 281 -509 -352 -125 -286 -360 -150 303 327 140 143 -50 -98 442 550 233 75 -60 151 -303 -273 -522
2502 -522 -977 101 256 456 34 344 75 68 -36 5 -377 -448 124 153 -283 -417 -326 -148 28 52 -113 345
2524 345 246 344 -328 -352 -458 -430 -498 -205 -86 -18 407 489 305 -47 -229 -310 -188 49 -73 -365 -411 -314 -197
2547 -197 -430 -298 298 129 333 582 315 -281 -345 -143 -193 -683 -301 -23 301 515 337 210 122 262 -18
2568 -18 -530 -343 164 13 28 -142 -82 -418 -491 -145 114 226 290 265 439 98 -65 -469 -494 -188 -305 -11
2590 -11 -49 270 358 151 -84 -38 -353 -12 162 -92 -111 -105 67 -433 -24 -356 -331 -36 744 445 323 189 135
2613 135 -139 -316 -707 -561 16 437 444 282 238 364 323 66 197 122 184 218 248 55 -81 34 -185 -44 396
2636 396 393 246 930 882 157 -254 98 17 -512 74 78 364 111 525 485 219 -118 141 136 11 80 301 351 -48
$$ packed form
2480E00k19p90J57K27j61p4K10M53K4j87Lj93m8N40J08l17j58j35K11m54L0k49
2502e22m55J078J55K00m22L10k69pj04M1l82p1N72K9m36j34R1J78J76K4j65M58
2524C45r9R8o72k4j06K8o8K93J19O8M25Q2j84l52j82q1J22K37j22k92m6R7J17
2547a97k33J32N96j69K04K49k67n96o4K02n0m90L82K78L24K14j78j27q8J40k80
2568a8n12J87N07j51J5j70O0l36p3L46K59J12O4k5J74l41j63m04k5L06j17K94
2590a1l8L19Q8k07k35M6l15L41J74k54j9OJ72n00M09l32K5K95P80k99j22j34n4
2613A35k74j77l91J46N77M21Pj62m4J26m1k57J31p5O2L4L0j93j36J15k19J41M40
2636C96lj47O84m8p25m11L52q1n29N86MK86k53M14m0k66l37K59nj25O9K21N0l99
$$ plain form
2660 -48 -263 -372 -614 -173 240 203 374 551 397 121 83 -77 -399 -229 -64 76 54 -17 -81 -113 -130 -49 -152
2683 -152 249 -124 94 -347 -300 -308 -664 -224 -450 -383 77 -75 340 321 104 -129 -279 -190 -295 -468 -418 -255
2705 -255 -164 -35 -230 2 -225 72 396 318 148 -223 134 -98 -250 -178 -345 -456 -303 71 452 268 324
2726 324 207 -343 -476 -173 -164 -310 143 432 -156 -157 214 196 -109 136 452 364 219 495 51 -159 -438 -440 -175
2749 -175 23 297 335 239 544 372 95 61 236 262 -120 75 420 0 75 48 154 -188 5 243 367 196
2771 196 532 354 -3 -86 -47 -91 -177 -120 65 347 567 395 328 -85 87 -141 -169 -282 -33 95 65 -27 -38
2794 -38 41 -279 -53 233 134 232 471 313 142 -432 -282 -96 -275 241 284 406 92 215 481 159 -206 -156
2816 -156 309 75 65 68 257 -190 -269 -66 -133 -115 77 512 173 77 79 218 -137 -76 -59 -232 16 108 417 94
$$ packed form
2660d8k15j09k42M41M13l7J71J77j54k76l8j60l22J70J65J40k2p1o4l2j7Q1j03
2683a52M01l73K18m41M7ql56M40k26O7M60j52M15j9k17k33j50Q9j05j73N0J63
2705b55R1J29j95K32k27K97L24p8j70l71L57k32j52P2j67j11J53L74L81j84N6
2726C24j17n50j33L03Rj46M53K89n88jL71j8l05K45L16q8j45K76m44k10k79kK65
2749a75J98K74L8r6L05j72k77l4J75K6l82J95L45m20P5k7J06l42J93K38J24j71
2771A96L36j78l57q3L9m4q6N7J85K82K20j72o7m13J72k28k8j13K49J28l0r2j1
2794c8P9l20K26K86r9R8K39j58j71n74J50J86j79N16M3J22l14J23K66l22l65N0
2816a56M65k34j0LJ89m47p9K03o7J8J92M35l39r6KJ39l55O1J7j73K48R2L09l23
$$ plain form
2840 94 67 295 21 118 -29 -156 -155 46 14 108 -252 -148 -301 -39 66 -23 -240 189 91 31 -182 -503 -235
2863 -235 -296 -104 -102 25 -194 -73 104 184 -443 -164 40 -12 -98 -158 217 -233 -212 36 -626 -485 7 259 257
2886 257 133 -123 -100 -268 -268 -193 -456 -338 274 324 40 -57 77 30 -310 157 77 -255 -6 241 252 -319 -522
2909 -522 -53 -209 149 -107 88 224 264 272 -81 -154 -408 242 444 115 187 197 28 -159 402 289 -227 288
2931 288 297 -4 295 337 52 -193 278 -88 -311 189 320 533 -32 1 385 -45 -35 -23 -72 272 -3 254
2953 254 -27 -228 -5 364 39 83 69 212 78 118 570 -175 -614 -219 20 160 -266 83 162 100 -156 171
2975 171 -134 -548 2 -126 -1 -231 48 120 -169 -143 -62 32 -8 -23 203 -126 -159 -70 -162 -476 -229 -43 14
2998 14 269 -68 105 -216 -96 44 -190 -202 -48 341 -42 162 298 207 -328 50 216 -275 -198 349 69
$$ packed form
2840I4k7K28k74R7j47j27JK01l2R4l60J04j53K62J05q9k17M29r8o0k13l21K68
2863b35o1J92KJ27k19J21J77Q0o27K79K04n2q6o0L75m50K1K48o62J41M92K52k
2886B57j24k56K3j68%P5k63J18O12N0k84r7J34m7l40M67q0l32K49K47J1n71k03
2909e22M69j56L58k56J95J36M0Ql53p3k54O50K02l29P2J0j69j87N61j13n16N15
2931B88Rl01K99M2k85k45M71l66k23N00J31K13n65L3L84m30J0J2m9L44k75K57
2953B54k81k01K23L69l25M4j4J43j34M0M52p45m39L95K39J40m26L49P9o2k56L27
2975A71l05m14N50j28J25k30K79P2k89K6Q1R4m0j5K26l29l3Q9r2l14K47J86N7
2998A4K55l37J73l21J20J40k34j2J54L89l83K04J36r1n35L78J66m91P7N47k80
$$ plain form
3019 69 -276 -165 9 -211 -338 -160 -54 -1 -66 246 -55 11 135 -114 -256 -666 -140 323 -499 34 187
3040 187 -7 -186 32 539 -203 -191 153 187 1 -106 378 -189 -404 7 -86 -148 -27 81 192 -145 37
3061 37 619 -300 -568 67 -18 -136 -183 228 -98 -62 312 279 -323 -292 211 267 -56 10 -27 241 19 149 413
3084 413 17 -81 333 17 -110 204 72 -101 100 241 233 -85 280 506 -216 -192 56 200 124 359 258 219
3106 219 -9 269 308 -86 139 405 412 11 -39 357 -140 -412 120 -55 -95 -3 159 170 -240 111 173 86 -249
3129 -249 71 263 3 16 305 -490 -91 -208 36 -299 -336 369 352 -282 50 83 -263 -178 -445 -43 -365 -298
3151 -298 92 10 -262 -68 15 -390 -516 243 -132 20 317 -97 -253 -264 68 -13 -81 -47 -96 -41 -194 199 42
3174 42 -138 -206 137 -86 -243 201 428 -60 29 142 89 -501 -20 38 53 -46 53 8 -15 -101 43 -160 -418 -164
$$ packed form
3019F9l45J11J74k20j27J78J06N3o5L12l01O6J24k49j42m10N26M63q22N33J53
3040A87j94j79K18N07p42J2L44L4j86j07M84n67k15M11r3o2J21J08J11l37J82
3061C7N82r19k68O35q5j18m7M11l26L6L74l3o02L1N03N6l23O6l7K68k22J30K64
3084D13l96r8M14l16j27L14j32j73K01J41ql18L65K26p22K4K48J44p6K35j01l9
3106B19k28K78L9l94K25K66Pm01n0L96m97k72N32j75m0R2J62J1m10L51O2q7l35
3129b49L20J92k60J3K89p95L99j17K44l35l7P05j7o34L32L3l46Q5k67M02l22O7
3151b98L90q2k72J94Q3m05j26P59l75J52K97m14j56j1L32q1o8L4m9N5j53L93j57
3174D2j80o8L43k23j57M44K27m88Q9J13n3n90M81N8J5r9R9m5k3q6J44k03k58K54
$$ plain form
3198 -164 85 -20 -240 -40 -2 58 -251 -31 101 -34 40 271 -37 27 178 220 -268 -256 132 199 -231 97
3220 97 99 -260 -43 288 25 -289 89 236 73 71 49 -59 -81 -101 78 -313 -400 -129 56 -18 8 417 41 68
3244 68 23 342 74 -242 133 12 -232 223 68 8 -23 149 141 -176 -87 -64 378 -78 -243 355 74 -69 397
3267 397 371 -5 117 296 377 7 155 12 -46 -32 345 109 -267 300 257 -124 -59 171 363 -52 -16 164
3289 164 -223 -249 -196 294 -368 -23 223 -68 -344 -260 181 -47 56 337 -286 -381 -88 72 126 -475 -250 295
3311 295 -182 -18 182 -82 7 -19 357 -156 -476 -142 35 -182 -82 -182 84 -133 103 123 -159 -335 -60
3332 -60 218 -365 -256 185 -254 -159 189 -273 -280 -146 117 91 -82 206 5 -70 -314 38 -365 -561 27 27 -78
3355 -78 -14 285 205 116 81 222 -175 -74 181 271 -56 -49 13 -19 -1 220 41 133 240 262 385 -141 -269 -102
$$ packed form
3198a64K49j05k20K00L8O0l09K20J32j35P4K31l08O4J51M2m88J2L88O7m30L28
3220I7Kl59K17L31k63l14L78J47j63kk2j08k2k0J79l91q7K71J85p4K6M09l76K7
3244F8m5L19k68l16L75j21k44M55j55o0l1J72ql17Q9K3M42m56j65N98k81j43M66
3267C97k6l76J22J79Q1l70J48j43n8J4L77k36l76N67m3l81O5K30J92m15L6J80
3289A64l87k6N3M90o62L45K46k91k76Q4M41k28J03K81o23r5K93J60N4o01K25N45
3311B95m77J64K00k64Q9k6L76n13l20L34J77k17J00j00K66k17K36K0k82j76K75
3332f0K78n83J09M41m39R5L48m62pJ34K63k6j73K88k01p5k44L52m03j96N88%j05
3355g8O4K99q0q9l5J41l97J01K55R0l27PO2l2J8K21j79R2J07K2J23n26j28J67
$$ plain form
3379 -102 138 -455 -96 2 309 207 474 364 -34 -56 382 433 -234 72 79 -282 -10 55 429 2 -115 538
3401 538 145 -164 371 442 -73 69 188 -389 -405 42 -9 -154 -103 89 63 -5 16 170 -184 122 69 92 -34
3424 -34 -174 65 -75 -224 194 276 86 -14 242 240 -87 -58 157 -348 -84 126 -95 -280 -32 412 58 224
3446 224 153 143 150 -28 67 194 -32 -223 226 -11 -5 150 267 -73 157 169 62 -137 429 -117 -116 -135 142 -41
3470 -41 -379 87 84 84 -285 137 142 -67 92 -32 186 -235 -147 -1 -210 -201 -165 12 -73 102 149 -109 -297 -66
3494 -66 -43 -397 -323 -48 95 -231 -113 -60 151 -39 89 54 -47 -53 64 -75 -304 -463 -173 -299 -265 24 282
3517 282 231 383 271 32 -14 121 -341 -189 -392 -150 -174 -124 -213 -14 -150 53 260 27 293 3 32 -86
3539 -86 -209 -242 134 -288 215 197 149 126 424 399 198 -24 391 272 -102 47 115 78 223 -158 166 14 -306
$$ packed form
3379a02K40n93L59R8L07j02K67j10l98k2M38N1o67L06Pl61K72O5L74m27j17O53
3401E38l93l09N35P1n15J42J19n77j6M47n1j45N1J92k6o8K1J54l54L06n3K3j26
3424c4j40K39j40j49M18Q2j90j00K56kl27K9K15n05K64K10k21j85K48M44l54J66
3446B24p1j0Pj78R5J27k26j91M49k37OJ55J17l40K30J2j07j99N66n46Jj9K77j83
3470d1l38M66l%l69M22Nk09J59j24K18m21Q8J46k09RL6J77q5J75M7k58j88K31
3494f6K3l54P4K75J43l26J18N3K11j90J28l5j01oJ17j39k29j59K90j26L4K89K58
3517B82n1J52j12k39m6J35m62J52k03K42k4N0q9J99j36K03K07k33K66k90K9j18
3539h6j23l3L76m22N03j8m8k3K98k5k01k22M15j19l74J49O8l7J45l81L24j52l20
$$ plain form
3562 -306 367 344 127 113 120 -120 -93 -6 172 -120 53 319 330 293 436 336 -64 -63 349 244 -190 -42 86
3585 86 -325 -206 -38 61 -64 -260 229 -6 0 134 135 -100 -644 -187 23 -357 -223 533 112 -171 227 225 -7
3608 -7 -181 59 39 -285 137 15 -269 -387 -166 84 -272 -20 408 249 182 32 -168 -69 -165 -328 -390 -461 121
3631 121 150 46 31 276 158 -32 -110 21 281 -76 -260 -212 -175 -436 -24 -138 152 31 161 100 165 -201
3653 -201 -53 -100 -85 -102 -281 -485 241 -38 -132 55 50 170 -61 285 66 -69 15 -53 118 -398 -472 -86 -146
3676 -146 162 170 110 128 322 306 -24 -294 -165 -33 62 11 -190 -147 -14 16 -57 35 -230 -287 280 333 10 40 -102
3701 -102 -202 104 221 179 151 277 288 130 93 176 -242 -169 189 -13 50 75 5 13 100 -83 62 283 262 287 181
3726 181 82 7 -10 174 -175 -163 -242 150 109 411 228 307 503 -26 116 -179 -128 69 -66 122 46 51 35 249
$$ packed form
3562c06O73k3k17j4Pk40K7Q7J78k92J73K66J1l7J43j00m00JM12j05m34J48J28
3585H6m11J19J68R9j25j96M89k35OJ34Jk35n44M57K10l80J34P56m21k83L98kk32
3608gj74K40k0l24M22j22k84j18K21K50l56K52M28j59o7j50k00R9r6j63o2p1N82
3631A21K9j04j5K45j18j90p8J31K60l57j84M8L7k61M12j14K90j21J30o1O5l66
3653b01J48m7J5j7j79k04P26k79r4J87nJ20k31L46k19j35Q4o8J71n16p4L86o0
3676a46L08Qo0J8J94j6l30k70J29J32R5n1k01M3J33L0p3R2k65n7N67N3l23L0j42
3701a02j00L06J17m2k8J26J1j58l7Q3m18P3L58k02O3K5p0QQ7j83J45K21k1K5j06
3726A81r9p5j7J84l49J2p9L92m1L02j83P9J96n29J42k95N1J97j35J88p6Nj6K14
$$ plain form
3750 249 -73 -4 264 127 -57 -263 91 -76 -91 -317 -183 -228 44 15 61 204 -35 19 47 21 -204 61 51
3773 51 -205 -120 75 -236 -70 -208 -148 -332 -327 9 230 -7 28 -57 -233 -305 -181 -92 117 52 37 468 -72 75
3797 75 -231 10 84 -130 -341 -36 -54 -196 -242 -71 -247 -55 190 269 195 -63 145 -127 -186 -280 -204 -347 87
3820 87 -176 211 246 271 115 25 88 -186 74 133 42 4 -138 49 29 -23 158 283 189 361 213 23 356 -117
3844 -117 -187 -151 -73 -7 -157 -172 137 -5 439 95 151 -24 56 207 -26 27 4 -153 90 -84 -221 133 45
3867 45 76 253 222 220 101 -56 -256 -176 4 -225 9 -76 98 130 47 163 21 160 103 -5 -22 65 68 -235 -173
3892 -173 -25 17 0 258 44 297 419 -54 -179 158 -141 -446 100 106 279 134 169 274 17 -24 215 119
3914 119 141 346 12 162 -133 -514 -123 19 -157 -199 511 302 -64 279 299 -218 -200 -221 -284 -254 -110 232
$$ packed form
3750B49l22O9K68j37j84k06L54j67j5k26J34m5K72k9M6J43k39N4K8k6k25K65j0
3773E1k56Q5J95l11J66j38O0j84NL36K21k37L5q5j76p2J24Q9K09o5j5M31n40J47
3797G5l06K41P4k14k11L05j8j42m6J71j76J92K45P9p4k58K08k72n9r4P6j43M34
3820H7k63L87L5K5j56r0O3k74K60N9r1l8j42J87k0n2J81J25r4J72j48j90L33m73
3844a17p0L6P8O6j50j5L09j42M44l44N6j75Q0J51k33N3k3j57K43j74j37L54q8
3867D5L1J77l1kj19j57k00Q0J80k29K34q5J74L2q3J16j42J39n7j08j7Q7Ll03O2
3892a73J48M2j7K58k14K53J22m73j25L37k99l05N46OJ73j45L5J05k57m1K39r6
3914A19K2K05l34J50k95l81L91J42j76m2P10k09l66L43K0n17J8k1o3L0J44L42
$$ plain form
3936 232 -80 28 17 -116 -62 14 69 110 -1 -101 -196 -49 -385 -355 -135 -79 -181 5 -19 111 -45 18 -78 -546
3960 -546 -289 -34 -72 44 175 -12 -423 -50 32 -221 168 111 -269 68 -148 117 -244 -338 -261 -178 -123 73
3982 73 171 176 343 195 34 -8 -335 -114 -151 -23 148 66 156 10 91 93 -121 157 17 -101 419 155 -146 -181
4006 -181 93 -13 58 65 199 214 128 437 -55 -185 164 16 1 -36 212 198 165 155 -120 279 200 120 282 135
4030 135 251 140 127 -51 -267 16 150 130 -300 85 177 214 -65 133 -65 88 7 196 180 -398 35 239
4052 239 -18 -326 -110 272 35 -57 110 3 -71 -29 -4 79 -233 -133 150 206 -23 66 45 227 -214 -118 -568
4075 -568 -65 -58 112 118 -154 78 -107 -120 -185 -63 51 146 246 -153 -128 -169 -91 67 16 -252 -354 51 -12 -201
4099 -201 59 240 -235 -98 22 7 -6 36 -97 37 -171 -137 -25 -161 -32 -121 130 -63 77 143 129 -115
$$ packed form
3936B32l12J08j1j33N4P6N5M1j11j00r5J47l36L0K20N6j02J86k4J30j56O3r6m68
3960e46K57K55l8J16J31j87m11L73Q2k53L89n7l80L37k16K65l61r4P7Q3N5J96
3982G3R8NJ67j48j61m2l27K21l7J28J71q2R0j46Q1Kk14K78j40j18N20k64l01l5
4006a81K74j06P1PJ34J5q6L09m92j30L49j48j5l7K48j4l3j0k75L99p9q0J62j47
4030A35J16j11j3j78k16K83J34k0m30L85R2L7k79J98j98J53q1J89j6n78M33K04
4052B39k57l08K16L82k37r2J67j07p4M2K5Q3l12J00K83N6k29Q9k1J82m41R6m50
4075e68N03PJ70Ok72K32j85j3o5J22J14R5J00l99K5m1P8J58n1k68j02M05o3j89
4099b01K60J81m75J37J20j5j3M2j33J34k08L4J12j36J29q9K51j93J40O6j4k44
$$ plain form
4121 -115 -117 31 -37 -39 80 -2 241 5 -99 51 -103 102 125 174 76 -46 107 -140 -245 -173 -134 86 -136 100
4145 100 388 -33 -45 158 267 -155 126 -52 10 23 238 -198 134 -7 -165 80 112 152 108 322 267 -8
4167 -8 -49 -102 -139 -28 113 324 129 374 4 41 -126 28 84 263 129 146 181 265 -95 146 177 -118 116 61
4191 61 239 -13 69 113 259 214 133 59 248 196 219 228 184 230 -176 65 236 -191 -219 215 58 193 197 35 -244
4216 -244 -163 186 -62 -71 46 86 -152 -290 -251 -97 -319 -82 12 -163 -296 -161 -100 -107 -99 -119 67 -37 -224 29
4240 29 -58 -285 -20 -47 -120 -107 103 -10 -36 -374 -41 -25 -180 -79 -102 -194 69 -28 -20 -10 -79 67 -182 -8 69
4265 69 -37 292 -22 136 56 26 -289 -249 16 46 -40 127 171 49 179 -61 149 -66 -266 186 -153 -43
4287 -43 -114 165 -144 -175 -88 -63 -60 31 114 249 -32 163 -3 -176 -10 5 -114 -42 -58 -89 151 39 -44 151 265
$$ packed form
4121a15kJ48o8kJ19q2K43k36j04J50j54K05K3M9r8j22J53k47j05P2L9K20k22K36
4145A00K88m21j2K03J09m22K81j78O2J3K15m36L32j41j58K45L2M0m4K14n5k75
4167hm1n3l7J11J41K11j95K45l70L7j67J54N6J79j34J7L5Q4l60K41L1k95K34n5
4191F1J78k52Q2M4J46m5q1p4J89n2K3Rm4M6m06K41J71m27k8M34j57J35Mj62k79
4216b44Q1L49k48rJ17M0k38j38L9J54k22K37R4j75j33J35O1pQk0J86j04j87K53
4240B9q7k27K65k7p3J3K10j13k6l38L33J6j55J01k3r2K63r7QJ0o9J46k49J74P7
4265F9j06L29l14J58q0l0l15M0K65L0q6J67M4j22J30k40K10k15k00M52l39J10
4287d3p1K79l09l1Q7K5LR1Q3J35k81J95j66j73J66J5j19P2j6l1K40j12q3J95J14
$$ plain form
4312 265 -178 -119 92 166 -169 32 -4 -96 -133 24 -35 17 -156 266 -64 49 -187 -398 208 22 41 83 119
4335 119 118 -147 157 82 -250 58 -45 -114 208 169 269 351 19 -69 -106 -14 -203 96 173 93 94 -54 65 183
4359 183 -77 5 78 -195 23 188 -133 182 144 -141 -78 51 65 246 195 137 154 -3 130 -121 338 171 -9
4382 -9 -106 14 104 -228 -3 -209 -258 171 54 -104 23 -123 171 -175 -244 233 -243 34 252 -71 -78 15 -109
4405 -109 -67 -269 -122 -6 -67 -92 302 280 -57 -124 136 173 -389 -157 -149 -44 -105 -108 -157 -233 -95 168 -91 83
4429 83 255 -8 -137 -65 -243 -349 -190 408 -136 -315 -107 119 -151 -233 66 90 -161 -190 24 4 -216 57
4451 57 143 -121 234 114 68 161 398 108 141 155 58 -38 79 72 -320 62 50 46 106 107 142 254 141 77 -31 98
4477 98 64 187 25 -127 104 101 160 258 -67 -6 117 113 -192 48 361 -107 -231 20 129 -12 94 114 238
$$ packed form
4312B65m43N9K11P4l35K01l6r2l7J57n9N2j73M22l30J13k36k11O06j86J9M2L6
4335A19jk65L04p5l32L08j03o9L22l9J00Q2l32q8l7R2j89K99P7q0Jj48J19J18
4359A83k60Q2P3k73K18J65l21L15l8k85O3J29J4J81n1n8J7j57J33k51M59j67j80
4382ir7J20R0l32K25k06m9M29j17j58J27j46K94l46o9M77m76K77K18l23pR3j24
4405a09M2k02J47J16o1k5L94k2l37o7K60L7n62K32QJ05o1lm9p6J38K63k59J74
4429H3J72k63j29P2j78j06J59N98n44j79K08K26k70q2K99K4k51k9K14k0k20K73
4451E7Q6k64L55j20m6R3K37k90L3J4r7r6J17pl92L82j2mO0JL5J12j13o4j08J29
4477I8l4J23j62j52K31lN9R8l25O1J23ml05K40L13m68j24K51J09j41J06K0J24
$$ plain form
4500 238 -211 57 292 207 141 -150 90 -173 -261 -60 -336 338 197 235 -50 247 73 -44 -98 -83 -52 -167
4522 -167 76 119 156 -213 125 -131 -34 -202 93 -151 -160 -272 -64 -189 -1 -21 -98 -97 146 112 110 -116 347 -9
4546 -9 -29 -81 -174 -74 -76 -353 -219 5 -56 -33 -161 -357 -60 215 74 152 -204 -327 -79 -155 -175 -129 -108 39 -131
4571 -131 151 -2 -121 262 -197 -144 -61 48 -141 -163 -254 -73 -15 -148 31 -196 -160 -110 196 -156 -320 209
4593 209 -99 -139 72 63 -26 -103 -135 -149 100 157 141 2 -137 200 -385 -114 80 85 -350 -112 364 -8 -304 157
4617 157 122 -130 8 428 79 -78 73 204 50 -190 103 -59 10 407 202 251 -11 290 188 -62 -124
4638 -124 127 189 97 60 309 98 135 90 29 89 210 173 -160 237 -99 107 -173 109 -127 384 118 -93 153
4661 153 570 174 -270 292 -60 -20 -51 167 -76 -126 180 -46 -183 -131 259 79 -127 157 -34 266 -219
$$ packed form
4500B38m49K68K35q5o6k91K40k63q8K01k76O74j41L8k85K97j74j17n4J5L1j15
4522a67K43M3L7l69L38k56R7j68K95k44rj12K08j25J88k0p7JK43l4kk26M63l56
4546ik0n2r3J00kk77J34K24o1K3j28j96K97K75j41P8l56j23K48p6k0M6K1J47j70
4571a31K82j53j19L83m59N3Q3J09j89k2r1J81N8j33J79k27L6N0L06l52j64N29
4593B09l08m0K11rq9p7l2j4K49N7j6j39j39L37n85K71J94Nm35K38M76l72k96M61
4617A57l5k52J38M20l49j57J51J31j54k40K93j62O9L97k05M9k62L01j02k50o2
4638a24K51O2r2l7K49k11L7m5o1O0J21l7l33L97l36K06k80K82k36N11k66k11K46
4661A53M17l96m44N62l52M0l1K18k43n0L06k26j37N2L90j80k06K84j91L00m85
$$ plain form
4682 -219 197 -159 -175 175 -65 -47 92 184 98 -200 216 46 -361 -100 318 -308 -218 -3 135 -107 -216 265
4704 265 59 -256 -191 62 -88 -169 -38 180 -245 -258 133 83 22 268 -6 -49 80 178 -66 -183 -169 -172 -231 -251
4728 -251 -287 -22 -97 -121 -71 344 135 2 251 -166 81 -90 -67 81 -253 -50 -7 9 156 173 108 -115 217
4751 217 -1 153 -357 -89 217 -231 40 106 19 -217 181 274 -13 -42 -56 -105 -169 151 177 -252 -196 258 114
4774 114 -281 354 295 172 -170 228 40 -668 -97 265 -85 -129 416 -125 -94 -9 82 243 -102 36 -5 -263
4796 -263 -34 262 -188 -237 213 166 16 -470 273 87 -39 181 113 -174 -252 198 202 -264 -62 10 112 128 -48
4819 -48 8 135 310 63 176 63 151 -162 -29 -60 -72 -212 -11 272 339 140 109 -319 254 -35 -84 -163 173
4842 173 -168 -256 -102 -26 -300 -45 329 150 -107 -93 138 -94 -324 277 -167 -630 162 63 -108 -188 402 132
$$ packed form
4682b19M16l56j6L50k40J8J39R2q6k98M16j70m07K61M18o26R0K15J38k42j09M81
4704B65k06l15O5K53j50q1J31K18m25j3L91n0o1K46k74m3J29R8k44j17J4ln9k0
4728b51l6K65p5k4N0M15k09j33K49m17K47j71K3J48l34K03M3J6J47J7o5k23L32
4751B17k18J54n10K68L06m48K71O6q7k36L98R3k87k9j4m9o4L20K6m29N6M54j44
4774A14l95O35n9j23l42L98j88p08N71L62l50m4N45n41L1Q5R1J61l45J38m1k58
4796b63K29K96m50m9M50m7j50m86P43j86j26K20o8k87p8M50Mm66K02P2J02J6j76
4819d8N6J27J75k47J13j13Q8l13J33l1j2j40K01K83O7j99l1m28N73k89m9p9L36
4842A73l41q8J54P6k74K55L74j79k57J4K31k32k30O01m44m63P92r9j71q0N90k70
$$ plain form
4864 132 -214 -24 17 -267 -486 18 -105 -514 -113 274 -507 -233 214 59 -350 54 309 -92 43 41 -141
4885 -141 -387 -141 313 -210 -344 445 125 -57 -163 259 149 54 -238 209 -61 -257 -133 -20 -211 -62
4905 -62 77 294 -61 -53 114 135 138 132 170 -113 100 26 2 -128 80 211 220 63 79 257 274 47 -41 -184 -306
4930 -306 -190 15 289 185 25 -114 -85 176 491 3 -490 113 -116 -122 -369 10 82 -168 -34 135 -206
4951 -206 -76 37 261 -125 121 418 39 -459 61 -144 -235 190 249 -66 -91 426 650 -424 -114 208 -71
4972 -71 -41 -132 262 -2 -319 278 153 -367 -256 191 106 -80 384 291 -139 55 14 -342 -164 -1 62 23 80
4995 80 272 102 -10 -98 -41 -58 -110 162 101 -45 -156 23 -54 -71 86 -16 242 50 -82 -333 -78 -181 103
5018 103 160 -220 -77 -11 30 -182 155 290 94 -385 219 -119 -507 -49 190 27 -464 -91 178 -244 -105
$$ packed form
4864A32l46J90M1k84k19N04j23m09M01L87p81K74M47j55m09M04K55m01J35kj82
4885a41k46K46M54n23j34P89l20j82j06M22j10r5k92M47k70j96J24J13j91J49
4905f2J39K17l55QJ67K1LoL8k83K13p4k4j30K08J31Rj57J6J78J7k27q8j43j22
4930c06J16K05K74j04j60j39K9K61L15m88m93O03k29ok47L79P2k50J34J69l41
4951b06J30J13K24l86K46K97l79m98N20k05r1M25N9l15k5N17K24j074L10L22k79
4972g1L0r1L94k64l17N97j25n20J11M47q5j86M64r3m30J94m1l56J78J63O3l9N7
4995H0J92j70j12q8N7j7n2K72o1j46j11J79p7j7J57j02K58j92j32k51K55j03K84
5018A03N7l80J43O6M1k12L37J35j96m79O04l38l88M58K39j63m91L73K69m22J39
$$ plain form
5039 -105 171 -204 -121 307 5 -364 -266 42 108 -285 74 143 -270 -135 385 -19 -282 506 522 -249 -193 -19
5061 -19 -62 -426 -153 229 85 -205 139 140 -29 11 580 -188 -432 61 362 163 -40 316 290 -284 176 272
5083 272 46 262 143 63 -71 -52 84 6 119 -13 147 250 -89 297 332 286 27 155 143 74 -147 36
5105 36 108 7 232 14 106 -14 220 132 -299 -168 370 333 -8 32 -10 -154 -179 -2 -133 -159 166 266 89
5128 89 222 191 -115 -152 -18 -107 -274 -128 201 131 -64 64 326 -109 -292 175 -59 -587 -107 216 -44 -306
5150 -306 -31 -122 -408 -232 439 -52 -254 76 54 -452 -246 40 -101 -264 143 185 -284 8 -105 143 -285
5171 -285 127 -36 27 119 209 -71 -529 -148 36 -80 -72 79 135 -36 137 -31 254 46 -193 -171 -314 -125
5193 -125 128 -135 -13 -115 198 19 -5 -104 -16 -281 -184 -48 -9 -31 93 172 43 -136 -232 7 -125 -195 -98
$$ packed form
5039a05K76l75Q3M28l02l69R8L08O6l93L59O9m13J35N20m04k63P88J6p71N6J74
5061a9m3l64K73L82j44k90L44Jj69M0N69p68k44M93L01j99k03L56k6n74M60R6
5083B72k26K16j19q0j34J9J36p8J13j32J60J03l39L86L5m6k59J28j2o9k21J83
5105C6P2j01K25k18R2j20K34q8m31J31N38l7l41M0m2j44k5J77j31k6L25J00j77
5128H9J33l1l06l7J34q9j67J46L29p0j95J28K62m35j83M67k34n28M80L23k60k62
5150c06K75r1k86J76O71m91k02L30k2n06K06K86j41j63M07M2m69K92j13K48m28
5171b85M12j63O3R2R0k80m58L81J84j16QJ51N6j71J73j68K85k08k39K2j43J89
5193a25K53k63J22j02L13j79k4r9Q8k65R7J36L9k2J24P9j29j79r6K39j32p0R7
$$ plain form
5216 -98 158 -80 -328 -65 -130 -336 -82 -14 -242 -235 38 207 -129 100 536 -172 -179 -29 225 -350 97 275
5238 275 149 -137 283 441 149 57 45 -29 -159 218 243 56 236 271 8 -197 -77 301 31 -60 291 194
5260 194 -110 221 220 -13 119 -50 -43 77 156 389 39 110 -137 171 74 -208 3 69 85 -27 242 139 -108
5283 -108 -188 218 -251 -123 -178 130 37 114 -38 -80 -17 -87 103 -220 11 -86 66 -129 -18 105 -102 9 -58
5306 -58 14 -171 -217 216 51 -192 -141 -116 -318 -49 74 387 -89 -333 319 -364 -332 -41 -16 -153 -2 -177
5328 -177 56 -159 -12 554 -238 -225 -48 -12 -554 -192 67 -139 -135 12 80 -121 59 -68 -217 44 180 -56
5350 -56 -157 -63 266 28 101 -129 52 234 -38 -123 132 115 227 109 -111 -285 -85 263 -280 -304 -277 315
5372 315 232 274 47 170 135 -98 -188 298 -156 145 43 171 -163 -24 189 -67 112 71 -425 -281 435 138
$$ packed form
5216i8K56k38k48K63o5k06K54O8k28PK73J69l36K29M36p08pJ50K54n75M47J78
5238B75j26k86M20J58k92r2j2p4j30L77K5j87J80L5k63k05J20L78k70r1L51r7
5260A94l04L31jk33J32j69PJ20P9K33l50P1k47L08r7k82K11O6J6j12K69j03k47
5283a08q0M06m69J28n5L08r3P7j52m2O3p0J90l23K31r7J52j95J11J23k07J11o7
5306e8P2j85m6M33j65k43N1K5k02K69J23L13m76k44O52o83L2K91K5j37J51j75
5328a77K33k15J47N66p92J3J77L6n42L62K59k06MJ47O8k01J80j27j49K61J36k36
5350e6j01R4L29k38P3k30J81J82k72q5K55j7J12j18k20j74K00L48n43k4K7N92
5372C15q3M2k27J23l5k33r0M86m54L01j02J28l34J39K13k56J79m1m96J44P16k97
$$ plain form
5394 138 79 42 37 -171 -259 134 287 -96 -76 273 423 -115 -29 58 -180 -9 164 50 -216 185 264 -148 -500
5417 -500 232 42 -39 22 215 -79 -366 169 205 -404 -19 -55 18 -76 265 135 67 84 -204 -71 123 -113 -3
5440 -3 106 29 196 406 180 97 -98 -351 -144 104 -24 236 439 -165 -39 -13 29 -287 29 -161 85 227
5462 227 -152 44 94 28 -99 21 -156 109 -310 -5 -208 -16 27 -120 8 -55 -154 -13 -207 -73 -32 325
5484 325 -173 -186 50 282 -139 -106 -370 -91 -93 -146 0 122 -118 244 -226 -200 159 100 11 -107 -31 -104 22
5507 22 -96 127 -240 -162 134 19 -194 -4 141 -296 -231 89 -198 166 125 126 -157 99 227 84 -26 -175
5529 -175 238 9 107 115 156 -15 -80 269 -79 -115 140 106 -43 234 167 111 -176 -41 20 -113 165 -119 32
5552 32 -110 -160 15 36 -183 -69 62 113 81 2 -125 54 69 130 -57 -17 115 174 -117 45 149 43 -13 -117
$$ packed form
5394A38n9l7nk08q8L93J53l83K0L49J50n38Q6Q7k38J71J73j14k66M01P9m12l52
5417e00P32j90q1O1J93k94k87N35L6o09L85l6P3r4L41j30o8J7k88J33J94k36J10
5440cJ09p7J67K10k26q3j95k53K07K48j28K60K03o04J26K6M2l16L16j90K46J42
5462B27l79J96N0o6j27J20j77K65m19L05k03J92M3j47J28o3r9J41j94J34M1L57
5484C25m98j3K36K32m21L3k64K79kn3J46J22k40L62m70K6L59n9q9j18P6p3J26
5507B2j18K23l67P8K96j15k13J90J45m37O5L20k87L64m1Jk83K56J28j43j10j49
5529a75M13k29R8QM1j71o5L49l48l6K55l4j49K77o7n6k87J35O1j33K78k84J51
5552C2j42n0J75K1k19J14J31N1l2p9j27J79J5O1j87M0J32N9k91J62J04j06n6j04
$$ plain form
5576 -117 -11 168 -127 -6 103 -26 116 69 64 158 -94 150 -204 -92 21 -18 22 -59 -65 -209 -60 -257 -39
5599 -39 -188 -10 69 -28 -92 -11 2 46 -171 -2 -55 18 -162 -142 -153 -46 16 -155 -154 -55 236 165 -25 12 22 41
5625 41 -57 32 -166 133 41 31 87 -112 -260 -421 -75 -2 -174 -214 -270 18 52 -25 -232 139 -83 -108 -66 -77 180
5650 180 -85 -228 21 33 88 -212 170 -228 -136 148 100 -224 -135 6 -77 -216 -16 150 254 -132 320 -42
5672 -42 -57 36 -51 -237 -120 53 -257 19 -191 -4 -178 50 -43 118 -8 132 58 163 -169 29 -88 168
5694 168 -214 -39 20 -46 23 -66 233 -135 324 100 269 252 -36 30 -46 -123 216 -110 412 158 -48 52 -39
5717 -39 64 -71 113 126 64 5 109 27 -128 167 179 210 178 192 -293 41 -195 -59 96 -211 98 65 -151
5740 -151 76 8 364 38 84 -152 118 96 -242 -97 -89 -268 -116 16 -133 26 -131 84 -269 129 353 203
$$ packed form
5576a17J06J79k95J21J09j29J42m7nR4k52K44l54J12J13l9M0q1oj44J49j97K18
5599c9j49J78P9r7o4Q1J3M4k17J69n3P3j80K0j1J07O2j71JR9K91p1j90L7J0J9
5625D1r8Q9j98K99r2j0N6j99j48j61L46P3j72m0n6K88L4p7k07L71k22k5M2j1K57
5650A80k65j43K49J2N5l00L82l98R2K84m8l24Q9J41q3j39K00J66J04l86M52l62
5672d2j5R3q7j86J17J73l10K76k10J87j74K28r3J61j26J40p4J05l32J98j17K56
5694A68l82J75N9o6O9q9K99l68M59k24J69j7k88O6p6p7L39l26N22k54k06J00r1
5717c9J03j35J84J3o2n9J04q2j55K95J2L1l2J4m85L34k36J36J55l07L09l3k16
5740a51K27o8L56l26M6k36K70k2l38J45Qj79J52J32j49J59j57K15l53L98K24j50
$$ [...]
8191E3
##END NTUPLES=NMR FID
##END=
