##TITLE=1H_SL62-DMDO(f17-2)
 CDCl3, 8 sc, 
 7.07.2021
##JCAMPDX= 6.0         $$ Bruker NMR JCAMP-DX V2.0
##DATA TYPE= NMR FID
##DATA CLASS= NTUPLES
##ORIGIN= UXNMR, Bruker Analytische Messtechnik GmbH
##OWNER= root
$$ XWIN-NMR		Version 3.5
$$ Wed Jul  7 09:31:58 2021 Russian Standard Time (UT+4h)  she@DPX200
##.OBSERVE FREQUENCY= 200.131506
##.OBSERVE NUCLEUS= ^1H
##.DELAY= (6, 6)
##.ACQUISITION MODE= SIMULTANEOUS
##.ACQUISITION SCHEME= undefined
##.AVERAGES= 8
##.DIGITISER RES= 18
##SPECTROMETER/DATA SYSTEM= spect
##.PULSE SEQUENCE= zg30
##.SOLVENT NAME= CDCl3
##.SHIFT REFERENCE= (INTERNAL, CDCl3, 0, 15.7039)
##AUDIT TRAIL= $$ (NUMBER, WHEN, WHO, WHERE, WHAT)
$$ ##TITLE= Audit trail, XWIN-NMR		Version 3.5
$$ ##JCAMPDX= 5.01
$$ ##ORIGIN= Bruker BioSpin GmbH
$$ ##OWNER= she
$$ F:/spectra/data/she/nmr/H-F/1/audita.txt
$$ ##AUDIT TRAIL=  $$ (NUMBER, WHEN, WHO, WHERE, WHAT)
(   1,<2021-07-07 09:30:18.21 +0400>,<she>,<DPX200>,
      <created by zg, POWCHK disabled, PULCHK disabled
       configuration hash MD5:
       00 E9 B6 7A A2 85 ED C7 34 08 36 98 17 FE 4E 26
       data hash MD5: 16K
       C9 94 29 8D B9 4E 1C 5D 65 5A 30 4F E4 78 62 54>)
$$ ##END=
$$ 
$$ hash MD5
$$ ED 4C D2 0C 4E 22 5B 68 12 8F 15 DF 02 1D 18 3F
##$RELAX= 
##$RELAX= 
##$RELAX= 
##$RELAX= 
##$RELAX= 
##$RELAX= 
$$ Bruker specific parameters
$$ --------------------------
##$DU= <F:/spectra>
##$EXPNO= 1
##$NAME= <H-F>
##$PROCNO= 1
##$TYPE= <nmr>
##$USER= <she>
##$AMP= (0..31)
100 100 100 100 100 100 100 100 100 100 100 100 100 100 100 100 100 100 
100 100 100 100 100 100 100 100 100 100 100 100 100 100 
##$AQSEQ= 0
##$AQ_mod= 1
##$AUNM= <au_zg>
##$AUTOPOS= <>
##$BF1= 200.13
##$BF2= 200.13
##$BF3= 200.13
##$BF4= 200.13
##$BF5= 200.13
##$BF6= 200.13
##$BF7= 200.13
##$BF8= 200.13
##$BYTORDA= 1
##$CFDGTYP= 0
##$CFRGTYP= 5
##$CHEMSTR= <none>
##$CNST= (0..31)
1 1 145 1 1 1 1 1 1 1 1 1 1 1 1 1 1 1 1 1 1 1 1 1 1 1 1 1 1 1 1 1 
##$CPDPRG= <>
##$CPDPRG1= <>
##$CPDPRG2= <>
##$CPDPRG3= <>
##$CPDPRG4= <mlev>
##$CPDPRG5= <mlev>
##$CPDPRG6= <mlev>
##$CPDPRG7= <mlev>
##$CPDPRG8= <mlev>
##$CPDPRGB= <>
##$CPDPRGT= <>
##$D= (0..31)
0 1.2 0 0 0 0 0 0 0 0.06 0 0.03 0 0 0 0 0.0002 0 0 0 0 0 0 0 0 0 0 0 0 
0 0 0 
##$DATE= 1625635817
##$DBL= (0..7)
120 120 120 120 120 120 120 120 
##$DBP= (0..7)
150 150 150 150 150 150 150 150 
##$DBP07= 0
##$DBPNAM0= <>
##$DBPNAM1= <>
##$DBPNAM2= <>
##$DBPNAM3= <>
##$DBPNAM4= <>
##$DBPNAM5= <>
##$DBPNAM6= <>
##$DBPNAM7= <>
##$DBPOAL= (0..7)
0.5 0.5 0.5 0.5 0.5 0.5 0.5 0.5 
##$DBPOFFS= (0..7)
0 0 0 0 0 0 0 0 
##$DE= 6
##$DECBNUC= <off>
##$DECIM= 32
##$DECNUC= <off>
##$DECSTAT= 4
##$DIGMOD= 1
##$DIGTYP= 9
##$DL= (0..7)
0 120 120 120 120 120 120 120 
##$DP= (0..7)
150 150 150 150 150 150 150 150 
##$DP07= 0
##$DPNAME0= <>
##$DPNAME1= <>
##$DPNAME2= <>
##$DPNAME3= <>
##$DPNAME4= <>
##$DPNAME5= <>
##$DPNAME6= <>
##$DPNAME7= <>
##$DPOAL= (0..7)
0.5 0.5 0.5 0.5 0.5 0.5 0.5 0.5 
##$DPOFFS= (0..7)
0 0 0 0 0 0 0 0 
##$DQDMODE= 0
##$DR= 18
##$DS= 0
##$DSLIST= <SSSSSSSSSSSSSSS>
$$ [...]
##$SUBNAM2= <"">
##$SUBNAM3= <"">
##$SUBNAM4= <"">
##$SUBNAM5= <"">
##$SUBNAM6= <"">
##$SUBNAM7= <"">
##$SUBNAM8= <"">
##$SUBNAM9= <"">
##$SW= 20.0188882624521
##$SWIBOX= (0..15)
0 0 2 0 0 0 0 0 0 0 0 0 0 0 0 0 
##$SW_h= 4006.41025641026
##$TD= 16384
##$TD0= 1
##$TE= 0
##$TE2= 300
##$TE3= 300
##$TEG= 300
##$TL= (0..7)
0 120 120 120 120 120 120 120 
##$TP= (0..7)
150 150 150 150 150 150 150 150 
##$TP07= 0
##$TPNAME0= <>
##$TPNAME1= <>
##$TPNAME2= <>
##$TPNAME3= <>
##$TPNAME4= <>
##$TPNAME5= <>
##$TPNAME6= <>
##$TPNAME7= <>
##$TPOAL= (0..7)
0.5 0.5 0.5 0.5 0.5 0.5 0.5 0.5 
##$TPOFFS= (0..7)
0 0 0 0 0 0 0 0 
##$TUNHIN= 0
##$TUNHOUT= 0
##$TUNXOUT= 0
##$USERA1= <user>
##$USERA2= <user>
##$USERA3= <user>
##$USERA4= <user>
##$USERA5= <user>
##$V9= 5
##$VALIST= <valist>
##$VCLIST= <CCCCCCCCCCCCCCC>
##$VD= 0
##$VDLIST= <DDDDDDDDDDDDDDD>
##$VPLIST= <PPPPPPPPPPPPPPP>
##$VTLIST= <TTTTTTTTTTTTTTT>
##$WBST= 1024
##$WBSW= 4
##$XGAIN= (0..3)
0 0 0 0 
##$XL= 0
##$YL= 0
##$YMAX_a= 225863
##$YMIN_a= -329852
##$ZGOPTNS= <>
##$ZL1= 120
##$ZL2= 120
##$ZL3= 120
##$ZL4= 120
##$ABSF1= 10
##$ABSF2= 0
##$ABSG= 5
##$ABSL= 3
##$ALPHA= 0
##$AQORDER= 0
##$ASSFAC= 0
##$ASSFACI= 0
##$ASSFACX= 0
##$ASSWID= 0
##$AUNMP= <proc_1d>
##$AZFE= 0.1
##$AZFW= 0.1
##$BCFW= 1
##$BC_mod= 2
##$BYTORDP= 1
##$COROFFS= 0
##$CY= 11.3945322036743
##$DATMOD= 1
##$DC= 2
##$DFILT= <>
##$DTYPP= 0
##$F1P= 15.9154993809931
##$F2P= -4.1035820241983
##$FCOR= 0.5
##$FTSIZE= 0
##$FT_mod= 4
##$GAMMA= 1
##$GB= 0.15
##$INTBC= 1
##$INTSCL= 1
##$ISEN= 128
##$LB= 0.24
##$LEV0= 0
##$LPBIN= 0
##$MAXI= 10000
##$MC2= 0
##$MEAN= 0
##$ME_mod= 0
##$MI= 1.114404
##$NCOEF= 0
##$NC_proc= 0
##$NLEV= 6
##$NOISF1= 3.799351
##$NOISF2= 2.8
##$NSP= 1
##$NTH_PI= 0
##$NZP= 0
##$OFFSET= 15.70392
##$PC= 1
##$PHC0= -11922.6
##$PHC1= 24.00099
##$PH_mod= 1
##$PKNL= yes
##$PPARMOD= 0
##$PSCAL= 0
##$PSIGN= 0
##$REVERSE= no
##$SF= 200.130013532006
##$SI= 16384
##$SIGF1= 3
##$SIGF2= 2
##$SINO= 400
##$SIOLD= 16384
##$SREGLST= <1H.CDCl3>
##$SSB= 0
##$STSI= 0
##$STSR= 0
##$SW_p= 3612.71676300578
##$SYMM= 0
##$S_DEV= 0
##$TDeff= 0
##$TDoff= 0
##$TI= <>
##$TILT= no
##$TM1= 0
##$TM2= 0
##$TOPLEV= 0
##$USERP1= <user>
##$USERP2= <user>
##$USERP3= <user>
##$USERP4= <user>
##$USERP5= <user>
##$WDW= 1
##$XDIM= 8192
##$YMAX_p= 0
##$YMIN_p= 0
$$ End of Bruker specific parameters
$$ ---------------------------------
##NTUPLES= NMR FID
##VAR_NAME=  TIME,          FID/REAL,        FID/IMAG
##SYMBOL=    X,             R,               I
##VAR_TYPE=  INDEPENDENT,   DEPENDENT,       DEPENDENT
##VAR_FORM=  AFFN,          ASDF,            ASDF
##VAR_DIM=   8192,          8192,            8192
##UNITS=     SECONDS,       ARBITRARY UNITS, ARBITRARY UNITS
##FACTOR=    0.0002496,     1,               1
##FIRST=     0,             0,               0
##LAST=      2.0444736,     0,               0
##MIN=       0,             -329852,         0
##MAX=       2.0444736,     225863,          0
$$ Real data points
##PAGE= N=1
##DATA TABLE= (X++(R..R)), XYDATA
0 0 0 0 0 0 0 0 0 0 0 0 0 8 -8 8 -16 16 -17 24 -32 33 -41 49 -64 72 -85 97 -113 133 -153 177 -201 230 -262
33 -262 297 -335 378 -424 476 -532 591 -661 735 -816 903 -997 1103 -1219 1341 -1479 1629
50 1629 -1796 1979 -2180 2405 -2656 2939 -3262 3628 -4056 4557 -5156 5887 -6802 7986 -9578
65 -9578 11859 -15400 21677 -36131 142290 -101922 -265835 225863 94055 -178549 13594
76 13594 136766 -79574 -30118 74138 -9692 -19882 61589 -19738 -40237 39413 28274 -20733
88 -20733 16003 -3151 -26549 22055 20287 -40493 1038 24546 -50757 -32449 65603 17977
100 17977 -55588 -2338 29013 -11324 -10121 -11893 -18467 14645 -4768 -42312 18292 26885 -55961
113 -55961 -21497 41745 -31046 -38946 45412 -2900 -67238 10472 39391 -25459 -19328 9946
125 9946 -13410 -11076 6684 -16856 -22533 4893 2011 -18775 -9172 8859 2009 -14039 -9308
138 -9308 5440 2435 -8431 -5287 2721 -2363 -9908 -1577 7233 -3862 -16612 -8238 3632 4299
152 4299 -904 -8821 -407 17254 7350 -12402 -1209 8970 -2662 -7014 -7371 -6347 11295 11110
166 11110 -12488 -6298 12713 2238 -2997 572 -9318 1243 18812 -905 -9336 13213 3057
179 3057 -15079 7202 8752 -14959 -866 13569 -8879 -6753 15768 2032 -8554 9879 4264
192 4264 -13095 6150 14665 -8712 -6938 11758 5003 -580 1472 -10377 -4365 13870 -522
205 -522 -10867 10164 10493 -2427 6162 3128 -4799 16363 10254 -20946 -1023 22754 -9076 -16733
219 -16733 16885 10397 -8964 8331 12059 -5826 1814 10795 -7 4271 12452 -1036 -3824
232 -3824 12387 4706 -11281 230 10705 1586 94 3780 777 9094 13850 -2842 -3305 13936
246 13936 4906 -10351 -853 3999 1749 6466 403 -4045 8921 4296 -10564 2468 7212 -8872
260 -8872 1365 14699 -3538 -7925 7901 1858 -7443 -389 -2310 -6155 2075 -298 -8500 -550
274 -550 4564 -3923 -6139 -1320 -3012 -3833 -748 -3230 -5086 284 -954 -7333 -3653 -2721 -11869 -6392
290 -6392 4201 -7745 -13199 3118 3368 -8402 -4456 -2242 -4742 2178 -4271 -16142 -226 7585
304 7585 -12453 -11449 4967 -2613 -9345 128 -1228 -4859 1190 -1236 -6608 867 2985 -5734 -3176
319 -3176 4448 -1252 -8259 -1844 3554 -1596 -4516 -269 2951 3914 1942 -4844 -1576 8785 1601
334 1601 -8017 2710 8342 -2395 -1930 4810 2439 2558 2988 -2992 -482 5977 623 -1241 6584
349 6584 5094 -212 5223 7490 -589 -3509 3267 4473 579 2463 4489 -77 293 5403 776
364 776 -1511 6744 4894 -3966 2029 8054 1733 103 2572 -799 1562 3769 -3144 -2021 3579
379 3579 -250 -388 8260 3596 -4970 859 5410 -1001 -1515 2794 653 -1712 808 546 -824 1603
395 1603 618 -3694 21 4772 -169 -2582 1946 -576 -1800 4958 2729 -5074 -862 2144 -3241
410 -3241 79 3697 -2712 -2133 4360 -457 -2827 3035 1257 -4270 -349 3067 -731 -283 871 -1255
426 -1255 -1326 2159 1634 -1803 -2028 -75 -745 -938 1420 874 -1109 -294 16 34 771 -740 -2950 -21
444 -21 816 -2576 196 2572 -2664 -4157 997 551 -2131 150 135 -3794 -1024 4116 -21 -4636 -1304
461 -1304 817 -3480 -2865 1917 -841 -3856 -643 -1035 -1671 2194 -822 -5869 -491 1556 -3762 -746
477 -746 2294 -4854 -3795 3171 -1473 -4223 1970 -1180 -6837 1388 4686 -3922 -3687 1621 -1510 -2699
493 -2699 2025 463 -2948 -503 -835 -2617 2050 1848 -4549 -1163 3512 -1721 -1838 4223 -1585 -5553
509 -5553 4632 4239 -4393 932 4482 -4019 -1559 5958 -81 -2920 3097 276 -1798 4065 2709
524 2709 -1918 1679 2700 -594 2274 3046 -2043 -130 4618 1033 -808 4417 2181 -2770 868
539 868 4559 376 179 2726 899 679 3180 1177 -874 2570 1519 -1582 2486 3442 -1752 99
555 99 4022 89 -514 2905 156 -1079 1903 1109 -433 1559 1119 -539 1333 609 -491 1101 -32
572 -32 -1214 1071 1265 -1175 -42 1564 -974 -921 1542 -38 -1716 20 965 -221 -1244 -402 -24
589 -24 115 -685 -1432 -216 413 -1474 -824 1290 -750 -1659 756 289 -2355 192 720 -2475 -1557 1401
607 1401 -1175 -1194 769 -1314 -1114 1204 -1139 -2237 1200 -294 -2798 716 1088 -2293 -868 1290
623 1290 -1281 -914 1172 -1211 -1505 1234 -503 -2404 751 1295 -1681 -792 920 -932 -1095 1002
639 1002 -556 -1898 1443 1136 -2213 -792 1147 -701 -199 44 -1246 223 1236 -2450 -1064 2428
655 2428 -731 -2363 1734 458 -2902 418 1543 -1807 -550 1413 -1346 -1017 1213 -731 -1656 466
671 466 506 -978 -257 -271 -359 317 -421 -1348 741 898 -1390 -1043 985 -261 -1239 354 -253 -1101 512
690 512 188 -1240 288 -21 -1367 999 1674 -3123 -783 3563 -728 -3171 2091 1847 -1709 -10
706 -10 756 -601 1187 664 -817 1193 1178 -1334 1124 2372 -888 -610 2724 369 -599 2371 460
723 460 -1441 2555 2659 -2069 110 4020 584 -1625 1956 2217 500 1345 -173 -148 3733 1694 -3249
740 -3249 1527 5580 -1440 -2016 4802 1357 -2235 2719 2718 -1515 1481 2190 -1584 1062 2915 -1854
756 -1854 -744 3166 22 -1845 1348 799 -802 516 -107 -1059 1961 1657 -2748 -1273 2446 609
772 609 -2417 -459 188 -818 -162 -29 -1497 -156 441 -1851 -463 1223 -1889 -1681 1088 -1355 -3097
789 -3097 798 904 -3296 -1962 285 -1711 -1082 88 -2032 -1933 197 -141 -1144 -1037 -805 -1631 -1123
806 -1123 135 -646 -2153 -1609 420 -360 -2304 -701 520 -1375 -1387 -442 -544 550 279 -2505 -1590
823 -1590 2518 1099 -2498 -1645 484 -139 -663 -427 -135 61 482 -810 -669 1818 519 -2372 58
840 58 2088 -703 -698 1691 -638 -1886 1394 632 -963 1552 170 -2893 1871 4153 -974 -1915 1420
857 1420 259 207 902 -1074 -582 2192 349 -2288 1315 2445 -1160 -513 965 -554 654 2886
873 2886 -914 -2543 2278 2957 -1982 -602 1941 -848 -862 1471 -541 -868 2006 105 -1405 2734
889 2734 1513 -2519 1303 2810 -1784 -736 2467 368 -888 1224 -634 155 2859 507 -3147
904 -3147 617 3576 433 -1196 1747 1901 564 801 -100 -130 2040 821 -2721 306 3330 250
920 250 -702 2092 589 -1248 2085 2129 -682 -298 1289 660 1515 905 -1415 145 2062 -616 -806
937 -806 1663 871 -685 617 1105 23 297 855 -864 -1470 1032 616 -1256 -407 326 -1416 -279
954 -279 1616 -1564 -3087 264 1341 -509 -873 -1258 -610 1243 -846 -3811 -292 2108 -3045 -4099
970 -4099 527 1160 -2702 -2631 -420 -93 -1002 -1594 -992 -643 -1399 -1951 -939 -245 -1572 -3185 -1170 731
988 731 -1452 -3374 -2023 -348 415 -564 -2638 -841 2573 -333 -3828 -772 1659 -1600 -3125 -938
1004 -938 593 344 -1082 -1854 1164 1007 -1297 -59 1357 -328 -1220 1526 2083 -206 -1469 -252
1020 -252 1650 835 -840 -634 787 1403 1388 978 112 1501 1932 41 -430 1810 2408 -96 -449 1832
1038 1832 1929 603 965 1039 -1027 423 3109 1084 -412 1401 1752 1395 2295 614 -946 2342 1760
1055 1760 -1797 600 2522 -773 -1036 2217 613 -417 1589 1102 -296 890 1017 558 1127 240
1071 240 -1373 67 1550 234 -1503 -591 464 1343 370 -1183 -357 2408 1248 -2168 -550 1873
1087 1873 -65 -1807 -652 -355 133 1168 -882 -1789 1147 735 -1473 -87 524 -1190 147 1095
1103 1095 -748 -124 773 -782 -1007 416 -754 -1546 250 843 -782 -617 152 551 263 -884 -1107
1120 -1107 898 581 -386 -439 -589 -368 823 -409 -2779 -1024 1705 -1044 -2715 888 1478 -690 -53
1137 -53 -37 -1373 559 627 -3046 -1754 1746 -1412 -2851 635 -250 -2297 318 229 -2166 357 880
1154 880 -2245 622 1682 -3106 -2089 2448 -1465 -3506 573 -418 -2398 788 47 -3266 824 2359
1170 2359 -2565 -2114 2298 -188 -2591 223 -609 -1902 2037 459 -3659 699 2665 -3375 -1509
1185 -1509 3188 -1841 -2808 3851 1749 -2865 2094 2398 -2363 250 1599 -1813 559 2590 -1991
1200 -1991 18 4325 -160 -1800 3044 1022 -1899 3027 3668 -1677 413 4076 1015 -494 1553
1215 1553 699 -691 1810 1505 -205 1686 2714 730 1390 2233 109 1186 2071 -1077 -352 4344
1231 4344 1404 -2441 1516 2892 -941 -202 2258 784 -279 1050 1193 1538 630 -836 460 1507
1247 1507 -655 -464 719 -127 -537 106 -565 292 1562 -780 -2002 3 764 -342 -749 -1410 -511
1264 -511 821 -477 -2273 -141 515 -2016 -1874 621 -824 -2194 -175 -318 -1144 88 186 -1545 -665
1281 -665 -46 -2169 -1115 748 -1989 -2518 934 -324 -2454 432 -1 -3110 203 1833 -2207 -1246
1297 -1246 2068 -502 -1994 249 -1061 -1796 65 -1027 -2070 743 977 -1761 299 1208 -1624 -268
1313 -268 1460 -1881 -2005 2343 346 -2620 325 1633 -1844 -601 1088 -1067 -541 1419 -708 -910
1329 -910 2145 28 -1684 1780 705 -2367 459 1413 -1596 86 1801 -1515 -708 2055 -533 -1247
1345 -1247 1405 656 -1188 751 899 -615 1256 604 -1695 -144 1709 -690 -1678 1184 163 -968
1361 -968 758 1230 -230 310 897 -28 53 895 -332 -122 513 -31 141 1248 -8 -417 1335 720
1379 720 -880 1077 1497 -161 936 1830 139 196 715 -285 107 1052 -67 241 1587 911 145 1147
1397 1147 956 37 852 1375 70 331 761 673 804 635 281 820 822 -79 -211 1551 706 -982 701
1416 701 2000 -3 -324 1166 162 -650 979 678 -679 3 304 -377 41 57 -653 -356 -954 -609
1434 -609 769 371 -1812 -306 1409 -842 -1028 602 -480 -2412 -1026 25 -1123 -1722 -588 -746
1450 -746 -785 -298 -326 -835 -1332 -1252 -695 -566 -1059 -1322 -824 -497 -821 -650 -292 -1365 -1499 -102 -132 -749 -294
1471 -294 -199 -1167 -569 538 -694 -1612 -1042 186 -132 -985 -389 503 -286 -1342 -322 863 -420 -1174
1489 -1174 -356 171 891 614 23 185 204 -354 -81 854 -151 -286 637 996 742 678 516 -30 276 796
1509 796 783 390 637 768 441 147 877 720 447 -101 298 1084 1019 373 408 1463 474 397 849 253 -492
1530 -492 580 824 -296 62 969 147 47 699 477 168 805 12 -171 823 530 -284 117 626 25
1549 25 252 444 174 20 354 539 10 165 167 -184 253 454 10 -434 12 910 -404 -105 684 451 -233
1570 -233 367 -217 25 406 65 -625 148 1052 357 -80 468 280 -281 13 96 -240 -257 -131 -187 216 401
1591 401 -421 -386 749 -373 -562 506 569 -793 69 471 -618 -153 547 -852 -882 786 4 -602 291
1610 291 -28 -709 384 -47 -1051 4 413 -1158 -475 660 -467 -783 595 66 -1845 -92 622
1627 622 -1338 -1409 742 -550 -1112 -98 -426 -976 212 -142 -1146 -78 -113 -1541 -318 568 -1084
1644 -1084 -1090 576 -246 -1167 30 -83 -691 250 -475 -936 101 760 -585 -863 112 -63 -473 -340 -294
1663 -294 52 511 -41 -736 491 594 -844 -622 965 33 -378 604 381 139 432 443 -194 201 339
1682 339 -80 508 1001 -50 254 459 605 436 224 96 496 682 278 320 594 317 568 729 138 220
1702 220 888 305 105 536 730 262 688 456 71 365 943 43 -35 470 609 251 236 35 -146 813 709
1723 709 -522 157 815 -233 -216 743 58 -377 449 557 -219 -53 179 -218 -39 221 -764 -477 1176
1742 1176 18 -939 -25 54 -449 205 -396 -649 452 163 -1149 -242 697 -526 -682 283 -45 -636 8
1761 8 -107 -866 121 336 -600 -317 202 -478 -280 137 -633 -1096 60 289 -797 54 -84 -1049 66 641
1781 641 -788 -556 456 -35 -604 146 -59 28 173 -420 -858 272 227 -379 145 303 -536 230 538 -416
1801 -416 -262 247 495 -627 117 -11 -26 166 -11 -277 423 187 -602 162 522 -652 -698 813 -264
1820 -264 -793 75 762 -366 -20 130 -525 51 229 -394 -532 245 104 -427 -145 -357 -265 181 -345 -421
1840 -421 518 506 -814 -181 313 70 -455 311 -66 -303 140 -62 -205 391 5 -609 309 644 -669 -219
1860 -219 715 130 -598 677 617 -207 716 292 -178 234 781 56 161 398 -21 507 1045 -418 -349 1028
1880 1028 350 -232 567 817 40 346 421 296 266 784 289 -261 388 650 205 -42 14 211 538 318 -390
1901 -390 450 433 -41 97 981 324 -333 48 789 341 -10 -64 71 277 -55 -324 -82 261 -53 -146 -81
1922 -81 289 361 112 -556 -372 426 237 -812 -492 157 122 -453 -45 -289 -102 -601 -568 336 -83 -994 -143
1943 -143 85 -546 -629 -243 -291 -571 -248 29 -196 -306 50 -375 -543 46 -267 -277 -385 -891 -306 227 -381
1964 -381 -901 -125 -83 -402 -296 187 -473 -269 174 -624 -721 307 92 -629 -76 316 -87 -245 -129 -540
1984 -540 -59 -86 -561 -157 249 -44 -509 348 236 -466 6 517 27 -36 125 -159 -97 446 -128 -109 588
2005 588 383 -168 7 415 168 229 265 -410 -346 630 -130 -445 248 370 -321 -58 330 -95 438 211 -103
2026 -103 77 189 205 45 369 162 18 206 430 -761 14 192 -12 -5 315 68 33 557 533 57 -78
2047 -78 167 316 208 -96 28 227 389 -74 -172 458 416 -155 59 510 380 228 82 75 -124 286 227 -271
2069 -271 -200 343 163 -26 365 148 55 274 389 54 304 380 -127 368 305 -488 -311 180 557 -445 -122
2090 -122 325 65 -174 -62 205 21 14 -80 10 141 -7 -38 86 -207 14 188 -88 -239 -115 341 7 -558
2112 -558 -246 206 -610 -96 -3 -185 -537 77 -45 -487 -670 -119 -362 -365 -365 -477 -390 -396 -322 -202 -271 -347 -280 124
2136 124 -472 -779 -379 -105 -447 -801 -605 -68 -366 -1118 40 -365 -215 -326 -159 -464 -423 98 -61 -589
2156 -589 -245 164 -132 -37 -203 25 -51 -469 -192 -110 242 -287 -327 258 35 -295 207 331 -415 -263 475
2177 475 255 133 431 -127 288 706 363 84 289 499 96 251 507 -112 514 587 62 339 516 326
2197 326 -124 304 485 225 444 455 -41 434 734 291 86 679 -24 147 726 156 -26 218 298 -40 569
2218 569 677 473 -70 288 219 287 396 -124 -178 -8 -138 13 300 77 -324 64 431 125 190 324 -42
2239 -42 -214 273 -2 -206 175 -56 -17 193 -82 -75 -27 -244 -292 69 318 -142 -215 228 -58 -343 387 22
2261 22 -706 308 71 -310 -36 263 -210 -218 132 -346 8 117 -68 -168 231 85 -565 219 -102 -591 67
2282 67 307 -864 -277 117 -253 -423 306 -377 -345 385 -143 -639 242 -43 -551 -137 534 -885 -265 374
2302 374 -377 -631 286 -146 -407 -85 83 -658 31 16 -382 -262 -156 -653 -441 71 -205 -427 74 -154
2322 -154 -701 29 111 -650 -558 204 -288 -438 359 -313 -465 -121 -100 -235 344 -40 -427 -76 67 -502 144
2343 144 611 -407 -416 408 121 -453 -101 247 -125 338 184 -210 -22 202 -70 326 483 177 305 449
2363 449 172 215 910 259 -138 382 246 -263 346 436 107 285 317 334 847 393 -51 479 1014 98 -85
2384 -85 748 565 -152 401 572 -107 22 596 441 425 613 -93 335 762 429 23 765 49 -186 510 237
2405 237 -223 309 537 -425 300 641 -424 -123 83 21 -685 205 422 -673 258 -28 -474 96 -37 -562
2425 -562 -264 269 -668 -537 444 -295 -875 335 -126 -811 -296 -24 -793 -400 205 -280 -645 -35 -173 -668
2445 -668 -156 -324 -618 307 -25 -496 -49 346 -545 -825 398 -306 -655 41 -248 -303 -136 -191 -248 -52 -234
2466 -234 -524 -204 299 -493 -126 621 -281 -527 272 -181 -518 4 197 -321 -69 189 -117 -23 124 42 101
2487 101 390 -193 -515 519 50 -340 -30 454 -255 -14 -50 -421 1 246 181 -222 202 223 304 30 226
2508 226 38 401 -128 -431 170 20 -241 -128 385 120 -148 381 326 -107 -167 -27 229 286 -105 -284 200
2529 200 -75 -495 290 70 -232 355 777 -12 -100 676 577 -246 208 401 -48 -13 130 321 598 689 -109
2550 -109 72 464 188 217 567 220 -284 658 771 -184 241 604 205 -8 357 367 156 173 306 122 279
2571 279 24 150 469 -39 -510 519 679 170 -241 25 -105 -354 241 139 -213 78 152 -512 100 158
2591 158 75 -214 -235 -182 109 177 -529 -341 -112 -232 -392 252 58 -298 -93 128 -104 -577 -461 -130 -356
2612 -356 -357 -229 -260 -394 -862 -417 -305 -450 -237 -567 -420 -726 -45 78 -400 -442 -448 -112 -31 -360 -213 -213 -306
2635 -306 87 -181 -248 -268 -167 -129 -256 -57 65 179 -158 35 22 56 144 -73 57 118 202 191 212 -209 -57
2658 -57 10 590 84 -53 263 589 651 -441 -23 432 177 -36 -15 292 65 86 -187 92 504 512 1 -131
2680 -131 158 242 501 -20 31 415 268 131 428 298 63 66 240 518 -31 13 166 311 63 106 104 381 310
2703 310 32 -240 101 282 17 -92 395 89 67 226 -13 -257 26 168 -392 -112 379 224 -21 -173
2723 -173 -92 161 29 7 59 279 395 61 156 74 161 241 177 -78 -66 290 -69 -179 37 380 -207 -341 419
2746 419 -9 -330 -140 -119 173 7 -98 34 462 -108 -535 163 133 -80 -239 102 -152 -254 -11 -146 -445
2767 -445 62 122 -387 -393 -18 -11 -133 -68 -87 -91 -5 -380 -70 166 -56 -645 134 -22 -255 -183 -288 -239 -362 -85
2791 -85 -156 -485 -103 -341 -421 -48 -38 -430 -172 -386 -256 78 74 -436 -179 115 -79 -277 -82 10 -109 -372
2813 -372 -357 -32 9 -164 0 -133 -32 -213 -105 -14 -309 172 154 -53 -133 375 107 -306 325 349 5 -93
2835 -93 337 184 129 276 -162 592 509 -6 -23 675 310 113 75 273 32 544 630 183 90 463 114 284
2857 284 277 366 286 419 294 4 530 621 -43 450 257 -69 51 575 460 18 231 364 -54 252 72 26
2879 26 266 324 -279 315 378 -82 -164 262 38 -225 551 -221 -524 695 240 -176 -199 -205 -86 -134 -20 -538
2901 -538 47 -4 -341 -198 216 288 -9 -148 -203 -268 -72 53 -215 285 179 -313 -301 -156 -289 -237 -289 -140
2923 -140 -251 37 -166 -359 296 -261 -329 134 -27 -514 -310 70 -88 -199 24 36 -115 214 -24 -268 -307
2944 -307 119 -129 -311 172 50 51 -248 13 73 218 -104 -179 299 49 -138 -222 177 -34 160 144 36 100
2966 100 222 59 -138 255 41 -169 -196 58 -272 130 243 -221 -46 359 -286 -534 186 -105 -196 21 -248
2987 -248 -343 190 -23 -184 -114 247 -431 123 397 -77 -207 123 33 -151 174 229 -92 200 -131 -27 183
3008 183 65 253 7 183 -103 -188 468 103 -217 221 309 -206 31 276 -91 -63 428 130 -5 308 78
3029 78 -175 369 322 104 141 103 180 356 19 -63 11 333 -97 -50 466 128 8 109 159 150 378 -57 -294 214
3053 214 -56 -235 122 6 -293 101 451 285 -262 43 242 -301 -31 486 -192 -158 330 -122 0 32 31
3074 31 -56 -129 -293 -93 -96 100 -290 -144 -120 -194 239 -64 -295 -315 -141 41 -350 -194 -114 -276 49 -285 -181
3097 -181 -212 -229 63 118 -153 -384 -138 -441 -116 -18 -82 24 -196 -92 22 -116 28 -184 -180 7 -107 -115 -324
3120 -324 -184 -406 -71 134 -51 -84 30 -76 -53 -48 -238 -279 -51 -15 -15 138 41 79 -25 100 214 -19 292
3143 292 -75 13 -394 214 -181 -224 -84 -34 94 318 111 -436 31 259 91 -231 302 287 -73 -32 -161 233
3165 233 198 62 -121 159 9 -89 -80 269 246 -90 435 -57 -203 101 153 222 230 -36 220 -104 -96 -26 374 -119
3189 -119 -177 233 261 60 166 306 71 -46 136 -45 116 -46 -108 24 9 -27 -113 -4 21 -295 416 -36
3211 -36 -88 160 292 -48 -57 239 124 176 -98 236 -56 -253 -122 -71 36 -36 46 -105 191 227 187 -64 40
3234 40 -48 208 16 -135 -18 -10 141 45 79 -165 296 91 -281 -75 267 -97 5 -30 -52 -209 -112 174 -298
3257 -298 -127 32 -19 -306 72 77 -169 -38 -163 95 -97 -304 -245 -160 -250 -325 -42 -258 -98 -109 -119 -147 -261
3280 -261 -255 87 -94 -87 -9 -394 54 -145 72 11 -337 -209 -182 -279 -181 -191 -401 -240 60 21 -133 235 27 -165
3304 -165 67 -312 -31 -110 -24 89 -155 52 -220 -26 -119 -286 -49 -9 34 47 54 -263 30 77 29 -390 -130
3327 -130 35 354 -154 358 -31 -243 -254 -34 97 10 23 96 63 361 158 -46 -22 62 36 99 94 255 136 281
3351 281 53 166 194 58 302 252 80 -49 31 178 218 15 -47 -56 183 154 111 33 227 99 -34 63 273 -113
3375 -113 267 53 12 15 190 241 96 56 232 461 72 -108 200 -2 -238 -14 138 33 -26 -138 42 12
3397 12 -105 38 -103 65 -81 128 -62 99 298 141 115 -387 -184 202 -199 -512 144 302 28 49 117
3418 117 -88 -64 -158 -161 81 -154 -66 49 -94 -72 -221 80 -11 -98 -182 -166 19 114 -9 272 71 -55 -93 -116
3442 -116 109 -43 -177 -93 62 367 118 -12 -315 268 -54 -323 -296 151 -115 -52 17 -117 -321 1 51 -246
3464 -246 -10 -59 -32 -90 -75 -53 -131 41 -132 -241 28 -168 -86 -21 320 -683 -628 -170 -104 -274 -397 13 114
3487 114 -132 -115 -14 71 -214 -89 100 341 -82 -67 78 257 60 481 -172 -324 157 193 44 -184 172
3508 172 45 -43 152 -106 -122 235 128 -360 162 207 -26 157 141 -159 317 389 -213 105 337 65 110 306
3530 306 93 342 339 267 -25 56 12 16 220 285 -72 116 417 237 41 38 90 2 298 235 -185 112 70 281 -10
3555 -10 95 113 94 174 -129 -135 417 -48 -160 431 109 86 127 121 19 97 185 4 -137 199 -140 -203 197 53
3579 53 233 -79 10 -210 -141 137 -272 -38 -409 -313 -102 80 -127 -450 -363 -175 73 -128 -121 -136 -64 247 -318
3602 -318 -230 0 -83 -165 -73 -72 -361 158 -146 -159 -160 18 -80 -188 -130 -250 -198 18 123 -107 -184 -233 88 152 -100
3627 -100 -310 72 163 -293 113 157 -254 -211 59 99 -257 -146 -169 -95 7 196 -276 37 50 -97 97 78 -138
3650 -138 -123 211 80 -166 69 -146 -142 -44 -188 -223 -203 57 20 94 331 -140 18 236 99 -24 290 158 -102
3673 -102 264 13 282 -86 411 113 -120 -1 -69 68 -226 59 268 293 16 -20 118 62 -159 169 -52
3694 -52 99 15 160 307 162 88 393 86 36 197 282 146 -91 390 23 193 183 248 174 63 108 120 145 -44
3718 -44 149 347 164 87 145 355 205 -36 -37 128 470 309 267 24 287 352 144 -223 210 169 164 26 -163
3741 -163 -15 -28 82 65 -134 -179 -181 -263 -123 160 -194 -298 20 -232 -183 7 -185 -305 -141 135 -475 -515 -219
3764 -219 -166 -190 -177 24 -310 -16 -269 101 -35 153 -216 -356 -222 -563 -188 -121 -391 -417 -265 -229 -139 -167 -256
3787 -256 -74 -257 -138 -118 -59 -306 39 -252 -304 -199 -48 20 -28 -69 129 97 -203 188 66 8 -24 110 -60
3810 -60 8 -84 -96 -187 51 163 250 73 151 -109 239 -40 -93 328 69 463 18 50 543 179 -84 -68 137
3833 137 143 69 -10 265 204 360 70 -4 187 -87 -33 230 -70 -97 -189 234 234 150 183 2 -43 -111 98 62 281
3858 281 10 69 -178 2 -103 367 -91 -144 -4 254 136 -108 254 233 324 99 201 -10 213 193 -4 55
3880 55 86 221 49 72 40 -203 -20 -62 32 -147 -207 -130 -153 -86 -78 -353 2 33 -149 209 105 -152 24 46 169
3905 169 -83 286 -152 -151 -14 96 144 -367 -272 -237 127 -276 -417 -91 198 -53 -231 134 49 1 114 -92
3927 -92 -150 -295 -193 -331 -303 3 -265 -165 36 28 -420 -62 -194 -66 132 -61 -217 -23 -129 -20 -84 14
3949 14 -164 -327 238 -191 -52 -307 -328 -139 -45 -184 -413 32 -21 -1 -10 -67 -110 -36 -84 -271 -304 148 108 -206
3973 -206 -293 -146 1 114 -91 64 332 -82 -119 -50 86 -22 -73 87 -44 -4 91 254 278 109 203 -52 63
3996 63 100 51 -56 196 160 194 433 126 258 329 -5 67 160 339 -36 258 350 -48 122 342 461 225 188
4019 188 183 93 317 -26 59 309 -1 48 146 83 -151 63 323 -172 43 127 158 272 35 85 -220 170 -171
4042 -171 -6 26 129 124 -53 -86 -3 -199 248 -162 -305 217 -166 -194 -122 -166 -167 186 19 -140 129 215 101 -219
4066 -219 -20 -427 -239 53 25 -392 -28 125 -231 -135 -62 -141 81 -76 110 -152 30 -32 -326 0 -100 -73
4088 -73 -20 -51 -93 18 289 -66 -159 320 -89 68 -149 87 -52 -302 -25 -309 -69 47 -146 172 168 -155
4110 -155 -244 201 -156 -160 335 -81 -286 276 148 139 151 -131 -270 90 -215 206 -62 115 -175 7 82 -77
4132 -77 -24 -74 216 -92 -60 183 -193 -274 112 -170 -102 -111 -98 -192 73 145 300 44 -83 4 79 230 -83 150
4156 150 -25 -40 -217 214 104 81 -48 39 134 37 -46 -160 104 164 100 176 302 35 -126 143 67 143 169 246
4180 246 25 124 170 -236 491 238 184 66 151 113 186 42 -18 74 79 -18 287 19 360 166 46 39 104 52 -46
4205 -46 102 69 41 8 176 257 96 -14 26 -5 -37 62 36 -45 166 62 -55 15 168 150 -90 78 151 -162 -160
4230 -160 -77 -283 -131 -33 -117 -201 140 -153 194 -98 -227 -205 -68 -31 -11 -205 -188 -160 -38 -95 -99 -184 24 -160
4254 -160 126 -126 -455 -31 -113 -109 -102 -278 -120 -66 223 -209 -295 -204 66 -95 -237 98 -184 -191 9 70 -136 99
4278 99 -120 198 157 252 53 -205 153 -129 147 79 185 -67 -128 107 318 86 -246 159 -137 139 -94 -152
4300 -152 220 149 58 147 -80 -37 53 88 7 -205 40 228 -101 121 188 13 -7 86 262 -113 253 -85 234
4323 234 10 27 114 36 -43 -172 68 107 -255 -38 -16 -259 -92 -21 34 -27 160 -67 -38 -75 -135 -268 39 -31
4347 -31 196 -60 350 170 7 159 143 -76 -158 73 108 -156 67 99 154 -12 249 -69 -10 94 109 -83 319
4370 319 24 -103 -101 59 -19 -211 5 -190 54 80 -138 -86 279 -9 88 -326 58 -123 -319 171 310 63
4392 63 162 117 78 205 -120 -100 -9 93 57 -275 67 -39 -79 -192 -130 -77 -122 92 106 136 10 213 5 57 -93
4417 -93 -94 -270 -158 -371 -32 217 -235 203 -71 -256 -77 111 -400 -175 -153 -30 -111 -179 -105 -74 -274 -107 -94
4440 -94 63 -274 -180 60 238 -42 -269 52 -153 -21 -142 10 -118 -1 -166 33 -302 -203 179 20 -11
4461 -11 66 -51 -146 41 -91 -33 74 -112 152 -69 173 37 82 -214 -352 146 44 47 242 34 293 125
4483 125 28 -48 -67 -62 168 210 93 -88 157 238 -135 -175 135 -68 -77 300 75 -59 23 -62 136 -34 -73 124
4507 124 190 64 -108 142 28 147 181 120 -175 79 188 156 59 -337 -151 123 11 -144 -21 115 -150 -26
4529 -26 -31 202 -301 -5 10 -337 -119 105 -6 -34 196 4 99 209 -77 -135 124 -199 -117 211 -153 -48 -262
4552 -262 -36 52 37 298 307 209 -235 19 200 -108 19 -56 55 -149 -2 -165 -98 -151 -155 -204 -188 233 16 135
4576 135 -38 -20 -33 -270 -157 -89 88 27 52 95 -155 -89 132 -216 -99 -50 -90 -42 -23 -18 -386 -64 135 -91
4600 -91 -1 106 65 -131 284 96 -150 77 -254 102 -335 -257 8 25 -135 2 -96 195 -29 -14 -31 -268 -163
4623 -163 -55 -50 -88 115 -186 -132 358 338 -22 -124 -158 -126 264 122 -115 -128 -107 4 -102 200 17 -237 149
4646 149 147 156 5 -360 -90 86 48 195 -257 -61 -112 344 137 165 -152 127 -155 86 276 139 237 -100 283
4669 283 189 17 155 52 67 -66 -124 253 316 -57 -228 -67 149 35 -92 179 -61 -108 45 30 -98 266
4691 266 -108 -7 -13 -326 169 -50 99 -97 -18 124 -234 -56 71 -94 290 355 95 90 230 -8 118 66
4713 66 79 192 -13 -97 -55 34 190 -223 12 -24 -283 -112 -10 -30 -152 44 -153 -65 12 -197 -171 -167 157 1
4737 1 172 6 -276 -61 97 102 -21 70 -74 -76 -81 18 -140 -55 46 90 89 44 -17 6 -76 -154 -321 46 122 141 101
4764 101 -191 130 -255 -49 -42 -96 -118 107 53 -31 -116 53 5 109 2 158 -46 74 24 -38 104 -79 103
4787 103 52 105 -72 -2 -210 -157 -46 -100 -128 32 60 133 43 30 -159 -19 -215 74 -88 -43 -130 279 31 -35
4811 -35 113 -65 -66 -329 -201 79 -38 185 59 -155 -62 127 84 20 45 -174 248 -174 -118 -26 27 -51 -24 147
4835 147 -110 -362 -129 113 -57 -72 -93 -166 82 219 -169 274 303 -124 -83 143 120 -7 173 65 -7 -149
4857 -149 127 305 257 264 40 276 -156 -183 100 260 -96 367 40 33 163 -126 136 -157 261 214 208 -27 197
4880 197 -18 -25 84 121 80 104 -4 -375 -118 85 239 -48 -115 65 99 -37 80 -61 -77 166 -292 255 19
4903 19 -163 -296 153 -127 -62 -110 43 8 -4 66 -208 -20 -150 -51 111 -10 -232 -20 151 -72 -34 -151 -72
4926 -72 -177 -383 149 54 -251 43 62 -131 -508 -49 -19 -33 10 67 68 -179 -4 26 136 -12 -66 -35 -204 52
4950 52 -326 -233 -121 -3 28 30 62 131 -265 48 -83 -199 12 102 165 -270 196 48 26 -79 93 51 -12 60
4974 60 138 219 13 47 86 -87 63 332 -127 267 -34 11 -133 74 117 283 94 70 558 112 165 206 -52
4997 -52 232 216 166 106 34 -107 296 219 62 -106 226 -63 157 47 -126 231 -348 12 -224 232 -67 48
5019 48 -60 124 -219 -124 -53 200 -87 340 -223 -22 34 90 43 124 -115 -206 214 -453 -29 -203 129 105 169
5042 169 131 -110 187 21 -90 -13 91 36 -12 221 -279 -69 -142 16 -86 -97 71 131 -52 69 64 18 140
5065 140 261 -259 48 82 54 -177 38 211 -35 -25 -128 24 -74 -77 159 122 126 11 -18 -110 -62 -119 214 -353
5089 -353 -107 -276 -54 -94 -231 -379 -130 106 149 35 -136 -224 -35 -180 31 -192 -135 -145 -105 -92 -121 -12 -81
5112 -81 -34 -167 221 -199 -79 -267 -116 -118 -8 101 -114 71 77 -115 -90 120 57 -221 24 -98 102 -48 109
5135 109 152 58 176 80 316 -58 54 223 144 121 123 -106 -65 52 133 279 207 -45 135 115 334 12 92 -181
5159 -181 89 121 -5 591 157 77 -45 136 123 259 328 250 100 14 13 -152 151 86 -9 204 39 -78 184
5182 184 208 -87 47 -100 -83 153 134 -141 -159 -80 113 226 -21 51 62 129 -19 11 12 -74 -63 -91 38 -186 -117
5207 -117 65 -260 -112 -166 177 -35 -172 62 111 -133 -150 37 -199 110 -392 -106 105 -82 -303 -47 -72
5228 -72 -289 -107 243 -105 -76 150 -284 -69 33 112 -174 134 58 -226 -82 -214 6 -102 -129 -53 -38 -108 43
5251 43 -37 -198 -127 -343 -255 -103 188 74 -140 -12 31 213 181 -92 58 -82 -603 -121 164 -138 -167 144
5273 144 -116 0 -27 -50 -278 214 -181 -8 -147 149 201 -108 -115 -67 -11 251 -293 -80 15 -354 184 -42 94
5296 94 -119 333 245 -101 -164 -26 -5 -84 -63 -160 146 -126 40 -140 -12 207 -98 -13 116 -172 -128 -11 62
5319 62 286 67 234 -1 138 -30 -120 -15 -44 28 -99 -90 11 -98 128 102 436 188 -2 -92 193 127 160
5342 160 206 -175 34 114 124 55 167 -64 -223 70 171 128 79 8 194 137 341 -277 10 203 -89 -172 50
5365 50 -133 64 234 -199 -173 50 292 -25 43 142 -82 45 21 -137 -10 -68 -4 161 -138 167 196 -328 -43
5388 -43 27 -314 39 76 -168 -114 9 -53 48 -91 -298 -33 36 -108 -43 -112 -278 -167 -147 -124 -299 -231 -34 -108
5412 -108 -267 -151 -44 -85 238 -197 5 -241 232 -159 -167 82 -118 202 -42 -12 -19 154 109 258 -166 203
5434 203 96 -82 -96 -257 -77 180 -266 -20 -39 -70 29 31 82 146 276 85 -57 -2 252 194 206 198 16 148
5458 148 -41 -8 -29 236 -61 -459 119 11 -53 -238 182 -42 -137 105 -12 151 -33 -137 7 -248 175
5479 175 -285 43 -97 341 1 -83 -132 -133 221 -103 -102 -92 131 -33 -71 24 81 13 103 -187 -11 -98 65 174
5503 174 3 -38 -281 172 -145 62 251 -83 28 -30 -103 107 -130 -7 -25 -88 235 -68 -78 -68 78 1 -42
5526 -42 -166 45 139 -48 55 -39 -76 -155 -95 51 -120 -63 97 114 39 -149 52 189 93 117 -55 114 -55 -286
5550 -286 -124 -271 -119 -2 -235 197 -125 94 -255 -172 31 334 -144 37 -385 -239 -6 -41 -317 -160 -3
5571 -3 -185 -52 71 -133 13 165 171 -93 -41 324 -14 -20 -61 130 139 -162 -206 -206 110 -94 149 -44 30 311 -145
5596 -145 -150 -55 -111 125 -36 -87 -164 56 -158 -63 -158 -97 88 -121 -287 -185 -7 -169 -8 -192 -341 -221 -8
5619 -8 -104 144 -46 -7 -17 -55 -314 50 117 -304 -118 73 42 14 7 -33 -141 225 -70 -17 -124 191 261 152 13
5644 13 -93 337 -241 -25 235 85 352 -65 29 102 -192 -82 265 69 20 46 37 -80 -68 218 27 157 56
5667 56 57 -74 -24 -313 56 -9 -6 -131 111 81 203 -45 7 212 -73 -37 70 4 24 23 57 35 -65 98 -12
5692 -12 169 155 64 106 176 160 5 -78 11 111 -272 37 -74 250 -114 -25 -99 8 -174 9 19 310 -97 -268
5716 -268 11 40 133 -65 -276 10 141 -157 85 120 65 126 -36 216 -66 -195 -87 24 -185 -35 -141 85
5738 85 75 211 43 -113 -13 -336 -106 151 156 22 -177 -18 -220 -34 75 -11 44 10 197 -127 -331 -14
5760 -14 -97 129 -188 -153 -48 22 -87 27 50 20 -45 -100 150 157 100 -49 -52 113 -90 -62 -104 225 -136 -104 -97 -61
5786 -61 -109 -8 223 202 -196 -323 38 -73 100 -3 -102 -314 -167 96 81 33 -25 -28 -47 164 415 26 -65 -141
5810 -141 26 260 9 29 -210 314 94 -4 448 42 30 116 20 73 43 56 222 210 132 -106 -11 357 179 139
5834 139 42 65 89 -2 135 213 -243 89 -25 272 183 -44 54 212 147 -79 -5 136 151 55 394 35 196 -62
5858 -62 -125 -19 225 9 -235 236 -119 98 -251 141 -394 1 89 229 16 -101 -9 191 -141 -235 11 -21
5880 -21 -109 -149 -29 -91 -280 198 142 -21 122 118 45 -179 -152 -6 -117 -93 -189 -234 -249 75 -161 -76 -54 -209 -99
5905 -99 -257 -62 -212 34 114 78 -145 7 186 -266 -39 -29 -295 -23 -102 130 -80 -148 -161 -20 -72 28 52
5928 52 150 51 212 -109 111 191 227 170 155 -159 -82 -234 104 -11 -251 256 -101 171 -82 -110 -114 52 -157 -117
5952 -117 69 -7 -132 -9 -130 114 -75 -37 -212 -195 -43 -22 30 -58 -157 66 -94 -4 72 -120 -300 159 238
5975 238 -240 83 -33 161 -132 193 -325 -185 114 133 239 180 -67 23 -79 -144 110 -55 29 167 57 14
5997 14 -8 -37 158 -48 -122 164 283 188 166 -76 56 -196 34 289 37 56 -44 193 21 250 -145 29
6019 29 417 141 -139 -6 -178 62 99 137 161 9 166 -272 73 298 48 -270 -95 -103 -315 221 51 29
6041 29 366 -35 21 -71 -63 -160 85 -376 46 -72 24 176 162 22 248 -60 -216 -7 -95 -70 -82 -100 35 -60
6065 -60 -104 -180 -36 -81 -188 -195 -21 92 -109 49 95 -55 -81 -195 118 -258 -341 -34 -88 -341 25 3 170 -24
6089 -24 -135 -69 34 166 -93 -39 -168 -26 131 -48 -6 24 35 332 -170 -13 61 -65 -70 90 -78 395 -62
6112 -62 36 13 -348 -151 24 31 -92 75 182 -6 -64 -356 -17 -42 148 -19 2 55 216 167 -133 -89 378 -117
6136 -117 126 83 -253 399 -68 -1 68 -207 207 -120 -124 76 247 20 87 127 -113 -31 305 111 -85 308 199
6159 199 7 80 -37 185 -11 26 331 180 21 18 -42 144 117 -156 1 169 39 103 108 7 58 145 9 6
6183 6 -41 -184 -78 -117 -23 -10 16 -9 -16 -96 82 90 -45 52 -73 196 147 -280 19 -227 39 -117 -114 227 71 -375
6209 -375 -194 265 233 -61 -97 -245 79 53 -84 47 -27 -114 -58 -56 8 53 51 -17 -138 -159 136 -348 30 -143 -27
6234 -27 -210 -37 163 -153 -101 -26 73 104 -363 -92 -294 61 28 -7 -80 179 -31 31 47 -86 -29 -95 31 73
6258 73 -57 26 176 -174 -225 -214 145 15 -203 -102 -255 -42 229 3 -61 -7 -189 86 204 111 -21 -65 75
6281 75 -230 9 285 49 331 96 -68 12 -54 -76 -88 103 -61 100 -99 158 -24 170 19 -44 166 151
6303 151 -75 94 -70 84 290 -100 17 220 61 115 73 44 144 47 -234 -24 345 126 -37 -67 227 -23
6325 -23 54 211 87 -52 55 212 229 -78 189 -60 309 34 -77 -100 -29 -8 -254 -15 103 60 -21 -7 -41
6348 -41 -128 88 -95 29 170 59 34 -200 -15 113 -69 -86 -186 93 9 78 -39 2 -56 -115 -37 -55 -68 -85
6372 -85 12 7 136 -199 -30 -220 -45 -37 -226 -14 -58 -53 83 -143 -352 22 2 -260 66 290 -113 45 -149
6395 -149 -79 -164 107 -135 -58 -32 -168 194 118 -25 75 -93 -30 97 -21 174 -133 72 -10 173 -131 138
6417 138 234 -188 -165 2 277 299 199 -98 54 177 -160 68 239 -121 59 266 296 -296 -95 -59 -237 -308
6439 -308 -106 321 -53 -35 20 218 -84 51 160 138 -13 -24 53 137 -84 -82 266 31 -67 39 -28 -6 94 48
6463 48 -165 -76 154 321 104 115 -143 -75 -150 -212 138 39 53 2 -20 -45 105 157 35 101 -244 407 241 176 19
6488 19 -81 61 176 36 160 -23 109 -218 -28 -32 80 106 158 287 179 64 60 127 -159 -28 123 -128 85
6511 85 15 -2 6 77 235 73 -226 -272 48 -35 32 24 -182 -38 70 -119 69 -204 177 -88 168 -187 44 -5
6535 -5 -35 -53 -22 19 -305 62 -145 142 327 44 164 -63 -155 -46 -62 -71 11 134 56 175 -21 -199 -156 8
6559 8 237 -257 -150 123 -55 35 132 40 26 -13 -216 28 -162 153 295 -62 -150 213 15 -44 -196 52 -16
6582 -16 -151 -54 101 57 67 -17 115 41 115 80 -158 -7 -67 175 478 211 0 179 278 -374 265 79 275
6605 275 -35 93 -8 -26 275 260 107 -309 167 124 210 -60 -175 141 139 0 -30 7 -24 -6 -308 48 -64
6628 -64 54 -44 86 63 -156 -158 -69 -36 35 66 -78 67 -101 -307 -80 -25 64 -75 -53 342 122 -91 324 161
6652 161 61 180 279 -152 -223 24 84 143 15 -54 27 3 -9 -45 78 104 131 -234 282 74 -1 -136 -116 6
6676 6 197 125 -40 -15 -41 -183 -69 44 -270 154 -34 -167 -275 183 252 51 -109 43 -80 -152 25 -85
6698 -85 49 243 2 133 19 -156 4 -90 -69 47 -161 -37 -244 -125 -103 38 27 -129 168 -232 -186 201
6720 201 -17 -91 33 -193 -206 57 -174 -107 -144 -205 -158 28 -232 108 -110 130 53 90 86 129 103 140 -217 -58
6744 -58 -174 30 85 -49 -16 -21 -26 -33 -133 111 -36 47 -23 322 -145 125 87 138 42 13 1 -124 -36 -56 28 111 -100
6771 -100 146 -232 -153 51 -55 -156 -59 -164 59 -49 10 173 40 -336 -61 183 55 227 301 -255 208
6792 208 147 -278 -25 52 245 -16 -199 -40 142 -151 278 137 -117 7 32 -34 127 110 -155 150 228 -96
6814 -96 11 134 8 -46 193 50 109 -42 153 -31 -114 38 32 115 -127 -92 -219 138 -102 19 -71 -144 157
6837 157 244 -29 3 -136 50 11 -189 -129 -51 1 46 19 68 -103 -46 23 -102 47 -130 -9 -81 -149 241 155 287
6862 287 90 -171 -163 -268 -7 174 -134 56 -191 -99 315 -144 78 109 166 -7 36 -115 -257 28 -111 131
6884 131 -193 77 203 64 -178 48 65 142 -74 21 113 165 0 -90 244 -21 -207 -165 54 -18 67 39 -15 55
6908 55 -133 -10 -10 302 11 -196 -120 -102 -27 9 88 -262 20 -63 -360 49 -135 -171 -62 11 -16 86 18 36 -216
6933 -216 -24 95 -81 103 40 -196 -10 375 189 -91 -10 233 13 -36 255 -54 -280 1 -57 316 -183
6954 -183 -187 38 -267 149 238 -62 319 -19 -9 -84 196 -74 172 4 -84 78 -157 51 -136 17 121 75
6976 75 68 92 44 -33 -170 189 376 -188 -49 226 315 -256 -316 230 54 -181 -6 25 82 -48 121 50 -37 -139
7000 -139 24 -90 296 138 -102 -241 -162 90 -50 -27 -278 5 211 -288 -166 56 -146 129 -100 -139 63
7021 63 67 -88 28 10 21 -113 -174 -68 97 186 -17 -38 -106 -66 37 -11 144 -283 -297 183 12 -171 -188 -20
7045 -20 -190 127 -71 -240 -288 -137 -116 -265 -165 -66 -78 433 87 64 -115 -139 86 -22 121 -49 -134 -29 -172
7068 -172 -186 9 -294 -248 24 -120 -107 -3 -7 31 -140 45 73 204 -18 121 -289 194 56 -23 -177 -203 100
7091 100 -145 206 73 34 -245 -112 -62 45 11 116 50 10 120 277 30 196 -188 184 15 -251 4 -15
7113 -15 -55 130 -51 113 -140 -77 167 -67 113 -19 171 55 -128 67 39 -38 88 -1 -193 109 -3 -103
7135 -103 221 54 208 196 257 -268 -107 -126 195 -173 -11 192 57 125 77 0 -126 -9 -104 -14 27 162 -245
7158 -245 -101 4 -22 338 19 -241 -60 -44 -60 -68 51 212 -127 -19 -130 -68 220 -52 -56 157 -131 157 57
7181 57 11 171 -133 -81 43 263 -107 -52 94 31 -107 123 146 -136 110 36 -22 191 147 -102 -259 -35 55
7204 55 -211 -30 -52 -230 59 -132 77 250 83 -152 -188 -71 106 -122 29 210 -149 -13 88 315 93
7225 93 -33 145 19 130 -19 265 -20 -26 -152 149 -140 99 85 57 -109 -161 -98 -426 75 286 -85 -275
7247 -275 124 47 175 -166 -191 94 -64 30 -5 -101 -60 -22 30 99 23 -15 147 -35 -64 -73 70 121 143 -205 -69
7272 -69 118 240 176 10 -248 -3 154 -63 94 -115 83 -110 -31 63 234 24 29 68 65 76 144 132 92 122 -11
7297 -11 -91 -9 99 -10 45 106 443 130 -58 -139 -62 213 32 14 36 -112 225 227 -43 1 0 -186 64 -178 -128
7322 -128 102 -33 -58 212 -45 -170 56 85 -81 77 -124 27 17 143 31 -31 35 -43 191 -57 212 -121
7344 -121 135 -158 -86 -86 -134 34 -89 53 180 276 97 27 167 -74 -30 -15 -191 -288 -176 57 110 -40 -84 26
7368 26 227 36 -27 -66 104 57 48 207 -84 206 7 121 -57 108 -102 -63 -59 61 7 -47 -146 82 -278 57
7392 57 238 -129 -173 -7 -171 -16 23 52 56 -216 180 -127 -39 48 183 144 -103 -304 70 15 -61 -156 18 84
7416 84 -200 -23 69 -47 51 73 -132 263 109 -154 94 210 136 140 41 3 206 25 -171 6 -7 -227 -71
7439 -71 207 -84 66 -119 -56 145 179 -5 85 163 -277 15 508 64 -40 207 75 319 383 -120 -26 -64 -50
7462 -50 238 -34 -9 -38 -33 15 295 202 76 44 -148 169 -15 -3 97 126 17 50 54 -127 59 117 -165 -18 -69
7487 -69 -104 -59 248 87 236 206 370 124 -144 267 -61 -61 185 -83 56 -192 -43 190 -223 136 -3 -28
7509 -28 78 72 66 6 109 -173 -305 -57 69 -106 245 74 -178 -252 54 56 -111 102 -113 -2 -89 -40 99 145
7533 145 -113 -47 46 -84 107 33 -229 32 -15 184 89 -49 206 -373 25 146 -76 109 -70 -108 196 108
7555 108 25 -191 55 -76 -22 -243 297 84 -75 -85 -55 -96 114 -119 -330 -14 -20 118 -96 -14 245 -124 117
7578 117 101 39 158 -91 -79 -8 -146 -3 -312 311 100 -243 81 155 -21 -116 120 119 16 -19 193 -193 72
7601 72 -224 -59 -1 100 -78 141 -285 24 96 142 -134 8 194 9 60 137 24 -103 -230 18 92 -82
7623 -82 39 55 62 -7 -81 24 155 295 182 -70 39 -117 36 95 121 270 -144 231 72 94 168 208 191 -19
7647 -19 -208 198 128 -81 188 -47 81 48 134 160 -237 266 125 -5 -97 69 48 318 6 198 271 -15 42
7670 42 53 213 53 122 158 -158 110 64 298 8 61 44 -16 -15 74 -273 -103 102 -57 186 89 -62 -63 -153 -79
7695 -79 193 192 -131 -116 36 8 304 193 -158 -87 17 -118 109 -189 -24 216 26 -218 83 252 -54 -92
7717 -92 4 -182 2 -126 -95 161 -93 -113 -126 -142 -170 -60 -232 99 -188 -60 48 155 -226 -233 223 -119 116
7740 116 115 135 -176 250 -25 -71 49 19 148 -52 8 48 -142 30 25 -270 -193 -97 37 105 71 147 115 -60 189
7765 189 -162 -208 -12 -88 -118 -37 22 -169 -140 24 -66 -33 98 121 -76 -16 1 219 222 173 3 -20 -10 151 227 -5
7791 -5 51 -103 -19 201 -46 -79 -140 54 -55 111 227 123 14 230 -92 248 -57 113 156 83 -162 -6 -94
7814 -94 124 -155 -28 -36 -180 18 19 137 65 125 38 22 -36 -68 -31 -194 192 -27 112 83 -153 4 -106 -207
7838 -207 -68 -129 165 29 -5 -77 118 112 -5 -197 -61 34 26 120 -5 62 26 56 46 -43 37 -103 -123 -50 0 57
7864 57 -125 38 98 68 -17 -192 -125 20 -157 84 -70 150 65 -33 41 185 34 220 130 57 -69 56 54 -93
7888 -93 40 -58 -120 -215 -105 -262 103 75 31 92 71 -208 -141 177 147 -141 -72 -206 -62 -64 92 162 -211 118 98
7913 98 12 201 132 -36 140 -28 -254 100 -119 176 -136 17 -81 -28 -102 157 -40 69 -15 49 5 -198 93
7936 93 -76 110 203 -211 -23 -139 113 -115 -68 79 128 9 85 73 -90 283 86 261 58 -77 -14 -279
7958 -279 126 -174 253 88 216 193 -183 -9 -71 42 120 72 96 67 161 163 -283 -21 345 352 -96 78 84 -99
7982 -99 355 -14 -69 45 207 -5 206 156 272 140 12 -54 2 50 -24 -153 -43 -88 84 -198 195 -61 106
8005 106 -85 14 -75 -26 -102 -88 -26 -131 273 -58 -174 63 15 35 72 377 86 441 -37 -164 12 63 127 30
8029 30 -71 134 281 95 159 -190 -87 236 -100 -133 79 -219 -152 -24 -134 -160 93 -36 -48 -85 16 97 -200
8052 -200 145 -295 -220 177 -47 193 -18 136 365 -49 263 1 100 -62 -6 87 -6 59 -119 149 62 -18 -40
8075 -40 -209 30 15 28 69 251 167 -9 -80 -51 -173 -18 230 149 -54 15 -162 -23 -64 -95 51 70 -67 33
8099 33 169 234 -46 -3 -260 59 117 -103 -20 28 248 -245 196 -98 -100 246 -113 -36 -122 185 -112 89 -323
8122 -323 -55 -208 -119 78 -104 -8 35 -280 201 191 -218 102 65 -142 -229 -189 118 -283 107 -164 39 213
8144 213 -50 -50 -21 -73 24 98 212 -56 -57 -310 37 2 -14 -405 -93 109 -72 145 -30 -74 -89 -231 126 -59
8168 -59 171 36 -204 -154 133 13 -50 -12 93 -129 6 118 -10 -54 57 -223 -206 46 24 3 -290 -99 135
8191A35
$$ Imaginary data points
##PAGE= N=2
##DATA TABLE= (X++(I..I)), XYDATA
0 0 0 0 0 0 0 0 0 0 0 0 0 0 8 -8 8 -8 8 -15 16 -16 24 -24 32 -32 40 -48 56 -64 72 -82 95 -106 120 -136 154
35 154 -173 194 -217 241 -269 297 -330 366 -406 446 -494 543 -600 661 -728 801 -882 976
53 976 -1076 1191 -1322 1471 -1646 1850 -2095 2396 -2770 3256 -3907 4831 -6238 8611 -13341
68 -13341 26171 -126585 -329852 177412 160733 -212315 -47055 159921 -65281 -86140 75821
79 75821 1919 -58489 34460 -12541 -62608 23176 27453 -44065 -15133 -3077 -34424 1488
91 1488 15671 -44575 -21738 23971 -33565 -35446 56955 20775 -69975 -17537 35423 -15485 -27627
104 -27627 -6804 -13860 6080 4133 -35083 5774 32329 -43441 -30474 48998 -6653 -44082
116 -44082 38873 17107 -60262 7743 55489 -20196 -30517 17645 50 -12129 10766 -3996
128 -3996 -14882 13379 14856 -8842 -1420 17681 8676 -8076 -2472 12442 9244 -3910 -1534
141 -1534 8189 4140 -3418 2960 11127 975 -9337 1921 15227 11764 3779 -560 4777 17128
155 17128 7663 -13088 -2789 12456 117 -6672 1181 3642 13065 13222 -9377 -6239 16489 6739
169 6739 -6172 2095 -445 3107 18307 2012 -13402 8503 6973 -14097 3468 13951 -10277
182 -10277 -3144 17312 -1768 -7674 16046 7083 -10963 6141 8248 -10794 2877 16042 -6538
195 -6538 -9515 12637 7215 -6219 -1045 -4328 -2067 14907 5424 -9986 8914 14303 -4849 -408
209 -408 5175 -4972 6939 8048 -19652 -6872 22958 -3223 -18968 15896 16010 -11561 892
222 892 12092 -7517 -4690 9339 -880 -3579 6175 -3998 -10508 5327 2313 -14189 -3305
235 -3305 10861 147 -5899 1380 -24 1646 5602 -8505 -12483 4842 165 -16553 -6256 4664
249 4664 -1618 -980 -2936 -9052 824 687 -14268 -4640 6369 -8922 -6035 9135 -6791 -16313
263 -16313 1462 29 -13081 -5386 -1486 -7316 -1360 153 -8496 -3057 4084 -5224 -8668 -1686
277 -1686 -1661 -4229 -1531 -1901 -4564 -656 -288 -6653 -4294 -144 -5912 -3519 7781 -924 -8471 6432
293 6432 8890 -6132 -3865 3457 -471 2286 301 -8831 2838 13439 -5132 -8232 11113 6939
307 6939 -5031 4576 6592 -524 4177 4968 -1499 3879 7964 -1030 -299 8093 3480 -3692 2592
322 2592 9199 3660 -321 4898 7405 5737 3073 -1415 857 9725 4637 -5871 3448 11043 -85
337 -85 -2762 6228 4307 810 2550 -1189 -309 6892 2955 -1420 5245 5150 -2157 961 4370 -3097
353 -3097 -5392 2162 4282 -805 -514 2075 -1183 -1886 2920 732 -3540 2808 3237 -5825 -1512 5683
369 5683 -948 -5204 -824 -2011 -2010 1262 -3539 -4227 2947 802 -2163 4178 1387 -8224 -2832 4168
385 4168 -2410 -4822 847 -172 -3453 -967 148 -1998 -393 31 -3273 -973 3541 -896 -4561
400 -4561 315 386 -2770 1922 1452 -6732 -2882 2947 -1901 -1349 3086 -2333 -3764 3321 205 -4141
416 -4141 1540 1089 -4931 -1364 3202 -881 -2425 63 -1061 -2236 659 630 -3044 -3026 93 125 -567
433 -567 974 455 -2252 -1250 -125 -931 -607 -1243 -3349 -835 1452 -1789 -1072 2067 -2320 -4355 1378
450 1378 1925 -2222 -663 867 -2432 -1242 3359 -56 -5327 -1616 2235 -1895 -2474 2843 755 -3289
466 -3289 -69 1682 -463 1415 549 -4397 88 4239 -1466 -1010 3513 -1806 -3026 4774 1577 -3620
482 -3620 2349 2175 -4201 2677 7050 -1990 -3518 3734 2078 -1310 3127 2700 -1878 672 2529 275
498 275 2585 3396 -1978 -483 5680 1386 -1778 4425 1613 -3880 4666 6923 -3178 -700 5746
513 5746 -1669 -1951 6631 1915 -3441 2843 2749 -1282 3004 3546 -2010 534 3394 -475 490 2582
529 2582 -1788 -1135 4089 953 -2233 2190 1683 -3230 -237 3911 -44 -2248 1408 428 -1315 1178
545 1178 -25 -2519 511 952 -2636 191 1944 -2968 -1752 2609 -738 -2828 877 -385 -3110
560 -3110 34 687 -2029 -474 14 -1950 -833 -497 -2183 -542 -353 -2078 -390 353 -2242 -1462 625
577 625 -1542 -2020 89 -344 -2315 -748 676 -1009 -1747 -1153 -153 -275 -990 -1793 -441 343 -1110
594 -1110 -1499 523 -112 -2068 342 178 -2139 -415 1222 -1882 -1561 1600 -86 -1264 420 -146
610 -146 -1088 1107 58 -1956 1300 978 -2206 673 1987 -1768 -1083 2187 -103 -1202 1439 -104
626 -104 -1256 1370 803 -1831 733 1714 -1452 -1110 1623 127 -939 1281 458 -1515 1209 1770 -1815
643 -1815 -693 1813 -5 -703 540 -263 -27 1307 -1087 -796 2859 157 -2754 1549 1924 -2177
659 -2177 -57 2403 -931 -992 1892 -273 -1302 1346 587 -1174 1016 1299 -484 69 1003 168 584
676 584 596 -458 955 1524 -876 -1049 1521 1009 -721 776 775 -605 779 1439 -273 448 1499 -232
694 -232 913 2058 -1591 -640 3750 520 -2740 2251 2981 -1419 -167 1920 370 1047 1500 -637
710 -637 845 1785 -1079 159 2778 -784 -1102 2384 911 -1507 1608 1008 -1789 1440 2537 -2274
726 -2274 -1062 3409 424 -2963 646 2139 -788 -517 -351 -665 1590 987 -3832 -481 4488 -2242
742 -2242 -4332 3009 1360 -4086 442 2146 -3230 -1729 1515 -2228 -1453 1466 -2517 -2628 1784 -412
758 -412 -3608 -140 563 -2287 -1255 -632 -2132 82 96 -3508 -2712 1898 -249 -3816 -1569 419 -985
775 -985 -1155 -457 -1685 -943 30 -1669 -1580 745 -1468 -2584 790 -451 -3215 436 1428 -2707 -1802
792 -1802 1535 -215 -949 594 -765 -1215 1127 1296 -896 -512 139 -389 -216 655 363 -970 -291 1603
810 1603 827 -703 481 1692 184 -276 1274 1206 1307 950 -856 -326 3095 1826 -2042 -1025 2373
827 2373 1454 -36 818 1145 937 1064 556 389 2027 1199 -1712 81 2962 367 -913 1670 634
844 634 -1126 1631 1683 -793 989 1266 -1660 1238 4231 -1079 -2825 1560 1556 -422 667 -465 -502
861 -502 2382 966 -2212 836 2691 -1158 -1333 1527 344 -103 1720 -863 -2637 1622 2934 -2039
877 -2039 -1824 2236 83 -1493 1494 329 -1070 1727 655 -1378 1661 1745 -2721 -221 3126 -1388
893 -1388 -1854 2359 692 -1747 518 221 -520 2297 831 -3209 166 3799 212 -2191 579 1251
909 1251 -651 -756 -694 -860 738 151 -2559 -269 3255 -157 -2570 810 438 -1714 235 1319 -1994
926 -1994 -1968 530 125 -531 -726 -2347 -1034 1151 -917 -2144 374 196 -1947 -797 -262 -1052 -1375
943 -1375 -485 -1724 -2303 -190 159 -2121 -1500 -108 -1534 -1367 657 -1667 -3777 244 1887 -1554
959 -1554 -2294 -815 -596 302 -789 -3550 -649 2219 -2048 -3700 1349 2199 -1687 -1946 951 1242 -353
976 -353 -803 -52 248 -319 -729 505 694 -563 -1389 455 2631 367 -1438 494 2389 2250 542
993 542 -576 843 3532 1042 -2576 606 3478 450 -1153 1865 3046 1935 362 140 2372 2557
1009 2557 -178 528 2521 934 238 2364 2851 -19 -567 1098 2358 1625 -50 210 2247 2233 1280
1026 1280 765 46 1172 1562 -135 -731 1535 2076 -493 -988 1318 1561 -388 -384 282 -816 14 2463
1044 2463 672 -1571 560 1163 -321 247 -809 -2235 488 1136 -2607 -689 2312 -939 -2260 1163
1060 1163 548 -1774 30 135 -1627 -549 439 -1013 -850 -787 -2109 -869 682 -697 -1975 -1003 423
1077 423 636 -189 -1277 -1080 1069 72 -2955 -1611 1265 -563 -2312 -910 -9 82 378 -749 -1842
1094 -1842 686 1041 -1788 -505 672 -1164 -613 1181 -1121 -1494 336 -821 -1582 84 -354 -1448
1110 -1448 461 774 -829 -656 235 128 -343 -1276 -1206 553 525 -855 -493 -165 -577 209 -676 -2733 -637
1129 -637 2387 -258 -2237 820 2314 -962 -811 267 -1372 -318 491 -2241 -1752 2256 -19 -2542
1145 -2542 1135 1410 -2005 592 1392 -1456 -41 1647 -1300 -95 2079 -1810 -1635 3065 438 -3158
1161 -3158 1340 1955 -964 1250 2061 -1445 892 3705 -1194 -2010 3341 1469 -2034 1053 1808 -199
1177 -199 2136 2264 -2267 784 4467 -989 -1553 4593 1013 -1959 3768 3365 -2642 1167 3729 -1521
1193 -1521 -309 2949 -403 48 3343 -177 -280 3969 1049 -2426 2307 2297 -1387 1849 3699 -1946
1209 -1946 -1269 3375 341 -2206 498 504 -1229 988 1513 -548 712 1654 -719 -906 837 -951 -1050
1226 -1050 501 -1861 -1918 2388 435 -3944 -708 2086 -1787 -2182 930 -375 -2018 -742 -243 -614
1242 -614 -1452 -2322 -1001 31 -1676 -2046 -216 -1075 -1782 -559 -984 -1127 121 -1619 -2625 -432 221
1259 221 -1106 -1734 -1517 -977 469 -533 -2541 -574 466 -1754 -2003 569 77 -1788 -259 568 -671
1276 -671 -441 506 -1649 -1116 734 -1195 -717 1527 -429 -1758 1584 1366 -1883 622 1682 -1703
1292 -1703 571 3088 -602 -1278 2197 404 -2020 707 362 -1288 851 974 -571 1531 2526 -808
1308 -808 485 1884 -718 -158 1921 -812 -1619 2525 1709 -2110 399 2643 -807 -569 1822 80
1324 80 -225 2108 525 -652 1851 626 -1813 1040 1615 -2083 99 2218 -706 -3 2370 -641
1340 -641 -930 2068 211 -1502 1142 1349 -1233 512 1367 -533 425 1030 -1280 -164 2199 -372
1356 -372 -1390 1291 1199 -523 935 1673 -69 25 1036 -135 -281 654 -54 -202 731 486 35 1111
1374 1111 326 -927 1275 1077 -843 629 1635 -213 -38 1121 -402 -999 311 -240 -554 514
1390 514 169 -31 976 407 -650 173 484 -1031 -747 42 -601 -899 100 -216 -678 -415 -659 -634 -323
1409 -323 -1031 -762 505 -278 -1613 -558 980 -1049 -1965 -193 -391 -1394 -502 -234 -1467 -910 -252
1426 -252 -1223 -1052 -563 -1062 -967 -867 -1016 294 164 -2192 -1189 771 -922 -2072 -116 -348 -2200 -807
1444 -807 809 -365 -1217 -43 172 -211 24 -66 -306 -1002 -632 -27 260 -215 -804 204 213 -160 207 433
1464 433 -317 -643 804 1085 264 148 506 -220 116 929 445 -648 324 1356 1135 351 927 1406 603
1483 603 -333 807 1759 679 -209 628 1121 1513 928 -66 577 1063 169 320 1186 871 210 978 1554
1502 1554 662 519 646 33 219 592 670 169 572 799 284 31 343 565 134 -374 71 940 320 -456
1522 -456 -343 677 -56 -535 78 -104 -1105 7 961 -448 -358 725 -16 -280 149 150 -301 56 -558
1541 -558 -726 206 -208 -692 -288 205 -422 -572 85 -180 -372 -71 84 -325 -268 -384 -268 -316 478 -116 -967
1562 -967 81 338 -612 -614 336 -10 -608 -345 -164 -458 50 -18 -756 -303 642 35 -714 -60 -54 -538 -480 185
1584 185 -493 -643 -156 93 -142 258 -490 -630 331 -146 -934 562 411 -1332 -803 243 -582 -375 255
1603 255 -803 -1103 375 215 -784 49 153 -716 -300 -61 -981 -738 421 -616 -1037 643 92 -757
1621 -757 -11 266 -1156 233 1022 -1125 -1119 895 19 -1099 344 220 -593 206 869 -569 168 890
1639 890 -645 58 1391 -322 -826 1217 537 -537 368 1038 -305 371 557 -286 792 1381 -124
1656 -124 -526 1110 822 53 408 582 611 1053 506 -90 485 1533 -411 -38 1203 1025 113 682 907
1675 907 59 584 839 -47 398 836 -41 476 980 185 -105 525 710 168 99 86 223 848 191 12 429
1696 429 145 -17 153 -118 -249 579 138 -70 61 299 -366 -52 -288 -620 -142 351 -74 -785 19 3
1716 3 -413 -74 -297 -366 140 108 -948 -365 392 -431 -1102 219 -294 -948 -428 232 -930 -611 -34 -649
1736 -649 -589 142 -659 -905 417 -417 -1221 153 171 -487 -446 -194 -541 43 583 -1103 -270 693 -408 -971
1756 -971 311 66 -684 49 296 -618 5 625 -587 -370 652 -109 -411 457 -80 -1022 284 500 -434
1775 -434 169 564 -570 91 898 -289 -668 524 206 -695 241 272 -23 246 -30 -56 367 612 -529
1794 -529 -325 460 -154 95 408 -89 -251 530 348 -408 254 400 -26 249 126 -130 287 539 -477 -193
1814 -193 425 -196 -465 801 385 -804 125 858 -130 -321 98 -50 278 108 -90 -79 829 221 -190 116
1834 116 429 71 446 -3 -179 516 896 -206 -264 932 420 -214 476 473 110 318 285 -159 331 278 -373
1855 -373 547 911 -409 -39 1091 191 -445 812 809 -40 478 268 -171 69 721 -7 -64 143 -342 148
1875 148 517 -176 -761 688 265 -469 -17 597 -424 -129 595 179 -105 497 95 -522 -114 251 -125
1894 -125 -615 -263 -30 276 -136 -605 -59 105 -767 -531 368 107 -1002 -382 162 -145 -546 -376 -361 -295
1914 -295 -474 -269 -185 53 -460 -636 -174 -127 -489 -417 -581 -691 18 23 -1292 -573 181 -281 -292 -274 -27 -80
1936 -80 -483 -482 146 -112 -533 -258 281 -393 -446 133 57 -382 -48 353 62 -132 231 -181 -174 68 64 -302 139
1959 139 -220 87 336 -183 -672 310 632 -371 111 489 26 -78 782 254 -343 640 462 -429 170 743
1979 743 180 150 490 268 175 553 95 21 836 284 -462 490 594 -495 -158 651 30 -83 176 -70 237
2000 237 289 235 -234 398 493 -397 -40 671 164 -118 196 48 -30 421 71 -342 -22 564 93 -106 264
2021 264 266 84 87 38 13 204 109 -44 -26 -18 -368 145 7 -448 99 409 102 -415 374 90 -317 357 408 -175
2045 -175 -301 382 79 -162 -42 -264 20 222 -129 -345 226 625 41 -349 91 194 -3 -125 -138 11
2065 11 -181 1 196 -188 91 91 -192 -13 262 -82 -212 51 -221 41 92 -112 -338 37 -366 -635 -117
2086 -117 144 -298 -685 304 -54 -421 -200 -14 -353 -100 -402 -377 -297 -23 -124 -149 -408 -105 -98 -278 -624 -413
2108 -413 -73 -341 -659 76 -70 -533 -258 29 -131 -589 -287 -280 -698 -343 -388 51 -173 -305 -501 -75 53
2129 53 -32 -70 -128 -123 -49 273 106 -317 -151 188 136 -479 -271 301 3 -31 335 576 106 120 304 193 -55
2152 -55 523 422 -2 40 733 168 258 138 495 149 301 679 539 624 501 -85 550 477 120 234 361 77
2174 77 154 506 354 228 446 369 140 552 170 -158 123 340 476 441 342 30 299 512 -143 -67 366 -206
2196 -206 -162 25 525 252 -54 43 -464 -29 456 -38 -279 -142 -171 -229 445 87 -545 -158 363 -186 -276 178
2218 178 -201 -390 167 -185 -315 -69 -210 -655 -305 -186 -267 128 -51 -306 -180 310 -83 -491 -29 -266
2238 -266 -434 104 -305 -127 -72 -89 -382 -160 -134 -337 -93 -264 -510 -130 456 -704 -474 96 253 -300 -72
2259 -72 -17 -559 -139 121 -256 -83 339 -304 -405 258 -155 -40 404 -436 -275 298 195 -589 -75 121 -628
2280 -628 -592 432 -370 -565 426 241 -246 342 483 -629 -16 123 -439 98 98 -580 -339 254 -418 -412 373
2301 373 -202 -671 54 258 -553 76 348 -141 -243 329 -57 -257 267 -50 -269 485 73 -227 656 574
2321 574 -324 118 772 -187 -208 628 15 -80 452 340 -352 367 136 -6 143 209 20 385 776 430 158
2342 158 816 402 50 676 685 47 473 358 -179 555 785 -26 74 378 302 27 594 420 -41 508 258
2363 258 115 354 303 -107 272 432 -133 92 466 -102 -63 434 93 108 162 -36 -64 417 -91 -710 152 -99
2385 -99 -635 163 191 -494 -262 -38 -118 -447 62 -126 -457 -140 60 -663 -10 -486 -642 -234 -268 -832 -607
2406 -607 -43 -576 -481 178 -470 -1047 244 100 -867 -233 -261 -705 -476 -13 -114 -697 105 -670 -369 169
2426 169 -596 -383 447 16 -823 -62 370 -818 -343 451 -430 -213 270 -149 -566 429 24 -555 185 225
2446 225 -19 162 413 -287 159 679 72 -403 668 -74 -303 330 392 79 -34 424 -100 135 435 -64
2466 -64 304 407 -178 -109 367 185 -241 462 501 -265 299 519 14 -64 480 375 238 471 3 134 360
2487 360 -31 -328 354 190 -383 38 556 61 -139 412 -221 280 382 44 -102 564 164 70 -62 -97 275
2508 275 -16 161 -536 470 408 -298 -27 642 -38 -28 172 136 25 205 47 289 346 128 -352 369 437
2529 437 -413 457 387 8 -34 686 113 -341 444 119 -210 122 469 -111 -279 453 78 202 26 -139 -319
2550 -319 196 -283 -268 119 -99 -353 204 -24 -301 -326 189 -161 -544 313 24 -127 -64 -116 -493 -105 -84 -191
2572 -191 -86 -273 -837 -281 -135 -538 -978 -233 -295 -550 -161 59 -400 -461 -50 -296 -302 -49 -390 -449 -352 -405
2594 -405 -275 -209 -596 -328 213 -66 -362 -335 88 -434 -407 33 -85 -659 -367 154 -74 -124 -83 -54 -105 16
2616 16 29 -167 -126 -302 57 260 96 308 238 -126 -139 277 637 -57 -36 204 328 568 383 197 182 126 223
2639 223 322 190 428 670 134 17 145 391 242 18 155 801 330 189 271 451 308 -206 369 603 108
2660 108 -83 -83 481 362 -147 93 378 417 201 -73 163 165 152 -112 199 384 290 151 -29 183 287 94
2682 94 -296 -184 160 199 -121 94 246 333 -193 27 124 -31 -265 123 7 -2 -1 -27 -134 194 -122 -288 -212
2705 -212 -38 -335 -129 -197 -123 -50 29 -244 -517 -139 283 -266 -481 -136 70 -63 -88 -44 -190 -83 -136 -303
2727 -303 12 58 -218 -54 -185 145 182 -138 -53 -217 173 -9 -656 -49 -8 -237 -227 -139 115 -325 -278 120
2749 120 200 -328 -217 -271 76 -144 -575 -217 -87 -209 -181 -84 62 -285 -84 -29 -415 -28 -75 -322 -464 2
2771 2 45 -240 -231 -85 133 188 -322 -344 -45 -100 -437 217 341 -87 -188 202 -147 -124 28 -28 27 258 -27 -70
2795 -70 -82 -27 -89 -193 -21 94 223 99 -147 35 288 329 29 146 203 27 125 57 172 389 218 460 188
2818 188 529 151 525 48 177 249 302 45 67 318 420 27 140 494 -94 309 256 461 214 63 -56
2839 -56 92 311 -207 -81 383 600 -48 -112 487 160 -55 36 -282 5 233 156 -324 269 20 -190 38
2860 38 -68 -235 71 188 -299 8 279 -46 -330 -42 -177 -449 -37 -126 -373 -307 -64 -144 -220 63 -106 -351
2882 -351 89 -355 -509 -111 -523 -364 45 -420 -677 -64 8 -354 -631 -98 -270 -249 -192 -48 -174 157 -221
2903 -221 -469 273 199 -354 4 33 -274 -170 -55 -274 -279 126 -395 -24 278 -99 -506 -190 199 -166 -244 56
2925 56 375 242 94 -250 81 456 22 -332 36 253 11 335 63 -336 -28 294 -16 -17 147 349 -4
2946 -4 141 -275 -73 143 -123 -5 131 272 -70 415 225 -95 -16 7 -57 100 284 75 18 195 24 -272
2968 -272 -202 -289 -254 72 201 -251 151 312 -335 -128 471 87 -233 436 356 -207 166 26 -17 317 93 -54
2990 -54 -45 106 -60 -53 267 198 -55 244 -110 -143 81 263 -360 257 291 179 63 301 276 -23 236 -87 124
3013 124 315 37 -82 180 207 -2 -129 189 -142 243 143 32 213 87 -18 -117 77 283 -72 -145 265
3034 265 -263 210 7 -236 118 198 -96 -386 236 -190 -321 -163 -186 -162 -44 4 -41 48 -34 -64 -197 -56 -304
3057 -304 -351 3 55 -392 30 -100 -126 -215 175 -486 -319 -81 -141 -357 -56 -279 -281 -206 -246 137 -37 -27 -429
3080 -429 -238 -486 -441 -170 291 -104 -213 216 -261 -125 -122 31 -86 39 137 -150 -233 314 -79 -133 -98 111
3102 111 -283 143 -42 23 80 434 -220 67 327 8 10 392 79 -103 134 239 -52 54 55 -26 321 65
3124 65 59 -47 453 47 334 292 -189 -14 272 31 -129 -41 -44 -110 355 323 -130 239 261 62 194 235 243 41
3148 41 69 -60 174 337 286 50 68 405 260 -30 221 -101 36 27 42 44 280 85 -319 -64 -186 -97 277
3171 277 -94 70 -53 217 13 148 270 -64 78 -513 -203 18 -41 -22 -30 -72 -157 -281 -20 146 -14 -56
3193 -56 20 131 -286 -68 -196 9 96 4 -275 -96 -76 -79 -69 -50 237 37 207 234 -150 137 -19 -170 -59
3216 -59 -97 -95 -148 68 118 64 -69 -63 92 86 -205 -22 34 56 -154 -10 -198 -229 -99 2 111 282 -457 4 -122
3241 -122 -308 -260 -21 57 -73 -41 6 40 -136 -105 -142 -166 -57 70 135 -91 -150 112 -30 -302 19 -108 -134 -148
3265 -148 -206 -3 -94 -44 -66 -75 -121 -96 -244 -39 -113 -167 -103 50 -34 -146 98 37 -148 85 108 111 117 451 16 116
3291 116 113 -158 43 63 120 -3 33 151 249 -47 282 -210 113 115 -127 199 24 94 133 181 -136 189 74 267
3315 267 91 3 224 179 111 -38 148 345 -48 159 358 322 321 -61 256 194 79 216 434 371 69 58 219
3338 219 60 -132 27 -80 8 38 56 196 109 -115 -59 -24 -24 -21 -25 -125 96 150 -96 -103 126 181 -203 -135 -184 -84
3364 -84 -94 -172 -334 -188 -14 -37 100 87 -91 127 -54 57 -239 158 -149 78 -120 -89 77 -124 -152 -106 -69
3387 -69 -172 -20 -522 56 -105 -240 220 53 -282 -177 -25 19 -63 75 -198 -417 95 86 -153 -192 -117 5
3409 5 31 -77 -457 88 246 -82 -278 190 65 -32 -178 -124 -210 -72 -338 -156 -239 134 -161 -56 133 77 -107
3432 -107 114 -212 -313 325 -72 -285 -11 136 -71 -260 127 -54 192 109 -142 -77 4 -7 165 32 -251
3453 -251 -137 -57 -69 -245 67 60 -76 -47 133 210 12 121 48 -69 -15 27 -57 72 -118 92 57 330 -172 -161
3477 -161 320 78 -334 188 399 -142 143 343 65 95 154 214 -2 270 142 250 372 -53 32 194 235 90
3499 90 621 291 -64 103 159 77 55 340 -91 357 335 132 58 253 193 215 226 387 -82 199 226 47 13 154
3523 154 -227 6 428 258 130 -175 -118 -116 125 88 61 11 -167 -181 -128 -135 -110 -207 146 -73 -106 -251 -231 -134 225
3548 225 -90 -318 -63 91 -304 -398 -136 63 -39 20 -111 -65 91 -303 -51 19 -100 -306 -15 102 -260
3569 -260 -230 -372 -242 -329 25 -331 -621 -311 -23 -159 -283 -163 -326 -84 10 -290 -8 21 -421 -135 1
3590 1 -18 -322 -28 136 -125 48 -15 -239 47 116 -134 151 185 147 41 29 -65 -109 -50 165 52 110 81 -141
3614 -141 157 313 172 42 408 255 248 266 -19 -19 139 35 -114 460 218 -25 308 196 -27 50 39 75 53
3637 53 70 265 -11 -102 218 106 -3 171 184 -61 -16 -321 -53 136 140 12 -168 -62 -87 177 132 -71 -102
3660 -102 27 -350 -91 106 -11 -150 79 11 58 108 -51 63 244 156 -255 -44 428 78 -11 74 -142 231
3682 231 -167 172 166 53 -69 -24 70 59 -176 -57 12 -81 -35 383 79 135 78 88 -224 -143 312 76 -201 -61
3706 -61 229 -11 -34 -55 102 258 -204 -145 176 -119 -200 -238 164 -296 -209 -149 -109 -255 -80 27 -222 -49 -157
3729 -157 -217 -73 -355 124 59 -326 -132 -9 12 -240 -157 -162 -190 -321 -194 -132 -173 -92 -497 -93 -137 166 -173 -176
3753 -176 -115 -404 -103 -107 -170 -375 -40 -38 -87 -272 70 -233 -139 -27 -99 -86 -40 -45 -31 -66 -14 154 275 -81 -344
3778 -344 91 -69 -54 127 59 103 59 19 26 7 110 292 55 140 18 170 360 247 -45 161 87 150 352 357
3802 357 409 84 215 165 26 -193 219 66 88 162 221 445 181 230 57 -34 -14 78 282 -17 -80 61 381
3825 381 79 150 342 -11 -165 -102 341 136 63 -5 -75 -172 -41 71 263 59 -91 -188 50 -26 107 -199 -100
3848 -100 -86 -40 -46 87 42 -48 -43 38 72 -93 -6 -248 -57 220 -107 26 -72 -63 -19 -30 -210 -190 -47 74 -48 60
3874 60 199 -357 -344 52 -261 28 -76 37 105 112 26 35 -39 -185 -98 -144 -236 -197 149 -222 74 -95 -15 -59 30
3899 30 167 121 -110 164 210 -84 58 -217 -77 112 136 -69 -98 -340 55 134 328 -15 -34 54 -41 -118 -62 -5
3923 -5 -288 -206 -109 -216 -118 -3 -296 43 -13 -77 0 140 -139 -56 -12 -188 -46 66 186 -118 35 -127 -56 -319
3947 -319 247 -114 -183 -46 -13 -191 -12 -10 -138 149 -162 98 -39 -41 -91 91 284 -7 -89 54 245 201 4
3970 4 372 252 -3 -11 -22 188 -120 75 326 -37 -78 340 187 -25 -64 25 20 75 107 149 128 151 -24 151 121
3995 121 182 106 55 230 99 -202 -99 -32 129 298 -146 -1 -5 13 -125 -105 131 -32 -177 168 -165 -103 -46
4018 -46 -127 252 127 -78 -151 -198 65 -136 -169 300 -243 -243 -280 -92 -162 104 72 40 -218 1 -351 -101 -403 -168
4042 -168 -255 -111 -48 -348 308 -284 -8 -160 -59 -81 124 -195 -306 -178 53 144 176 -66 87 -30 -96 -127
4064 -127 -139 236 -72 -247 25 -74 -193 44 38 -127 -129 62 -140 -86 137 -194 80 224 118 -65 31 7 -155
4087 -155 -113 267 -116 -244 12 -58 48 146 -12 -78 68 199 20 -38 236 91 276 2 86 168 190 69 289
4110 289 261 -58 102 -231 322 5 -119 288 -23 137 9 25 18 125 29 -349 209 -12 134 30 245 -36
4132 -36 -104 143 -102 -28 -135 -39 160 158 29 232 6 465 275 -347 247 -95 353 109 -82 17 -250 242
4154 242 -116 267 -146 -48 61 -12 1 181 182 -261 -109 -146 22 130 120 -27 189 466 201 263 392 -30 37
4177 37 38 153 -134 208 304 105 -58 112 160 -22 -21 221 111 73 -95 -89 73 -227 -77 -139 81 99 -75 -170
4201 -170 289 181 42 -177 -38 -362 107 -304 115 -20 -203 108 -142 -227 54 -10 -411 -100 42 42 -80
4222 -80 -102 -246 39 -206 -109 -250 -119 -154 -34 117 -179 -28 -372 7 -186 -64 -66 63 -126 -160 121 -227
4244 -227 -124 7 -43 -69 -136 -151 -84 -173 -185 65 -16 105 -85 178 338 65 -56 3 -99 28 206 27 8
4267 8 254 28 160 145 25 105 157 27 -137 262 152 -134 137 56 91 129 40 142 -145 136 24 188 132
4290 132 118 -60 -117 -27 -179 83 -62 275 -229 305 -155 -57 86 1 -447 21 213 -124 79 129 36 2 2
4313 2 -187 -130 99 -146 86 -66 281 -124 125 -15 134 188 -5 -26 -216 128 53 87 196 -165 -82 -35 7
4336 7 49 -161 87 89 -67 -431 -67 -273 40 -54 243 -49 33 -71 -11 -145 -36 -198 123 -141 -149 2 -32 15
4360 15 246 -210 29 106 -222 90 -43 -39 -60 -38 -32 9 -186 70 -57 18 11 -122 42 -173 92 -99 -167 -263 -152
4385 -152 -55 46 -212 -237 75 -146 -13 -98 -147 -203 -81 88 153 129 -222 15 191 208 -292 79 85 -12 95 -167
4409 -167 -132 -147 71 -39 144 -256 -113 228 -137 83 26 11 0 67 -317 111 -70 19 -393 -22 -161 90
4431 90 -196 11 20 -68 20 122 -127 62 -140 49 -12 -249 58 81 -3 -392 -46 95 137 29 112 148 117 -69
4455 -69 -23 -13 124 83 1 -128 74 -34 -94 42 86 64 381 367 137 134 93 320 41 -137 -51 -179 29 -30 444
4480 444 63 -96 17 -188 59 -136 51 -183 -50 87 2 -36 -85 -82 261 161 164 307 210 87 19 141 -19
4503 -19 -3 101 59 -135 16 -105 69 -243 -65 -316 55 -30 -108 -109 -138 -103 -164 120 -136 -217 -201 -86 -125 -83 -314
4528 -314 124 -68 -63 -332 -17 28 -137 -355 -29 -188 -186 -281 -106 11 -155 156 47 63 -289 -202 -10 -139 -65
4551 -65 -75 95 59 26 57 -162 313 -195 -44 58 74 147 -15 2 50 2 -65 -192 58 -112 -131 -126 286 95 70
4576 70 45 17 -164 9 99 -230 7 -126 -244 -130 -67 65 -10 -178 254 -235 156 245 23 -48 -60 48 -73
4599 -73 8 126 -128 92 17 -178 -111 4 281 -65 -66 -10 -149 116 -10 -87 -216 -171 -137 128 46 20 -186 119
4623 119 134 165 126 -67 -66 -49 34 -10 170 92 196 336 -132 353 11 70 171 70 -140 22 5 -211 336 115
4647 115 118 -122 -46 -68 40 208 19 291 -163 98 32 -42 171 161 121 0 42 31 60 -82 327 282 28 226
4671 226 -115 -106 94 -74 -139 130 55 -105 68 57 15 -30 144 -129 -223 -205 -232 -211 29 -59 -11 -73 72 -67 48
4696 48 73 15 -185 -210 31 35 -129 -50 -52 76 -79 -205 -258 7 10 -84 -208 -253 -101 -74 -251 2 -178 -273 -289 -68
4722 -68 -142 -257 45 -279 231 -104 46 -196 -340 60 -318 -44 74 -196 -235 -72 46 61 -44 -123 -28 -92
4744 -92 -73 -123 24 -62 43 107 -38 52 61 -144 112 -47 88 -87 -144 -235 -41 -82 103 308 -92 56 182 -41
4768 -41 89 99 0 268 266 -33 80 203 202 -168 -95 153 138 81 -108 136 -126 -9 139 2 135 -76 -22 -222
4792 -222 272 107 -41 -49 398 -81 391 293 112 72 -175 -201 37 -92 107 -63 -181 -232 108 177 152 -114 11
4815 11 153 7 51 -71 -76 223 89 -111 17 113 -102 -225 151 -143 120 184 9 -85 375 45 -229 278
4837 278 166 -100 22 295 0 -45 -31 -27 111 -147 -40 86 -165 -41 96 144 193 -1 101 101 23 -433 21
4860 21 -86 23 188 307 84 -242 -132 212 137 -47 131 -74 -186 -134 -8 -64 -301 -287 217 -197 39 15
4882 15 -67 3 58 -345 31 58 -112 -57 -75 151 -308 -149 -21 -151 -28 231 -299 -1 -105 -157 -292 -34 -66
4905 -66 -128 -121 -11 -176 9 -115 -114 -204 23 83 9 -18 38 7 -175 142 117 -83 -39 89 -4 242 77 -106 178
4930 178 32 -145 28 80 233 49 227 168 13 51 134 -27 264 129 -80 -144 -73 148 -60 -41 53 -47 167
4953 167 155 232 230 17 117 286 -7 108 67 229 38 9 223 -30 129 84 105 153 175 -184 -53 25 116 128
4977 128 136 -3 275 -145 -34 107 -103 -107 -110 -13 200 -53 -103 -67 -230 138 -51 -46 11 -15 -24 -168 -42 103 -56
5002 -56 -10 -57 58 -53 115 148 115 -339 -27 -68 -24 -266 3 -124 -232 -171 -36 -17 -166 -158 -141 40 -226 134
5026 134 48 -115 58 183 -210 -164 -156 -32 73 -86 -73 -251 -30 165 -147 -196 -138 71 -75 25 207 -82
5048 -82 182 -102 -103 87 -124 112 -113 -80 167 115 -63 -85 213 -46 -9 -112 -95 87 20 2 146 48 71 96
5072 96 -78 -191 -33 247 263 137 -137 240 222 65 -50 -24 36 -75 53 -83 -7 -68 -65 -15 -133 118 169 -319
5096 -319 -73 -166 22 -61 290 3 17 104 129 16 301 84 -418 -239 -82 -74 -145 170 227 350 173 -18 -81
5119 -81 11 -73 -264 228 188 -115 118 -269 158 16 -132 -65 33 -121 -146 -18 -187 127 3 153 -172 179
5141 179 -149 -216 -76 -215 34 58 82 76 169 50 91 106 112 -6 237 192 372 269 -37 -282 87 155 62 160 193
5166 193 45 -254 -207 95 53 -77 97 25 238 29 -32 -330 79 -139 12 -54 -159 104 -130 -116 -348 -13
5188 -13 -44 -105 -239 -26 -40 -136 -232 34 -109 -215 -328 13 -1 309 50 -33 84 -259 -75 -68 -268 -181 -51 45
5212 45 -172 -285 31 -63 -283 -53 -65 -98 108 -216 -31 -64 15 173 -315 -9 158 71 -129 -83 176 45 -125
5235 -125 -159 -118 16 -48 108 -116 -95 -62 -232 97 205 273 -184 146 -58 47 231 390 -186 -134 -34 490
5257 490 139 112 261 209 135 -187 -169 272 -104 325 -78 -31 202 157 -206 -26 41 -17 -267 -164 35 -45 76
5280 76 -216 236 -37 55 -186 -95 100 21 182 -52 71 -134 -32 8 -60 -244 -3 -95 -32 -10 141 186 -103
5303 -103 -190 -175 103 256 157 115 417 233 89 301 36 -40 -38 28 -120 238 379 142 -126 -214 50 -153 -53
5326 -53 222 144 -111 155 9 91 162 166 168 -14 -9 -86 102 -36 -244 -276 89 -192 -174 -130 -177 -87 424 -17 -69 -166
5352 -166 -155 31 -72 -206 -119 115 -102 51 -1 -128 81 -27 37 58 -72 -165 -15 -87 217 -78 -22 -165 -254
5375 -254 25 -44 -237 6 -272 -43 -105 96 120 23 83 61 68 -23 164 72 38 -92 7 9 37 155 148 -157 -178 15
5401 15 -66 -42 -114 -153 -102 -4 -39 -150 53 73 -90 146 36 108 12 -114 118 -3 -9 41 171 122 -210 -80 143
5426 143 -5 -7 173 -54 101 30 84 -11 -43 279 -67 309 -334 28 102 173 12 -296 -29 -21 34 155 -39 -93
5450 -93 23 -124 1 -57 197 -54 33 94 -73 27 16 119 -57 -410 -203 85 44 -60 55 -96 -122 213
5472 213 -105 220 -47 77 -7 57 102 -302 -260 -97 2 38 35 346 197 21 -84 99 149 13 -132 158 446
5495 446 51 221 -1 -168 162 -165 -151 200 105 161 20 112 191 -31 26 -126 -82 54 18 -64 -102 130 84 174
5519 174 -73 -34 5 69 -48 -317 45 -108 -228 9 -72 -304 109 -201 -14 -116 -350 32 -67 -95 225 138
5541 138 175 96 354 93 -132 77 172 -18 -34 -43 -281 -361 105 -51 -182 92 -141 -173 -186 -63 -309 49 115
5564 115 259 -39 115 -21 73 -226 -72 94 -95 -31 38 30 -140 -4 167 348 75 -35 67 356 -193 -34
5586 -34 14 62 -230 156 -179 -23 60 -197 214 -33 -182 52 18 131 -271 -109 323 333 14 109 159 135 15
5609 15 122 107 -287 8 149 -297 75 -145 -191 -33 113 258 123 135 294 -107 405 430 24 143 310 119
5631 119 231 39 63 -221 5 173 75 31 8 -111 40 38 -138 -65 311 7 -25 -44 -66 -103 225 -271 -236 -132
5655 -132 -172 -168 -315 -236 -195 -79 -128 -76 -19 -222 -349 -182 -268 -72 -40 79 433 -297 -270 104 210 79 -53 142
5679 142 -59 130 193 -16 -38 -159 -113 -63 -58 -39 -89 -55 -151 -25 8 60 -25 -94 122 -39 223 -104 -132 257 -80
5704 -80 22 209 142 -12 -317 -48 29 -1 166 202 -95 125 162 0 -92 -153 -6 286 -25 239 -15 75 335
5727 335 -10 117 -208 -147 84 245 -57 216 -89 -58 -56 -18 265 90 -67 -108 175 44 -78 317 -193 -21
5749 -21 183 -29 -88 143 225 -194 179 -348 -164 30 101 80 298 -256 -87 -343 -33 22 30 338 78 -122 74
5772 74 370 -168 -221 82 185 -26 -62 128 -74 111 -309 -112 151 199 45 263 -17 -82 137 98 -135 28
5794 28 -74 -25 -81 -148 231 132 -6 111 216 100 -49 -22 271 -18 355 47 -319 156 -139 -138 97 207 78
5817 78 175 73 162 78 226 227 121 144 111 164 -2 -119 -38 -79 -263 -50 -10 -55 81 -206 -29 -120 17 -153 94
5842 94 -88 -196 147 -156 19 112 140 129 -193 -111 -53 48 -118 58 -21 -299 -12 148 29 -328 -119 70
5864 70 1 -130 -131 -53 -310 -175 -57 -8 3 -280 -58 26 -192 -222 -295 104 58 -69 202 135 -202 -201 -13 -143 -162
5889 -162 28 -280 1 87 -184 191 -201 -189 119 -37 -96 22 219 242 -182 -48 146 47 118 153 89 31 201
5912 201 -39 173 -91 -127 86 -32 16 -226 170 -57 100 95 -20 -189 -3 25 -172 71 96 -126 -50 215
5934 215 -31 4 63 216 124 -135 70 185 0 -300 162 -162 61 197 81 130 26 -140 -72 66 -103 53
5956 53 -46 331 -272 -271 82 177 -160 53 -37 215 28 -5 -267 13 -38 271 58 -74 68 -105 -38 -64 -33 164
5980 164 -185 119 -167 -175 -78 -170 135 68 -153 -136 -61 86 -16 3 5 -2 101 -209 -37 112 -142 12 267 -119
6004 -119 -122 -104 33 -105 156 -8 183 370 -119 34 62 -57 -50 -124 7 404 16 15 48 -149 137 -133 30
6027 30 -277 55 83 -125 -72 8 -277 134 -39 34 74 -137 272 360 -166 95 -177 -215 -32 21 -61 -133 -33 -48
6051 -48 -119 -62 -186 -150 50 84 -82 -142 55 179 10 -38 172 286 178 -93 68 -61 -274 -94 407 -179
6073 -179 -105 320 -130 40 -124 103 -231 -125 -74 51 135 -28 57 -179 11 202 13 60 49 -319 76 -81
6095 -81 266 -53 150 -28 34 301 -88 141 -49 82 -139 80 277 237 83 97 102 399 -183 -120 137 69 32
6118 32 -264 75 327 222 231 175 66 121 -57 136 159 167 -35 -70 -21 -30 66 82 -50 -165 159 -51 -216 -8 169
6143 169 -30 42 300 44 -120 -186 -11 83 241 170 205 -47 -298 -78 -181 57 -61 69 -73 -26 -98 -137 -5
6166 -5 -46 -268 22 331 -43 -106 168 11 -168 -305 -167 -189 62 -65 27 -274 -50 -184 110 -103 -29 246
6188 246 -55 -169 -116 -37 51 35 -18 353 -248 -99 213 -150 -224 222 190 188 -17 -13 -12 -92 34 203 -71 48 -66
6213 -66 -217 -373 -4 -108 -122 -33 -302 3 -34 64 -30 17 71 -162 -9 33 13 -63 24 36 172 -48 129 366
6237 366 130 -109 58 -96 42 -6 101 218 32 212 -96 160 -71 -74 13 14 -65 -19 -60 -97 260 257 -150 -153 30
6262 30 235 -164 149 25 150 163 108 41 358 -107 43 125 6 108 81 -84 77 -39 266 33 124 34 250
6285 250 363 286 196 -129 338 173 -268 103 -21 -2 -89 -19 -24 -281 60 44 -1 30 -343 -236 -125 21 130
6308 130 -173 181 -318 -64 9 -245 -59 -88 324 -86 -40 -99 -176 211 -274 253 150 -181 -287 -224 167 -6
6330 -6 19 -59 -113 180 24 56 -112 -111 -29 -154 -185 -110 -26 -68 -145 -22 -55 -54 109 -152 -206 -29 -79 21 18 -142 -137 -80
6358 -80 147 -174 -348 -61 -72 -182 -229 -73 113 -151 325 -71 -257 -30 -116 -105 94 -86 -13 85 82 192 136
6381 136 -9 247 31 -20 -321 292 140 -46 50 -92 232 -76 -177 -142 174 12 131 -54 -81 69 -45
6402 -45 -161 -43 196 55 217 -41 -67 -101 12 -76 13 -26 160 65 -200 -59 92 -63 -103 -208 -27 -47 62
6425 62 386 -15 -239 97 142 77 -67 -32 -175 -245 46 -154 -49 -170 193 44 -59 -173 -28 -128 -256 -156
6447 -156 -111 244 -91 95 -61 -8 -45 179 69 121 37 49 40 -178 54 17 -3 -87 66 58 -64 211 416 53
6471 53 -150 -63 -44 -9 -64 62 -12 -178 -143 24 142 331 -116 -273 -198 130 -16 60 78 247 101 -140 -9
6494 -9 -100 -8 -70 -456 -239 161 -94 -13 66 70 15 -65 -236 11 -14 55 -343 -138 3 107 206 -169 120 -217 67
6519 67 -64 -342 -316 -51 -133 -162 174 50 -143 13 353 45 -93 48 109 -1 -197 -34 -52 189 -10 69
6541 69 -192 102 191 -15 -121 -53 -38 -235 -75 -50 17 -241 93 62 235 -103 173 -18 -71 -67 215 57 170
6564 170 1 -92 42 -136 133 -53 -113 190 -145 298 -190 55 149 72 80 6 -16 172 148 2 84 131 79 107
6588 107 156 -26 192 -145 69 -58 199 127 105 -44 -156 -217 -53 79 -73 48 216 137 -124 135 139 55 -246
6611 -246 -114 100 -146 55 -1 66 281 59 -106 163 104 -23 -166 48 -59 -114 46 34 -92 -31 -93 18
6633 18 74 73 -326 168 -154 60 -189 -8 125 -14 -157 8 25 4 65 -211 -96 42 -97 -264 98 -105
6655 -105 219 -108 -38 -66 -46 -193 111 16 66 105 -82 -42 -42 240 96 -90 32 270 120 47 -67 -42 -157 48
6679 48 -166 -73 46 -175 211 -116 -86 19 -45 31 -12 -254 250 91 -92 -47 96 -75 92 -78 -168 17 133
6702 133 134 420 -7 -192 -48 -41 -144 -88 321 16 -130 70 -44 165 -78 -149 18 -106 24 66 3 -38 -176
6725 -176 -110 -46 -165 -103 -202 26 -194 93 -15 -211 59 -11 -104 -291 -5 -388 22 147 31 -79 74 -10
6747 -10 42 139 -22 121 126 88 -113 -95 29 -96 188 39 184 -44 -1 50 -62 94 3 -26 58 183 -202 24
6771 24 197 282 49 38 4 125 37 -47 140 64 -85 -231 12 39 -30 81 -253 -78 -199 60 -152 -110 189
6794 189 -90 -73 -110 74 191 106 104 18 28 -7 111 -123 83 -133 -83 36 221 -77 -98 25 -157 16 -116
6817 -116 -2 -310 227 40 61 130 150 -61 -53 -40 -93 -44 0 -142 -273 -61 18 -25 -5 -54 76 101 54 -114 -110 -32
6843 -32 -43 112 43 134 49 -172 14 -273 -25 5 -103 -28 -44 103 -43 -110 79 184 -84 -13 -65 -14 -63 23 -166
6868 -166 51 117 -60 117 -260 83 -11 111 9 -179 229 -118 156 -31 136 -59 102 70 -54 1 -119
6889 -119 1 -30 -269 165 -241 -30 339 14 16 161 28 0 103 -340 70 -97 -62 92 -35 98 -350 -107
6911 -107 -25 27 18 51 79 347 112 91 -70 160 -85 -198 174 172 77 133 294 -53 0 -149 6 -198 -116 96
6935 96 -41 -246 44 -205 -152 76 -42 71 163 297 -2 53 100 -159 -105 -26 121 -218 168 154 107 180 37
6958 37 -9 -55 136 -72 -127 -95 -93 -182 -98 -28 174 139 -212 5 -49 138 -180 154 284 30 155 -50 -342 293
6982 293 -208 -58 6 -73 29 -68 185 62 144 -152 -20 107 69 -13 -97 -145 298 -75 361 60 -89 146 7
7005 7 201 -53 -81 -88 -138 84 119 -21 112 -3 9 -134 93 -69 -104 102 -208 26 229 21 -92 107 -13
7028 -13 162 101 -91 -15 -38 188 236 -158 53 74 -349 62 -145 186 -23 94 -194 -15 30 -218 -72 -101 -21
7051 -21 -214 127 -79 39 -138 -48 -46 2 -5 62 -52 61 -216 -258 56 -121 107 257 378 44 33 74 -234 144
7075 144 -110 129 -17 116 217 254 231 209 -78 28 124 104 72 0 44 44 -17 -151 35 -340 102 193 65 97
7099 97 -49 -77 280 -17 -14 102 15 126 -184 -101 100 -173 73 -99 -141 -52 34 29 -239 171 -131 335 -94 8
7123 8 70 -199 -187 -12 -95 -27 -103 -59 -110 -100 -111 79 -180 -15 84 -139 -85 77 -16 181 54 128 -52 -56 251 72
7149 72 -271 110 232 19 255 -245 36 62 12 -102 -85 -122 162 95 2 -45 80 -171 88 171 -29 70 -136
7172 -136 -194 -174 -172 59 63 -24 95 3 102 13 -150 -191 -101 -85 55 50 -309 -166 77 139 -22 141 23 -214 65
7197 65 -165 160 -1 -153 86 -130 -7 -168 -5 -140 -67 -229 -17 195 76 290 176 -219 -251 79 115
7218 115 303 -148 -173 -109 83 136 -30 -80 272 -63 188 -117 -32 -81 -6 -10 56 18 -63 199 -36 180 5 6 107
7243 107 255 88 50 156 75 -33 247 3 273 -187 64 223 28 136 -103 356 -53 178 -53 -176 249
7264 249 288 38 -126 -6 64 108 11 61 -156 -128 -24 86 273 359 51 -28 -38 -48 -147 190 102 -75 254 132
7288 132 86 -69 44 -203 360 33 331 53 117 -164 -192 6 -115 48 -51 -179 79 -119 -20 -49 -117 -71 -22
7311 -22 197 67 -10 -189 4 -284 24 -129 113 -220 -185 -215 116 53 -60 -151 47 -70 -18 -87 -44 -132 -1
7334 -1 17 -90 131 -104 -112 199 -64 -127 -45 -255 -40 121 87 -81 83 109 -272 -258 150 -102 -127 -245 182 62
7358 62 77 -20 106 6 -333 -11 -90 266 -63 -11 -30 283 310 80 -143 -365 -67 318 -54 10 -42 -39 -139 76
7382 76 62 73 -147 43 -30 -30 -39 34 -18 -110 -3 54 -283 -32 -2 159 254 122 -27 -36 21 171 452 150 20 3
7408 3 158 257 101 189 7 93 69 140 246 59 -78 -173 31 149 -29 -51 66 121 302 60 137 -20 110 -1
7432 -1 -37 116 83 239 -71 119 197 110 -46 91 48 1 -19 258 -56 -109 -93 29 195 131 66 15 26 93 292
7457 292 133 47 29 102 214 109 -247 11 36 -97 -137 43 196 -15 -96 -99 26 26 133 68 89 -167 -91 44
7481 44 -79 -222 -124 -62 65 192 -129 -257 -149 -41 -49 54 -28 -104 -133 53 -47 -245 -241 214 -187 -149 451 -93
7505 -93 -41 30 3 10 39 -223 -107 103 2 136 -120 -58 113 224 -108 -253 -272 25 -223 -83 -80 -79 -221 72
7529 72 50 46 72 -96 -199 131 50 141 -45 -201 -142 137 41 -74 178 225 -43 350 152 113 352 82 -45 113
7553 113 75 -349 190 91 68 -142 87 159 12 29 115 -18 134 -53 212 -281 -289 268 -28 -91 86 -37 297
7576 297 33 -104 -87 110 -72 36 -63 118 172 157 59 306 24 96 -73 -216 -27 -17 124 81 224 -35 -21
7599 -21 78 37 123 226 -28 29 296 -99 102 8 90 -55 -39 60 -14 -186 -90 -134 -109 59 -16 6 -156 206 46
7624 46 -93 215 103 -246 -10 -74 69 -98 -82 -29 114 271 -293 149 -4 127 -8 34 -70 -249 -128 -175
7646 -175 26 -226 84 21 45 67 -163 -206 -170 -314 -263 4 67 115 111 272 -158 -166 -267 228 -166 -192 0 -9 114
7671 114 -13 154 -286 -29 102 -270 163 -17 15 142 87 25 -79 -260 -278 94 280 110 -221 -92 -148 82
7693 82 -26 -197 -124 72 -207 -348 111 -1 113 -145 13 -336 126 -76 32 -31 -24 -48 211 56 118 164 -221
7716 -221 -88 20 -79 -50 373 101 100 -41 307 35 -57 -59 -71 100 141 239 242 28 75 9 171 -203 166 239 284
7741 284 -9 -100 -107 70 31 145 229 86 81 -147 50 289 -154 245 1 -29 220 -77 47 -197 218 205 59
7764 59 109 106 40 2 -50 113 125 14 -149 17 6 47 -81 64 -12 -83 152 -119 133 -133 -143 5 -111 -238
7788 -238 -53 -67 -94 -52 140 -62 -129 124 -289 -30 101 -85 -33 -190 280 2 74 -123 40 -9 61 8 -148
7811 -148 7 -73 -139 143 -13 -256 -69 -282 -73 -92 176 5 -63 -95 -246 -70 -235 -203 -68 234 -139 -73
7833 -73 -142 34 84 23 71 61 206 -305 198 -119 -148 -406 16 -172 -51 -72 -14 0 -19 -206 -100 180 -135 -272
7857 -272 -75 80 126 -63 4 -164 141 -93 -72 -61 82 45 -179 -246 60 247 -131 -77 -427 182 -46 101
7879 101 -103 282 -41 -23 142 -2 192 -121 -107 66 23 105 -143 -126 51 126 -89 -130 -19 236 277 -83 -16
7902 -16 28 56 -106 -195 -142 381 121 -12 6 73 52 -86 -28 -31 -16 1 21 -21 -74 158 43 140 -36 100 -14 181
7928 181 -67 -149 158 2 32 112 177 2 22 -31 135 -34 90 330 -151 -17 294 39 -47 117 -49 97
7950 97 114 72 101 -74 -51 130 99 -84 -155 46 98 -76 86 101 -146 -128 -148 -54 -138 237 243 -144 -21 -154 205
7975 205 -79 94 48 -136 193 -169 7 446 -221 -118 183 -116 -91 31 -97 -99 22 -147 -47 241 -10
7996 -10 7 77 207 -50 -15 -291 -340 -252 100 -135 -113 13 -192 -180 94 -219 150 4 207 -213 -39 130 12
8019 12 269 -71 36 -12 59 81 58 -45 239 -68 -6 249 140 -191 124 -119 -46 -122 -118 213 62 202 -195
8042 -195 83 -89 -21 34 170 -150 92 202 113 31 105 -215 60 -177 -116 -86 -92 -183 42 -223 -132 231 55 152
8066 152 -142 -218 45 248 -11 117 -89 195 126 -1 -3 52 69 129 132 127 91 -115 -55 243 37 10 305 133 129
8091 129 -194 215 -77 0 -38 1 -23 -186 -120 156 -17 158 -314 -36 114 104 37 -51 107 -168 65 -32 -117
8114 -117 -127 -265 -4 -331 41 45 -6 74 15 -2 13 179 42 197 211 -70 -116 282 -96 -39 -402 58 133 -139
8138 -139 -58 -5 18 45 11 -310 107 -65 -105 -62 -51 244 183 46 -69 -195 -211 252 198 -256 185 -251 -104 313
8162 313 220 -136 -216 -116 -214 143 -241 -403 -157 10 100 -112 -198 43 -143 -160 92 -176 -263 -40 193 -133
8184 -133 -161 18 -80 -196 -33 -96 -188
8191a88
##END NTUPLES=NMR FID
##END=
