##TITLE=1H_SL62-DMDO(f17-1)
 CDCl3, 8 sc, 
 7.07.2021
##JCAMPDX= 6.0         $$ Bruker NMR JCAMP-DX V2.0
##DATA TYPE= NMR FID
##DATA CLASS= NTUPLES
##ORIGIN= UXNMR, Bruker Analytische Messtechnik GmbH
##OWNER= root
$$ XWIN-NMR		Version 3.5
$$ Wed Jul  7 09:03:04 2021 Russian Standard Time (UT+4h)  she@DPX200
##.OBSERVE FREQUENCY= 200.131506
##.OBSERVE NUCLEUS= ^1H
##.DELAY= (6, 6)
##.ACQUISITION MODE= SIMULTANEOUS
##.ACQUISITION SCHEME= undefined
##.AVERAGES= 8
##.DIGITISER RES= 18
##SPECTROMETER/DATA SYSTEM= spect
##.PULSE SEQUENCE= zg30
##.SOLVENT NAME= CDCl3
##.SHIFT REFERENCE= (INTERNAL, CDCl3, 0, 15.7039)
##AUDIT TRAIL= $$ (NUMBER, WHEN, WHO, WHERE, WHAT)
$$ ##TITLE= Audit trail, XWIN-NMR		Version 3.5
$$ ##JCAMPDX= 5.01
$$ ##ORIGIN= Bruker BioSpin GmbH
$$ ##OWNER= she
$$ F:/spectra/data/she/nmr/H-F/1/audita.txt
$$ ##AUDIT TRAIL=  $$ (NUMBER, WHEN, WHO, WHERE, WHAT)
(   1,<2021-07-07 09:01:46.98 +0400>,<she>,<DPX200>,
      <created by zg, POWCHK disabled, PULCHK disabled
       configuration hash MD5:
       00 E9 B6 7A A2 85 ED C7 34 08 36 98 17 FE 4E 26
       data hash MD5: 16K
       36 CD 44 82 82 09 AD 6D 4A F3 A4 0C 11 C5 1B 79>)
$$ ##END=
$$ 
$$ hash MD5
$$ 83 59 B8 FC 9A 9B C8 94 39 3A 43 ED 30 21 56 98
##$RELAX= 
##$RELAX= 
##$RELAX= 
##$RELAX= 
##$RELAX= 
##$RELAX= 
$$ Bruker specific parameters
$$ --------------------------
##$DU= <F:/spectra>
##$EXPNO= 1
##$NAME= <H-F>
##$PROCNO= 1
##$TYPE= <nmr>
##$USER= <she>
##$AMP= (0..31)
100 100 100 100 100 100 100 100 100 100 100 100 100 100 100 100 100 100 
100 100 100 100 100 100 100 100 100 100 100 100 100 100 
##$AQSEQ= 0
##$AQ_mod= 1
##$AUNM= <au_zg>
##$AUTOPOS= <>
##$BF1= 200.13
##$BF2= 200.13
##$BF3= 200.13
##$BF4= 200.13
##$BF5= 200.13
##$BF6= 200.13
##$BF7= 200.13
##$BF8= 200.13
##$BYTORDA= 1
##$CFDGTYP= 0
##$CFRGTYP= 5
##$CHEMSTR= <none>
##$CNST= (0..31)
1 1 145 1 1 1 1 1 1 1 1 1 1 1 1 1 1 1 1 1 1 1 1 1 1 1 1 1 1 1 1 1 
##$CPDPRG= <>
##$CPDPRG1= <>
##$CPDPRG2= <>
##$CPDPRG3= <>
##$CPDPRG4= <mlev>
##$CPDPRG5= <mlev>
##$CPDPRG6= <mlev>
##$CPDPRG7= <mlev>
##$CPDPRG8= <mlev>
##$CPDPRGB= <>
##$CPDPRGT= <>
##$D= (0..31)
0 1.2 0 0 0 0 0 0 0 0.06 0 0.03 0 0 0 0 0.0002 0 0 0 0 0 0 0 0 0 0 0 0 
0 0 0 
##$DATE= 1625634106
##$DBL= (0..7)
120 120 120 120 120 120 120 120 
##$DBP= (0..7)
150 150 150 150 150 150 150 150 
##$DBP07= 0
##$DBPNAM0= <>
##$DBPNAM1= <>
##$DBPNAM2= <>
##$DBPNAM3= <>
##$DBPNAM4= <>
##$DBPNAM5= <>
##$DBPNAM6= <>
##$DBPNAM7= <>
##$DBPOAL= (0..7)
0.5 0.5 0.5 0.5 0.5 0.5 0.5 0.5 
##$DBPOFFS= (0..7)
0 0 0 0 0 0 0 0 
##$DE= 6
##$DECBNUC= <off>
##$DECIM= 32
##$DECNUC= <off>
##$DECSTAT= 4
##$DIGMOD= 1
##$DIGTYP= 9
##$DL= (0..7)
0 120 120 120 120 120 120 120 
##$DP= (0..7)
150 150 150 150 150 150 150 150 
##$DP07= 0
##$DPNAME0= <>
##$DPNAME1= <>
##$DPNAME2= <>
##$DPNAME3= <>
##$DPNAME4= <>
##$DPNAME5= <>
##$DPNAME6= <>
##$DPNAME7= <>
##$DPOAL= (0..7)
0.5 0.5 0.5 0.5 0.5 0.5 0.5 0.5 
##$DPOFFS= (0..7)
0 0 0 0 0 0 0 0 
##$DQDMODE= 0
##$DR= 18
##$DS= 0
##$DSLIST= <SSSSSSSSSSSSSSS>
$$ [...]
##$SUBNAM2= <"">
##$SUBNAM3= <"">
##$SUBNAM4= <"">
##$SUBNAM5= <"">
##$SUBNAM6= <"">
##$SUBNAM7= <"">
##$SUBNAM8= <"">
##$SUBNAM9= <"">
##$SW= 20.0188882624521
##$SWIBOX= (0..15)
0 0 2 0 0 0 0 0 0 0 0 0 0 0 0 0 
##$SW_h= 4006.41025641026
##$TD= 16384
##$TD0= 1
##$TE= 0
##$TE2= 300
##$TE3= 300
##$TEG= 300
##$TL= (0..7)
0 120 120 120 120 120 120 120 
##$TP= (0..7)
150 150 150 150 150 150 150 150 
##$TP07= 0
##$TPNAME0= <>
##$TPNAME1= <>
##$TPNAME2= <>
##$TPNAME3= <>
##$TPNAME4= <>
##$TPNAME5= <>
##$TPNAME6= <>
##$TPNAME7= <>
##$TPOAL= (0..7)
0.5 0.5 0.5 0.5 0.5 0.5 0.5 0.5 
##$TPOFFS= (0..7)
0 0 0 0 0 0 0 0 
##$TUNHIN= 0
##$TUNHOUT= 0
##$TUNXOUT= 0
##$USERA1= <user>
##$USERA2= <user>
##$USERA3= <user>
##$USERA4= <user>
##$USERA5= <user>
##$V9= 5
##$VALIST= <valist>
##$VCLIST= <CCCCCCCCCCCCCCC>
##$VD= 0
##$VDLIST= <DDDDDDDDDDDDDDD>
##$VPLIST= <PPPPPPPPPPPPPPP>
##$VTLIST= <TTTTTTTTTTTTTTT>
##$WBST= 1024
##$WBSW= 4
##$XGAIN= (0..3)
0 0 0 0 
##$XL= 0
##$YL= 0
##$YMAX_a= 144683
##$YMIN_a= -272858
##$ZGOPTNS= <>
##$ZL1= 120
##$ZL2= 120
##$ZL3= 120
##$ZL4= 120
##$ABSF1= 10
##$ABSF2= 0
##$ABSG= 5
##$ABSL= 3
##$ALPHA= 0
##$AQORDER= 0
##$ASSFAC= 0
##$ASSFACI= 0
##$ASSFACX= 0
##$ASSWID= 0
##$AUNMP= <proc_1d>
##$AZFE= 0.1
##$AZFW= 0.1
##$BCFW= 1
##$BC_mod= 2
##$BYTORDP= 1
##$COROFFS= 0
##$CY= 11.3945322036743
##$DATMOD= 1
##$DC= 2
##$DFILT= <>
##$DTYPP= 0
##$F1P= 15.9154993809931
##$F2P= -4.1035820241983
##$FCOR= 0.5
##$FTSIZE= 0
##$FT_mod= 4
##$GAMMA= 1
##$GB= 0.15
##$INTBC= 1
##$INTSCL= 1
##$ISEN= 128
##$LB= 0.24
##$LEV0= 0
##$LPBIN= 0
##$MAXI= 10000
##$MC2= 0
##$MEAN= 0
##$ME_mod= 0
##$MI= 1.114404
##$NCOEF= 0
##$NC_proc= 0
##$NLEV= 6
##$NOISF1= 3.799351
##$NOISF2= 2.8
##$NSP= 1
##$NTH_PI= 0
##$NZP= 0
##$OFFSET= 15.70392
##$PC= 1
##$PHC0= -11911.14
##$PHC1= 9.200991
##$PH_mod= 1
##$PKNL= yes
##$PPARMOD= 0
##$PSCAL= 0
##$PSIGN= 0
##$REVERSE= no
##$SF= 200.130013532006
##$SI= 16384
##$SIGF1= 3
##$SIGF2= 2
##$SINO= 400
##$SIOLD= 16384
##$SREGLST= <1H.CDCl3>
##$SSB= 0
##$STSI= 0
##$STSR= 0
##$SW_p= 3612.71676300578
##$SYMM= 0
##$S_DEV= 0
##$TDeff= 0
##$TDoff= 0
##$TI= <>
##$TILT= no
##$TM1= 0
##$TM2= 0
##$TOPLEV= 0
##$USERP1= <user>
##$USERP2= <user>
##$USERP3= <user>
##$USERP4= <user>
##$USERP5= <user>
##$WDW= 1
##$XDIM= 8192
##$YMAX_p= 0
##$YMIN_p= 0
$$ End of Bruker specific parameters
$$ ---------------------------------
##NTUPLES= NMR FID
##VAR_NAME=  TIME,          FID/REAL,        FID/IMAG
##SYMBOL=    X,             R,               I
##VAR_TYPE=  INDEPENDENT,   DEPENDENT,       DEPENDENT
##VAR_FORM=  AFFN,          ASDF,            ASDF
##VAR_DIM=   8192,          8192,            8192
##UNITS=     SECONDS,       ARBITRARY UNITS, ARBITRARY UNITS
##FACTOR=    0.0002496,     1,               1
##FIRST=     0,             0,               0
##LAST=      2.0444736,     0,               0
##MIN=       0,             -272858,         0
##MAX=       2.0444736,     144683,          0
$$ Real data points
##PAGE= N=1
##DATA TABLE= (X++(R..R)), XYDATA
$$ [...]
1881C18O18q69q97J027j9j80J12j32M30j27p20L59L12l81q6P07l44q74K69N49
1901G2O8k19m55K04M94M57j127n5P38l1l74p5o63N25N67m5p03q2Q86j65j22k3
1923a28n10N96Q25r40n86O17K54m5l75j55L84L74qp25K83P83o45%K43l14l09N65
1945A84P5r1k56j58J037j81n23m58J108L12r60k38K68J95M4kn85M51K09o9k63
1966I9J72r1O2k40j89K51M39m51l96N98Kj28l61N37k08j68NL59j36k60l4L37L4
1989B33p29J01K88J3j93J21K50j30o6M24n65l53Q88J71n40n25K48N27k85n08J52
2010d78M29j05J49j46L57jo8q2k39M9K83k07j10l2o0K85l79J36L79O0m65N98j65
2033A88j40m42M06P14p32l71J11N47m30m1K84N15l67l08K25K68N2j98j28L0l53
$$ plain form
1881 318 936 67 -830 197 178 -2 110 -22 408 281 -439 -80 232 -149 -235 472 128 -746 -477 72
1901 72 140 -79 -534 -330 164 621 -506 -561 177 146 -228 -303 -966 -441 126 81 -622 -704 182 17 -105 -128
1923 -128 -638 -42 783 -157 -743 -126 128 83 -292 -447 -63 311 303 -422 -139 644 -1 -1 242 -72 -381 184
1945 184 259 168 -88 -246 791 610 87 -371 737 1049 89 -149 119 314 358 356 -229 222 431 362 99
1966 99 271 180 242 2 -187 64 503 52 -344 254 256 128 -233 304 96 -72 -67 292 156 -104 -138 199 233
1989 233 -496 -395 -107 -94 -287 -166 84 -46 -112 312 -253 -606 282 453 -87 -612 -364 163 -122 -630 -478
2010 -478 -49 -154 -5 -151 206 205 137 55 -184 -135 148 -59 -169 -201 -261 24 -355 -219 160 220 -245 353 188
2033 188 48 -394 12 726 -6 -377 -266 281 -149 -190 94 609 242 -66 159 427 479 281 153 183 -170
2054a70J48j18N4J27J55j34P3j1K17k82L67l76Q9l83L93l0j08n71J99K14L71k50
2076b6k75L15m7J74p3j90j04K81j71n4j94j30K59M09k49q3L73k13k67O7L34k19
2098h3k6m16M72k23k1L38Ql40m0K41J33k27J90K67j97R2p7k44n0P5j77M02k79
2121a82j8K48L23j58r7J98K51n05J65k37L04j37k30K21k5k60M35k11J9J09M55
2142F68o7m47Q5p7O2j22O8rk47J39K05j87j9j07K86j90l67J77O15r2p69L72N0
2165B7k95M03k32q3m24N33L5j47P8J37l73L01L0l49N00j22m52l52R04l90M8K54
2187C1K3l53J69K10j17j5R5k95K9J98l65L66J49m03K38M33o70j06M11J54n26K98
2209d6J0k19K50J67j31N8m15Q9N70K73p50L46N01o79j30M54J60r19M91K36o84
$$ plain form
2054 -170 -22 -140 -86 41 196 62 135 124 341 59 426 50 139 -244 149 119 11 -560 -361 -147 224 -26
2076 -26 -301 14 -33 141 68 -122 -226 55 -116 -170 -364 -494 -235 174 -75 -158 215 2 -265 -198 136 -83
2098 -83 -109 -525 -53 -276 -297 41 49 -291 -331 -90 43 -184 6 273 76 168 91 -153 -203 -128 -305 97 -182
2121 -182 -200 48 371 213 116 314 565 60 225 -12 292 155 -75 146 121 -139 296 85 104 213 668
2142 668 601 154 239 162 224 102 170 161 -86 53 258 71 52 -55 231 41 -326 -149 466 374 -395 -23 27
2165 27 -268 135 -97 -180 -604 -71 -36 -183 -105 32 -341 -40 -10 -359 141 19 -433 -785 119 -271 -223 31
2187 31 54 -299 -130 80 -37 -52 43 -252 -223 -25 -390 -24 125 -278 -40 393 -277 -383 28 182 -344 -46
2209 -46 -36 -255 -5 162 31 89 -326 -237 333 606 -144 202 703 24 -106 348 508 -411 80 316 -368
2230c68K28Q73m21l02K33l31L63l6j39R8J50k84L2K44n45n29Q88L69p21rM72j75
2252I0L76Q1m18k59K57n7n50P89o16J25N08k92m63R64k25q92M21L96k45j11M92
2273C71m54n47M46L65m81L80j57l45N09R5l34R5J65n09K98M76q61J58O74m94k58
2294d08J7K39rL25l5n74O62L78l87k39Pn53L50N88n41j57M70K83n56N54k70k42
2316i8L31N7p92L97L54m70M54P7q25K87Q34k31j011P63J85m67K62K10o22K40N47
2337D82n72R8Q8k74J72M15o83l1L04J49k89J70k77K51M24j24p92L36M88l11j20
2358i6M6l25q0Q15j77l82R2q4k67M76rp24Q38K23p02K7Q12o41J8L06m67l26N84
2381d3J43j38N14m75l48N91J90j065L31M87j22P8J25m43J82O08m08q48Q73R1m58
$$ plain form
2230 -368 -140 733 312 10 243 -88 275 239 100 198 348 64 96 340 -205 -734 154 523 -198 -207 265 90
2252 90 466 547 129 -130 127 70 -480 309 -307 -182 326 34 -429 535 310 -582 -161 235 -10 -121 371
2273 371 -83 -630 -184 181 -300 80 -77 -422 87 182 -152 -57 108 -401 -103 373 -488 -330 344 -150 -408
2294 -408 -391 -152 -161 164 129 -445 217 595 208 -31 -24 -577 -227 361 -180 -337 133 416 -140 414 144 -98
2316 -98 233 290 -502 -105 249 -221 233 310 -515 -228 606 375 -636 127 312 -155 107 317 -305 -65 482
2337 482 -90 8 96 -178 -6 409 -274 -305 -1 148 -141 29 -248 3 427 303 -489 -153 335 24 -96
2358 -96 -50 -375 -455 360 183 -199 -107 -191 -458 18 9 -715 123 346 -356 -329 483 -158 -140 166 -301 -627 -43
2381 -43 100 -38 476 1 -347 244 434 -631 -300 187 65 143 268 -175 7 615 207 -641 232 323 -135
2402a35J54J49l3O2L44l69k29J20k64L04M46o19m93O73L68m94k96J60K43L05l36
2423F0j71N60p3l25j3J14m66r7P12M8k33l5M34o58J72j59l92M56L56j70l36J41
2445g5k5K98J3n13j86N75k86k73Q09n5n97K12l7l75K93J30K53m22JJ34P8J73k85
2468a60k74J36L63l29K6K40M3j95N2n0j25L8K25j11J26K31j50R4k15j74M42n50
2490c17J27J19K23j66j06M47k57j32K33l23j79L71K3l8K88j6N7j79o8j87l8m5
2512a63J39K51K3k55K79k05J60n44J81K13n9J55n4K46j53p5k59j38L28j03p7M7
2534f3r3L27q2m05R2J59O0k80lK78L12m12q7k6K61m56M02j93K00L4k65K97lj06
2558e2j34K2J46O7j36J71j79K43k16K28m54J44j14L23j2R0j24o3K63r4J44j83
$$ plain form
2402 -135 19 168 135 197 541 172 -57 63 -201 103 549 -70 -563 110 478 -16 -312 -152 91 396 60
2423 60 -111 449 376 51 38 152 -314 -411 301 349 116 81 515 -143 29 -130 -522 -66 290 120 -216 -75
2445 -75 -100 198 211 -302 -488 87 -199 -472 337 282 -315 -103 -140 -515 -222 -92 161 -261 -260 -126 -48 125 -160
2468 -160 -434 -298 65 -264 -238 2 45 -150 -98 -148 -273 -235 -10 -121 5 236 86 180 -35 -209 233 -317
2490 -317 -190 -71 152 -14 -120 327 70 -62 171 -152 -331 40 63 25 313 297 354 175 107 -80 -118 -163
2512 -163 -24 227 250 -5 274 69 229 -315 -134 79 20 175 121 367 214 139 -120 -258 70 -33 -110 -63
2534 -63 -156 171 89 -316 -224 -65 -5 -285 -288 -10 302 -110 -197 -223 38 -418 -16 -209 -9 25 -240 57 54 -52
2558 -52 -186 -164 -18 49 -87 84 -95 148 -68 160 -294 -150 -264 59 47 137 13 -50 213 119 263 80
2580H0j37k94L61K35l06K7J93j14k9n8K95J24l19j01J67K67J52j89n74J14R9K
2602ej68J3M74j69M6j5L38j71n61J00K5L12k80L52J32j7k79k70J53Rk84J48K23
2625A06L1N5j11Qk55L1J3j24M7K05j05J99k07j6K01l73K33J4K20j10m2K6j50j16
2649b20J42j03P4K2K33l69L80Q4k5k65k24J61q7n7P6O91m70o4o0K93J27k87j91
2672a39L7K97j52J36J33P6q6m76O7j31K26N8j47K2M25K6m96O1K62l36J7j40L35
2695G5L20k95m9J23J40j35n18P94l40l49L17p5Q6P0q2k95P6K7K01j58p7jL57q8
2719A24j14m3K92l93J1m0p6L74m44L86j22J40m32P4L22K2j92j23K73j33K2k05
2741b77l4k09N99j53o2L42J89l75p7p1K52m3k53k48O03k6p6j14L56k32n91K85
$$ plain form
2580 80 -57 -351 10 245 -61 -34 159 45 16 -42 253 377 58 -43 124 391 543 354 -220 -106 -7 -5
2602 -5 -173 -160 314 145 191 176 514 343 -218 -118 -93 219 -61 291 423 406 127 -143 10 19 -265 -117 106
2625 106 137 192 81 89 -166 -135 -122 -246 -199 6 -99 100 -107 -123 78 -295 -62 -48 172 62 20 46 -104 -220
2649 -220 -78 -181 -107 -85 148 -221 159 243 218 -47 -271 -110 -197 -254 -178 513 43 -21 -81 212 339 52 -139
2672 -139 -102 195 43 179 312 388 302 -174 -107 -238 -12 46 -101 -79 346 372 -124 -63 199 -137 -120 -260 75
2695 75 395 100 51 174 314 179 -339 455 115 -234 83 8 94 164 82 -213 -137 -110 91 -67 -144 -145 212 124
2719 124 10 -33 259 -134 -123 -163 -239 135 -309 77 -45 95 -337 -263 59 81 -111 -234 39 -94 -72 -277
2741 -277 -311 -520 79 -74 -136 206 395 20 -57 -128 124 81 -172 -420 183 157 81 -33 323 91 -500 -215
2763b15L66k46K71J68l53L19M5n45k22O41q4j12k5M7O7K02j78r0K41r6l22L7L85
2786C01j02q1L46m18j4j52Q9J3J47Kk92L4Q5P1J19j09n59O44jn13p1N14K84n75
2810b38Q4L53l04J57k52l83N15N2q8m0l9j6p8M70n55J5M31r3m52N12k1l94Q7M89
2834B12k96l34K48L87K35l86l58J16O29m95l95K53R6J99J84o1l83K84N9n27p4
2855d07O91l52L60J37k27k71K31n6j14J29k02k14N85p5m24N3M90j9l69K30l90
2876b14K51O74o97r2K20N3m08L82k31L0J91K51q58K78L95j39j36K37l97l7o4L45
2898C4q7L81q20J69P26k45o37J60J45K88j39J48n32J92K89j55k53R3J30Pj02J00
2920a08N7L99k61n39K28R2Q3R5L24n20m7K49R9k63j4r7j6P38l28l04J01K16k51
$$ plain form
2763 -215 151 -95 176 344 -9 310 355 -190 -412 229 145 33 8 55 122 324 146 56 297 201 -121 -84 301
2786 301 199 118 464 46 32 -120 -31 -18 129 131 -161 -127 -42 29 148 39 -520 124 123 -390 -461 53 337 -238
2810 -238 -154 199 -105 52 -200 -583 -68 -16 -104 -144 -183 -199 -277 193 -362 -347 84 -9 -461 51 30 -364 -277 212
2834 212 -84 -418 -170 217 452 66 -292 -176 453 -42 -437 -184 -88 111 295 234 -149 135 194 -333 -407
2855 -407 284 -68 292 429 202 -69 162 106 -8 121 -81 -295 290 215 -209 -156 334 315 -54 176 -214
2876 -214 37 711 14 -78 142 195 -213 169 -62 -32 159 410 -448 -170 225 86 -50 187 -210 -247 -311 34
2898 34 -53 328 -492 -323 403 158 -479 -319 -174 114 -25 123 -409 -217 72 -83 -336 -243 -113 -106 -208 -108
2920 -108 -51 348 87 -452 -224 -132 -49 46 370 -150 -197 52 151 -112 -126 -223 -239 499 171 -133 -32 184 -67
2943f7m8M9j17K95L78l85k01L15k5m44M18j09l85N0N42M7l40Q6l19L84K47n13
2965a42j73N94j31j9j06n3j25Q76m00o28L4P50n1o42J73p2M66K16q58j07L73j00
2987a25K27J03m89N6K47j1j90P9J54j75K43j57k03p8L33J53o6l23J64P1J90k82
3009g9k43M70M7m16K3K17L3k70K31j23J60N3j20j17K57j93KL90l02pL80j82n68
3032c57M34J53k57j5J51j21r6J70m4J37K38l10j4N8O9k81O8rk01J20M41l26J81
3055A89p4oK2m4K30k23M4k1L4k00n1j71N41j61k26M9N05k14m93J69qJ56J16k35
3079g2q2L5j45L66L6J12m38K09J18n41M20J54O4n66K46K07l23r2L57k55J15K45
3101A70l95M75j93j68K03O7j80M7N0j09k64L22l12N6J73K31l16Q0L67n6m39K52
$$ plain form
2943 -67 -115 -66 -183 112 490 105 -96 219 194 -250 168 59 -326 -276 266 313 -27 59 -260 124 371 -142
2965 -142 -315 279 148 129 23 -30 -155 721 321 -307 -273 477 426 -216 -43 -115 351 567 -291 -398 -25 -125
2987 -125 102 205 -284 -228 19 8 -182 -103 51 -124 119 -38 -241 -319 14 167 101 -222 -58 13 203 -79
3009 -79 -322 148 195 -221 -198 19 52 -218 13 -110 50 103 -17 -134 123 -70 -68 322 20 13 393 211 -357
3032 -357 77 230 -27 -42 109 -12 -108 62 18 155 393 83 69 127 196 -85 -17 -26 -227 -107 334 8 189
3055 189 115 109 131 87 317 94 138 117 151 -49 -100 -271 270 109 -117 -68 437 223 -270 -101 -109 47 163 -72
3079 -72 -154 -119 -264 102 138 250 -188 21 139 -402 18 172 236 -330 -84 123 -200 -292 65 -190 -75 170
3101 170 -225 250 57 -111 92 159 -21 26 76 -33 -297 25 -287 -231 -58 173 -143 -63 304 248 -191 61
3123F1K77j88L12m47K85m36P0J88Pm4m09M20k56K53K29l06N5L69k96j15j90J86
3145B5J34Q9k80m2K68l47J53j99L04K47m32N5Q5p5j5q8K14k62N1j9L10Rk29R8
3169E4Q5k03M8K0nj23o8J86K0k73K20J04q7p5j71K91q7l37K96K04m7j75J22m4
3193d5k43K9M32l16J7k5J41J2k3J06k42J50j32L62k63j59L6K72j39J17J60J06
3215C53M9j91o6j04m92M26Q3J06j46j5P8nk53K77K27l03K13K2n6j19P8j03J59
3238B18j59M4l5k21J38K25j40R1j48J93n1k61J47k87L16j33j10J95j35j19J73
3259e9J97l0m8M14m40k16j46M53m53K63J14j48J8J19j64K10k42K33j20R0p2n1
3281g8j34K51l88K47j23K35l22J53L28K6K4J15k11r9j43J77M8m52K45RMm6J53
$$ plain form
3123 61 338 150 462 15 300 -136 -66 122 129 85 -324 96 -160 93 322 16 71 440 144 29 -161 25
3145 25 159 248 -32 -74 194 -153 0 -199 105 352 -80 -25 60 -15 -30 -118 96 -166 -115 -134 176 185 -44 54
3169 54 139 -64 -16 4 -1 -124 -192 -6 14 -259 -39 65 -22 -97 -268 23 -64 -401 -105 99 52 -123 -1 -45
3193 -45 -288 -259 173 -143 -126 -151 -10 2 -21 85 -157 -7 -139 223 -40 -199 -163 109 -30 87 247 353
3215 353 402 211 145 41 -451 -25 58 164 18 3 81 76 -177 100 327 24 237 259 203 84 162 59 218
3238 218 59 103 68 -153 -15 210 70 161 13 206 155 -106 41 -246 70 -63 -173 22 -113 -232 -59
3259 -59 138 108 60 474 34 -182 -328 125 -328 -65 49 -99 -81 38 -126 84 -158 75 -45 45 -27 -78
3281 -78 -212 39 -349 -102 -225 10 -312 -159 169 195 219 334 123 24 -119 58 106 -346 -101 -92 -88 -134 19
3304A9q2n4k5L29j21Q8J31q4k51L40j92Kj83J89j02J05j3k68K27L04l95J44K08
3327C16l11j22J53J06j85j35L12k16J06n7J58J06o4k11n4j0K06J72l60O6j83L38
3349A31m48JK58J77Q3l48J82N1Q7o4k56J71l8k45M8K19m00r6M86J89n35K04K88
3372A45k62M49l15l1j09O5n1n2kj37P2Q45m86l32J90M32k93k93N58n07M73j19
3394B40p2l23J36k1O2L21n82j01O25M3l37O5N74o75L18J29l42k61L25J53j37r0
3416E0M4k34M63k05r5K18r4k47K65m20j99N48J35k95k62L06j12J49J30k90%L61
3438B16k80k46J81k36J36R6m10K82L25O3n03J03L00p2pK01o6j12j06J85L4r9K3
3461Hk28L49k19k04Q4K13N6J97J94n78j46K93J49k59k7j9L0L73l66O2N29k82j33
$$ plain form
3304 19 -63 -117 -142 187 66 154 285 201 -50 290 98 100 -83 106 4 109 96 -172 55 359 -36 108 316
3327 316 5 -117 36 142 -43 -178 134 -82 24 -33 125 231 167 -44 -98 -108 98 270 -90 -24 -207 131
3349 131 -317 -316 -58 119 202 -146 36 87 174 110 -146 25 -13 -258 -210 9 -391 -487 -1 188 -347 -143 145
3372 145 -117 332 17 -14 -123 -58 -109 -161 -163 -300 -228 617 131 -201 -11 421 128 -165 393 -114 359 240
3394 240 168 -155 -19 -40 22 343 -239 -340 285 328 -9 56 630 -45 273 402 60 -201 124 277 140 50
3416 50 94 -140 323 118 23 241 147 -100 165 -255 -454 94 229 -66 -328 -22 -134 15 145 -145 -145 216
3438 216 -64 -310 -129 -365 -229 -133 -543 -261 64 127 -376 -273 27 -45 -52 149 83 -29 -135 50 84 -15 8
3461 8 -220 129 -90 -294 -210 3 59 256 450 -128 -274 19 168 -91 -118 -137 -107 266 -100 -38 491 209 76
3484G6l5L27k86k6J96m94M6L00r3j68L77J8l02M49L53n64K7p1J57p4M4k61k86
3507b90O78k92k92Q0k3K67L29k55m51P0P87n51m62K72k04P4L43k98k85Q19k70
3528D6Lj3J0k62O09j28m87p5L51j16k66K19l38M56J82k22j93K27K1knJ2j57r7
3552b25L44j94j49K42l77J11P34o07l54P97M3m67J81k62Q4J61J68l97R8K74J0
3573B15l21K62j30j70J14L20k93K62j35j81L7J59m99M96P2p8j6K18l50j91O61
3594D52l45k13J44K00j72m1m7J01J51n19j35K40K99k18N15j57k67J76k70O1j4
3615e9J90P1j05J24l28K2k48J32J54N0R2j3L4K74l71m30K80j23j61J43K76L6r3
3638e3R9J08n21L12k7j43R7l4m7L5L95m11K61j34OJ50q4J37j75K01k15p4J97j06
$$ plain form
3484 76 41 368 82 56 252 -242 -196 104 11 -157 220 238 -64 385 738 174 201 130 287 213 257 -4 -290
3507 -290 388 96 -196 -116 -139 128 457 202 -249 -179 608 57 -405 -133 -337 -263 80 -218 -503 316 46
3528 46 49 36 46 -216 393 265 -222 -297 54 -62 -328 -109 -447 9 191 -31 -224 3 24 22 17 29 -128 -225
3552 -225 119 -75 -224 18 -359 -248 486 -121 -475 322 365 -102 79 -183 -99 62 230 -167 -69 205 215
3573 215 -106 156 26 -144 -30 290 -3 259 124 -57 -20 139 -360 136 208 130 114 332 -18 -209 452
3594 452 107 -106 38 238 66 25 -22 79 230 -289 -424 -184 115 -103 412 255 -12 164 -106 -45 -59
3615 -59 131 202 97 221 -107 -85 -333 -201 -47 3 95 82 116 390 19 -411 -131 -254 -415 -272 4 40 -53
3638 -53 46 154 -367 -55 -82 -225 -128 -162 -209 -174 221 -190 71 -63 -57 93 9 146 -29 172 -43 -117 80 -26
3662b6L5j74l1K57N3K7n2q4j82R6Q9K01j35j97K74P2k14J72k39K54J16l29j13
3685a30M05m09J95K41k73J4n4K13n43J57L52l64o9K28M72k99j03l6j10J38O2J96
3707B83k13k61J87l4q8L7p2J74k12n2L58L41n75k5J02J22l95J4L09kl26l5M52
3730H9j62k83J68J53K0rj56J46J14j82K86k64N6N3j69J51M3j52L78o6r1J6L7m4
3754A32j87L75k03J41ko0l84L35o8J13k03j82N91j26j05J07m4k34K76j97q1O6
3776F0K58k15J53L7j05j1J16l21L70j17k69J40j55K91j13l3k31j40K62j43L0K0
3798a16J23K2O7Ok36O1J55k0k44L5K90l07oJ20q2Q4j36K82J10Ml79J72J97k88
3822h6p3l42M71J21j91r3J92K57k33m7N1l91L49j19K10j76M04l7j58k91K37o5
$$ plain form
3662 -26 9 -165 -196 61 114 141 89 5 -177 -81 8 209 74 -123 151 223 9 181 -58 196 312 -17 -130
3685 -130 275 -134 61 302 29 43 -11 202 -341 -184 168 -196 -265 -37 435 136 33 -3 -113 25 87 283
3707 283 70 -191 -4 -38 -126 -89 -161 13 -199 -251 107 448 -127 -152 -50 72 -323 -309 0 -2 -328 -363 89
3730 89 -73 -356 -188 -35 -15 -24 -180 -34 80 -102 184 -80 -24 29 -140 11 54 -98 280 214 123 139 176 132
3754 132 -55 320 117 258 256 196 -188 147 79 192 -11 -193 398 272 167 274 230 -4 272 75 -6 60
3776 60 318 103 256 293 188 177 293 -28 342 225 -44 96 -59 232 119 86 -145 -285 -23 -166 -136 -116
3798 -116 7 29 96 102 -134 -73 82 62 -182 -147 143 -164 -170 -50 -132 -48 -184 98 208 212 -167 5 202 -86
3822 -86 -159 -501 -30 91 -100 -193 -1 256 23 -24 27 -364 -15 -134 76 -100 304 267 109 -182 55 -10
3844a0l30M14l31M97j99K39p9m16L90r0j87Q3k25O84l17j44K44r5k00J35j1n6
3866dM7j20L42l92K4QN9j96L35l64L54K16m34K18K59k77k5J7J41l67K6m5K29j19
3890f8L27l75p3J54R8l04R0j89K49K50m11K21J23l63J35k95M79k33J16K12O6l77
3912a68N6k04L05Q3m5j88M09l47RM05k12k31R0l2j10L44k77Q6J55j41J04j22j05
3935a36M4K45k19N4J30K28m30P9J00j96J7M2L03k21K24Q3k43n8q6k0J4k7J4R8
3959C9P1q9k64J83M00l86L6l65L30L55k45k42J17L20k10k24o5J9Q6J23R0k24J10
3982c5j7j97N48k64l20L53j6m0l98K31O7J31j33j07r2L50Q3k80L88l53K36K10
4004C45k93l71M54j04Q1m1MJ32l27K40M4l64K51nr5J07j14M2L4K51m09j63M43
$$ plain form
3844 -10 -340 74 -257 240 41 280 201 -215 175 85 -102 -19 -244 440 123 -21 223 128 -72 63 52 -4
3866 -4 43 -77 265 -127 -103 -95 -36 -232 103 -261 93 309 -125 93 352 75 50 67 208 -159 -133 -178 51 -68
3890 -68 259 -116 -189 -35 63 -241 -151 -340 -91 159 -252 -31 92 -271 -136 -431 48 -185 -69 143 209 -168
3912 -168 -112 -316 -11 72 27 -161 248 -99 -90 315 103 -128 -38 -70 -180 164 -113 -27 128 -13 91 -31 -136
3935 -136 -92 153 -66 -12 118 346 -84 -5 95 -101 -84 -42 261 40 264 347 104 46 -40 -60 -46 -73 -59 39
3959 39 110 21 -243 -60 340 -46 -10 -375 -45 310 65 -177 -60 260 50 -174 -239 -220 -134 -11 79 -145 -35
3982 -35 -52 -249 299 35 -285 68 52 12 -386 -155 -88 43 -90 -197 -289 61 144 -136 252 -101 135 345
4004 345 52 -319 135 31 112 71 75 207 -120 120 164 -200 51 46 -49 58 -56 -14 20 271 -138 -301 142
4027A42j73J7J01m3j44Q5L18l33l2K5k35N58j80j13J06L32p00L69K39n47R2J77
4049F1L0L3p6J84j20j70l19J68J47L28j15j63L81n63K51Ml26j26N52l4k28J54
4071E3J00l17J61N4l81q0J99J81K30L7m70J93k24M0k51N82j32l94Q63l45l34K76
4093D1J93m41r9J16j97J24N58l1o45O44j48j54J65J55n29K49J88m98L07L58j98
4114A58l61K47N3j21L30k40l45M06K5O0J70l56l15M60J78l33j22L40m02L14J6
4135A62j31k63M27q5k08N91m67J13N3j54k73J21K30m22L21J97j32n7N37l36m25
4156b01J78J74k31J75j47l00K44N72o02j45N12m91o0O40m81J41j8K45j92l06L46
4177E3q6K18J09o26L15K7M8j63K16o6m6K76k68R7j4J76m98K22rk68L36p0J85k40
$$ plain form
4027 142 -31 -14 87 44 -100 -15 303 -30 -62 -37 -272 286 106 -7 99 431 -269 100 339 -208 -116 61
4049 61 91 124 48 232 112 -58 -377 -209 -62 266 151 -12 369 -194 57 61 -265 -391 161 127 -101 53
4071 53 153 -164 -3 51 -330 -410 -211 -30 200 237 -233 -40 -264 -224 -475 107 -25 -419 444 99 -235 41
4093 41 234 -207 -306 -190 -387 -263 295 264 -381 263 115 -39 126 281 -248 1 189 -309 -2 356 158
4114 158 -203 44 97 -24 306 66 -279 127 152 212 382 26 -289 171 349 16 -106 234 -168 146 162
4135 162 31 -232 195 110 -98 493 26 139 192 38 -235 -114 116 -306 15 212 80 23 560 224 -201
4156 -201 -23 151 -80 95 -52 -352 -108 464 -138 -283 229 -262 -322 318 -163 -22 -40 205 13 -293 53
4177 53 -33 185 294 -332 -17 10 58 -105 111 45 -1 275 7 104 90 266 -232 -10 -19 -287 49 -21 164 -76
4201g6nJL09jl60N9L41j92n4R8O4k86M50J90m52m4K69j2l09j28N2L37k36L02k35
4226H2o0L0l9J64j44K7MJ17j36nP0q4l11L55J34k56K17k96K89nk29q6o4J36j52
4251b42L81o3j41RL6j30J45m8J55k95mO4m3j97M42j38l7k75L09M7O0J12j44m8
4275d5Ol9p6L96l83j30K86J58r5o3J45j24j44j8J82j04R2j75M9KO2p3J15K56j93
4300H7K09q6j77L57n46J04K91r4k28KM2K05R2j97J04k25J51j02K68p1r5J01k83
4323i1K30j1QO4l58J85m9J75n79M26K14n0K78n19R9q6j28nj12L83o7j02J63J39
4347B07j53l91K58K62O7m27J7L41l80L5m7M71j57l61r8L44M2M2o7o0K50m18K41
4370A8J5k76L59m70M36k50M6j07N2J27K90k32NK81k08j33J10q7O6J53k62J70j5
$$ plain form
4201 -76 -81 -80 229 228 -132 -73 268 76 22 120 184 -102 348 538 86 42 311 299 -10 -138 -86 251 15 317 82
4226 82 22 52 13 177 33 60 64 181 45 40 110 26 -285 70 204 -52 165 -131 158 153 -76 -162 -226 -90 -242
4251 -242 139 76 -65 -56 -20 -150 -5 -53 102 -193 -197 -133 -176 -373 69 -69 -106 -381 -72 -25 35 147 3 -45
4275 -45 -39 -78 -154 242 -141 -271 15 173 78 15 160 36 -108 -126 56 -48 44 -131 -82 -80 -18 -91 24 280 87
4300 87 296 210 33 390 -156 -52 239 145 -83 -81 -39 166 258 61 165 -60 91 -11 257 186 91 192 -91
4323 -91 139 128 136 200 -158 27 -22 153 -426 0 214 164 442 -77 22 -64 -192 -197 -309 74 7 -95 68 207
4347 207 54 -337 -79 183 250 -177 -160 181 -199 -164 -211 260 103 -258 -356 -12 30 72 5 -55 195 -223 18
4370 18 33 -243 116 -354 82 -168 -122 -229 -177 -50 240 8 13 294 86 -47 63 -24 42 195 -67 103 88
4393H8q4P0K8p7rJ43m5kk17K88j31K30k71MJ64k82K50j30J83j09J7p6R1K3k99
4418a53L37m17J76L9l26K92k8kK06j38K42j13m30J21K53j09k43J61J2j87J26J83
4440BQ2J34n10M22K5o9k24J77j16k63K57j22J84j08K42J64m74J05O7J70j11J12
4462A46k66J16K9R8j43J49j36j41K18l96M23o8K77k82p5K19rn32K71J28J31l33
4484a76M5mN8P0j60K52J1P8j46m5J48q1J05j73P7m1J41k98J97L67m49r7K5J40
4508D4OP9q8Q6j03q5L00l53J15j95Q2O89o68M8q2J28K6J3l0r2l1L15j49m27K69
4533a03q8J68K9j07k8N29m48N6kj29k85R1P13m07l55O33k9k37P7k45J28L95k97
4556E9j64K69k73J3OJ52n0M9J28k26q7J98j38o6J05M31m95L40k54J50j58j10L37
$$ plain form
4393 88 4 74 102 25 16 159 114 112 -105 183 52 282 11 15 179 -103 147 17 200 91 108 32 123 146 -153
4418 -153 184 -233 -57 -18 -344 -52 -80 -82 124 -14 228 115 -315 -194 59 -50 -293 -132 -120 -307 -181 2
4440 2 84 218 -292 130 155 86 -138 39 -77 -340 -83 -205 -21 -129 113 277 -197 -92 -25 145 34 146
4462 146 -120 -4 25 123 -20 129 -7 -148 70 -326 97 29 306 24 -51 168 159 -373 -102 26 157 -176
4484 -176 -131 -135 -77 -7 -167 85 96 174 28 -17 131 50 155 -18 59 18 159 -139 58 425 -24 -121 -96 44
4508 44 50 129 41 127 24 -61 239 -114 1 -194 -112 577 -91 -43 -125 3 29 42 12 -80 -111 204 55 -372 -103
4533 -103 -191 -23 6 -101 -129 400 -48 8 6 -123 -408 -317 396 -11 -366 267 238 1 78 -167 -39 356 59
4556 59 -105 164 -109 -96 -90 62 12 61 189 -37 -124 74 -64 -130 -25 406 -89 251 -3 147 -11 -121 216
4579B16k3l9j35j20J94j83J50K9Q9r8R6k85j01J43M24l18k55J46l7K88l7k27L00
4602B17L10n14j66L09L1n63J05K78k09p6K65JjQ2j54k03N24m17K71k40j82K1M73
4625A62j64k61P3J80j44l2J86Q4l56L74j62m7L03q2n0l9j18k06O97m27K95j72
4647I4Q7n26N01j53k73L27p1J62l53K0J68L9L87n18J22j90P04j62k95J20k84J85
4669I1J74n13N4K54N4j71R3k11K39PK43k94j22L33j85J1qq4q6P9J33l18L69j53
4693a1k76L48n3J31o5M9j66J80l28J73o0k09J48Q1J82j9n23O83m04J07J67m9l11
4716b25K74pj15O5mj90N1J29P9LN1q3j74L83l29j69P9K49K1l02J13jJ1K87k73
4741g7J66k39P9R7L09k29j70K94k28k27L00k99L37r5j34K21K68L1l19k96L02N9
$$ plain form
4579 216 193 154 19 -101 93 -90 60 89 178 80 176 -109 -210 -67 357 39 -216 -70 -107 181 144 -83 217
4602 217 527 13 -153 156 187 -376 -271 7 -202 -278 -13 -12 -13 69 -85 -288 236 -181 90 -150 -332 -311 162
4625 162 -2 -263 -190 -10 -154 -186 0 84 -272 102 -60 -107 196 114 64 25 -93 -299 398 -29 266 94
4647 94 181 -345 156 3 -270 57 -14 148 -205 -185 -17 22 409 -109 13 -177 527 365 70 190 -94 91
4669 91 265 -248 -194 60 114 -57 36 -175 64 71 314 20 -102 231 46 57 49 -35 -121 -42 91 -227 142 -11
4693 -11 -287 61 8 139 74 123 -43 137 -191 -18 -78 -287 -139 -58 124 105 -418 265 -139 -32 135 86 -225
4716 -225 49 42 -73 -8 -12 -202 -151 -22 57 60 111 28 -146 237 -92 -261 -182 67 88 -214 -101 -102 -91 196 -77
4741 -77 89 -150 -71 26 335 106 -64 230 2 -225 75 -224 113 18 -116 105 373 404 85 -211 91 150
4763A50j03j7r4j02J14J44k39K72j45P9k3K31j94l33K53m4L56j58j58N0q6j8p1
4786a36J07J40q5k0J99l93K18L95j27m04r2J61k6j85K8k09M57M2m6P1j65K1L0
4809a9L8J91P6m13K29j64r2P4M02m17Q3n5p6J16J01O5J7j90j21L76j74k17K85
4832A15J86m46R1J59j13J40j50j37J07j31j0N46k19M9o34N99k25jj5lK2PN5p4
4856h2J39k20K34k1o1LP5o8p6oJ92P8j5O9j89m5P7J27l06K8j26L57k12j40N27
4881C39l45J58K42l92j7K1J03l09M54p4J26l20k46L61l47J95j9lP9j25l9K77q1
4904C8k35K38p5J13J80l17K11l56J40Q2J07o8k40P6O0Q6J7lj34%R5J27l20J36
4928d2k7K06p5L88n58K58k13N3r0N31m05m7QJ84l32P9J07L07k25p5n1J45j2lO4
$$ plain form
4763 150 47 30 -64 -166 -52 92 -147 125 -20 59 36 267 73 -260 -7 -51 305 147 -11 39 -47 -65 -136
4786 -136 -29 111 26 6 205 -188 30 425 298 -106 -198 -37 -63 -248 -220 -429 28 70 24 95 -70 -49 -19
4809 -19 19 210 286 -127 102 -62 -154 -80 322 -95 -12 -67 -143 -27 74 139 156 -34 -155 221 47 -170 115
4832 115 301 -145 -54 105 -8 132 -18 -155 -48 -179 -189 357 138 187 -447 152 -73 -74 -89 -92 -70 -63 -8 -82
4856 -82 57 -163 71 50 -11 -8 67 -1 -77 -83 109 187 172 241 52 7 84 211 -95 -67 -193 164 -48 -188 339
4881 339 -6 152 394 2 -15 6 109 -200 254 180 306 -14 -260 101 -246 -51 -70 -73 6 -119 -158 119 38
4904 38 -197 41 -34 79 259 -58 153 -203 -63 19 126 58 -182 -106 -46 40 57 54 -80 -80 15 142 -178 -42
4928 -42 -69 137 62 450 -108 150 -63 -10 -100 431 26 -21 -13 171 -161 -82 25 332 107 32 -19 126 114 111 175
4953A75k57J89J07j55k54K50q8J46q4r7J17P3k94R5M07m51J39P9q4n7j72L67j88
4976c7j55L40j0j18p7k94M16mj65J75j61j43L46J6j24M7j8p2k0R2Mk76J36K53
5000A51n4j54J1l03L97j44j0q1L50j15n2O4j00J15l72J70J09k78R7L85l95K05
5022dJ74K5j15k30L32k33QK76k69j12M3J80k70J59J95j30J34j13j44J76K46j73
5044A55r4J30l65K21o7j90K89K23m70K56l87K26O0k71J80M5J08m1L0L9L0l11J2
5067a92K35j47O1j24K28Qr6j10J14q1J06q7J82M5k25J3L25n24J80j10K22p0J20
5090G3J04k66K14k44J97K5o7k38J55m5l3J41m6K43l40K04j53m07O28J3j10J52
5112B00o8n5k28k6k8J52k2M4J60J72l90K96J9l49K79L5j55k41J87J43j03k90K17
$$ plain form
4953 175 -82 107 214 59 -195 55 -33 113 29 -68 49 122 -172 -77 330 -121 18 97 13 -44 -216 151 -37
4976 -37 -192 148 138 20 -57 -351 65 61 -104 71 -90 -233 113 129 5 52 34 -38 -58 34 38 -238 -102 151
5000 151 97 -57 -46 -349 48 -96 -106 -187 163 48 -4 60 -40 75 -297 -127 -18 -296 -199 186 -209 -4
5022 -4 170 195 80 -150 182 -51 -43 233 -36 -148 -105 75 -195 -36 159 29 163 50 -94 82 328 155
5044 155 61 191 -174 47 -20 -210 79 302 -168 88 -299 -73 -13 -284 -104 -59 49 8 38 77 107 -204 -192
5067 -192 43 -104 -43 -167 61 69 -27 -137 -23 -104 2 -85 97 142 -83 -70 255 -269 -89 -199 23 -47 73
5090 73 177 -89 125 -119 78 103 36 -202 -47 -92 -125 16 -30 213 -127 77 -76 -483 145 158 48 200
5112 200 132 77 -151 -177 -205 -53 -75 -31 129 301 -89 207 226 -123 156 191 36 -205 -18 125 22 -268 -51
5135e1k37J45O5j42K67k9j4j59K37k7k73M44L4l75J97P6l82J88J03Q4j83K1k53
5158b64L4J38j5j71N18k18j17j90K78k51J68K76l96J40M3P4J49j95N0J0K2k39
5180a56R9K9Q8l5O3K3k04p5K38J8j58M8l1r2K43j9j70Q7r4k22P84m25M3j98L23
5205B07l24J46J88j76mJ9j35O6J45R2k89O1K02k48O7J73k01J19j51j37L40k49
5227h9j62l6N13m09J75j6L18k73k8J00j74J38n7p9Q9Q5j72j83L33j63Q9R8m0k03
5251a46J35k3O1k98P13n28k58L26o5oK09l47K1L82k86O4j20K78l39M22k65o6K39
5274A03Rp3N7O6j20j88K66j52J43O0j68J6R2j90RJ76P5l01L48Q7j91M4n0k03P9
5299fN5n2J09j47J10j15O7Nj24J45K85n20J71Q8k06L02o2j00j8J15j80J7L12J34
$$ plain form
5135 -51 -288 -143 -78 -220 47 18 4 -155 82 55 -218 226 260 -115 82 158 -224 -36 67 151 -32 -11 -264
5158 -264 -230 -92 -107 -278 240 22 -95 -285 -7 -258 -90 186 -210 -70 -27 47 196 1 51 61 83 -156
5180 -156 -57 -28 60 25 88 111 -93 -168 70 88 -70 -22 -53 -145 98 79 -91 -4 -98 -320 464 39 82 -116 207
5205 207 -117 29 217 41 37 56 -79 -13 132 224 -65 -4 198 -50 17 190 -11 108 -43 -180 160 -89
5227 -89 -251 -287 226 -183 -8 -24 294 21 -7 93 -81 57 0 -79 10 95 -77 -260 73 -90 -1 97 57 -146
5251 -146 -11 -34 27 -271 442 -86 -344 -18 -83 -89 120 -227 -206 176 -110 -46 -166 112 -227 195 -70 -136 103
5274 103 112 39 96 162 42 -146 120 -32 111 171 3 19 111 -79 -70 106 181 -120 228 315 124 168 118 -85 -6
5299 -6 49 -3 106 -41 69 -46 21 26 -98 47 332 -188 -17 71 -135 167 105 5 -13 102 -78 -61 251 385
5323C85m19L05j82k05q0J54j01J64J08r9k84R2L49m46J78K54k54L5J7j72K06J22
5345A27k38o9J06P7L1o1J33Q0l69K19r5r3L74k58JJ32P7j89M7k68L34j89m2Q7
5369d6O8R7j42mN8J30l06J40l12K31J01J65n0k55J06L87k55k13L17k48k10J45
5391i6O8J40O3l93J76K9M3N3j72J17L1K38k04L5o7%N6J2k58R9m7K87l01o1l7J68
5417b1K04l1k97R9j19J98l3k36Q8J79J41k27q4L8l3n4J5J46k22K10J7j34K50k33
5441a39J90j43M08k70j08n2Q6k5pK98l30K50j27K4K31l23qk01J39J65KM4k45j25
5465b66L04p1j07N47m61K7n2J47o8l3k1qK2K03j72Q9L0Lj61N4k40J19N7O6j59
5490a51L72k54J31j4J03j20k40J53Q0Pn8k34K65j83L12j43o5k76J59l6Q3L49m41
$$ plain form
5323 385 -34 271 89 -116 -196 -42 -143 21 129 30 -254 -162 187 -259 -81 173 -81 -46 -29 -201 5 127
5345 127 -111 -180 -74 3 34 -27 106 186 -183 36 -59 -152 222 -36 -35 97 174 -15 32 -236 98 -91 -133 -46
5369 -46 22 119 -23 -27 31 161 -145 -5 -317 -86 15 180 130 -125 -19 368 113 -100 217 -31 -241 -96
5391 -96 -28 112 175 -218 -42 -13 30 83 -89 28 59 297 93 128 61 61 117 129 -129 -30 -77 210 -91 -152 -189 -21
5417 -21 183 152 -145 -46 -165 33 0 -236 -148 31 172 -55 -139 -101 -134 -188 -173 -27 -249 -39 -22 -156 94 -139
5441 -139 51 -92 316 46 -62 -114 -28 -53 -60 238 -92 158 31 55 286 -37 -45 -246 -107 58 60 104 -141 -266
5465 -266 38 -33 -140 407 -54 -27 -79 68 0 -33 -54 -62 -40 163 -9 80 110 113 -48 6 -234 -115 -58 8 -151
5490 -151 221 -33 98 84 187 67 -173 -20 60 67 9 -225 40 -143 169 26 -39 -315 -156 -192 -109 240 -201
5513b01L62l80K58J38k31L5J30j91l06M80k13J22j20K3L47m58M39j39L9n9p3O2
5535F4j90L90k37r8n3n8J20J84mj1P1m61J20J30L08l20K00k24r4j20K54L9K26
5558B36k8j20m5K45n32L74j63j59K38J7L6j55o6M02N4k80k%j65L06k62J6P0j32
5582a15J45m0J02j11J09j46J28k07k9L77l28K71l71J66J73M8k67J29Mp9r1J41
5604IJ68k94K48m0j57MJ19j23K2j18J69K17k90N9j53K07o2p0J62k8j04k55K91
5627a9N0j59M2O7rP7rj67M64l84k6K91j95p8n8P1J8O7K5R2l55L2j03L86j77J37
5653H0K6j43L81m11L2l2J12j12O4J07k04J05J8K0m7p8K68k13%J54j17P0K85k39
5677A26j78J70k37N2j26K11m9J11jO1k05p1K60j45L9m6J07j56j09j00J63p1J93
$$ plain form
5513 -201 161 -219 39 177 -54 -19 111 -80 -386 94 -119 3 -117 -94 253 -205 234 95 134 75 2 64
5535 64 -126 264 27 -71 -124 -182 -62 122 118 107 178 -283 -163 -33 275 -45 155 -69 -163 -283 -29 10 236
5558 236 208 88 43 288 -244 130 -33 -192 46 63 99 -56 -122 280 334 54 52 52 -113 193 -69 -53 17 -115
5582 -115 30 -10 92 -19 90 -56 72 -135 -164 213 -115 156 -215 -49 124 172 -95 34 38 -41 -132 9
5604 9 177 -117 131 91 -66 -62 57 -66 -44 -162 7 224 -66 -7 -160 47 -15 -85 77 49 -55 -310 -19
5627 -19 31 -128 -86 -19 -28 49 40 -127 337 -47 -73 218 23 -55 -113 -42 -24 43 68 160 -195 -163 -266 120 -57 80
5653 80 106 -37 344 -67 -35 -67 45 -67 -3 104 -100 5 23 43 -4 -82 186 -27 -27 127 10 80 365 126
5677 126 -52 118 -119 -67 -193 18 -31 80 79 140 -65 -136 124 -21 18 -28 79 -77 -186 -286 -123 -194 -1
5700aJ73k24L4K4J43n88N21k5o2k58L48q7l4j00K66k99N00m17K80j26k6j54j01
5723b13J79j21K26L2M4j45J52r9j16n9K18l41J08K84j52J1Nj65l0L21m3m9O9l00
5747a84J6J73J88o0j40K18k23r6M18l78j71L04j54L90O6m68K51j92k5J11K2J74
5769B40j7j36j25L8R6k09L07l18J09L2M2K69l87j04K70J18k70l0L9k07L75J74
5791C06n48J49JK03j39OR6k5K39k14j78L7J83l76K00L3j52N03k90l58M93j24j87
5814a42L28j06p8O1l60J60O3K6j31K09Q2k70J15J89l1n8k3K66k88j2j44K03O1
5837A20j6j80M7j50L79l17k4J84q1O5q9m4p9K96k78J3K31p7J13j20n9j46O8P0
5861g4J13j01J7J8Q8j85J33r4l2J8Q8P7M1j4q0J07l72J34J35K0k2p0o3P4j13J02
$$ plain form
5700 -1 172 -52 -18 6 149 -439 82 57 -5 -263 85 -2 -36 -136 130 -169 331 -86 194 68 42 -112 -213
5723 -213 -34 -155 71 103 147 2 154 55 -61 -120 98 -243 -135 149 -3 8 13 -152 -182 139 96 47 116 -184
5747 -184 -168 5 193 133 -7 211 -12 -108 310 -68 -239 65 -89 301 367 -101 150 -42 -67 44 66 240
5769 240 223 87 -38 0 96 -113 194 -124 -15 17 59 328 -59 -163 107 225 -45 -75 -36 -243 132 306
5791 306 -242 -93 -92 111 -28 -22 74 49 288 74 -104 -67 116 -260 -60 -27 -179 324 34 -324 169 45 -142
5814 -142 186 80 2 63 -297 -137 -74 -48 -179 30 112 -158 -43 146 115 57 34 300 12 0 -144 59 120
5837 120 104 -76 -29 -179 200 -117 -141 43 -38 27 -62 -106 -185 111 -167 -154 77 0 113 -7 -66 -212 -144 -74
5861 -74 39 -62 -45 -27 61 -124 9 -85 -117 -99 -11 66 107 93 13 120 -252 -118 17 37 15 -55 -118 -44 -157 -55
5887e5N6P7L0n04M16J93j77j41J14m2M8j19N1J5o6j04K82k0K13l37k8J94p0k8
5911bR9n5p1J94m49K46kJ95m2P5k93kK07P6j35k21J67J54k54K87j3P1k1k45K41
5936B07l1j28N8j13j1J13k16M3J54l13L35mN5L2j07l3o3q8kpR6K67k95J50j54
5961e5k18N10j76l7K05k72M2J01j16L3J32j45o3j86K57J26n9J4k18j47J48J95
5983G1j92n5rL1J16R1j69l2J82r8J41M8l19p0J28k1N5L7J26m5p2R8R5J63l76J2
6009f4M5P7J35k65J31r9j19K61M4k92K21q2J19j55l88N14j00k46L57j88O5l9P9
6032A1P8o2J95j28P5J0l86N19j11l52K23m4J2j6p9J57l8R6j85k15J32l3K09l1
6056C7j55l72N28R7j27k04J43L06m95L91r6O0k14q7N19r6l51L63l47N8J62k01
$$ plain form
5887 -55 1 78 108 -396 20 213 36 -105 9 -33 15 -104 -53 -38 -104 -208 74 54 267 -70 -98 96 26 -2
5911 -2 97 42 -29 165 -284 -38 -40 155 113 188 -105 -107 100 176 41 -180 -13 141 -113 174 161 232 211 -34 207
5936 207 176 48 106 -7 -18 95 -121 -78 76 -237 98 94 149 181 74 41 -22 -110 -112 -119 -23 244 -51 99 -55
5961 -55 -273 237 61 24 229 -43 -1 100 -16 17 149 4 -59 -245 12 138 79 93 -125 -272 -124 71
5983 71 -121 -176 -185 -154 -38 53 -116 -148 34 -64 77 125 -194 -264 -136 -157 -102 -65 61 16 -56 42 137 300 -76 -64
6009 -64 -19 58 193 -72 59 -40 -159 102 146 -146 75 -7 112 -43 -431 83 -17 -263 94 -94 -29 -68 11
6032 11 89 27 222 94 169 179 -207 312 201 -151 72 28 40 24 -55 102 64 160 -25 -240 -108 -141 68 37
6056 37 -118 -490 38 135 8 -196 -53 253 -242 149 53 113 -101 -188 331 235 -116 247 -100 -42 120 -81
6078h1n4L79k85PK05l62K29k08K73R7q0o3jl3r7q1K04qN7j10J18Q5LR8k91K42
6104B43k02l2Q9k43J67m7l3o0J32M1N9j43J94O2k15K74m96K98k81J49on0R1j56
6128a65M32k78J19J29k74k5J38K1n0j1p9J61m%j96K00j16p7J08j55QJ00k0J34
6152A00k92N81m06R9j22l7K95j07k21J74j81K64l93K86j84J27M4l16L03K7q5K6
6174a8K29q5q6K6J3k06K65j98J13j93L00m3l18NL77j72k23J42q0o7L12k73K71
6197I1m0q8j09Q9j19R2L06l03L07j35jk95J91L6K16k48L41j1m07K38n71K17M00
6220A97m23M37k23r2K40j85P9J12l57L26j37J37n3M0m5J44j53k21K16j92J13l9
6242g9M04m63J13k08K96j48k4Q9l0j62L18k13R0L13j33j71oP6j75Q3l2o9J67K4
$$ plain form
6078 -81 -135 244 -41 -34 171 -191 38 -170 103 200 120 57 56 23 -74 -155 49 41 98 -12 106 191 194 292 1 243
6104 243 41 9 98 -145 22 -25 -58 -118 14 55 114 -29 165 227 12 286 -210 88 -193 -44 -50 -100 -9 -165
6128 -165 267 -11 108 237 -37 -62 76 97 47 36 -43 118 114 114 -82 118 2 -75 33 -122 -114 -14 -34 100
6152 100 -192 389 -17 82 -40 -77 218 111 -110 64 -117 147 -246 40 -144 -17 27 -289 14 41 -44 -18
6174 -18 211 126 40 66 79 -127 138 -60 53 -140 160 117 -201 -196 181 9 -214 -72 -152 -219 93 -180 91
6197 91 51 -37 -146 -57 -176 -84 222 -81 226 91 90 -205 -14 22 238 -10 331 320 -87 151 -420 -203 197
6220 197 -226 211 -12 -104 136 -49 30 142 -215 111 -26 111 58 98 53 197 44 -177 39 -153 -40 -79
6242 -79 325 -138 -25 -233 63 -85 -109 -20 -50 -212 106 -107 -17 296 163 -8 -14 62 -113 -30 -62 -131 36 60
6266F0j55M1R3K5j73L86l70j6J93n1l8k04J67K40m47M71l37J70J66n43K07K78
6288A63j51k64N40m10Q4J48q3q0l6J40N3N5q1j02r7J25k26L64J79Ok31o3N4k6
6312F1k08K83j57p9J36j2K21k84j17L19n4j88L8K45j94L1K74l11p1P9j07P8n2
6335f9n6k0J08J22K5l68K72k17R8j6j6L8J67j81n3L15m0j58n0r7R7Q5L5P2n5J95
6361B33l29L4J34k05k04L13J29r2J1J52l09P7J71L0Q4n2k57rJ34K14j68k47M7
6384a09J3J49j31K65p6o5l4j71J47n7J54j16M07k47k13J72j3L1q5L3O3J03k79
6407e9K8J75k79mN0L2K42j01j75N9j21N4k7J98O2k64O7j24J96J44j76l7O8K44
6431B52l8j70j01J55k87L89q0r2J41k63J46k68N9K97Pq6R0l88K71k6j85O34n55
$$ plain form
6266 60 -95 -54 39 64 -109 277 -93 -109 84 33 -5 -209 -42 198 -249 222 -115 55 221 -322 -115 163
6288 163 12 -252 288 -122 -38 110 27 -53 -89 51 104 159 78 -24 -121 4 -222 142 321 327 96 33 87 61
6312 61 -147 136 -21 -100 36 24 245 -39 -156 163 109 -79 -41 204 10 41 315 4 -67 12 -95 -17 -69
6335 -69 -125 -145 -37 85 110 -258 14 -203 -105 -121 -137 -99 68 -113 -166 149 109 -49 -99 -196 -99 -14 21 93 38 233
6361 233 -96 -62 72 -133 -337 -24 105 13 24 176 -133 -56 115 145 229 177 -80 -89 45 259 91 -156 -109
6384 -109 -96 53 -78 187 111 46 12 -159 -12 -69 85 -31 376 129 -84 88 75 106 21 54 117 220 -59
6407 -59 -31 144 -135 -139 -89 -57 185 84 -91 -32 -153 -99 -126 72 134 -130 -63 -187 9 153 -23 -60 8 252
6431 252 214 44 -57 98 -189 200 120 28 169 -94 52 -216 -157 140 147 61 151 -237 34 8 -177 457 -98
6454i8N6kL1l21L46J74k3p3k09q7M06n3k51L4L0J93n9q9j2n7J26K6k21J58K34
6479B59o2j41j26J00J90j59m7J49q2K8j39J74r4q5o3o0o9L52k52J76j81R7J58
6502A23%J01k42J0J58j25l07K11J70r3k37J31J65K4M3j89NL8N0j90L7k02R7M18
6526A96m2k83PK39J7j72K56k11J20q3j12l0k56L47o6M1M6M4k16K74r8j4l5J32
6550A01p0N4j30j18K91j06k22K96K49k43Q8l1m0j23Q3J67k85K69m8K05l14J41
6572B14j84j62L05j34k17L34K02m07O2OK54k12n7L0j29L37l35K32r3m9J43j98
6594e8k36M59K0k03j8j84J76J51k71j25K54j68J98J14j70%J45k32j49M52j46O0
6616F9Mp9j27K03o8L7n6J18k59J67PJ98n0j71N6k20Q0l6L24l82K57J50l32j8J48
$$ plain form
6454 -98 -42 -44 -13 -334 12 186 163 90 -119 -206 200 147 -104 -70 -40 153 94 5 -7 -64 62 88 -133 25 259
6479 259 197 56 -70 30 220 61 14 163 81 109 -30 144 50 -35 -98 -158 -227 125 -127 49 -132 -35 123
6502 123 123 224 -18 -8 150 25 -282 -71 99 6 -231 -100 65 89 132 -57 -52 -14 36 -154 -117 -319 -222 196
6526 196 154 -129 -122 117 134 -38 218 7 127 44 -68 -98 -354 -7 -73 -32 14 58 -158 116 18 4 -31 101
6550 101 31 85 -45 -163 128 22 -200 96 345 102 190 159 119 -4 79 246 -39 230 182 387 73 214
6572 214 30 -132 173 39 -178 156 358 -49 13 19 273 61 4 34 -95 242 -93 139 46 -3 140 -58
6594 -58 -294 165 185 -18 -36 -220 -44 107 -164 -289 -35 -203 -5 109 -61 -61 84 -148 -297 155 9 69
6616 69 73 -6 -133 70 2 39 -17 101 -158 9 16 214 164 -7 49 -171 -91 -127 197 -185 72 222 -110 -128 20
6641B0O7J69l88N4k8K57j49j09J95k07J83m8j38N4J0Q7j73L98l59J91pj18J82
6664A43p1j81K90Q3n82M24k45K72k43J52k59K59LL6N0r2Q3J62k43J59n45M82k19
6687h2O2M14m23j17M9K12p3Q8j45k40K84r5R8j19K26k75P4o6L07k34LN3O5j77
6711a11K83r5k45K53m8J9k57L2l8K27P9O8j5j76j86L69k52K18j39j15K47l2o5
6734B1M9k23K55J90k15NOk00J16J37o5j15K9K87j69k32K69j46K09j81j15K56j58
6757A0j72P3J28j54J23m7L96j93k63M8O4L3K28k87m3L56m35Q8j59K50k23K31K
6780E4P3j33R9p3j98L68l37J03J81k96K60m6Jl9k2Q0k14k00J71K54k26K84J00
6803B44l23P2k22J56K4O4k84o3P2K7L07L1Jn1j54L8J69q7m5J15k53K70k0lj38
$$ plain form
6641 20 87 256 -132 -78 -106 151 2 -107 88 -119 64 16 -122 -68 -58 29 -144 254 -105 86 79 -39 143
6664 143 72 -109 181 264 -318 106 -139 133 -110 42 -217 42 45 81 131 39 122 284 41 200 -345 137 -82
6687 -82 -20 394 -29 -146 -97 115 42 130 -15 -255 29 -66 32 -87 139 -136 -62 -128 179 -55 -52 1 66 -111
6711 -111 172 77 -168 85 37 56 -201 -169 -207 20 99 167 152 -24 -210 159 -93 125 -14 -129 118 86 21
6734 21 70 -153 102 292 77 82 88 -112 4 141 76 -39 -10 277 108 -124 145 -1 208 27 -88 168 10
6757 10 -162 -89 39 -115 8 -39 357 164 -99 -51 13 46 274 -13 -56 300 -135 -47 -206 44 -179 52 54
6780 54 127 -6 93 20 -178 190 -147 -44 137 -159 101 55 56 17 -5 75 -139 -339 -168 86 -140 144 244
6803 244 -79 -7 -229 -73 -49 15 -269 -332 -260 -233 74 105 106 55 -99 -61 108 21 -24 91 -162 108 88 85 -53
6828e3L06k32M0j03J72m1j49J61n9l4J9J5l7n1J88j79J69k13n4q1L91l30K59J78
6852B82j51k45KK34k52P0m2oJ60Mo5O7j13J75j0j73L39n61K98P8ok62J02J74j35
6877c6R1p6K9k32L26r8m9Q4j71M10j60j85L69l02J37j70J69k99K1K36N8j14o1
6900b3o9J83j45j82L4K29j32N4J30j94K51j26J97k34J3K9n6j94J47J13j59L45
6922B11j74p3l9R1J22M02l11k56K85j69J23j58o0L5o1L07m06K51q9k59M18r5l3
6945F2k2J02KP6l49QP9J32k26J53J62j24L9j48J03j15L88m45N7K31m07J47J07
6968A2j47M12l65L21k74LL73n47K96N3L7k31m2M7k38K42k55K15kL49j19m66K86
6991d0m0N7Q3J93k28j68O9k22J68J59j51Q4J62N2l50L28p9o1o4K39k84o9O7o5
$$ plain form
6828 -53 253 21 61 -42 130 89 -60 101 42 8 27 42 5 -46 142 -37 132 -81 -135 -216 175 -155 104 282
6852 282 131 -114 -112 122 -130 -60 -102 -108 52 56 -9 58 -55 120 110 -63 276 -285 13 91 85 -177 -75 99 -36
6877 -36 55 -21 8 -224 102 4 -45 39 -132 278 118 -67 302 0 137 -33 136 -163 -142 94 152 38 -23
6900 -23 -92 91 -54 -236 -202 27 -105 -51 79 -115 136 10 207 -27 -14 15 -41 -235 -88 25 -134 211
6922 211 37 -36 -75 16 138 540 229 -27 258 89 212 54 -6 29 -32 275 -131 120 31 -228 190 95 62
6945 62 40 142 144 220 -129 -121 -42 90 -136 17 179 55 94 -54 49 -66 322 -123 -66 165 -242 -95 12
6968 12 -135 277 -88 233 -41 -38 335 -212 84 137 174 -57 -99 -52 -290 -48 -303 -88 -90 259 140 -326 -40
6991 -40 -80 -23 60 253 25 -143 -74 -296 -128 31 -120 -36 126 178 -172 156 77 16 -48 191 -93 -162 -95 -160
7015a60l5L37M7k27O4m3J40l01L15l32L67k27O3r3o3k3N2K55l38M59j41J5J09
7038B40l07K20m34J97J29r0j15o2K52l7j52K70j95K48k00L11j47K20k21j24j15
7059a12L12m8l21K06j95J23o5J4J54j62J49j6q0k10J89m0j18L72l56K03K05k63
7081e9p2M6J5M30R6m67k26L59q9L03j61k7J4o3j0J36k84J75j3J58j78J00n38L04
7105e1J26k12R8J8j62n4M48o2qj81J11l55L28o8j8p4J50k8j22R2Q8%j36J6O7L3
7131D4j76m1O03n30N5j9l0J58k37q3M24k82m8J80j51J96j61j29L00k23r1J56N3
7154c2J00m9j23m0K23R0k53JK45o1k57J02m6J39j80o0Q9L8m3J76J03o4l22J53
7178g1k20L26nJ24N4m46Q9R3K45l00J69%k88M51k92J37J18oj62J5J1K9k82J82
$$ plain form
7015 -160 -195 142 189 -38 26 -17 123 -178 137 -195 172 -55 8 -85 -148 -171 -119 136 -202 257 116 131 240
7038 240 -67 153 -281 -84 45 -45 -160 -222 30 -7 -159 111 -84 164 -36 275 128 348 127 3 -112
7059 -112 200 152 -169 37 -158 -35 -100 -86 68 -94 55 39 -41 -251 -62 -102 -220 152 -204 -1 204 -59
7081 -59 -131 -85 -70 360 456 -11 -237 122 33 336 175 148 162 99 89 225 -59 116 103 261 83 183 -355 -51
7105 -51 75 -137 -39 -21 -183 -237 211 149 141 -40 71 -284 44 -24 -42 -116 34 6 -116 -24 64 64 -72 -56 11 44
7131 44 -132 -173 430 -100 -45 -64 -94 64 -173 -256 168 -114 -162 18 -133 63 -98 -227 73 -150 -241 -85 -32
7154 -32 68 19 -104 -144 79 169 -84 -83 162 101 -156 -54 -100 39 -141 -201 -112 -74 -117 59 162 98 -224 -71
7178 -71 -291 35 30 154 208 -238 -149 -56 189 -111 58 58 -230 221 -71 66 184 178 16 31 42 71 -211 -29
7202b9m1N4j22q5J37P0j14M85n28J44k3o3J00m7K1k9J32j92M42m16J39J09J6k94
7226a34K23j55j4k75L32L4K9j72J59j79J79J8N1J08k62P4j94K71k00N8K8k4R3
7249D8j57P7k56J45K04j61K42p2j73L2P2jJ21j25j29J07j74P9J12K32k02k36N70
7272C55l29J98k58p6J34J45j99P6j7J4K4K9K3p2l14K55J61N5l74K67r7K84j57
7295A27k28J72j15K08j89L33N1l53J72j08m5Rj50L7o8J75k9k05J2K77q6l0l0j49
7319b12l9N55j28m31L36P4ok27J57l72L21j78J92k40qN12n39K20k0j02j05J88
7341e2L40n00R0J89j07k20K00o7J88n3K39l38L04m37J98L16n05K27j95r0K7Q2
7363a64K25K6K71m58J41k60J77J29m5k72L13J99l08P7k06J99j64K4J62J47j46
$$ plain form
7202 -29 -70 -16 -138 -223 -86 -16 -130 355 -173 -29 -52 -115 -15 -62 -41 -70 62 -130 312 -104 35 144 160 -134
7226 -134 89 -66 -80 -355 -23 11 40 -132 27 -152 27 45 96 204 -58 16 -178 93 -107 -49 -21 -45 48
7249 48 -109 -32 -288 -143 61 -100 142 70 -103 -71 1 0 121 -4 -133 -26 -200 -121 -9 223 21 -215 355
7272 355 26 224 -34 -110 24 169 -30 46 29 43 67 96 119 47 -267 -12 149 204 -170 97 0 284 127
7295 127 -101 71 -44 164 -25 308 359 6 178 70 25 34 -116 -79 -147 28 -1 -206 -194 83 -3 -33 -63 -212
7319 -212 -251 304 176 -255 81 155 149 -78 79 -293 28 -150 42 -198 -206 306 -233 -13 -33 -135 -240 -52
7341 -52 288 -212 -122 67 -40 -260 -60 -127 61 8 247 -91 213 -224 -26 290 -215 12 -183 -273 -246 -164
7363 -164 61 87 358 -100 41 -219 -42 87 42 -230 83 282 -26 51 -155 44 -120 -96 66 213 67
7384F7j42J16J03Pk7J01j09j56K48k0j09l26Q5J69j26p9L39R0k90Q6j52L48p2
7407A51o5Q0q0k05n2J81K45j27j97O8k8P0k8j33O4J29j35k26L35Q5k86J22Q1L53
7431D02j80l41O2Q1k8j31L69pk70l40K74J4J02l3K2L2l7r1J64R1j15r1k3N5n0
7456f9j15KO8J66Q4j22m1m2M0J16K2j15M3J47j67J60r7N3P0q3j82j33K16M3q9
7481b5j7J15L8k06R3j22J16J29j23l21J88L51q8k64J27J51pk5o4Rk5j25K05j56
7505d6Q2L42k16l8j89Q8j03P7K72j93l95K42J56P6j69K7J8J54l53K75l36J1N03
7528B85l86J94j93N03m68N3n0N6m2K37l22N49m86K57j74K3o0j42J46j07N9k70
7550c38K13R3J14j76k0O7K03j32j00j24L16o5k45Q5j35j82N90J68o7l64J59M6
$$ plain form
7384 67 -75 41 144 151 124 225 116 -40 208 188 79 -247 -162 7 -119 -198 141 231 -59 27 -125 223 151
7407 151 86 166 86 -119 -171 10 255 128 -69 -1 -29 41 13 -120 -56 73 -62 -288 47 132 -154 -32 49 402
7431 402 222 -119 -57 24 -4 -135 234 227 -43 -383 -109 -95 7 -26 -4 28 -9 -100 64 155 40 -51 -74 -19 -69
7456 -69 -184 -182 -114 52 136 14 -27 -69 -29 87 109 -6 37 184 17 177 80 133 203 120 -62 -195 21 64 -25
7481 -25 -42 73 111 -95 -2 -124 -8 121 -2 -323 -135 216 128 -136 -9 142 135 110 46 55 30 -95 110 -46
7505 -46 36 378 162 124 -65 23 -80 -3 269 76 -319 -77 79 155 -14 13 31 185 -168 107 -229 -218 285
7528 285 -101 93 -100 403 -65 -12 -62 -6 -48 189 -133 416 -70 187 13 36 -24 -166 -20 -127 -68 -338
7550 -338 -125 -32 82 -94 -114 -47 156 24 -76 -200 116 51 -194 -109 -244 -426 164 332 265 -99 60 106
7572A06K1L2n1m9j1J07j95p3j5k22J49L84j87K8n5j73J30j1mK78l22J87q3O7j06
7597f8K89m3k04Q2J48k16j43K27j82J36J21o1Or7J3l4j31k0J50N8k5K01k49m3
7621h5K08om46J45J10J27K68m82j02M55k29Q1J56k8l09J38j16K8K12l8n3J02L6
7644A72j24k0J27p5R1k37Pp0N2M09k32r5q6K5j8m9k9M1K18j57oj62J06j55J73
7669i4M1J40j42K80l79K45r3J06k13K55j66L4r8J10L52k99j74L18k31R2k01L67
7691B50m1m38L14j9j67k33L89k60L73j09j53K95k3m00K24N6j42J0n2K69k36o2
7713a55L2J30k66L21K6o9o7j24K85m0j16l6K57m19Q0K82n0Oj03r4q5L10j52J24
7737G7j71J42p9P7J21o3J10k93J23K7j40P3J30l5k81K7L16j46q4m4K80op9l2l16
$$ plain form
7572 106 127 159 108 59 48 155 -40 -113 -128 -350 -201 183 -4 24 -31 -204 -74 -85 -89 189 -133 54 -29 38 -68
7597 -68 221 178 -26 56 204 -12 -155 72 -110 26 147 86 92 -5 8 -26 -157 -177 -27 31 6 207 -42 -85
7621 -85 123 117 -329 -184 -74 53 321 -161 -263 192 -37 44 200 172 -137 1 -115 -87 125 87 34 136 172
7644 172 48 28 155 80 171 -66 -59 -129 -77 332 100 5 -81 -56 -74 -123 -152 -111 107 -50 -56 -218 -112 -267 -94
7669 -94 -53 87 -55 225 -154 91 -2 104 -109 146 -20 14 -84 26 378 79 -95 223 -8 84 -117 250
7691 250 209 -229 85 66 -101 -334 55 -205 168 59 -94 201 178 -222 2 58 -84 -74 -126 143 -93 -155
7713 -155 -123 7 -259 62 88 19 -48 -172 113 73 -43 -79 178 -241 -161 121 71 77 -26 -120 -205 105 -47 77
7737 77 -94 48 -31 46 167 104 214 -79 44 71 -69 4 134 99 -182 -155 161 15 -69 -113 167 161 82 50 -266
7762b66K26k10L46o4q6q9Q7k8Q9J33k55J02J51p9j49J05J68K9m87K56K72j89p2
7785a0J29q5r0k49M18l80K76Q7K9j74O0J68l36K34k76J68J34K41k55k03K27J45
7807B58j63k76M04j86lL03k81j31n9r3M90n26K03j91J19J44qJ34l14J43j62M18
7829B23k31R6l1J04j3m47K21n1K17l7n6J37j26k7K2p9K09J16l77J47k8K3j72M38
7853B78j56R2m6l25K30R1j11o3j85K30K70l75j05j15M43O5l83K40l1K8o6o8l9
7876a01L5o2J19j9l42L60l7L1j7Q1L3J58j50m19K25m7LL49m8m27L34L3L6k98P0
7901a00J64j11l4j41L0L43k45J14n3J6R4j99L1m4kL1m0K3J05J97l91K09O2k71
7925b12%K43J32l35K18K0l12j03N29k90L31l99L33q3m4j91K92j85J05J52j27j79
$$ plain form
7762 -266 -40 -250 96 32 -54 -143 -56 -84 5 138 -117 -15 136 57 -92 13 181 210 -277 -21 251 62 -10
7785 -10 119 34 -56 -305 113 -267 9 96 125 -49 11 179 -157 77 -199 -31 103 344 89 -114 113 258
7807 258 95 -181 223 37 34 337 56 -75 -134 -227 263 -263 -60 -251 -132 12 4 138 -176 -33 -195 223
7829 223 -8 88 57 161 148 -299 -78 -129 88 51 -5 132 6 -21 1 -78 131 247 -130 17 -11 12 -160 278
7853 278 122 214 168 -157 73 164 53 -10 -195 35 305 -70 -175 -290 153 218 -165 75 44 72 6 -62 -101
7876 -101 -66 -128 -9 -28 -370 -10 -47 -16 -33 48 81 239 89 -330 -105 -152 -149 200 152 -275 59 92 128 -170 -100
7901 -100 64 -47 -81 -222 -192 151 -94 20 -33 -17 77 -122 -91 -135 -137 -106 -146 -123 -18 179 -212 -3 59 -212
7925 -212 -212 31 163 -172 46 66 -246 -349 180 -110 221 -178 155 72 28 -163 129 -56 49 201 74 -105
7947a05Q5M0K58l45L16P8l37J59O8j26m9O5k01q4J84j81Q2P8m3l4J16M83o04J22
7971B5j44J37J2p6k37J03K27r6K9j42J97L3p9J28qJ32n4MJ09l34p0K24k11l1J95
7996G3j16K00j78k0J12J42q0m1k29J92j34N5m9L42k17K10m22J44K53m67K97M0
8018A07k05QL54k05m4o6k9m4R1j21L13K51m78J13l2r4J75p5k22K94j2k38J71J52
8042A64O5l26K19P9o1j23O7j98Q9K37l33K59j94LL2M1k31K91k37L07j22J5j60
8065a17L10k38nO8k5k31J83k9J32j81jK56j93j71R5L2J86l3j3j48J13R6j36o1
8089a11M6M9%j27o6L87k01K00k31L05k43j53K69J03k69J88p0k30j34N50l08k20
8111b66K65k49N2J08J40Q8L6j28J63j43j33jQ1M15m77kK08k56K28l03L07j30q3
$$ plain form
7947 -105 -20 20 278 -67 249 327 -10 149 217 91 42 107 -94 -178 6 -175 -93 -15 -58 -92 24 507 -97 25
7971 25 -119 18 30 -46 -283 -180 47 -49 -20 -162 35 68 -11 117 109 241 187 191 300 -34 -104 120 -91 -122 73
7996 73 -43 157 -21 -41 71 213 133 92 -137 55 -79 -24 -73 269 52 262 -160 -16 237 -230 67 107
8018 107 -98 -90 264 59 15 -51 -80 -124 -33 -154 159 410 -68 45 13 -81 94 19 -203 91 79 -159 12 164
8042 164 229 -97 122 201 140 17 84 -114 -25 212 -121 138 -56 -53 -21 20 -211 80 -157 150 28 43 -117
8065 -117 193 -45 -50 18 -7 -238 -55 -84 48 -133 -134 122 -71 -242 -147 -115 71 38 25 -123 -10 86 -50 -111
8089 -111 -65 -16 -16 -143 -209 178 -23 177 -54 251 8 -145 124 227 -42 146 76 -154 -288 262 -46 -266
8111 -266 -1 -250 -198 -90 50 138 174 46 209 66 -67 -68 13 428 -49 -51 157 -99 129 -174 133 3 -80
8134h0K3L5j60L13K51m82k60L09J66k28j15K82j45Jj51N2J08l0J56k3k31K82k27
8157a54l5K04j04J7L8o4J77j68J16L6l91L10n5p5L86m74O4L94j67J23l50Q6J93
8180A07n2P9j3j62j25K12r5R9o3J36j60
$$ plain form
8134 -80 -57 -22 -182 131 382 -100 -360 -51 115 -113 -228 54 -91 -90 -241 -189 -81 -111 45 22 -209 73 -154
8157 -154 -189 15 -89 -72 -34 -98 79 -89 27 63 -328 -18 -73 -148 238 -236 -172 222 55 178 -172 -86 107
8180 107 55 134 121 -41 -166 46 -49 50 -13 123 -37
8191c7
$$ Imaginary data points
##PAGE= N=2
##DATA TABLE= (X++(I..I)), XYDATA
0@%%%%%%%%%%%%%%Qj6J6j6J6k4L2l3M1m8N6p1P9q8J04j20J36j56J79k02K26k54
36a35K86l18L55l98M43m92N44o01O65p34Q09q92R83j083J192j313J448j597J767
55I29j960K179k432K726l076L499m022M693n577O799q608J1543j7067L0782j20701
70a00293j72565L86165L1020k86986P1651J82824j20734m5444J03996k9902o2020
81d2288N7536j839n3763K7858M6814k6394l3750N579J8828j2645j6877L0872L2810
94C2741l7414k8420M8118L6543l2846m1897j6397K1462M0917k0801n3407M6664
106d737O0522o6172l6391Q5709n32q1133L7636M5532o3489J0138P1310n3360n5598
119e0565N7919Q175m5039K6902K0438k7360J4127K0952j3806O698k057l0518P231
$$ plain form
0 0 0 0 0 0 0 0 0 0 0 0 0 0 0 0 8 -8 8 -8 8 -16 16 -17 24 -24 32 -39 40 -48 56 -64 72 -84 95 -107 119 -135
36 -135 151 -167 188 -210 233 -259 285 -316 349 -385 424 -468 515 -568 624 -689 759 -838 929
55 929 -1031 1148 -1284 1442 -1634 1865 -2157 2536 -3041 3758 -4850 6693 -10374 20408 -100293
70 -100293 -272858 113307 144327 -142659 -71008 111816 -8918 -54362 49634 19732 -42288
81 -42288 15248 13409 -40354 -12496 34318 7924 -25826 -20247 -1419 -14064 -30941 -69 32741
94 32741 -4673 -33093 15025 51568 18722 -23175 -39572 -18110 22807 2006 -51401 -4737
106 -4737 55785 -10387 -46778 38931 38399 -42734 -5098 40434 -23055 -12917 58393 5033 -50565
119 -50565 7354 15529 -29510 -2608 17830 -9530 4597 25549 11743 18441 16384 -14134 -6903
132f903J3220j9026J2209J6835k8529L465L2645k0149j6609K6092o382j9195K2824
145A0497P946j6361P112k316k0356Q474M105k2499J3936K8361k3861j4249M1078
158B1867R864l6107o309J1112o677N482M534k2180L216K9654q913k3810J0129
171h138Q806n887M174P36j018J1857j454j0365M742j0617j7983J8084J0298k3324
185b0089N885K5152o203M50R105k1605l530K7457j3478k3184J9536P800j4363
198g067J1966J109k5636Q555K5012j2317j2907J5235J1033J526m856j5258j245
211d850J3281q986j7641Q997J3628j470K014L679m941J818M508q994l404J0152
225G791m651p354J3304J294j8732R78J1321p426k717P107k101P123J5007j4065
$$ plain form
132 -6903 6317 -12709 -500 16335 -12194 -8729 23916 3767 -12842 13250 6868 -12327 10497
145 10497 18443 2082 9194 6878 -13478 -5004 -899 -23398 -9462 18899 -4962 -19211 21867
158 21867 31731 -4376 -10685 427 -6250 -768 3766 -18414 -15198 14456 5543 -18267 -8138
171 -8138 668 -5219 -1045 -309 -1327 10530 9076 -1289 3453 -7164 -25147 -7063 3235 -20089
185 -20089 -14204 10948 4745 5195 14300 -7305 -10835 16622 3144 -20040 -504 7296 -7067
198 -7067 4899 6008 -19628 -11073 13939 1622 -11285 3950 14983 16509 11653 -3605 -4850
211 -4850 8431 -555 -18196 -9199 4429 2959 4973 8652 3711 5529 10037 1043 -2361 7791
225 7791 3140 -4214 9090 10384 -8348 -7370 3951 -3475 -6192 915 -1186 5937 20944 6879
239F879j6227J6968O261k2515p450R671O427L514n923o224J2667Q182j5157n840
253h767Q885J416n4J628p827J975J0865r956j4666P992Q449p733j521J1451M951
268G088m120k567K996L18p282o719L185P950k063p326M113J0529k687j0135j099
283g819P300N688j159q125J558J4793n31j8647l964J1233K59o108j277L560J0033
298F794O302j0582n508J1080J233j2625j669Q361o01l417K641K287l764l918K851
313e35L891k526j084M171L537J057j539n758l367K616j05o088j765O889P691k656
329D429p708L682R137m011r049k64L624L505j32o861r92N623j168o564K013L090
345a646L27K868N37l300M437L571p953o614L455J714l524J157M177r33k012L305
$$ plain form
239 6879 -9348 7620 13881 -8634 -16084 -6413 14 3528 -2395 -8619 4048 12230 -2927 -8767
253 -8767 118 1534 1480 3108 -4719 -2744 8121 -1835 -16501 -8509 -60 -7793 -9314 2137 7088
268 7088 2968 401 3397 3715 -3567 -10286 -7101 849 -1214 -8540 -4427 6102 3415 -6720 -7819
283 -7819 -519 5169 4010 -4115 -2557 12236 11705 -6942 -10906 327 586 -5522 -6799 -3239 6794
298 6794 13096 2514 -2994 8086 9319 -3306 -4975 3386 2785 -632 2009 4296 532 -3386 -535
313 -535 3356 830 -254 3917 7454 8511 6972 1214 -2153 463 358 -5730 -7495 -606 7085 4429
329 4429 -3279 403 9540 5529 -3520 -3784 -160 3345 3213 -3648 -4640 983 -185 -6749 -4736 -1646
345 -1646 -1319 1549 2086 -1214 3223 6794 -1159 -7773 -4318 -2604 -6128 -4971 -794 -1727 -3739 -434
361d34M637l386n019J896K799Q2j041j503K74K572k504m307J366L644O99k91j701
378b217K098P351k21p568k412L664P80l047l850K944Q131l046p287O691N952q872
394i09j418Q253l327n331P452K556p134l92K575l266j676L375P23k080K651L132
410E184r78j941Q19o5j989k793j350L484M459m319m323M328K304m196L20K371
426A315k028m93K287J891K34l163l678K825q33o042N349P092q952j737J0941k739
442B269p063P153O17j0134J512P261k192o94j2k497J068J401k340L284L058p756
458e065q8J0873n93q800L143L243q002j775P814J761l679j293J021L688J953m556
474c55L85M919p591m429J2635L776j3266P46P510o738p93J0148l988q452O750
$$ plain form
361 -434 4203 817 -4202 -2306 493 575 -466 -1969 -1695 877 -1627 -5934 -4568 -924 -225 -516 -2217
378 -2217 -119 7232 7011 -557 -2969 695 1475 -1572 -5422 -2478 5653 2607 -4680 2011 7963 -909
394 -909 -2327 5926 2599 -2732 4720 7276 142 -250 2325 -941 -2617 758 1481 -599 2052 5184
410 5184 4206 2265 3084 3019 1030 -1763 -3113 371 4830 511 -3812 516 2820 -1376 -1056 1315
426 1315 -713 -1206 1081 2972 3206 43 -3635 -810 -1643 -7685 -2336 4756 -4196 -5933 5008 2269
442 2269 -4794 2359 2976 -7158 -5646 1615 -577 -1271 -1283 -3780 -2712 -1311 -3651 -367 2691 -5065
458 -5065 -5153 5720 5127 -3673 -530 2713 -5289 -7064 750 2511 -1168 -2461 -1440 2248 4201 -355
474 -355 30 4949 -2642 -7071 5564 9340 -3926 -3180 4330 -2408 -3201 6947 2959 -5493 1257
489A257L740k464J641j550k869J908l255k194R839l02j2164O249P936j0666J361
504a533J2063r294j0412J1105M808p095J524o9n304L312L298l402O74J83l316
519c458M908L338q248J200R438q768q073J0756K994q998L680M166q754J244Q930
534D355l834l978K183l507L059Q201p616p231R906J018q978N431L134p538M424
549i71M647q571K563P984p918j451Q697p554m590J3016j780j0994O974K882o509
564c575O439K411j1650L779J0392o971k918N452m234r7Q085p490o689J1523J930
579F387r991L575M675o171K661M728o973q11N972l938K79N488p636l851J2363
594F757r21j1293M462M247m246M590L00j1963P042J2904j2817r024J2971J685
$$ plain form
489 1257 4997 2533 4174 2624 -245 1663 -1592 -3786 6053 5751 -6413 -164 7772 -2894 -1533
504 -1533 10530 1236 -9176 1929 6737 -358 1166 1097 -4207 -895 2403 -999 -325 -142 -3458
519 -3458 1450 4788 -3460 -2260 7178 -1590 -9663 1093 4087 -4911 -1231 2935 -5819 -4575 4355
534 4355 521 -3457 -1274 -4781 -1722 6479 -1137 -8368 1538 2556 -6422 -991 2143 -5395 -971
549 -971 3676 -4895 -2332 5652 -2266 -3717 4980 -2574 -7164 5852 4072 -6922 52 2934 -3575
564 -3575 2864 5275 -6375 -2596 7796 825 -2093 3359 -875 -972 7113 -377 -7066 4457 6387
579 6387 -3604 -29 4646 -1525 1136 5864 -1109 -1920 4052 114 393 5881 -1755 -5606 6757
594 6757 5836 -5457 -995 3252 -994 3596 3896 -8067 -1025 11879 -938 -9962 3009 4694
608D694r078M890R04n461M395K069m889L382q10o597P897M524j2177L43J0658
623D744n364k813O340o888l089J3733k662j4786P237J0627q317l378M953k449
637b112n4M669l544k024L695k597Q62N688o146n041R427Q97q275N021L207q904
653e231M631R245j0511n950J2578O86q770K811J721j804M256j463o868N548M160
668E039o958K784L944p850J116R982n924o850P284j7m292N245m29o973L846M516
684D463l694r03r7j289N781j89r545K734R587n519o156N233J264l718K767R18
700A637l632J812N62k046L659K04p855K501Q529m999n957M787J780k485K354j885
716a034m116O360K613q388N15O622l217k210M070k215k455M588r14k655L730k313
$$ plain form
608 4694 -4384 506 1410 -4051 344 2413 -2476 906 96 -6501 1396 5920 -6257 -5914 4744
623 4744 -620 -3433 2907 -3981 -7070 6663 4001 -10785 -3548 7079 -1238 -4616 337 -2112
637 -2112 -2166 2503 -1041 -3065 630 -1967 -1105 4583 -1563 -6604 2823 3720 -4555 466 3673 -5231
653 -5231 -600 8645 -1866 -7816 4762 5448 -3322 -511 1210 -594 3662 2199 -4669 879 5039
668 5039 -1919 865 4809 -3041 -1925 8057 2133 -4717 2567 2550 -1742 3503 3074 -3899 -53 4463
684 4463 769 -134 -231 -1520 4261 4072 -5473 -2739 6848 1329 -4827 406 1670 -2048 719 1637
700 1637 -1995 -183 379 -1667 1992 2196 -5659 -3158 5371 372 -5585 -798 982 -1503 851 -1034
716 -1034 -5150 1210 3823 -4565 -4050 2572 -645 -2855 1215 -1000 -3455 1133 219 -2436 1294 -1019
732a019l812P686K065r428J4Q330j107m599k02Q13L146Q87n070J56N143k465k444
749a906M510r29m175L361L005l704p62J387l94J767j91m131J363N520k210m946
765b435J921L296j337j43o42k023J927K391l258k23K489k262j574M646j62m659
781b048J696K663k344o12R51o4J456j905l174L524L021m389j510L310j31j726
797a282Q86L1M11Ok494k1M918k004m550K911K760l527n10L001j20k311L56P56
815g83J045K64k201q85K690J299l088j257L825J633m229k065M376L176m131l430
831c761L521L634l029k934L246K714m312j675L675J583l043p86J649J816j067
846A231k132Q78K538m48l503J04L212J803l114k921K724M086l197m684L347M361
$$ plain form
732 -1019 -4831 2855 4920 -4508 -4494 3836 2729 -1870 -2072 -1259 1887 2774 -2296 -2140 3003 538 -1906
749 -1906 2604 1675 -2500 861 3866 162 -600 787 393 2160 1969 -2162 -799 4721 2511 -2435
765 -2435 -514 2782 1445 1302 660 -1363 564 2955 -303 -526 1963 -299 -1873 2773 2611 -2048
781 -2048 -352 2311 -33 -645 306 242 1698 -207 -3381 143 3164 -1225 -2735 575 444 -1282
797 -1282 -396 -365 46 52 -2442 -2463 2455 451 -4099 -1188 1572 -1955 -2465 536 416 -1895 -1539 -783
815 -783 262 526 -1675 -2560 130 1429 -1659 -2916 909 2542 -1687 -3752 624 3800 -331 -3761
831 -3761 -240 3394 365 -2569 677 3391 -921 -2596 1079 2662 -381 -1167 482 2298 1231
846 1231 -901 -23 2515 2067 -1436 -1332 1880 3683 569 -2352 372 4458 1261 -3423 -76 4285
862D285l239l480J995K952m02k991r13K659J694l528j553L982J549m261j741L922
878I30K338m679j809M365Q12l774N8L220q00k077L39j32N53J734j411k714K429
895f18K805k650l075K924K737l838k173M101K111l581p43K031m84n13J038p48
911f76q83J320K54o61O90J111j348o94M53L48n53M51Q84p75p19J809O50k139j75
930f53K269j573j389K690R12k274m15J633l87q14j28K4O91M81l72m91J286M44
948A934j376j669R44K176m09k891K32K945j23k496o20J881J225k080q47J660J157
965A643l99j730m27J418K28k187r06L147j71j993L99J557m3o54p91r8J186m17
983b38j822J425K129j486j980M65J078J000j760j854K855L171l586k099M040Q56
$$ plain form
862 4285 1046 -2434 -439 2513 2111 -880 -1793 866 2560 -968 -2521 1461 3010 -1251 -2992 930
878 930 3268 -1411 -3220 1145 1957 -1817 -1759 1461 661 -1416 -1077 -1209 -656 1078 -333 -3047 -618
895 -618 2187 -463 -3538 -614 2123 -1715 -3888 213 2324 -1257 -2000 31 -453 -966 72 -676
911 -676 -1559 -239 15 -646 44 1155 -193 -887 -434 -86 -639 -188 696 -79 -798 1011 1661 -478 -653
930 -653 1616 43 -1346 1344 2256 -18 -433 1200 813 -1 -129 -105 586 1067 695 204 1490 1934
948 1934 558 -1111 -167 2009 1600 -1291 -1059 1886 1763 -733 -1353 528 1753 -327 -1174 486 1643
965 1643 1244 -486 -913 505 733 -1454 -2360 787 616 -1377 -978 579 536 -118 -909 -1007 179 -238
983 -238 -2060 -635 1494 8 -1972 -1507 -429 571 -1189 -3043 -188 2983 -603 -2702 1338 2194
999B194m337j51K428p02M4M74m32L52R39n42r22O75K94j047N41J110j56l06J55
1018F11o31m1N18p53K23O98m75N69J606j305j038J963j595k220K423J028k317
1035g36J058J532k255M55K835k709j878L000k13j739K070J1j912P96j52j060J129
1052B32o6k144K456J554k204k43K243j787j347J761j266j121K267P45k803M69
1068a254K118q56o69p74M8K233K51k983J119L373l004k676L289q6l295J659K361
1085H54j680O89J795k983L95L082k491k683K625O63p33R29j309l30L337j722m077
1102c639L133L425l415k16L010j564j034K182j961j010J458j562o61M725o81l610
1118a420J827K325j865n65m17j162K563J697m493k29M688q28l551J17P09O35K500
$$ plain form
999 2194 -2143 -2294 134 -568 -524 -50 -482 -130 809 267 -655 20 314 -733 -192 918 762 456 611
1018 611 -20 -61 457 -296 -73 625 150 719 2325 1020 -18 1945 350 -1870 553 1581 -736
1035 -736 322 1854 -401 54 2889 180 -1698 1302 1089 -650 1420 1431 -481 315 163 -897 232
1052 232 166 -1978 478 2032 -172 -415 1828 41 -1306 455 -811 -1932 335 1080 -1723 -1254
1068 -1254 864 8 -661 -1435 -1387 846 1097 -1886 -767 2606 -398 -3074 215 129 -3166 -1507 854
1085 854 -826 -137 1658 -1325 -930 2152 -339 -3022 -397 266 -467 462 -847 -1177 2160 438 -3639
1102 -3639 -506 2919 -496 -712 2298 734 -300 1882 -79 -1089 369 -1193 -1854 2871 2190 -1420
1118 -1420 407 2732 867 302 -115 -1277 1286 2983 -1510 -1739 2949 2121 -1430 -1313 -604 31 2531
1135B531j431l169L479K141l990k53K168l581o23N039j539l386L161J473k351
1150c31O97K55k860K198J705k448L5J298j093J508J54n224M78O329j935m439L665
1167hK199k593J595o11l429K134J879l450J09L165j435k94J795j749o47K021j514
1184h33p34L858j235l827L440K868m982j656L170m69n53J314o98Q19K502j655
1200A329k232K295o65k466K472K62k931K208K276l201M0K831l235j268N083j01
1216B697m081K114J793j552J75j703k194K918J510l519N99L379j341L30J309l157
1232g23j444M247p92l773J919J583j297O30L03k185L64J527j338Q85J469k271
1248h96J016L004l035l297K240J272j954K11M07o18K860J529l797p70K690n32
$$ plain form
1135 2531 1100 -2069 1410 3551 -439 -692 1476 -2105 -2728 2311 772 -2614 547 2020 -331
1150 -331 366 621 -2239 -41 1664 -784 -749 549 -544 964 1118 -4106 -3628 2701 766 -3673 -8
1167 -8 2191 -402 1193 582 -2847 -713 1166 -2284 -2175 990 -445 -739 1056 -693 -1340 681 -833
1184 -833 -1567 2291 1056 -2771 669 3537 -1445 -3101 69 -400 -953 361 -337 482 2984 1329
1200 1329 -903 1392 727 -1739 733 995 -1936 272 2548 -653 -613 2218 -1017 -2285 2798 2697
1216 2697 -1384 730 2523 971 1146 -557 -2751 167 1677 -1842 -1243 2136 795 1125 2434 -723
1232 -723 -2167 2080 1288 -2485 -566 1017 -280 350 653 -1532 -1168 359 -979 -94 1375 -896
1248 -896 120 3124 89 -3208 -968 304 -1650 -1439 -1032 -1650 1210 2739 -1058 -1828 862 330
1264C30r65M54j114M73K867k127k599K492O86k796J378K183k442Q24L042j191
1280A495j938P82j128j65J634j719j397K906J083j563Q53j61j774J888R04k788
1296a088M07K725o56j458P40p87o21R49j79j532J791R41o17J174L30k059j70J474
1314A364j608j117J476l36k86J582j88j632N45O92q85J76K87R5J168K13k670K31
1332h93J745j733j387J377M38n63J938M10j276L78J19j448q5N56p24P0J164q5
1350Ak5k36p78J43J080o10q34J735P14n25m35J94r20k96N7j195R85J129J56j72
1370A68J323p69r53J035Pj470m54J318K79m81Q14o29o96L48M96k43l50P95M03
1389I41N33n06l71O00p08j774K60J545o99M27P12n99j90R45k7r63l33J97L33L77
$$ plain form
1264 330 -635 -181 -1295 -822 2045 -82 -2681 -189 497 -2299 -921 1262 -1180 -356 2686 1495
1280 1495 -443 339 -789 -954 680 -1039 -2436 470 1553 -10 843 682 -1092 796 1700 -1088
1296 -1088 -681 2044 1388 -70 670 -117 -738 211 32 -1500 291 1232 615 1789 2119 60 -110 1364
1314 1364 -244 -1361 115 -221 -507 1075 887 -745 -200 492 -393 -217 70 165 1333 1546 -1124 -893
1332 -893 852 -881 -2268 -891 -453 -1016 922 1332 56 434 553 -895 -980 -424 -1148 -1078 86 1
1350 1 -24 -260 -1038 -895 185 -425 -1259 476 1190 665 230 424 -496 -792 -735 -1930 -945 184 340 168
1370 168 1491 722 -231 804 811 -659 -1113 205 484 3 817 188 -508 -160 336 93 -257 538 941
1389 941 1474 968 597 1197 489 -1285 -1025 520 -179 248 960 361 171 1116 1089 126 -207 -10 323 700
1409G00J58k89l82m80n36L05K97m50K24J163r7J88Kqq48j001k93O69O65l42n19
1430h74L89Q74l51r7l8j70l57L08P73k42K3j66q49m02N69j04k73J19P36M08L0
1451C06L07M83p76j307j30J335o2r88M27P23m30k41N06J45k52p20O76P12M43k07
1471I50n16K77m27r88KN19K58n49M48J017O17m08p05k01L31j88o55K22L64K21
1491E89p01J40L22L2o11l48P08P49j92o38R19L28j528p69Q19q2o41K95M25K57
1511G3O06k55n33jL36n4r58n3R43K76q91j73P43m64n20K74N2K99O07k77Q7M54
1533E71n07m07j79l11j75L32O82k61L80j09p7o0j57K96j52m7p2P58J41r96j3P25
1555C62n61n99K83P88K9rK74j02J28K86p49j257J005P65q17J26N56J21o34J3l13
$$ plain form
1409 700 858 569 187 -293 -829 -524 -227 -677 -453 710 613 801 803 795 -53 -1054 -1347 -678 -13 -355 -874
1430 -874 -485 389 38 -59 -97 -267 -624 -316 457 215 238 72 -777 -1179 -610 -714 -987 -868 -132 276 306
1451 306 613 1096 320 -987 -1117 218 156 -832 -405 318 -112 -353 153 298 46 -674 2 714 1157 950
1471 950 434 711 284 -704 -702 -183 75 -474 -26 991 1608 1200 495 294 625 437 -218 4 368 589
1491 589 -112 28 350 382 -229 -577 131 880 688 50 969 1297 -231 -1000 -181 -263 -904 -609 -184 73
1511 73 679 424 -109 -110 226 172 -786 -839 104 380 -511 -684 59 -405 -925 -651 -599 -300 307 30 117 571
1533 571 64 -343 -522 -833 -1008 -676 6 -255 125 16 -61 -121 -278 18 -134 -181 -253 505 646 -350 -363 362
1555 362 -199 -798 -515 273 302 293 567 465 593 879 130 -1127 -122 643 -174 -48 508 629 -5 8 -305
1576c05P94k13l15j45J406l84j175Q21K49j552k75J017K25j61K88p3O87j6j027
1595a54M8N52j068P4P89n77j69R92j28j370P05O80q97j44R21j52k8L10j37q54
1615f07L60l12l18M56m35J71J473L2j720M75J700j286j503Q41P25N5o36n9L68
1634b20O91r12o52J340j32j036J340P12j499p2J067n55J0J92j187j01K436m19
1652A003k108J058J385k91j230p75O40J720o95j818P86K050j470p97J117l62r87
1669g74J106R11q30k57M10m24M65M9j585L47J575n73q29L12O1O32K31j637k75
1688a085K018M55k357K60J912j199j4O22j280k42J245p73l33R80k8p28J057k75
1706B35r22M74L72j027M20R58j023j72J113l53n68K71o54M58J435j195r51J637
$$ plain form
1576 -305 489 276 -39 -184 1222 838 -337 484 733 -819 -1094 -77 148 -13 275 202 889 873 -154
1595 -154 -106 446 -622 -548 241 -336 -505 487 359 -1011 -306 374 -523 -667 254 102 74 384 247 -607
1615 -607 -247 -559 -877 -421 -856 -685 788 820 -900 -425 1275 -11 -1514 -673 52 107 -529 -588 -220
1634 -220 471 -441 -1093 247 115 -921 419 1131 -368 -440 627 72 82 274 -913 -1014 1422 1003
1652 1003 -1105 -47 1338 1047 -183 -958 -318 1402 707 -1111 -325 1725 255 -542 575 213 -774
1669 -774 332 1243 413 156 566 142 607 656 -929 -582 993 420 -409 -97 -36 596 827 -810 -1085
1688 -1085 933 1388 -969 -709 1203 4 -10 612 -668 -910 335 -438 -771 209 181 -547 510 235
1706 235 -687 -213 159 -868 -448 510 -513 -685 428 75 -493 -222 -876 -418 1017 -178 -1129 508
1724E08L21j430J44R22r57O4J037j187M80J136r95p43J541m12j612J071P17l85
1742B20l68jpJ202j88k291N66K446k72k238O95Q02p7N48j152n64J196R1j039J034
1762F03J95j650J066J441j960n88J510m37m19O01o62n18J651M1j346m32J215J16
1780D27K0n02j245J583J064j431p73P52k42J02O61r81o69J410N06j201k56P66
1798iLj23K85q97K09J079o40m80P20n35l43J652k82j976O46J456m07m04j81o75
1818i02L13J459q71n26Q00K85n17M07m67m85J105k10j295P95R54j029L01P29j088
1837b42m47J592J50j148J11K35l41N29J35o08p4K62k16L20J08m73J74P60j057
1856b30P9O75o4p89K94k55K51L44k30n06N62J45n62L1J120o57j016P35k8J15L31
$$ plain form
1724 508 829 -601 -457 465 -492 -428 609 -578 -98 1038 43 -700 841 429 -1183 -112 605 220
1742 220 -148 -149 -156 1046 858 -1433 -867 1579 1307 -931 -236 566 489 1037 -115 -679 517 608 -431 603
1762 603 798 -852 214 1655 -305 -893 617 180 -239 362 -300 -818 833 874 -472 -904 311 427
1780 427 447 -55 -1300 283 1347 -84 -857 -105 -347 -245 416 -565 -1234 176 682 -519 -775 -9
1798 -9 -6 -129 156 -741 -532 547 -93 -573 147 -388 -731 921 639 -1337 -691 765 358 -46 -227 -902
1818 -902 -589 870 -1 -527 273 558 41 448 -19 -504 601 391 -904 -109 845 -184 117 846 -242
1837 -242 -689 903 1053 -95 16 251 -90 439 574 -34 -108 154 -62 258 366 -107 67 827 -230
1856 -230 -151 524 460 -329 -35 -290 -39 305 75 -431 131 276 -286 -255 865 208 -808 -73 -101 14 345
1877C45p29o80J371K52j069jP89M3n88q4K55K92K27r90J30M85l13k83R69l79q76
1898h34L41Q36k30m09j26l1P89K80r26l48P90Q4l44j80k72N41M48J00j008lJ538
1919A036m87p75j14j18J130J47q91m69N72L12Pk28j53L07L40P3j095K76O66l57
1939A79k46L5K44k34J19L49j52l96K64L76Pp73k07Q04J44o46l98M83L94n30k45
1960d29N13L2J52k84n16O50j24j67p3j94J16O60n95k53L32N04n24k56K67K26M9
1981H6k46K42j98k94J57L76j30m42j05M23L32k53l8K58%k01N4k79r5J31M42k54
2003c4l75L63M97m56j71J66L34l06Q2j42Q9K23ml62j62N2L78j06k54L55Q2O3k40
2026G2K63j5l31J39J22L61o27l31L67J13k28l73N00N61k90n52K18M87k38n45N29
$$ plain form
1877 345 -384 -1064 307 559 -510 -511 278 321 -267 -351 -96 196 423 -567 -437 48 -265 -548 421 42 -834
1898 -834 -493 343 113 -296 -422 -453 336 616 -310 -658 132 216 -128 -308 -580 -39 409 509 -499 -502 1036
1919 1036 549 -226 -340 -458 672 819 -72 -541 31 343 350 122 -31 276 616 689 -406 -130 536 179
1939 179 -67 -32 212 -22 97 446 294 -102 162 538 545 -228 -435 369 513 -133 -531 -48 346 -184 -429
1960 -429 84 116 268 -16 -532 118 -6 -173 -246 -440 -324 336 -259 -512 -180 324 -200 -456 -189 37 86
1981 86 -160 82 -116 -410 -253 123 -7 -449 -554 -131 201 -52 -90 168 168 -33 21 -258 -353 -222 220 -34
2003 -34 -409 -46 451 -5 -176 -10 324 18 100 -42 47 270 266 -96 -258 -206 172 66 -188 167 249 312 72
2026 72 335 320 -11 128 250 611 -16 -347 20 133 -95 -468 32 593 303 -249 -31 456 218 -327 202
2047B02k15J37j77n4j6K88k35J38q3K07j14k27P9m3J7Q4k12m1J84j46k79M09K29
2070A32l47m32O10J44l57M2L30K84o04j25M5P0N1j14K89r4pJ94j41l5m3n0L61
2093B03m31J25O0J38k57p0L39m16p5P18j48k9J16R6k74r7K54l22O5K71l16K52
2115B02k31p3L59k26j51L61K63k5l58j83O58l72k65j76O2N1K25l17J2N50l85K28
2137B09r3j09J02J60k69j93LL87m31R9K37j58j30L24k44Q6k00M16j05Q1l32L6
2159a24L07k29k24J66J99j85k31J62M6J44J36m8Nj13l95O3J06l3j24L24K75q21
2181e94J06P55N8n96M12P2k77O8Q9l64L94l2k91J66J52l82O22P3n72M12K80j65
2203C86q30O29L2k44J53K83j41m10M99n57O2Q2J00L69Oo27N0R03l83n68J29J17
$$ plain form
2047 202 -13 124 -53 -107 -123 165 -70 68 -15 192 78 -149 -70 -113 -96 -12 -224 -265 -81 -227 -506 -97 132
2070 132 -215 -647 -37 107 -250 -208 122 406 -198 -323 -278 -208 -157 -271 18 -76 -83 111 -30 -65 -108 -158 203
2093 203 -228 -103 -43 95 -162 -232 107 -309 -384 334 186 157 273 369 95 -2 252 -70 -5 266 -50 202
2115 202 -29 -102 257 31 -120 241 504 479 121 -62 596 224 -41 -217 -155 -104 121 -196 -184 366 -19 209
2137 209 116 7 109 269 0 -193 -190 197 -234 -135 102 -56 -186 138 -106 -20 -220 196 91 172 -160 -124
2159 -124 183 -46 -270 -104 95 -90 -321 -159 -113 31 167 119 124 11 -384 -321 -215 -248 -372 -48 227 -594
2181 -594 -488 267 325 -271 141 213 -64 4 93 -271 123 91 -200 -34 118 -264 358 431 -141 271 551 386
2203 386 -444 185 217 -27 126 409 268 -142 357 -200 -138 -56 44 413 419 -208 -158 745 362 -206 -77 40
2225D0l77Q12J69p53j78Q75k82n70M41n6j75J05j4j26Q8mm7o8k91l33R20M02r81
2248d03J16N86j72o6k50n4k68P28m58l26M93o4j84M52J16p80N50L76m53j06L38
2269A71k35M7K58k30n90O58J08k78K80k28l78O05J77n94K05L22l33n39P28j75
2289b1m52Q68j36k65L78k0j19K3R0o42M92O07p68m78P68n70M24L25m81k81N37
2310B79K23l14l4N3n12L24K04m30r0N06j88k75L72l26l4Q43k98r75N76M68l95
2331b3M9K09o38K6M76K8l41K68q0J58l5j51o22O02l7l46K81Rr4N63J43j031J8
2354e68R84m55k7j4j28o8N92q2l17L39j47l65J64K46n01L64N40m63m55O66M6j57
2376A94j41R3m23L07N53n32k1J9l92O22M17j068J99Q51m89j94K76p3k10L18l92
$$ plain form
2225 40 -337 475 644 -109 -287 588 306 -264 177 121 -54 51 37 -89 -1 -5 -52 -120 -411 -744 176 578 -403
2248 -403 -287 299 127 61 -189 -243 -511 217 -241 -567 -74 -138 -322 130 246 -534 16 392 -61 -167 171
2269 171 -64 -17 241 11 -579 79 187 -91 189 -39 -417 188 365 -229 -24 298 -35 -574 154 -21
2289 -21 -473 395 259 -6 372 352 233 256 346 -296 196 803 35 -443 325 -245 179 504 23 -258 279
2310 279 502 188 154 207 -305 19 223 -207 -297 209 21 -254 118 -208 -242 601 303 -672 -96 372 -23
2331 -23 26 235 -403 -377 99 127 -214 54 -26 132 97 -54 -676 -74 -111 -457 -176 -167 -261 302 445 -586 -568
2354 -568 416 -39 -66 -80 -208 -276 316 234 -83 256 109 -256 -92 154 -347 17 557 94 -361 305 351 194
2376 194 53 146 -277 30 583 51 30 49 -343 279 696 -372 -173 678 189 -5 271 198 -12 306 -86
2397h6m45O34L24p5j61P5k53L56k8k65q2J36l77M56J60j71p88M87L60n63k02L42
2419a66K83J38k32k0J42n5k77k27Q59m45m06Q43j14m73Q1M22n94J49j2k75K07
2440a72O10m14j05j13J03J48r5m1k83P28N3o66L03K60p61L12K97o16m5P36K03
2461D42o72K65J87j68L14m14l51K55M37K0l30L63j50n7L7n46K30K36K4Q8L23n39
2483fK78o1qr2k1j10J30K33j80j16k60M92l95j34J95L20k78Q9M6j60K33j36J34
2506A93k53k74L42L7r4j52N43j53l05O4j05o8K03m94M18K10r7n2P5j70%J88l10
2529b54K14j74q1K93L0O1j73j67j06L31k78m4M01j5J57l12n%K04l37J50J74J57
2552B26j86LJ36N2m13J25K12m0O3j58n6N1K46n4k73K57j77j36L39K23l46K98k29
$$ plain form
2397 -86 -531 103 427 352 191 266 13 369 341 76 -6 130 -247 209 369 198 -590 -103 257 -306 -508 -166
2419 -166 117 255 23 3 145 90 -187 -414 445 0 -406 437 323 -150 -69 353 -241 -92 -104 -379 -172
2440 -172 438 24 -81 -194 -91 57 -38 -79 -362 366 419 -247 56 316 -445 -133 164 -452 -497 239 442
2461 442 -230 35 222 54 368 -46 -397 -142 295 315 -15 348 198 141 178 -368 -138 98 122 210 533 -6
2483 -6 272 211 203 111 90 -20 110 343 163 47 -213 279 -116 -250 -55 265 -13 76 122 -38 195 59 193
2506 193 -60 -334 8 45 -49 -201 342 189 -116 -52 -157 -225 -22 -516 -98 112 15 -37 38 -132 -132 56 -254
2529 -254 -40 -214 -295 -2 28 89 -84 -251 -357 -26 -304 -348 53 38 195 -117 -122 -122 82 -255 -105 69 226
2552 226 40 43 179 231 -182 -57 155 115 178 20 -36 15 261 207 -66 191 14 -122 217 440 94 392 163
2575A63k42M84k46l35J72J21mN5J96jJ4l13k09k27O26l76L55k91J90p3K84o34
2597b91r4K67j92J25q2K50M11k79j25j41L8L19n24P5L08O0j67n2O3k66k0P3R8
2620a46J24j17J80k59K59j48j72n1pK17o0on9K98Q8k09j37J71Rm3j71L91r5j9
2644C8J1J43j06k87J89J7L3J43K61k44j88K53q9l01M9J6J60k17K6P42l97n5k41
2667d4M96k95k86Q4K90R1k07l0j21L81r9l47j97J96L62k37p1M18r9j86k52L8J42
2690B7J27k73J61Q8L93o24n2p8L66m52j13O18j36q8K52m3l48oO6n24M08L71j38
2713Bm2J36k04J56R8l40P0N8j69N3L57O9l33P8K72l78j62K76j17J27K34k58K1
2736DK0l5l1o9J34j85K88J30K01m56K92l19m21N28p7L70l67m56M44K77j31k16
$$ plain form
2575 163 -79 405 159 -176 -4 117 113 168 364 363 377 64 -145 -372 254 -122 233 -58 132 59 343 -291
2597 -291 -385 -118 -310 -185 -267 -17 394 115 -10 -151 -113 206 -318 -243 65 125 -42 -94 -31 -297 -317 -244 -146
2620 -146 -22 -139 41 -218 41 -107 -279 -330 -337 -120 -180 -186 -245 53 141 -68 -205 -34 -25 -68 -239 152 57 38
2644 38 49 192 86 -201 -12 5 38 181 442 198 10 263 174 -127 -78 -62 98 -119 -93 649 252 197 -44
2667 -44 452 157 -129 -45 245 336 129 99 -22 359 260 -87 -284 -88 274 37 -34 384 285 99 -153 -115 27
2690 27 154 -119 42 130 523 -101 -153 -231 135 -317 -430 188 52 -36 216 173 -175 -181 -115 -639 -231 140 2
2713 2 -40 96 -108 48 146 -194 -124 -66 -235 -182 175 244 -89 -11 261 -117 -279 -3 -120 7 241 -17 4
2736 4 24 -11 -42 -111 23 -162 126 256 457 1 293 -26 -447 81 4 374 7 -449 -5 272 141 -75
2758g5J47L03m00k04M26m9r2O4j44j71L49m09R7J09j01N5k2L25%j24j86j53K14
2781d1J05p00J91P97o11J55K40k82k82M81l16J08J12K26m53RL55j35k69Q3J7J37
2803g3L16n85J08L55N9n78J64K37k14L42l54j22L87J86k86pJ20l40R4K62r9J56
2825A28P0L5k16J72k06l21K41M47o92J54L28K31J6j21o15J59O91k93p73O31N70
2846F36l84n5J41n49K66J76r2l49M82n9m2Q1J5m02P9P3k32L61L1k67N15k19o00
2869c94L5N26Q7m49l6k7L22L49m11q08O05O7j44J74J00j86K05K43o09J11L35j79
2891h4l25N08l03J33K93m15K10O7k70m8M69r4n86J73M59j86k28L09n58J75P29
2912D28m11o72P24J71l82k6L94k59P6N2l27N18k13k50Q5O10n42j11M14P1n33n9
$$ plain form
2758 -75 72 375 -25 -229 197 148 56 120 -24 -195 154 -255 -158 -49 -150 -95 -117 208 208 84 -102 -255 -41
2781 -41 64 -636 -445 352 -259 -104 136 -146 -428 53 -263 -155 -43 183 -270 -261 94 -41 -310 -227 -210 -73
2803 -73 243 -342 -234 121 180 -398 -234 3 -211 131 -223 -345 42 228 -58 -65 55 -285 -191 71 -28 128
2825 128 198 233 17 189 -17 -338 -97 350 -342 -188 140 371 387 266 -349 -190 501 208 -565 66 636
2846 636 252 197 338 -211 55 231 139 -210 272 213 171 252 267 -135 -56 17 -215 146 177 -90 425 206 -394
2869 -394 -359 167 254 -195 -231 -258 64 413 2 -806 -201 -134 -278 -104 -4 -190 15 258 -351 -240 95 -84
2891 -84 -409 99 -204 -71 222 -193 17 84 -186 -234 235 141 -445 -272 187 1 -227 82 -476 -301 428
2912 428 17 -655 69 240 -142 -168 226 -33 43 95 -232 286 73 -177 -92 518 -24 -135 279 350 -183 -242
2934b42P8J39K23lm62r0M47K17n30j60J67M64J5m75J44J77o1n22L55K71l49P3
2956a24N66n05k8L76k11j66P06p43m2L51M0l92K61K6l2N9J74q00n7R29m45k1%
2979g8J54o8P6m57N6J20O9%J32Q3m34M08K18n29J65J60j48J26J18l98M7L99q4
3002A35j02k29J03J86J93j85o05M72M70o52l96Q44J64m54J77J87j90K00m3j18
3022A57j67k9j51L62J2k98J45J45l34M75qk84k97M79J49l37J0J30j28R9l03o2
3044b35K14L34m40J54J3Q5k03J47l15K7L60o7k08K14j19j74J51j6J35l00JJ70
3066g2R2om73L85L17k22m41L48K72j52J3l26J59R2K06j76j82j13K92j7J36k79
3088a47L00j13j48j02J70p9j02J70L32k23m70M68L81n75J98j68k8P10o01l3L9
$$ plain form
2934 -242 -164 -25 198 195 -267 -357 90 307 -223 -383 -216 248 263 -212 -68 109 48 -474 -119 152 -197 -124
2956 -124 442 -63 -91 285 74 -92 614 -129 -171 180 220 -172 89 115 83 142 316 -484 -541 388 -57 -78 -78
2979 -78 76 8 84 -373 -317 -197 -128 -128 4 87 -347 61 279 -250 -85 75 -73 53 171 -227 -180 219 135
3002 135 33 -196 -93 93 286 101 -504 -32 438 -214 -610 234 398 -56 121 308 118 318 275 157
3022 157 -10 -39 -190 172 184 -114 31 176 -158 317 309 25 -272 207 356 19 29 159 31 130 -173 -235
3044 -235 -21 313 -127 27 40 125 -78 69 -246 -219 141 74 -134 80 -39 -213 -62 -78 57 -243 -242 -72
3066 -72 20 14 -459 -74 243 21 -420 -72 200 48 61 -265 -106 -14 192 16 -166 -279 13 -4 132 -147
3088 -147 153 40 -108 -210 -40 -119 -221 -51 281 58 -412 56 437 -138 60 -108 -136 574 -27 -60 -21
3109b1L51k57j59K15K2J06Ol01L10J11n5l39k83K73k5K80j43j89K47j37l1J41
3131A22K05j98k08J66K06m29L56j82l42K04J2K0p5K91l3l16L92j3o6j20k51Q4
3153a75K58k42qPJ7M7J42k41j84K92J11R8R3l88K27j44k4p7J54J4o3Q4n8p5kM10
3179B73k63j18l3K95J03m89L9l1K02Pk5J95m62N10j18K2P1k50J86J06ok09K05
3202B10o9r3J9j95L85k48K5m8K45k19M12r9l05o9J26J67l35o8L51r0k48J66J23
3225A43j24P2L74l56J46n25Q0K57j86j41L4K59n8l20K85K28l12J11K20m57L3J55
3247h2J16J13N6n48K91R2l29K31J92j32K15l4j29k46K52J04l46Q6N1j85J38P7
3269a7J86j46j02L89k33o7j35J20k6N6k08L71R6m56OP7l2R1K57j08j35J19r4K79
$$ plain form
3109 -21 330 73 -86 129 151 257 263 -38 272 383 328 -11 -294 -21 -46 234 91 -98 149 12 -19 122
3131 122 327 129 -79 87 293 -136 220 38 -304 -100 -88 -68 -143 148 115 -201 191 178 112 -8 -259 -175
3153 -175 83 -159 -167 -160 -143 -96 46 -195 -379 -87 24 122 215 -173 54 -90 -114 -191 -37 -23 -86 -2 -60 -135 -137 273
3179 273 10 -108 -141 154 257 -232 -193 -224 -22 -15 -40 155 -307 203 85 107 178 -72 114 220 214 5 210
3202 210 141 48 67 -128 257 9 34 -14 231 12 424 325 20 -49 77 244 -91 -159 192 102 -146 20 143
3225 143 19 91 465 109 255 -270 -190 67 -119 -260 -226 33 -25 -345 -60 168 -144 -33 187 -270 -237 -82
3247 -82 34 147 203 -345 -54 38 -291 -60 132 0 215 181 52 -194 58 162 -184 -98 -47 -232 -94 -17
3269 -17 169 23 -79 310 77 10 -125 -5 -31 25 -183 188 284 -172 -166 -89 -121 -30 227 119 -16 103 9 288
3293B88j29J06j08l86J05J82J87j58k44J41K10k14n5j45K67J45j28j25J36k48
3313a73L4j27P9J91j57J72J71l52M15l0om81M24j57l0j1k13K82k61L35n3p7j25
3336a50M8k4K07l83L23j31o3j35J05j58K1M13j80k31M12QQ4r5k43J27mj83M1K77
3360H6q9j37j34J93mN2K87On0j49J20J00j72n4l6P8j64O4J09m68K20J71M98k69
3384B58m95N37R1l47j70K21l09J75J71k15q6J42J38j55J69j26L4M71q4n41K3J85
3406H7j59m8Mk42K8M22K1m37M93k14N2L26k66l86L90nj64k6M2r6J02Q9q8j91K41
3431b5J34k70K65k12j0n4J84l56J69K1j08L58j05l60L36J55J89k33j02J07k66
3452a83k6M76o54J92J78j74L09k19K8L07k8k36k32K98K09k45K50l19j70O70k23
$$ plain form
3293 288 159 265 157 -229 -124 58 245 87 -157 -16 194 -20 -75 -220 47 192 64 -61 75 -173
3313 -173 -139 -266 -187 4 -153 19 190 -162 253 223 217 -264 160 3 -27 -38 -251 31 -230 105 52 -25 -150
3336 -150 -102 -126 81 -302 21 -110 -173 -308 -203 -361 -340 73 -107 -338 74 82 166 71 -172 -45 -49 -232 -191 86
3360 86 -3 -140 -274 -81 -85 -33 254 260 210 61 181 281 109 55 19 97 -67 -3 106 -362 -142 29 527 258
3384 258 -237 300 391 44 -126 95 -214 -39 132 -83 -169 -27 111 -44 125 -1 33 504 420 -121 -98 87
3406 87 -72 -120 -116 -358 -330 92 113 -324 169 -45 7 333 67 -319 71 66 -98 -124 -82 -178 -76 13 -75 -266 -25
3431 -25 109 -161 104 -108 -118 -172 12 -344 -175 -154 -262 96 -9 -369 -33 122 311 78 -24 83 -183
3452 -183 -209 267 -387 -195 -17 -191 118 -101 -73 234 206 -30 -262 36 245 0 250 -69 -239 431 208
3473B08m51K77J3Q2P4L7m71L03J48j60l30N27j24p2m5j7m35N48J84k05j3K34l85
3496g3L15j5l39j76M39k75j02K90m21%P24j86m57l3M23k57pL04l15k55P82o17
3518b51O4P9j70M67J40k84o56P73k2l02J13k39J61J46L21o47l71Q13j18p0J08
3539E5q2O5K12k41n4J82L24l40j65M4m45J58M28j55k8J15L02k73J68j23k19L90
3561C18j68q4q1J10j95P7K53j84j10L71q2m29P36k16l80N09j33k19q5j0j56M49
3583B91k44k59K95J43k03J27J36k27l78N17k5l35M4Q1j19r1K46l37L44P9k32L66
3605B19k30J80l26L09m63m6L25P1k98K65k19j20m4N71k54P1P0J13k46L0j50Q3
3627h9J4j58qK26N7L4l14M51m3N4l06K3k6r2J61M1qj34j00M78k02l35K05K22k94
$$ plain form
3473 208 -243 34 47 129 203 240 -231 72 220 60 -270 257 133 61 16 -1 -436 112 296 91 78 312 -73
3496 -73 242 227 -112 -288 151 -124 -226 64 -357 -357 367 181 -276 -309 114 -143 -150 154 -161 -416 366 -251
3518 -251 -187 -108 -278 189 329 45 -611 162 140 -162 -49 -288 -127 19 340 -307 -678 135 17 -53 55
3539 55 -27 38 250 9 -45 137 461 121 -44 0 -445 -287 141 -14 -42 73 375 102 270 147 -72 318
3561 318 150 66 -15 95 -100 -23 230 46 -64 307 225 -204 532 316 -64 445 312 93 8 -2 -158 291
3583 291 47 -212 83 226 23 150 286 59 -319 198 173 -162 -118 -37 -156 -247 -1 -338 6 85 -147 219
3605 219 -11 169 -157 152 -311 -357 -32 39 -259 6 -213 -333 -377 194 -60 11 81 194 -52 -22 -172 -89
3627 -89 -75 -233 -241 -15 42 76 -238 213 170 224 -82 -59 -85 -177 -16 25 17 -117 -217 261 59 -276 -71 151 -143
3652a43L98o3n3k26K92l33k15L90k71l5j11M29J26n9r9J36K37k95k49J60L16l87
3674e5J88j34K70n09J18o4J45o6p8K02L26m11r7K44J4m20k12O10l55K54j60K15
3696B5l1k01n0K50R9l01K40J50k79k42j7L59j03O6k63mJ44L96k20j20L81k85J77
3719A71l03q5j19K81o8R0J26j57J26q1K6j53j38N74l28K13j13Q6K02n11R9k2j97
3742b81M47j70J54j44L08L7m23R1k49K59j62J73J71m0j98j56L06j48o9m9K77l2
3764A02j02L28Q4m61L8k40K06k74j1O05k17L04j96k86Q5O8L1R9l54K91j06k34
3786b40J25K96l37K33m9m6k53K21j29o8K51P8k03J56J51m96o4L70j9k79M41K1
3808A60j21n0j51K76N5j01Q0K22j42l02K71n06J05K39k00K65j7J28L7K7L13p30
$$ plain form
3652 -143 255 192 139 -87 205 -128 -343 47 -224 -259 -370 59 185 126 27 163 400 105 -144 16 332 -55
3674 -55 133 -1 269 -240 -122 -186 -41 -107 -185 17 343 -68 -165 79 93 -327 -539 71 -284 -30 -190 25
3696 25 -6 -207 -257 -7 92 -209 31 181 -98 -340 -357 2 -101 -35 -298 -302 -158 238 18 -102 279 -6 171
3719 171 -132 -217 -336 -55 -123 -33 93 -64 62 -19 7 -146 -284 290 -38 175 62 148 350 -161 -62 -84 -281
3742 -281 166 -4 150 6 314 351 -72 19 -230 29 -133 40 211 171 -27 -183 123 -25 -94 -143 134 102
3764 102 0 328 412 -49 -11 -251 -45 -319 -330 275 58 362 166 -120 -35 33 64 163 -191 100 -6 -240
3786 -240 -115 181 -156 77 28 -18 -271 -50 -179 -247 4 82 -121 35 186 -310 -374 -4 -23 -302 139 160
3808 160 39 -11 -162 114 169 68 148 370 228 -74 197 -309 -204 35 -165 100 83 211 248 275 588 -142
3830a42R9k00K41o5J40j48J09L51m00l16M13k17J97k8j12K72lO0j72np1M9j91
3853a39L94k42J41j94L41M5l40K66n49q7N80j54j51J10L62j98j67J08k32O5K41
3874B00j70j84r9J85J02p5k2r3R3N3l40K38J46k14L14j36K91o21J73J9R6j5j82
3897b41K92Rk14R7n2J19j8J13p5j39J62K08k20j60K66j92j00Q7qK64J9k4l46J86
3921C3J76n07N47j0l88J59J72J32m11K06%o6J31j55P8J91q8K6j1j75L1J81j25
3944A27n42N28J9J19m27N26m39J17J6k07J24nq8J44j41l4j80L07R0p0k63L18k77
3967b38L10K59l56k83L73jm0l08K79k4K06j2k20K69J4m92L50j0l54J80Q5J50k56
3990a19j00L95mP8k57j68L31K05m48K36j24jj05J84p3r3K17l8k21K16K3k6R1l49
$$ plain form
3830 -142 -43 -243 -2 -67 73 -75 34 385 -15 -331 82 -135 62 34 -78 194 191 251 79 74 3 52 -139
3853 -139 255 13 154 -40 301 346 6 272 -277 -364 216 62 -89 21 383 185 18 126 -106 -41 200
3874 200 30 -154 -253 -68 34 -41 -63 -156 -63 -10 -350 -112 34 -180 134 -2 289 -332 -159 -140 -44 -59 -241
3897 -241 51 60 -154 -57 -109 10 -8 105 30 -109 53 261 41 -119 147 -45 -145 -58 -66 198 217 193 -153 33
3921 33 209 -298 249 239 -149 10 182 314 -97 109 109 43 174 19 97 288 200 226 215 40 71 252 127
3944 127 -415 113 132 251 -176 350 -89 28 44 -163 -39 -44 -132 12 -129 -163 -343 -36 54 -16 -279 39 -238
3967 -238 72 331 -25 -308 65 64 24 -284 -5 -29 177 165 -55 214 228 -264 86 76 -278 -98 -13 137 -119
3990 -119 -219 176 172 250 -7 -175 156 361 -87 149 25 24 -81 103 30 -63 154 116 -105 111 134 108 199 -150
4014a50J71n0o9M40k2k6m43K77K18k65k36K05M0k09K84N3m47K88P5j52k20K90
4036E2oJ49R1k29L5P8J49n59J97k0k21L96J00l51j08L37m6k00K81l57k6K80J15
4059A37j87Jj38L19k6l12o6M10J00k83J42m7l17j59M51k51k71M71J07p3J66j54
4081B0Q7K6l01j27K10k23K48L63j78j75K47J67j88m18L19J12J3Jj38j26M29m2
4103C26n95L99l4k26K07J72k85l7O16k27l18k59L57j69K07l24J57J43Km8k41L13
4125A36l36J27M22j4l64K74k69Q4Ql88L72Q9pl30L03j96Q6j44K87p06K82J77J66
4148E9l20N29k22k95K48l0j76o2M36k40K0K22l33L16m6n20J36M59l18K21Q9n00
4170c27J25P7K57k14j61J77j19J54J75K34l63n7K20k65J97j64J28J03L1m32K91
$$ plain form
4014 -150 21 -29 -98 342 320 294 -149 128 346 81 -155 50 90 -119 165 218 -229 59 134 -18 -238 52
4036 52 46 195 286 57 92 170 319 -240 -43 -63 -284 112 212 -139 -247 90 44 -156 125 -232 -258 22 137
4059 137 -50 -49 -187 132 106 -206 -272 138 238 -45 97 50 -267 -426 25 -226 -497 -26 81 8 174 20
4081 20 107 133 -168 -295 -85 -308 -60 303 125 -50 197 364 176 -242 77 189 202 203 65 -61 368 326
4103 326 -269 130 96 -130 77 249 -36 -73 543 316 -2 -261 96 -73 134 -190 -33 110 112 64 -177 136
4125 136 -200 -73 349 335 -29 245 -24 60 68 -320 52 141 134 -196 107 -89 -3 -147 140 -566 -284 -107 59
4148 59 -261 268 46 -249 -1 -31 -207 -269 167 -73 -53 169 -164 152 106 -414 -278 181 -137 84 173 -327
4170 -327 -202 -125 132 -82 -243 -66 -185 -31 144 378 15 -42 178 -87 110 -54 74 177 208 -224 67
4191F7K38l08j46L27k09k63N79J0l70J10K58k71p5M2j68L19j83L5J75K79l32j46
4213c2K35l47j49L37%K2J15%l59J57k4M6K49k08k17R4J42O7l64J06J49j7k87J80
4237a05j8L0J57l16M40m07O2j98J39J04K94j4o25M12K29j29k91L25Q2k80j2K00
4259G9Jl20J52K32j37J1j79R7L55o45J63L69lm15M16l1m58M73L1k50j15N27j82
4282A71j48L48q0k75j68J63Q4J78j51k78L17n9k55j4L78j90K9k33J44K4J47k16
4304h4j54J72K58k03r4J5jp0J70J52l34J40J09p2OJ04r3j15j05L69k03J34k89
4327a88J50n5M5K40k31J41j96J21k24M6L19l74n5K21J76k69J87O9j61p9jR4J1
4350a3J42m87K05K12j22j90L16L2k67K62N7o5l35J59M48l40J63J00l06L44l67
$$ plain form
4191 67 305 -3 -149 178 -31 -294 285 295 -75 35 293 22 -53 -11 -179 140 -43 -8 167 446 114 -32
4213 -32 203 -144 -293 44 44 66 181 181 -178 -21 -45 1 250 42 -175 -81 61 128 -236 -130 19 2 -285 -105
4237 -105 -123 -93 64 -252 188 -219 -157 -355 -216 -112 182 168 -457 -45 184 55 -236 89 171 -109 -121 79
4259 79 80 -240 -88 144 7 18 -161 -64 291 -354 -191 178 175 -240 176 145 -313 160 191 -59 -174 353 171
4282 171 23 371 291 16 -152 11 95 273 122 -156 161 102 -153 -167 211 21 50 -183 -39 -15 132 -84
4304 -84 -238 -66 192 -11 -105 -90 -91 -161 9 161 -173 -33 76 4 10 114 21 -94 -199 170 -33 101 -188
4327 -188 -38 -93 -48 192 -39 102 -94 27 -197 -151 168 -206 -261 -40 136 -133 54 123 -38 -117 -118 -24 -13
4350 -13 129 -358 -153 59 -63 -253 63 95 -172 90 147 82 -253 -94 354 14 177 277 -29 315 -52
4371e2O7j75L42K6rj10K3O6p7r9P2M7j38Q3j25L99l46j5Q7P1K22l88j9J21K14
4396B87j83K08p0m82J64J17J09r2j11O8k18K53M9l2k44M29l71P0l5o4M1n4n3K39
4420B5Rk37K66K77l15k48J79M8mj76M5j27L10L3l05K42pK25k15p5J35k67J72L7
4444B7k29P1N12k26j99K8J23j16qJ92Q2k85J24L8%j75r1JL90k16j34J62k77J88
4468a8J9J97l3q8J4J38M2j69j78J41j08K55j44R9j92MP7j21P1J08J54m41L62l65
4492a76J67J63j43j71K71J54m00J02j31oK99j59j44J04J24J54l41J25j94m4K47
4513AJ3k11R5L1n5K63J01k61K25j96n3J18j31j8q1K71J75m76J53l5J78J20k22
4536EL6m1k12J38J08n3p3J16R1k97r5K42L39m05K96k13K75O4k53m2j82K19N3j47
$$ plain form
4371 -52 15 -160 182 208 199 89 112 178 101 2 74 121 -17 66 -59 340 -6 -21 66 137 359 -29 -48 73 287
4396 287 104 312 242 -240 -76 41 150 58 -53 15 -203 50 99 67 -177 252 -119 -49 -84 -148 -107 -161 -214 25
4420 25 34 -203 63 340 25 -223 -44 4 0 -176 -131 -258 52 85 -220 22 15 240 25 -50 85 -182 -10 27
4444 27 -202 -131 381 155 -44 -16 107 -9 -17 175 257 -28 96 134 134 -41 -132 -131 259 43 -91 71 -206 -18
4468 -18 1 198 165 77 91 229 271 102 -76 65 -43 212 68 167 -25 -21 56 -65 6 114 268 -173 189 -176
4492 -176 -9 154 11 -160 111 265 -135 -33 -164 -170 129 -30 -174 -70 54 208 -133 -8 -202 -246 1
4513 1 14 -197 -102 -71 -126 137 238 -23 202 6 -47 71 -60 -78 -159 112 287 -189 -36 -71 107 227 5
4536 5 41 0 -212 -74 34 -19 -92 24 115 -182 -277 -35 304 -101 195 -18 257 321 68 26 -156 63 116 -31
4560c1O8k31O3N5j28J98M6q8O3K8J71k29j60o6N1L50l24J9l14O28l08J26L36l78
4584e5q5J20k38K5J0J67k96J04L43r6j11R3J55k61J18j95M7M06n05K05J29j49
4606f9o7J88l03Q1j56L83p3J41o0j46k00J36J68j25J6k60L15J14K12n48M47J28
4628C22l24l01K40J88J0j08r8k4L44m70Q8K23q4J67o8J74k72J78k54J17K37n7
4650B28m62J56L53k49n8J20R7j86J39j15p0L39J54n60P5Nk23Q6K80l9l94N0K26
4673d8rq5L61j94j23l0K17k5j60%j9O7k09J21L41j22l78L71j1j3J28k45O8j90
4697a87M40l34j02K00Q8k30J81k18J66L47k64j43K54j66j33p5L40l5k79J23j32
4718a59qJ56k7L01k7k44j97R0N8mJ98P7k28K43k51r7J21N1O6n4K85l83M1pj69
$$ plain form
4560 -31 37 -194 -131 -76 -204 -6 40 -48 15 43 214 -15 -175 -241 -190 160 -164 -145 -459 169 -139 -13 323 -55
4584 -55 -140 -20 -258 -233 -223 -56 -352 -248 95 -1 -112 -19 136 -125 -7 -202 -155 251 -254 -49 80 -69
4606 -69 -136 52 -251 -170 -326 57 -16 125 65 -81 -281 -145 23 -102 -86 -346 -31 83 295 -253 194 322
4628 322 -2 -303 -63 125 135 27 -71 -95 249 -221 -133 90 6 173 105 279 7 185 -69 48 285 228
4650 228 -234 -78 275 26 -32 88 185 -1 138 23 -47 292 446 -114 -39 -34 -257 -171 109 70 -324 -274 -48
4673 -48 -57 -142 219 25 -98 -128 89 64 -96 -96 -115 -48 -257 -136 205 83 -295 76 65 52 180 -65 3 -187
4697 -187 253 -81 -183 17 105 -125 56 -162 4 351 87 -56 198 32 -101 -176 164 129 -150 -27 -159
4718 -159 -167 -11 -38 263 236 -8 -205 -115 -57 -61 137 214 -14 229 -22 -119 2 53 119 65 350 -33 8 1 -168
4743a68K38J6j9K9J15k10l72K74K27j71k01M66l16K28j40mj6j07rl6K21M0o6J49
4767A68J42m09k5K99j76q2K27K48m35K93l09O8j1r2J79p0k0q2J69J05k52K87k86
4790f4n2J06NJ59j89j39N3J99l23K31j62K4K28r9j3J37J9L0k30l5K5m2J43j93
4814a82J65J6j28L68n2k33K14j84J99k60K82L6l6l21L2J3J49m7l01M13M7L6j68
4837E8N4k26J03K3j05J10r7K81l34K64n9j23k69M33j20J98l65k7J81P5k24J09
4859f0J44M1j43M9k95j8K32j53J80j49J88l09M53m07K32K4k06R0P0j7K32l85K32
4882B5O2J43J4j32Q2m8k20L5M6j01J78r8K0o9n9K87k21j95R8J26Kj98K29l9k96
4907c29J02K46k01K44o6J08O0k18L71j84ml0J32l86J73q3o4M16n04K95k46M12
$$ plain form
4743 -168 70 86 67 96 211 1 -371 -97 130 -41 -242 224 -92 136 -4 -8 -24 -131 -140 -176 45 85 19 168
4767 168 310 -99 -124 175 -1 -83 144 392 -43 250 -59 9 -2 -94 85 15 -5 -87 82 187 -65 222 -64
4790 -64 -116 -10 -5 154 -35 -174 -121 78 -245 -14 -176 -152 76 -23 -36 101 120 150 -80 -115 -90 -132 11 -182
4814 -182 -17 -1 -129 239 187 -46 168 -16 183 -77 205 241 205 -116 -84 -71 78 31 -270 143 190 226 58
4837 58 112 -114 -11 12 -93 17 -80 201 -133 131 72 -51 -320 113 -7 191 -174 -201 -20 55 -169 -60
4859 -60 84 125 -18 31 -264 -282 -50 -203 -23 -172 16 -293 160 -247 -15 9 -197 -107 -37 -54 178 -207 25
4882 25 87 230 244 112 194 146 -74 -39 7 -94 84 -14 6 -63 -122 165 -56 -251 -153 -27 -25 -223 6 -33 -329
4907 -329 -227 19 -182 62 -4 104 164 -54 317 133 129 99 231 -155 18 -65 -129 287 -217 78 -168 244
4929B44k61m79Q46l26j09N6Q9j02j40K19J8j94k7J52K32j85k3K0r3Q2j26J05n0
4952e2k21K55N8j26j84J81J40j38K15k16J65j96m3R4K74m53N6J39J34k21K42K4
4974A27J46j38J55j34p7k76J22m3L29k39J86j32O4J6j5k39K50n5r2J30l02M35
4996B18k90K5K08J19j50k93N6N40m45J21J14k02K23k64K10j39J72k54J73m6j04
5017hK74k50J0q4K90l26j74L39K3P2k92L69j97m18L70j20J29r1j89L10J68q6j60
5040d1L20k51j42N2J22K03k29P8j4k68J86r5K9P8J10k68R7o1K84j04R5k75q4K98
5064A20j96J3l1J24j00K05k36r0J38o6J87j67L2j0J40R0l79M27k52R8J01j72J38
5087A14k54O1L17k53J76k21R9J74n5l65J57P1m1k77M70o3l02M21l06r6K88j09
$$ plain form
4929 244 -17 -496 350 24 -85 -29 60 -42 -182 37 55 -139 -166 -14 218 33 10 30 -63 19 -107 -2 -52
4952 -52 -273 -18 40 -86 -270 -89 51 -87 128 -88 77 -119 -162 -68 206 -247 -191 -52 82 -139 103 127
4974 127 273 135 290 156 79 -197 -75 -118 211 -28 158 26 90 106 91 -148 102 47 -45 85 -217 218
4996 218 -72 -47 161 280 130 -163 -107 433 -12 109 223 21 244 -20 190 51 223 -31 142 96 -8
5017 -8 266 16 26 -58 232 -94 -268 71 94 166 -126 243 46 -372 -2 -122 7 -84 -273 37 205 119 -41
5040 -41 279 28 -114 -62 60 263 34 112 98 -170 16 -79 -50 28 138 -130 -33 -94 190 86 181 -94 -178 120
5064 120 -76 -63 -94 30 -70 135 -101 -191 -53 -119 68 -99 -67 -77 63 153 -226 201 -51 47 148 -24 114
5087 114 -140 -79 238 -15 161 -60 39 213 158 -207 -50 21 -20 -297 173 110 -192 229 -77 -173 115 6
5109Fl56N74l10R1K0l9j00p6kK09l0N0j07k88L33J7m8J24j44K37k44K51k01L6
5133Cn0n1k36K02N1R6L82n75M9R3N4j57l5Q3Nm4K73l43J33j25J40R8j07o4M7K66
5159A88q2n3j06J96m64J94j25J83J46K0l1j33K90j9R7l46J67o4j52L1j05j3J32
5182d9n8L28p0j61j47K35l6n0K43o9j19j80J84p3R5P0k69j9L31k92J53K4n61L82
5206a08J72n6o2L62k01m62M73K5k64MO1O9r7L06l0k10J71j10k18N1n8q1J53p7
5230a87q5N0J27j29J10L64m93N89j76k58r0J86r3O5J9k56J66rK46k76l4L07O1
5253B04j15j6k02J29J61o5j43L56l14P4M42n58q2N5J97k7j39M7L9NP8k51J55n9
5277b9j27K48PO8o4o2RK0R0k61j81K76j80m2L34m0K48m45J80K29k93j55J08M2
$$ plain form
5109 6 -350 224 -86 5 25 -14 -114 -190 -192 17 -13 37 -70 -358 -25 -8 -56 68 -76 161 -83 168 -33 3
5133 3 -47 -98 -334 -132 -81 15 397 -178 -129 -36 18 -139 -174 -91 -86 -130 143 -200 -67 -192 -52 46 -61 -125 -78 188
5159 188 106 53 -53 143 -321 -127 -252 -69 77 97 66 -67 223 204 301 -45 122 58 -94 -63 -168 -181 -49
5182 -49 -107 221 151 -10 -157 78 42 -8 235 166 47 -133 51 -22 73 143 -126 -145 186 -106 47 71 -490 -108
5206 -108 64 8 -54 308 107 -355 118 143 -121 -117 -56 13 -84 222 192 -18 153 43 -175 -124 -182 -263 -110 -187
5230 -187 -272 -222 -95 -224 -114 250 -243 346 170 -88 -178 8 -85 -20 -1 -257 -91 -100 146 -130 -164 143 204
5253 204 89 73 -129 0 161 96 -47 309 -5 69 511 -47 -129 -74 123 96 -43 4 43 48 126 -125 30 -29
5277 -29 -156 92 99 167 103 41 50 70 160 -101 -282 -6 -186 -228 106 66 314 -131 49 278 -15 -170 -62 -20
5301b0J55k08k46J47k28K90J32j7J1r3J34L13k14k72q3K51l12J98n5K66q1k54
5323a86J12j38Q4k60O86j15m68K85r1o6K72j46R0j89J32J83n6j93O3k22K91j94
5345a26K9K93k43K0K31r4j27k6k34L23k22M75m81J6J02K62l1j03k1M7J23j99l4
5368b0q8o3r5L58j16J61L8n9j92m9J62m0K50j06q2R7kk39N3n9J6k01J95L8j9j70
5394b32M93N2j09j67M6Q5l23K85k1r0m6K45j06m13M89j72j8j45J21M6j82p7L32
5417I3l2L0J11l09K58j61j93J82r3L5m1k3O3p3R7N6o8L17l62Rm5L54m85K69j28
5442a39m4O7J84q9j0k7mK07k98M86n42N3K38j70Q8K32j82p0l2J77K7k62N7m1R1
5467cm2nJ98j86J66l6P3j07k17J63j35M9P9j47L18k13p2L46l72L43l82J28K49
$$ plain form
5301 -20 135 -73 -319 -172 -400 -110 22 5 16 -77 57 370 156 -116 -199 52 -260 -62 -117 149 68 -186
5323 -186 -74 -212 -128 -388 298 183 -285 0 -91 -157 115 -31 59 -130 2 185 129 -64 -1 -223 68 -126
5345 -126 -97 196 -47 -27 204 110 -17 -43 -277 46 -176 299 -182 -166 -64 198 167 64 43 90 213 14 -20
5368 -20 -108 -171 -266 92 -24 137 175 116 -76 -125 37 -3 247 141 59 156 154 -85 -32 -91 -75 -276 -81 -43 -62 -232
5394 -232 261 313 204 37 83 168 -155 130 109 19 -27 218 112 -301 188 16 -2 -147 -26 20 -162 -239 93
5417 93 61 91 202 -107 151 -10 -203 -21 -114 -79 -120 -143 -80 -153 -56 0 -68 249 -113 -104 -149 205 -280 -11 -139
5442 -139 -183 -116 68 -21 -31 -58 -62 145 -153 333 -209 -156 82 -88 0 232 50 -20 -52 125 152 -110 -53 -94 -3
5467 -3 -45 -50 148 -38 128 92 165 58 -159 4 -131 -82 -3 -150 168 -45 -117 229 -143 200 -182 -54 195
5490A95n09L13j34J20n4k3Q9O9m1r3k41L32P3m3q3J15j90l9L09j73k34J87L1R
5514a5j86K48J5l0r8J92j50j77K96j28PL13l80k2K37j43K0kj45J62nN8J18k35
5538e0K10l46M17k14j47p4N58k69k57L65k52K09k29o0K78J04m11K66n3J13j9K
5560A41J53k42K7J5m0Q7l26M15k86p9L27j93J12j93K32j11J54k66j87J10K58r9
5582Ij1J7j39k4K34J31l81K89O7l30p5K82j02l4m5K4K8j7j53R5N9Q6K08r6m66
5607c44L04j63M97l18K8N9rk24K04M5n4Q0J46l68N04n87L57k25L3RJ92K01l45
5630B2k15K48j25p2K78j98J17p3N3K5L28o69M26j17L6o7K74j77j57qJ25m2J43
5653A55NJ51l00j09J66j25l5k03L06j76J09L20j32l01Q9P6pQ0r5J02j38rJ8mn1
$$ plain form
5490 195 -314 -1 -135 -15 -69 -92 -3 66 25 -68 -309 23 96 53 -30 85 -105 -144 165 -8 -242 -55 -24 -15
5514 -15 -201 47 62 32 -66 126 -24 -201 95 -33 -26 287 -93 -115 122 -21 -1 -3 -148 14 9 67 185 -50
5538 -50 160 -186 231 17 -130 -204 354 85 -172 193 -59 150 -79 -139 139 243 -168 98 45 158 139 141
5560 141 294 52 79 94 54 141 -185 230 -56 -135 192 -1 111 -82 150 39 193 -73 -260 -150 108 9
5582 9 -2 15 -124 -148 86 217 -164 125 192 -138 -213 69 -33 -67 -112 -88 -60 -77 -230 -135 -76 10 218 122 -344
5607 -344 -40 -203 294 -24 4 63 54 -170 34 79 25 105 251 -117 387 -200 157 -68 -35 -26 166 367 22
5630 22 -193 55 -70 -142 136 -62 55 -18 35 60 388 -281 145 28 64 -3 271 94 -63 -71 54 12 155
5653 155 160 311 11 -98 68 -57 -92 -295 11 -165 -56 264 132 -169 -80 -4 -11 69 -26 76 -62 -71 -53 -57 -108
5678a08R2j51K25j29P7PL6j05j57M18j62k33Q9K95j18RJ23j49O6j17l44K15L0
5701i1j32K88K7K6q0L15m31qK08R2j78L7n7q8J45p4R4J5L5l68J44K39j19j64L4
5726i1J41nQN4r3j74K34l4l8J78N6j94J45qp6j52n8J37K67j75j45J97j97J99j97
5751b1J2K09l6J1j05J21j74O3j01m2L9J4Q8Ok60J17j1K83l21J35j62O1p3oJ50
5776cJ24j71N0R7o1q5O0j50J05J46j24L2l8O3m5m8Q7J46k36L17n9m95L34M2r2
5801dj56K54j36PR9k79L01k40K32j99J05Kl62M97l1j64K18L1k94N3K4K82N7j94
5825A03k28P1p9nJ73o1P0m08K50J29j52M9j90L39Q3k20J2L17n54J98r6L94p7k21
$$ plain form
5678 -108 -16 -167 58 -71 6 13 49 -56 -213 205 43 -190 -101 194 76 85 208 59 125 8 -336 -121 -91
5701 -91 -223 65 92 118 38 353 -78 -86 122 214 36 73 16 -72 73 -1 93 108 143 -225 -81 158 39 -125 -91
5726 -91 50 45 53 107 14 -160 74 40 2 180 236 42 187 179 103 -49 -107 30 297 122 -23 174 -23 176 -21
5751 -21 -9 200 164 175 70 191 17 80 -21 -63 -24 -10 78 84 -176 -59 -70 213 -108 27 -135 -74 -147 -153 -3
5776 -3 121 -50 0 97 36 -49 11 -139 -34 112 -12 20 -18 45 0 -48 39 185 -51 266 207 -288 46 88 -4
5801 -4 -160 94 -42 -35 64 -215 86 -154 78 -121 -16 -14 -376 121 90 -74 144 175 -119 -66 -42 240 297 103
5825 103 -125 -54 -133 -138 35 -26 44 -364 -114 15 -137 -88 -278 61 144 -76 -64 253 -301 -103 -199 195 118 -103
$$ [...]
8191b09
##END NTUPLES=NMR FID
##END=
